lucene-solr-dev mailing list archives

Site index · List index
Message view « Date » · « Thread »
Top « Date » · « Thread »
From solr-...@lucene.apache.org
Subject Solr nightly build failure
Date Fri, 02 Feb 2007 00:33:38 GMT

checkJunitPresence:

compile:
    [mkdir] Created dir: /tmp/apache-solr-nightly/build
    [javac] Compiling 170 source files to /tmp/apache-solr-nightly/build
    [javac] Note: Some input files use or override a deprecated API.
    [javac] Note: Recompile with -Xlint:deprecation for details.
    [javac] Note: Some input files use unchecked or unsafe operations.
    [javac] Note: Recompile with -Xlint:unchecked for details.

compileTests:
    [mkdir] Created dir: /tmp/apache-solr-nightly/build/tests
    [javac] Compiling 27 source files to /tmp/apache-solr-nightly/build/tests
    [javac] Note: Some input files use or override a deprecated API.
    [javac] Note: Recompile with -Xlint:deprecation for details.
    [javac] Note: Some input files use unchecked or unsafe operations.
    [javac] Note: Recompile with -Xlint:unchecked for details.

junit:
    [mkdir] Created dir: /tmp/apache-solr-nightly/build/test-results
    [junit] Running org.apache.solr.BasicFunctionalityTest
    [junit] Tests run: 22, Failures: 0, Errors: 22, Time elapsed: 0.271 sec
    [junit] Test org.apache.solr.BasicFunctionalityTest FAILED
    [junit] Running org.apache.solr.ConvertedLegacyTest
    [junit] Tests run: 1, Failures: 0, Errors: 1, Time elapsed: 0.264 sec
    [junit] Test org.apache.solr.ConvertedLegacyTest FAILED
    [junit] Running org.apache.solr.DisMaxRequestHandlerTest
    [junit] Tests run: 2, Failures: 0, Errors: 2, Time elapsed: 4.007 sec
    [junit] Test org.apache.solr.DisMaxRequestHandlerTest FAILED
    [junit] Running org.apache.solr.EchoParamsTest
    [junit] Tests run: 3, Failures: 0, Errors: 3, Time elapsed: 0.155 sec
    [junit] Test org.apache.solr.EchoParamsTest FAILED
    [junit] Running org.apache.solr.HighlighterTest
    [junit] Tests run: 10, Failures: 0, Errors: 10, Time elapsed: 0.202 sec
    [junit] Test org.apache.solr.HighlighterTest FAILED
    [junit] Running org.apache.solr.IndexInfoRequestHandlerTest
    [junit] Tests run: 1, Failures: 0, Errors: 1, Time elapsed: 0.489 sec
    [junit] Test org.apache.solr.IndexInfoRequestHandlerTest FAILED
    [junit] Running org.apache.solr.OutputWriterTest
    [junit] Tests run: 3, Failures: 0, Errors: 3, Time elapsed: 0.225 sec
    [junit] Test org.apache.solr.OutputWriterTest FAILED
    [junit] Running org.apache.solr.SampleTest
    [junit] Tests run: 2, Failures: 0, Errors: 2, Time elapsed: 0.22 sec
    [junit] Test org.apache.solr.SampleTest FAILED
    [junit] Running org.apache.solr.analysis.TestBufferedTokenStream
    [junit] Tests run: 2, Failures: 0, Errors: 0, Time elapsed: 0.064 sec
    [junit] Running org.apache.solr.analysis.TestHyphenatedWordsFilter
    [junit] Tests run: 1, Failures: 0, Errors: 0, Time elapsed: 0.074 sec
    [junit] Running org.apache.solr.analysis.TestPatternReplaceFilter
    [junit] Tests run: 5, Failures: 0, Errors: 0, Time elapsed: 0.098 sec
    [junit] Running org.apache.solr.analysis.TestRemoveDuplicatesTokenFilter
    [junit] Tests run: 3, Failures: 0, Errors: 0, Time elapsed: 0.065 sec
    [junit] Running org.apache.solr.analysis.TestSynonymFilter
    [junit] Tests run: 6, Failures: 0, Errors: 0, Time elapsed: 0.108 sec
    [junit] Running org.apache.solr.analysis.TestTrimFilter
    [junit] Tests run: 1, Failures: 0, Errors: 0, Time elapsed: 0.073 sec
    [junit] Running org.apache.solr.analysis.TestWordDelimiterFilter
    [junit] Tests run: 2, Failures: 0, Errors: 2, Time elapsed: 0.153 sec
    [junit] Test org.apache.solr.analysis.TestWordDelimiterFilter FAILED
    [junit] Running org.apache.solr.search.TestDocSet
    [junit] Tests run: 1, Failures: 0, Errors: 0, Time elapsed: 1.892 sec
    [junit] Running org.apache.solr.search.TestQueryUtils
    [junit] Tests run: 1, Failures: 0, Errors: 1, Time elapsed: 0.163 sec
    [junit] Test org.apache.solr.search.TestQueryUtils FAILED
    [junit] Running org.apache.solr.servlet.SolrRequestParserTest
    [junit] Tests run: 2, Failures: 0, Errors: 2, Time elapsed: 0.166 sec
    [junit] Test org.apache.solr.servlet.SolrRequestParserTest FAILED
    [junit] Running org.apache.solr.update.AutoCommitTest
    [junit] Tests run: 2, Failures: 0, Errors: 2, Time elapsed: 0.158 sec
    [junit] Test org.apache.solr.update.AutoCommitTest FAILED
    [junit] Running org.apache.solr.util.DateMathParserTest
    [junit] Tests run: 7, Failures: 0, Errors: 0, Time elapsed: 0.241 sec
    [junit] Running org.apache.solr.util.IteratorChainTest
    [junit] Tests run: 7, Failures: 0, Errors: 0, Time elapsed: 0.076 sec
    [junit] Running org.apache.solr.util.SolrPluginUtilsTest
    [junit] Tests run: 5, Failures: 0, Errors: 5, Time elapsed: 0.175 sec
    [junit] Test org.apache.solr.util.SolrPluginUtilsTest FAILED
    [junit] Running org.apache.solr.util.TestOpenBitSet
    [junit] Tests run: 3, Failures: 0, Errors: 0, Time elapsed: 1.012 sec
    [junit] Running org.apache.solr.util.TestUtils
    [junit] Tests run: 1, Failures: 0, Errors: 0, Time elapsed: 0.061 sec
    [junit] Running org.apache.solr.util.TestXMLEscaping
    [junit] Tests run: 7, Failures: 0, Errors: 0, Time elapsed: 0.065 sec

BUILD FAILED
/tmp/apache-solr-nightly/build.xml:295: Tests failed!

Total time: 1 minute 49 seconds



Mime
View raw message