lucene-dev mailing list archives

Site index · List index
Message view « Date » · « Thread »
Top « Date » · « Thread »
From Policeman Jenkins Server <jenk...@thetaphi.de>
Subject [JENKINS] Lucene-Solr-8.2-Linux (64bit/jdk-12.0.1) - Build # 526 - Still Unstable!
Date Tue, 06 Aug 2019 11:23:07 GMT
Build: https://jenkins.thetaphi.de/job/Lucene-Solr-8.2-Linux/526/
Java: 64bit/jdk-12.0.1 -XX:-UseCompressedOops -XX:+UseParallelGC

4 tests failed.
FAILED:  org.apache.solr.search.mlt.SimpleMLTQParserTest.doTest

Error Message:
Exception during query

Stack Trace:
java.lang.RuntimeException: Exception during query
	at __randomizedtesting.SeedInfo.seed([A9C4229C0DE00686:E809A38605B153F]:0)
	at org.apache.solr.SolrTestCaseJ4.assertQ(SolrTestCaseJ4.java:947)
	at org.apache.solr.SolrTestCaseJ4.assertQ(SolrTestCaseJ4.java:907)
	at org.apache.solr.search.mlt.SimpleMLTQParserTest.doTest(SimpleMLTQParserTest.java:82)
	at java.base/jdk.internal.reflect.NativeMethodAccessorImpl.invoke0(Native Method)
	at java.base/jdk.internal.reflect.NativeMethodAccessorImpl.invoke(NativeMethodAccessorImpl.java:62)
	at java.base/jdk.internal.reflect.DelegatingMethodAccessorImpl.invoke(DelegatingMethodAccessorImpl.java:43)
	at java.base/java.lang.reflect.Method.invoke(Method.java:567)
	at com.carrotsearch.randomizedtesting.RandomizedRunner.invoke(RandomizedRunner.java:1750)
	at com.carrotsearch.randomizedtesting.RandomizedRunner$8.evaluate(RandomizedRunner.java:938)
	at com.carrotsearch.randomizedtesting.RandomizedRunner$9.evaluate(RandomizedRunner.java:974)
	at com.carrotsearch.randomizedtesting.RandomizedRunner$10.evaluate(RandomizedRunner.java:988)
	at com.carrotsearch.randomizedtesting.rules.SystemPropertiesRestoreRule$1.evaluate(SystemPropertiesRestoreRule.java:57)
	at org.apache.lucene.util.TestRuleSetupTeardownChained$1.evaluate(TestRuleSetupTeardownChained.java:49)
	at org.apache.lucene.util.AbstractBeforeAfterRule$1.evaluate(AbstractBeforeAfterRule.java:45)
	at org.apache.lucene.util.TestRuleThreadAndTestName$1.evaluate(TestRuleThreadAndTestName.java:48)
	at org.apache.lucene.util.TestRuleIgnoreAfterMaxFailures$1.evaluate(TestRuleIgnoreAfterMaxFailures.java:64)
	at org.apache.lucene.util.TestRuleMarkFailure$1.evaluate(TestRuleMarkFailure.java:47)
	at com.carrotsearch.randomizedtesting.rules.StatementAdapter.evaluate(StatementAdapter.java:36)
	at com.carrotsearch.randomizedtesting.ThreadLeakControl$StatementRunner.run(ThreadLeakControl.java:368)
	at com.carrotsearch.randomizedtesting.ThreadLeakControl.forkTimeoutingTask(ThreadLeakControl.java:817)
	at com.carrotsearch.randomizedtesting.ThreadLeakControl$3.evaluate(ThreadLeakControl.java:468)
	at com.carrotsearch.randomizedtesting.RandomizedRunner.runSingleTest(RandomizedRunner.java:947)
	at com.carrotsearch.randomizedtesting.RandomizedRunner$5.evaluate(RandomizedRunner.java:832)
	at com.carrotsearch.randomizedtesting.RandomizedRunner$6.evaluate(RandomizedRunner.java:883)
	at com.carrotsearch.randomizedtesting.RandomizedRunner$7.evaluate(RandomizedRunner.java:894)
	at com.carrotsearch.randomizedtesting.rules.StatementAdapter.evaluate(StatementAdapter.java:36)
	at com.carrotsearch.randomizedtesting.rules.SystemPropertiesRestoreRule$1.evaluate(SystemPropertiesRestoreRule.java:57)
	at org.apache.lucene.util.AbstractBeforeAfterRule$1.evaluate(AbstractBeforeAfterRule.java:45)
	at com.carrotsearch.randomizedtesting.rules.StatementAdapter.evaluate(StatementAdapter.java:36)
	at org.apache.lucene.util.TestRuleStoreClassName$1.evaluate(TestRuleStoreClassName.java:41)
	at com.carrotsearch.randomizedtesting.rules.NoShadowingOrOverridesOnMethodsRule$1.evaluate(NoShadowingOrOverridesOnMethodsRule.java:40)
	at com.carrotsearch.randomizedtesting.rules.NoShadowingOrOverridesOnMethodsRule$1.evaluate(NoShadowingOrOverridesOnMethodsRule.java:40)
	at com.carrotsearch.randomizedtesting.rules.StatementAdapter.evaluate(StatementAdapter.java:36)
	at com.carrotsearch.randomizedtesting.rules.StatementAdapter.evaluate(StatementAdapter.java:36)
	at org.apache.lucene.util.TestRuleAssertionsRequired$1.evaluate(TestRuleAssertionsRequired.java:53)
	at org.apache.lucene.util.TestRuleMarkFailure$1.evaluate(TestRuleMarkFailure.java:47)
	at org.apache.lucene.util.TestRuleIgnoreAfterMaxFailures$1.evaluate(TestRuleIgnoreAfterMaxFailures.java:64)
	at org.apache.lucene.util.TestRuleIgnoreTestSuites$1.evaluate(TestRuleIgnoreTestSuites.java:54)
	at com.carrotsearch.randomizedtesting.rules.StatementAdapter.evaluate(StatementAdapter.java:36)
	at com.carrotsearch.randomizedtesting.ThreadLeakControl$StatementRunner.run(ThreadLeakControl.java:368)
	at java.base/java.lang.Thread.run(Thread.java:835)
Caused by: java.lang.RuntimeException: REQUEST FAILED: xpath=//result/doc[1]/str[@name='id'][.='13']
	xml response was: <?xml version="1.0" encoding="UTF-8"?>
<response>
<lst name="responseHeader"><int name="status">0</int><int name="QTime">50</int></lst><result name="response" numFound="16" start="0"><doc><str name="id">16</str><arr name="range_facet_l"><long>16</long></arr><int name="id_i1">16</int><arr name="range_facet_l_dv"><long>16</long></arr><arr name="range_facet_i_dv"><int>16</int></arr><arr name="lowerfilt"><str>The slim red fox jumped over the lazy brown dogs.</str></arr><arr name="lowerfilt1and2"><str>The slim red fox jumped over the lazy brown dogs.</str></arr><arr name="multiDefault"><str>muLti-Default</str></arr><int name="intDefault">42</int><date name="timestamp">2019-08-06T11:22:27.394Z</date><long name="_version_">1641116385825259520</long><int name="intDvoDefault">42</int></doc><doc><str name="id">18</str><arr name="range_facet_l"><long>18</long></arr><int name="id_i1">18</int><arr name="range_facet_l_dv"><long>18</long></arr><arr name="range_facet_i_dv"><int>18</int></arr><arr name="lowerfilt"><str>The quote red fox jumped over the lazy brown dogs.</str></arr><arr name="lowerfilt1and2"><str>The quote red fox jumped over the lazy brown dogs.</str></arr><arr name="multiDefault"><str>muLti-Default</str></arr><int name="intDefault">42</int><date name="timestamp">2019-08-06T11:22:27.420Z</date><long name="_version_">1641116385851473920</long><int name="intDvoDefault">42</int></doc><doc><str name="id">19</str><arr name="range_facet_l"><long>19</long></arr><int name="id_i1">19</int><arr name="range_facet_l_dv"><long>19</long></arr><arr name="range_facet_i_dv"><int>19</int></arr><arr name="lowerfilt"><str>The hose red fox jumped over the lazy brown dogs.</str></arr><arr name="lowerfilt1and2"><str>The hose red fox jumped over the lazy brown dogs.</str></arr><arr name="multiDefault"><str>muLti-Default</str></arr><int name="intDefault">42</int><date name="timestamp">2019-08-06T11:22:27.439Z</date><long name="_version_">1641116385887125504</long><int name="intDvoDefault">42</int></doc><doc><str name="id">20</str><arr name="range_facet_l"><long>20</long></arr><int name="id_i1">20</int><arr name="range_facet_l_dv"><long>20</long></arr><arr name="range_facet_i_dv"><int>20</int></arr><arr name="lowerfilt"><str>The quote red fox jumped over the lazy brown dogs.</str></arr><arr name="lowerfilt1and2"><str>The quote red fox jumped over the lazy brown dogs.</str></arr><arr name="multiDefault"><str>muLti-Default</str></arr><int name="intDefault">42</int><date name="timestamp">2019-08-06T11:22:27.456Z</date><long name="_version_">1641116385894465536</long><int name="intDvoDefault">42</int></doc><doc><str name="id">21</str><arr name="range_facet_l"><long>21</long></arr><int name="id_i1">21</int><arr name="range_facet_l_dv"><long>21</long></arr><arr name="range_facet_i_dv"><int>21</int></arr><arr name="lowerfilt"><str>The court red fox jumped over the lazy brown dogs.</str></arr><arr name="lowerfilt1and2"><str>The court red fox jumped over the lazy brown dogs.</str></arr><arr name="multiDefault"><str>muLti-Default</str></arr><int name="intDefault">42</int><date name="timestamp">2019-08-06T11:22:27.463Z</date><long name="_version_">1641116385898659840</long><int name="intDvoDefault">42</int></doc><doc><str name="id">22</str><arr name="range_facet_l"><long>22</long></arr><int name="id_i1">22</int><arr name="range_facet_l_dv"><long>22</long></arr><arr name="range_facet_i_dv"><int>22</int></arr><arr name="lowerfilt"><str>The quote red fox jumped over the lazy brown dogs.</str></arr><arr name="lowerfilt1and2"><str>The quote red fox jumped over the lazy brown dogs.</str></arr><arr name="multiDefault"><str>muLti-Default</str></arr><int name="intDefault">42</int><date name="timestamp">2019-08-06T11:22:27.467Z</date><long name="_version_">1641116385900756992</long><int name="intDvoDefault">42</int></doc><doc><str name="id">23</str><arr name="range_facet_l"><long>23</long></arr><int name="id_i1">23</int><arr name="range_facet_l_dv"><long>23</long></arr><arr name="range_facet_i_dv"><int>23</int></arr><arr name="lowerfilt"><str>The quote red fox jumped over the lazy brown dogs.</str></arr><arr name="lowerfilt1and2"><str>The quote red fox jumped over the lazy brown dogs.</str></arr><arr name="multiDefault"><str>muLti-Default</str></arr><int name="intDefault">42</int><date name="timestamp">2019-08-06T11:22:27.469Z</date><long name="_version_">1641116385903902720</long><int name="intDvoDefault">42</int></doc><doc><str name="id">24</str><arr name="range_facet_l"><long>24</long></arr><int name="id_i1">24</int><arr name="range_facet_l_dv"><long>24</long></arr><arr name="range_facet_i_dv"><int>24</int></arr><arr name="lowerfilt"><str>The file red fox jumped over the lazy brown dogs.</str></arr><arr name="lowerfilt1and2"><str>The file red fox jumped over the lazy brown dogs.</str></arr><arr name="multiDefault"><str>muLti-Default</str></arr><int name="intDefault">42</int><date name="timestamp">2019-08-06T11:22:27.471Z</date><long name="_version_">1641116385905999872</long><int name="intDvoDefault">42</int></doc><doc><str name="id">30</str><arr name="range_facet_l"><long>30</long></arr><int name="id_i1">30</int><arr name="range_facet_l_dv"><long>30</long></arr><arr name="range_facet_i_dv"><int>30</int></arr><arr name="lowerfilt"><str>The quote red fox jumped over the lazy brown dogs.</str></arr><arr name="lowerfilt1and2"><str>The quote red fox jumped over the lazy brown dogs.</str><str>red green yellow</str></arr><arr name="lowerfilt1"><str>red green yellow</str></arr><arr name="multiDefault"><str>muLti-Default</str></arr><int name="intDefault">42</int><date name="timestamp">2019-08-06T11:22:27.622Z</date><long name="_version_">1641116386063286272</long><int name="intDvoDefault">42</int></doc><doc><str name="id">31</str><arr name="range_facet_l"><long>31</long></arr><int name="id_i1">31</int><arr name="range_facet_l_dv"><long>31</long></arr><arr name="range_facet_i_dv"><int>31</int></arr><arr name="lowerfilt"><str>The fat red fox jumped over the lazy brown dogs.</str></arr><arr name="lowerfilt1and2"><str>The fat red fox jumped over the lazy brown dogs.</str><str>green blue yellow</str></arr><arr name="lowerfilt1"><str>green blue yellow</str></arr><arr name="multiDefault"><str>muLti-Default</str></arr><int name="intDefault">42</int><date name="timestamp">2019-08-06T11:22:27.625Z</date><long name="_version_">1641116386066432000</long><int name="intDvoDefault">42</int></doc></result>
</response>

	request was:q={!mlt+qf%3Dlowerfilt}17
	at org.apache.solr.SolrTestCaseJ4.assertQ(SolrTestCaseJ4.java:940)
	... 40 more


FAILED:  org.apache.solr.search.mlt.SimpleMLTQParserTest.doTest

Error Message:
Exception during query

Stack Trace:
java.lang.RuntimeException: Exception during query
	at __randomizedtesting.SeedInfo.seed([A9C4229C0DE00686:E809A38605B153F]:0)
	at org.apache.solr.SolrTestCaseJ4.assertQ(SolrTestCaseJ4.java:947)
	at org.apache.solr.SolrTestCaseJ4.assertQ(SolrTestCaseJ4.java:907)
	at org.apache.solr.search.mlt.SimpleMLTQParserTest.doTest(SimpleMLTQParserTest.java:82)
	at java.base/jdk.internal.reflect.NativeMethodAccessorImpl.invoke0(Native Method)
	at java.base/jdk.internal.reflect.NativeMethodAccessorImpl.invoke(NativeMethodAccessorImpl.java:62)
	at java.base/jdk.internal.reflect.DelegatingMethodAccessorImpl.invoke(DelegatingMethodAccessorImpl.java:43)
	at java.base/java.lang.reflect.Method.invoke(Method.java:567)
	at com.carrotsearch.randomizedtesting.RandomizedRunner.invoke(RandomizedRunner.java:1750)
	at com.carrotsearch.randomizedtesting.RandomizedRunner$8.evaluate(RandomizedRunner.java:938)
	at com.carrotsearch.randomizedtesting.RandomizedRunner$9.evaluate(RandomizedRunner.java:974)
	at com.carrotsearch.randomizedtesting.RandomizedRunner$10.evaluate(RandomizedRunner.java:988)
	at com.carrotsearch.randomizedtesting.rules.SystemPropertiesRestoreRule$1.evaluate(SystemPropertiesRestoreRule.java:57)
	at org.apache.lucene.util.TestRuleSetupTeardownChained$1.evaluate(TestRuleSetupTeardownChained.java:49)
	at org.apache.lucene.util.AbstractBeforeAfterRule$1.evaluate(AbstractBeforeAfterRule.java:45)
	at org.apache.lucene.util.TestRuleThreadAndTestName$1.evaluate(TestRuleThreadAndTestName.java:48)
	at org.apache.lucene.util.TestRuleIgnoreAfterMaxFailures$1.evaluate(TestRuleIgnoreAfterMaxFailures.java:64)
	at org.apache.lucene.util.TestRuleMarkFailure$1.evaluate(TestRuleMarkFailure.java:47)
	at com.carrotsearch.randomizedtesting.rules.StatementAdapter.evaluate(StatementAdapter.java:36)
	at com.carrotsearch.randomizedtesting.ThreadLeakControl$StatementRunner.run(ThreadLeakControl.java:368)
	at com.carrotsearch.randomizedtesting.ThreadLeakControl.forkTimeoutingTask(ThreadLeakControl.java:817)
	at com.carrotsearch.randomizedtesting.ThreadLeakControl$3.evaluate(ThreadLeakControl.java:468)
	at com.carrotsearch.randomizedtesting.RandomizedRunner.runSingleTest(RandomizedRunner.java:947)
	at com.carrotsearch.randomizedtesting.RandomizedRunner$5.evaluate(RandomizedRunner.java:832)
	at com.carrotsearch.randomizedtesting.RandomizedRunner$6.evaluate(RandomizedRunner.java:883)
	at com.carrotsearch.randomizedtesting.RandomizedRunner$7.evaluate(RandomizedRunner.java:894)
	at com.carrotsearch.randomizedtesting.rules.StatementAdapter.evaluate(StatementAdapter.java:36)
	at com.carrotsearch.randomizedtesting.rules.SystemPropertiesRestoreRule$1.evaluate(SystemPropertiesRestoreRule.java:57)
	at org.apache.lucene.util.AbstractBeforeAfterRule$1.evaluate(AbstractBeforeAfterRule.java:45)
	at com.carrotsearch.randomizedtesting.rules.StatementAdapter.evaluate(StatementAdapter.java:36)
	at org.apache.lucene.util.TestRuleStoreClassName$1.evaluate(TestRuleStoreClassName.java:41)
	at com.carrotsearch.randomizedtesting.rules.NoShadowingOrOverridesOnMethodsRule$1.evaluate(NoShadowingOrOverridesOnMethodsRule.java:40)
	at com.carrotsearch.randomizedtesting.rules.NoShadowingOrOverridesOnMethodsRule$1.evaluate(NoShadowingOrOverridesOnMethodsRule.java:40)
	at com.carrotsearch.randomizedtesting.rules.StatementAdapter.evaluate(StatementAdapter.java:36)
	at com.carrotsearch.randomizedtesting.rules.StatementAdapter.evaluate(StatementAdapter.java:36)
	at org.apache.lucene.util.TestRuleAssertionsRequired$1.evaluate(TestRuleAssertionsRequired.java:53)
	at org.apache.lucene.util.TestRuleMarkFailure$1.evaluate(TestRuleMarkFailure.java:47)
	at org.apache.lucene.util.TestRuleIgnoreAfterMaxFailures$1.evaluate(TestRuleIgnoreAfterMaxFailures.java:64)
	at org.apache.lucene.util.TestRuleIgnoreTestSuites$1.evaluate(TestRuleIgnoreTestSuites.java:54)
	at com.carrotsearch.randomizedtesting.rules.StatementAdapter.evaluate(StatementAdapter.java:36)
	at com.carrotsearch.randomizedtesting.ThreadLeakControl$StatementRunner.run(ThreadLeakControl.java:368)
	at java.base/java.lang.Thread.run(Thread.java:835)
Caused by: java.lang.RuntimeException: REQUEST FAILED: xpath=//result/doc[1]/str[@name='id'][.='13']
	xml response was: <?xml version="1.0" encoding="UTF-8"?>
<response>
<lst name="responseHeader"><int name="status">0</int><int name="QTime">2</int></lst><result name="response" numFound="16" start="0"><doc><str name="id">16</str><arr name="range_facet_l"><long>16</long></arr><int name="id_i1">16</int><arr name="range_facet_l_dv"><long>16</long></arr><arr name="range_facet_i_dv"><int>16</int></arr><arr name="lowerfilt"><str>The slim red fox jumped over the lazy brown dogs.</str></arr><arr name="lowerfilt1and2"><str>The slim red fox jumped over the lazy brown dogs.</str></arr><arr name="multiDefault"><str>muLti-Default</str></arr><int name="intDefault">42</int><date name="timestamp">2019-08-06T11:22:30.587Z</date><long name="_version_">1641116389172314112</long><int name="intDvoDefault">42</int></doc><doc><str name="id">18</str><arr name="range_facet_l"><long>18</long></arr><int name="id_i1">18</int><arr name="range_facet_l_dv"><long>18</long></arr><arr name="range_facet_i_dv"><int>18</int></arr><arr name="lowerfilt"><str>The quote red fox jumped over the lazy brown dogs.</str></arr><arr name="lowerfilt1and2"><str>The quote red fox jumped over the lazy brown dogs.</str></arr><arr name="multiDefault"><str>muLti-Default</str></arr><int name="intDefault">42</int><date name="timestamp">2019-08-06T11:22:30.591Z</date><long name="_version_">1641116389176508416</long><int name="intDvoDefault">42</int></doc><doc><str name="id">19</str><arr name="range_facet_l"><long>19</long></arr><int name="id_i1">19</int><arr name="range_facet_l_dv"><long>19</long></arr><arr name="range_facet_i_dv"><int>19</int></arr><arr name="lowerfilt"><str>The hose red fox jumped over the lazy brown dogs.</str></arr><arr name="lowerfilt1and2"><str>The hose red fox jumped over the lazy brown dogs.</str></arr><arr name="multiDefault"><str>muLti-Default</str></arr><int name="intDefault">42</int><date name="timestamp">2019-08-06T11:22:30.593Z</date><long name="_version_">1641116389178605568</long><int name="intDvoDefault">42</int></doc><doc><str name="id">20</str><arr name="range_facet_l"><long>20</long></arr><int name="id_i1">20</int><arr name="range_facet_l_dv"><long>20</long></arr><arr name="range_facet_i_dv"><int>20</int></arr><arr name="lowerfilt"><str>The quote red fox jumped over the lazy brown dogs.</str></arr><arr name="lowerfilt1and2"><str>The quote red fox jumped over the lazy brown dogs.</str></arr><arr name="multiDefault"><str>muLti-Default</str></arr><int name="intDefault">42</int><date name="timestamp">2019-08-06T11:22:30.594Z</date><long name="_version_">1641116389180702720</long><int name="intDvoDefault">42</int></doc><doc><str name="id">21</str><arr name="range_facet_l"><long>21</long></arr><int name="id_i1">21</int><arr name="range_facet_l_dv"><long>21</long></arr><arr name="range_facet_i_dv"><int>21</int></arr><arr name="lowerfilt"><str>The court red fox jumped over the lazy brown dogs.</str></arr><arr name="lowerfilt1and2"><str>The court red fox jumped over the lazy brown dogs.</str></arr><arr name="multiDefault"><str>muLti-Default</str></arr><int name="intDefault">42</int><date name="timestamp">2019-08-06T11:22:30.596Z</date><long name="_version_">1641116389181751296</long><int name="intDvoDefault">42</int></doc><doc><str name="id">22</str><arr name="range_facet_l"><long>22</long></arr><int name="id_i1">22</int><arr name="range_facet_l_dv"><long>22</long></arr><arr name="range_facet_i_dv"><int>22</int></arr><arr name="lowerfilt"><str>The quote red fox jumped over the lazy brown dogs.</str></arr><arr name="lowerfilt1and2"><str>The quote red fox jumped over the lazy brown dogs.</str></arr><arr name="multiDefault"><str>muLti-Default</str></arr><int name="intDefault">42</int><date name="timestamp">2019-08-06T11:22:30.598Z</date><long name="_version_">1641116389183848448</long><int name="intDvoDefault">42</int></doc><doc><str name="id">23</str><arr name="range_facet_l"><long>23</long></arr><int name="id_i1">23</int><arr name="range_facet_l_dv"><long>23</long></arr><arr name="range_facet_i_dv"><int>23</int></arr><arr name="lowerfilt"><str>The quote red fox jumped over the lazy brown dogs.</str></arr><arr name="lowerfilt1and2"><str>The quote red fox jumped over the lazy brown dogs.</str></arr><arr name="multiDefault"><str>muLti-Default</str></arr><int name="intDefault">42</int><date name="timestamp">2019-08-06T11:22:30.600Z</date><long name="_version_">1641116389185945600</long><int name="intDvoDefault">42</int></doc><doc><str name="id">24</str><arr name="range_facet_l"><long>24</long></arr><int name="id_i1">24</int><arr name="range_facet_l_dv"><long>24</long></arr><arr name="range_facet_i_dv"><int>24</int></arr><arr name="lowerfilt"><str>The file red fox jumped over the lazy brown dogs.</str></arr><arr name="lowerfilt1and2"><str>The file red fox jumped over the lazy brown dogs.</str></arr><arr name="multiDefault"><str>muLti-Default</str></arr><int name="intDefault">42</int><date name="timestamp">2019-08-06T11:22:30.601Z</date><long name="_version_">1641116389188042752</long><int name="intDvoDefault">42</int></doc><doc><str name="id">30</str><arr name="range_facet_l"><long>30</long></arr><int name="id_i1">30</int><arr name="range_facet_l_dv"><long>30</long></arr><arr name="range_facet_i_dv"><int>30</int></arr><arr name="lowerfilt"><str>The quote red fox jumped over the lazy brown dogs.</str></arr><arr name="lowerfilt1and2"><str>The quote red fox jumped over the lazy brown dogs.</str><str>red green yellow</str></arr><arr name="lowerfilt1"><str>red green yellow</str></arr><arr name="multiDefault"><str>muLti-Default</str></arr><int name="intDefault">42</int><date name="timestamp">2019-08-06T11:22:30.620Z</date><long name="_version_">1641116389206917120</long><int name="intDvoDefault">42</int></doc><doc><str name="id">31</str><arr name="range_facet_l"><long>31</long></arr><int name="id_i1">31</int><arr name="range_facet_l_dv"><long>31</long></arr><arr name="range_facet_i_dv"><int>31</int></arr><arr name="lowerfilt"><str>The fat red fox jumped over the lazy brown dogs.</str></arr><arr name="lowerfilt1and2"><str>The fat red fox jumped over the lazy brown dogs.</str><str>green blue yellow</str></arr><arr name="lowerfilt1"><str>green blue yellow</str></arr><arr name="multiDefault"><str>muLti-Default</str></arr><int name="intDefault">42</int><date name="timestamp">2019-08-06T11:22:30.622Z</date><long name="_version_">1641116389210062848</long><int name="intDvoDefault">42</int></doc></result>
</response>

	request was:q={!mlt+qf%3Dlowerfilt}17
	at org.apache.solr.SolrTestCaseJ4.assertQ(SolrTestCaseJ4.java:940)
	... 40 more


FAILED:  org.apache.solr.search.mlt.SimpleMLTQParserTest.doTest

Error Message:
Exception during query

Stack Trace:
java.lang.RuntimeException: Exception during query
	at __randomizedtesting.SeedInfo.seed([A9C4229C0DE00686:E809A38605B153F]:0)
	at org.apache.solr.SolrTestCaseJ4.assertQ(SolrTestCaseJ4.java:947)
	at org.apache.solr.SolrTestCaseJ4.assertQ(SolrTestCaseJ4.java:907)
	at org.apache.solr.search.mlt.SimpleMLTQParserTest.doTest(SimpleMLTQParserTest.java:82)
	at java.base/jdk.internal.reflect.NativeMethodAccessorImpl.invoke0(Native Method)
	at java.base/jdk.internal.reflect.NativeMethodAccessorImpl.invoke(NativeMethodAccessorImpl.java:62)
	at java.base/jdk.internal.reflect.DelegatingMethodAccessorImpl.invoke(DelegatingMethodAccessorImpl.java:43)
	at java.base/java.lang.reflect.Method.invoke(Method.java:567)
	at com.carrotsearch.randomizedtesting.RandomizedRunner.invoke(RandomizedRunner.java:1750)
	at com.carrotsearch.randomizedtesting.RandomizedRunner$8.evaluate(RandomizedRunner.java:938)
	at com.carrotsearch.randomizedtesting.RandomizedRunner$9.evaluate(RandomizedRunner.java:974)
	at com.carrotsearch.randomizedtesting.RandomizedRunner$10.evaluate(RandomizedRunner.java:988)
	at com.carrotsearch.randomizedtesting.rules.SystemPropertiesRestoreRule$1.evaluate(SystemPropertiesRestoreRule.java:57)
	at org.apache.lucene.util.TestRuleSetupTeardownChained$1.evaluate(TestRuleSetupTeardownChained.java:49)
	at org.apache.lucene.util.AbstractBeforeAfterRule$1.evaluate(AbstractBeforeAfterRule.java:45)
	at org.apache.lucene.util.TestRuleThreadAndTestName$1.evaluate(TestRuleThreadAndTestName.java:48)
	at org.apache.lucene.util.TestRuleIgnoreAfterMaxFailures$1.evaluate(TestRuleIgnoreAfterMaxFailures.java:64)
	at org.apache.lucene.util.TestRuleMarkFailure$1.evaluate(TestRuleMarkFailure.java:47)
	at com.carrotsearch.randomizedtesting.rules.StatementAdapter.evaluate(StatementAdapter.java:36)
	at com.carrotsearch.randomizedtesting.ThreadLeakControl$StatementRunner.run(ThreadLeakControl.java:368)
	at com.carrotsearch.randomizedtesting.ThreadLeakControl.forkTimeoutingTask(ThreadLeakControl.java:817)
	at com.carrotsearch.randomizedtesting.ThreadLeakControl$3.evaluate(ThreadLeakControl.java:468)
	at com.carrotsearch.randomizedtesting.RandomizedRunner.runSingleTest(RandomizedRunner.java:947)
	at com.carrotsearch.randomizedtesting.RandomizedRunner$5.evaluate(RandomizedRunner.java:832)
	at com.carrotsearch.randomizedtesting.RandomizedRunner$6.evaluate(RandomizedRunner.java:883)
	at com.carrotsearch.randomizedtesting.RandomizedRunner$7.evaluate(RandomizedRunner.java:894)
	at com.carrotsearch.randomizedtesting.rules.StatementAdapter.evaluate(StatementAdapter.java:36)
	at com.carrotsearch.randomizedtesting.rules.SystemPropertiesRestoreRule$1.evaluate(SystemPropertiesRestoreRule.java:57)
	at org.apache.lucene.util.AbstractBeforeAfterRule$1.evaluate(AbstractBeforeAfterRule.java:45)
	at com.carrotsearch.randomizedtesting.rules.StatementAdapter.evaluate(StatementAdapter.java:36)
	at org.apache.lucene.util.TestRuleStoreClassName$1.evaluate(TestRuleStoreClassName.java:41)
	at com.carrotsearch.randomizedtesting.rules.NoShadowingOrOverridesOnMethodsRule$1.evaluate(NoShadowingOrOverridesOnMethodsRule.java:40)
	at com.carrotsearch.randomizedtesting.rules.NoShadowingOrOverridesOnMethodsRule$1.evaluate(NoShadowingOrOverridesOnMethodsRule.java:40)
	at com.carrotsearch.randomizedtesting.rules.StatementAdapter.evaluate(StatementAdapter.java:36)
	at com.carrotsearch.randomizedtesting.rules.StatementAdapter.evaluate(StatementAdapter.java:36)
	at org.apache.lucene.util.TestRuleAssertionsRequired$1.evaluate(TestRuleAssertionsRequired.java:53)
	at org.apache.lucene.util.TestRuleMarkFailure$1.evaluate(TestRuleMarkFailure.java:47)
	at org.apache.lucene.util.TestRuleIgnoreAfterMaxFailures$1.evaluate(TestRuleIgnoreAfterMaxFailures.java:64)
	at org.apache.lucene.util.TestRuleIgnoreTestSuites$1.evaluate(TestRuleIgnoreTestSuites.java:54)
	at com.carrotsearch.randomizedtesting.rules.StatementAdapter.evaluate(StatementAdapter.java:36)
	at com.carrotsearch.randomizedtesting.ThreadLeakControl$StatementRunner.run(ThreadLeakControl.java:368)
	at java.base/java.lang.Thread.run(Thread.java:835)
Caused by: java.lang.RuntimeException: REQUEST FAILED: xpath=//result/doc[1]/str[@name='id'][.='13']
	xml response was: <?xml version="1.0" encoding="UTF-8"?>
<response>
<lst name="responseHeader"><int name="status">0</int><int name="QTime">1</int></lst><result name="response" numFound="16" start="0"><doc><str name="id">16</str><arr name="range_facet_l"><long>16</long></arr><int name="id_i1">16</int><arr name="range_facet_l_dv"><long>16</long></arr><arr name="range_facet_i_dv"><int>16</int></arr><arr name="lowerfilt"><str>The slim red fox jumped over the lazy brown dogs.</str></arr><arr name="lowerfilt1and2"><str>The slim red fox jumped over the lazy brown dogs.</str></arr><arr name="multiDefault"><str>muLti-Default</str></arr><int name="intDefault">42</int><date name="timestamp">2019-08-06T11:22:30.749Z</date><long name="_version_">1641116389343232000</long><int name="intDvoDefault">42</int></doc><doc><str name="id">18</str><arr name="range_facet_l"><long>18</long></arr><int name="id_i1">18</int><arr name="range_facet_l_dv"><long>18</long></arr><arr name="range_facet_i_dv"><int>18</int></arr><arr name="lowerfilt"><str>The quote red fox jumped over the lazy brown dogs.</str></arr><arr name="lowerfilt1and2"><str>The quote red fox jumped over the lazy brown dogs.</str></arr><arr name="multiDefault"><str>muLti-Default</str></arr><int name="intDefault">42</int><date name="timestamp">2019-08-06T11:22:30.757Z</date><long name="_version_">1641116389350572032</long><int name="intDvoDefault">42</int></doc><doc><str name="id">19</str><arr name="range_facet_l"><long>19</long></arr><int name="id_i1">19</int><arr name="range_facet_l_dv"><long>19</long></arr><arr name="range_facet_i_dv"><int>19</int></arr><arr name="lowerfilt"><str>The hose red fox jumped over the lazy brown dogs.</str></arr><arr name="lowerfilt1and2"><str>The hose red fox jumped over the lazy brown dogs.</str></arr><arr name="multiDefault"><str>muLti-Default</str></arr><int name="intDefault">42</int><date name="timestamp">2019-08-06T11:22:30.764Z</date><long name="_version_">1641116389358960640</long><int name="intDvoDefault">42</int></doc><doc><str name="id">20</str><arr name="range_facet_l"><long>20</long></arr><int name="id_i1">20</int><arr name="range_facet_l_dv"><long>20</long></arr><arr name="range_facet_i_dv"><int>20</int></arr><arr name="lowerfilt"><str>The quote red fox jumped over the lazy brown dogs.</str></arr><arr name="lowerfilt1and2"><str>The quote red fox jumped over the lazy brown dogs.</str></arr><arr name="multiDefault"><str>muLti-Default</str></arr><int name="intDefault">42</int><date name="timestamp">2019-08-06T11:22:30.767Z</date><long name="_version_">1641116389361057792</long><int name="intDvoDefault">42</int></doc><doc><str name="id">21</str><arr name="range_facet_l"><long>21</long></arr><int name="id_i1">21</int><arr name="range_facet_l_dv"><long>21</long></arr><arr name="range_facet_i_dv"><int>21</int></arr><arr name="lowerfilt"><str>The court red fox jumped over the lazy brown dogs.</str></arr><arr name="lowerfilt1and2"><str>The court red fox jumped over the lazy brown dogs.</str></arr><arr name="multiDefault"><str>muLti-Default</str></arr><int name="intDefault">42</int><date name="timestamp">2019-08-06T11:22:30.770Z</date><long name="_version_">1641116389364203520</long><int name="intDvoDefault">42</int></doc><doc><str name="id">22</str><arr name="range_facet_l"><long>22</long></arr><int name="id_i1">22</int><arr name="range_facet_l_dv"><long>22</long></arr><arr name="range_facet_i_dv"><int>22</int></arr><arr name="lowerfilt"><str>The quote red fox jumped over the lazy brown dogs.</str></arr><arr name="lowerfilt1and2"><str>The quote red fox jumped over the lazy brown dogs.</str></arr><arr name="multiDefault"><str>muLti-Default</str></arr><int name="intDefault">42</int><date name="timestamp">2019-08-06T11:22:30.775Z</date><long name="_version_">1641116389369446400</long><int name="intDvoDefault">42</int></doc><doc><str name="id">23</str><arr name="range_facet_l"><long>23</long></arr><int name="id_i1">23</int><arr name="range_facet_l_dv"><long>23</long></arr><arr name="range_facet_i_dv"><int>23</int></arr><arr name="lowerfilt"><str>The quote red fox jumped over the lazy brown dogs.</str></arr><arr name="lowerfilt1and2"><str>The quote red fox jumped over the lazy brown dogs.</str></arr><arr name="multiDefault"><str>muLti-Default</str></arr><int name="intDefault">42</int><date name="timestamp">2019-08-06T11:22:30.777Z</date><long name="_version_">1641116389371543552</long><int name="intDvoDefault">42</int></doc><doc><str name="id">24</str><arr name="range_facet_l"><long>24</long></arr><int name="id_i1">24</int><arr name="range_facet_l_dv"><long>24</long></arr><arr name="range_facet_i_dv"><int>24</int></arr><arr name="lowerfilt"><str>The file red fox jumped over the lazy brown dogs.</str></arr><arr name="lowerfilt1and2"><str>The file red fox jumped over the lazy brown dogs.</str></arr><arr name="multiDefault"><str>muLti-Default</str></arr><int name="intDefault">42</int><date name="timestamp">2019-08-06T11:22:30.779Z</date><long name="_version_">1641116389373640704</long><int name="intDvoDefault">42</int></doc><doc><str name="id">30</str><arr name="range_facet_l"><long>30</long></arr><int name="id_i1">30</int><arr name="range_facet_l_dv"><long>30</long></arr><arr name="range_facet_i_dv"><int>30</int></arr><arr name="lowerfilt"><str>The quote red fox jumped over the lazy brown dogs.</str></arr><arr name="lowerfilt1and2"><str>The quote red fox jumped over the lazy brown dogs.</str><str>red green yellow</str></arr><arr name="lowerfilt1"><str>red green yellow</str></arr><arr name="multiDefault"><str>muLti-Default</str></arr><int name="intDefault">42</int><date name="timestamp">2019-08-06T11:22:30.797Z</date><long name="_version_">1641116389393563648</long><int name="intDvoDefault">42</int></doc><doc><str name="id">31</str><arr name="range_facet_l"><long>31</long></arr><int name="id_i1">31</int><arr name="range_facet_l_dv"><long>31</long></arr><arr name="range_facet_i_dv"><int>31</int></arr><arr name="lowerfilt"><str>The fat red fox jumped over the lazy brown dogs.</str></arr><arr name="lowerfilt1and2"><str>The fat red fox jumped over the lazy brown dogs.</str><str>green blue yellow</str></arr><arr name="lowerfilt1"><str>green blue yellow</str></arr><arr name="multiDefault"><str>muLti-Default</str></arr><int name="intDefault">42</int><date name="timestamp">2019-08-06T11:22:30.800Z</date><long name="_version_">1641116389395660800</long><int name="intDvoDefault">42</int></doc></result>
</response>

	request was:q={!mlt+qf%3Dlowerfilt}17
	at org.apache.solr.SolrTestCaseJ4.assertQ(SolrTestCaseJ4.java:940)
	... 40 more


FAILED:  org.apache.solr.search.mlt.SimpleMLTQParserTest.doTest

Error Message:
Exception during query

Stack Trace:
java.lang.RuntimeException: Exception during query
	at __randomizedtesting.SeedInfo.seed([A9C4229C0DE00686:E809A38605B153F]:0)
	at org.apache.solr.SolrTestCaseJ4.assertQ(SolrTestCaseJ4.java:947)
	at org.apache.solr.SolrTestCaseJ4.assertQ(SolrTestCaseJ4.java:907)
	at org.apache.solr.search.mlt.SimpleMLTQParserTest.doTest(SimpleMLTQParserTest.java:82)
	at java.base/jdk.internal.reflect.NativeMethodAccessorImpl.invoke0(Native Method)
	at java.base/jdk.internal.reflect.NativeMethodAccessorImpl.invoke(NativeMethodAccessorImpl.java:62)
	at java.base/jdk.internal.reflect.DelegatingMethodAccessorImpl.invoke(DelegatingMethodAccessorImpl.java:43)
	at java.base/java.lang.reflect.Method.invoke(Method.java:567)
	at com.carrotsearch.randomizedtesting.RandomizedRunner.invoke(RandomizedRunner.java:1750)
	at com.carrotsearch.randomizedtesting.RandomizedRunner$8.evaluate(RandomizedRunner.java:938)
	at com.carrotsearch.randomizedtesting.RandomizedRunner$9.evaluate(RandomizedRunner.java:974)
	at com.carrotsearch.randomizedtesting.RandomizedRunner$10.evaluate(RandomizedRunner.java:988)
	at com.carrotsearch.randomizedtesting.rules.SystemPropertiesRestoreRule$1.evaluate(SystemPropertiesRestoreRule.java:57)
	at org.apache.lucene.util.TestRuleSetupTeardownChained$1.evaluate(TestRuleSetupTeardownChained.java:49)
	at org.apache.lucene.util.AbstractBeforeAfterRule$1.evaluate(AbstractBeforeAfterRule.java:45)
	at org.apache.lucene.util.TestRuleThreadAndTestName$1.evaluate(TestRuleThreadAndTestName.java:48)
	at org.apache.lucene.util.TestRuleIgnoreAfterMaxFailures$1.evaluate(TestRuleIgnoreAfterMaxFailures.java:64)
	at org.apache.lucene.util.TestRuleMarkFailure$1.evaluate(TestRuleMarkFailure.java:47)
	at com.carrotsearch.randomizedtesting.rules.StatementAdapter.evaluate(StatementAdapter.java:36)
	at com.carrotsearch.randomizedtesting.ThreadLeakControl$StatementRunner.run(ThreadLeakControl.java:368)
	at com.carrotsearch.randomizedtesting.ThreadLeakControl.forkTimeoutingTask(ThreadLeakControl.java:817)
	at com.carrotsearch.randomizedtesting.ThreadLeakControl$3.evaluate(ThreadLeakControl.java:468)
	at com.carrotsearch.randomizedtesting.RandomizedRunner.runSingleTest(RandomizedRunner.java:947)
	at com.carrotsearch.randomizedtesting.RandomizedRunner$5.evaluate(RandomizedRunner.java:832)
	at com.carrotsearch.randomizedtesting.RandomizedRunner$6.evaluate(RandomizedRunner.java:883)
	at com.carrotsearch.randomizedtesting.RandomizedRunner$7.evaluate(RandomizedRunner.java:894)
	at com.carrotsearch.randomizedtesting.rules.StatementAdapter.evaluate(StatementAdapter.java:36)
	at com.carrotsearch.randomizedtesting.rules.SystemPropertiesRestoreRule$1.evaluate(SystemPropertiesRestoreRule.java:57)
	at org.apache.lucene.util.AbstractBeforeAfterRule$1.evaluate(AbstractBeforeAfterRule.java:45)
	at com.carrotsearch.randomizedtesting.rules.StatementAdapter.evaluate(StatementAdapter.java:36)
	at org.apache.lucene.util.TestRuleStoreClassName$1.evaluate(TestRuleStoreClassName.java:41)
	at com.carrotsearch.randomizedtesting.rules.NoShadowingOrOverridesOnMethodsRule$1.evaluate(NoShadowingOrOverridesOnMethodsRule.java:40)
	at com.carrotsearch.randomizedtesting.rules.NoShadowingOrOverridesOnMethodsRule$1.evaluate(NoShadowingOrOverridesOnMethodsRule.java:40)
	at com.carrotsearch.randomizedtesting.rules.StatementAdapter.evaluate(StatementAdapter.java:36)
	at com.carrotsearch.randomizedtesting.rules.StatementAdapter.evaluate(StatementAdapter.java:36)
	at org.apache.lucene.util.TestRuleAssertionsRequired$1.evaluate(TestRuleAssertionsRequired.java:53)
	at org.apache.lucene.util.TestRuleMarkFailure$1.evaluate(TestRuleMarkFailure.java:47)
	at org.apache.lucene.util.TestRuleIgnoreAfterMaxFailures$1.evaluate(TestRuleIgnoreAfterMaxFailures.java:64)
	at org.apache.lucene.util.TestRuleIgnoreTestSuites$1.evaluate(TestRuleIgnoreTestSuites.java:54)
	at com.carrotsearch.randomizedtesting.rules.StatementAdapter.evaluate(StatementAdapter.java:36)
	at com.carrotsearch.randomizedtesting.ThreadLeakControl$StatementRunner.run(ThreadLeakControl.java:368)
	at java.base/java.lang.Thread.run(Thread.java:835)
Caused by: java.lang.RuntimeException: REQUEST FAILED: xpath=//result/doc[1]/str[@name='id'][.='13']
	xml response was: <?xml version="1.0" encoding="UTF-8"?>
<response>
<lst name="responseHeader"><int name="status">0</int><int name="QTime">1</int></lst><result name="response" numFound="16" start="0"><doc><str name="id">16</str><arr name="range_facet_l"><long>16</long></arr><int name="id_i1">16</int><arr name="range_facet_l_dv"><long>16</long></arr><arr name="range_facet_i_dv"><int>16</int></arr><arr name="lowerfilt"><str>The slim red fox jumped over the lazy brown dogs.</str></arr><arr name="lowerfilt1and2"><str>The slim red fox jumped over the lazy brown dogs.</str></arr><arr name="multiDefault"><str>muLti-Default</str></arr><int name="intDefault">42</int><date name="timestamp">2019-08-06T11:05:50.547Z</date><long name="_version_">1641115340554371072</long><int name="intDvoDefault">42</int></doc><doc><str name="id">18</str><arr name="range_facet_l"><long>18</long></arr><int name="id_i1">18</int><arr name="range_facet_l_dv"><long>18</long></arr><arr name="range_facet_i_dv"><int>18</int></arr><arr name="lowerfilt"><str>The quote red fox jumped over the lazy brown dogs.</str></arr><arr name="lowerfilt1and2"><str>The quote red fox jumped over the lazy brown dogs.</str></arr><arr name="multiDefault"><str>muLti-Default</str></arr><int name="intDefault">42</int><date name="timestamp">2019-08-06T11:05:50.548Z</date><long name="_version_">1641115340555419649</long><int name="intDvoDefault">42</int></doc><doc><str name="id">19</str><arr name="range_facet_l"><long>19</long></arr><int name="id_i1">19</int><arr name="range_facet_l_dv"><long>19</long></arr><arr name="range_facet_i_dv"><int>19</int></arr><arr name="lowerfilt"><str>The hose red fox jumped over the lazy brown dogs.</str></arr><arr name="lowerfilt1and2"><str>The hose red fox jumped over the lazy brown dogs.</str></arr><arr name="multiDefault"><str>muLti-Default</str></arr><int name="intDefault">42</int><date name="timestamp">2019-08-06T11:05:50.548Z</date><long name="_version_">1641115340555419650</long><int name="intDvoDefault">42</int></doc><doc><str name="id">20</str><arr name="range_facet_l"><long>20</long></arr><int name="id_i1">20</int><arr name="range_facet_l_dv"><long>20</long></arr><arr name="range_facet_i_dv"><int>20</int></arr><arr name="lowerfilt"><str>The quote red fox jumped over the lazy brown dogs.</str></arr><arr name="lowerfilt1and2"><str>The quote red fox jumped over the lazy brown dogs.</str></arr><arr name="multiDefault"><str>muLti-Default</str></arr><int name="intDefault">42</int><date name="timestamp">2019-08-06T11:05:50.548Z</date><long name="_version_">1641115340555419651</long><int name="intDvoDefault">42</int></doc><doc><str name="id">21</str><arr name="range_facet_l"><long>21</long></arr><int name="id_i1">21</int><arr name="range_facet_l_dv"><long>21</long></arr><arr name="range_facet_i_dv"><int>21</int></arr><arr name="lowerfilt"><str>The court red fox jumped over the lazy brown dogs.</str></arr><arr name="lowerfilt1and2"><str>The court red fox jumped over the lazy brown dogs.</str></arr><arr name="multiDefault"><str>muLti-Default</str></arr><int name="intDefault">42</int><date name="timestamp">2019-08-06T11:05:50.548Z</date><long name="_version_">1641115340555419652</long><int name="intDvoDefault">42</int></doc><doc><str name="id">22</str><arr name="range_facet_l"><long>22</long></arr><int name="id_i1">22</int><arr name="range_facet_l_dv"><long>22</long></arr><arr name="range_facet_i_dv"><int>22</int></arr><arr name="lowerfilt"><str>The quote red fox jumped over the lazy brown dogs.</str></arr><arr name="lowerfilt1and2"><str>The quote red fox jumped over the lazy brown dogs.</str></arr><arr name="multiDefault"><str>muLti-Default</str></arr><int name="intDefault">42</int><date name="timestamp">2019-08-06T11:05:50.549Z</date><long name="_version_">1641115340556468224</long><int name="intDvoDefault">42</int></doc><doc><str name="id">23</str><arr name="range_facet_l"><long>23</long></arr><int name="id_i1">23</int><arr name="range_facet_l_dv"><long>23</long></arr><arr name="range_facet_i_dv"><int>23</int></arr><arr name="lowerfilt"><str>The quote red fox jumped over the lazy brown dogs.</str></arr><arr name="lowerfilt1and2"><str>The quote red fox jumped over the lazy brown dogs.</str></arr><arr name="multiDefault"><str>muLti-Default</str></arr><int name="intDefault">42</int><date name="timestamp">2019-08-06T11:05:50.549Z</date><long name="_version_">1641115340556468225</long><int name="intDvoDefault">42</int></doc><doc><str name="id">24</str><arr name="range_facet_l"><long>24</long></arr><int name="id_i1">24</int><arr name="range_facet_l_dv"><long>24</long></arr><arr name="range_facet_i_dv"><int>24</int></arr><arr name="lowerfilt"><str>The file red fox jumped over the lazy brown dogs.</str></arr><arr name="lowerfilt1and2"><str>The file red fox jumped over the lazy brown dogs.</str></arr><arr name="multiDefault"><str>muLti-Default</str></arr><int name="intDefault">42</int><date name="timestamp">2019-08-06T11:05:50.549Z</date><long name="_version_">1641115340556468226</long><int name="intDvoDefault">42</int></doc><doc><str name="id">30</str><arr name="range_facet_l"><long>30</long></arr><int name="id_i1">30</int><arr name="range_facet_l_dv"><long>30</long></arr><arr name="range_facet_i_dv"><int>30</int></arr><arr name="lowerfilt"><str>The quote red fox jumped over the lazy brown dogs.</str></arr><arr name="lowerfilt1and2"><str>The quote red fox jumped over the lazy brown dogs.</str><str>red green yellow</str></arr><arr name="lowerfilt1"><str>red green yellow</str></arr><arr name="multiDefault"><str>muLti-Default</str></arr><int name="intDefault">42</int><date name="timestamp">2019-08-06T11:05:50.553Z</date><long name="_version_">1641115340560662528</long><int name="intDvoDefault">42</int></doc><doc><str name="id">31</str><arr name="range_facet_l"><long>31</long></arr><int name="id_i1">31</int><arr name="range_facet_l_dv"><long>31</long></arr><arr name="range_facet_i_dv"><int>31</int></arr><arr name="lowerfilt"><str>The fat red fox jumped over the lazy brown dogs.</str></arr><arr name="lowerfilt1and2"><str>The fat red fox jumped over the lazy brown dogs.</str><str>green blue yellow</str></arr><arr name="lowerfilt1"><str>green blue yellow</str></arr><arr name="multiDefault"><str>muLti-Default</str></arr><int name="intDefault">42</int><date name="timestamp">2019-08-06T11:05:50.553Z</date><long name="_version_">1641115340560662529</long><int name="intDvoDefault">42</int></doc></result>
</response>

	request was:q={!mlt+qf%3Dlowerfilt}17
	at org.apache.solr.SolrTestCaseJ4.assertQ(SolrTestCaseJ4.java:940)
	... 40 more




Build Log:
[...truncated 15892 lines...]
   [junit4] Suite: org.apache.solr.search.mlt.SimpleMLTQParserTest
   [junit4]   2> 2585384 INFO  (SUITE-SimpleMLTQParserTest-seed#[A9C4229C0DE00686]-worker) [     ] o.a.s.SolrTestCaseJ4 SecureRandom sanity checks: test.solr.allowed.securerandom=null & java.security.egd=file:/dev/./urandom
   [junit4]   2> Creating dataDir: /home/jenkins/workspace/Lucene-Solr-8.2-Linux/solr/build/solr-core/test/J1/temp/solr.search.mlt.SimpleMLTQParserTest_A9C4229C0DE00686-001/init-core-data-001
   [junit4]   2> 2585385 WARN  (SUITE-SimpleMLTQParserTest-seed#[A9C4229C0DE00686]-worker) [     ] o.a.s.SolrTestCaseJ4 startTrackingSearchers: numOpens=17 numCloses=17
   [junit4]   2> 2585385 INFO  (SUITE-SimpleMLTQParserTest-seed#[A9C4229C0DE00686]-worker) [     ] o.a.s.SolrTestCaseJ4 Using PointFields (NUMERIC_POINTS_SYSPROP=true) w/NUMERIC_DOCVALUES_SYSPROP=false
   [junit4]   2> 2585396 INFO  (SUITE-SimpleMLTQParserTest-seed#[A9C4229C0DE00686]-worker) [     ] o.a.s.SolrTestCaseJ4 Randomized ssl (false) and clientAuth (false) via: @org.apache.solr.util.RandomizeSSL(reason="", ssl=0.0/0.0, value=0.0/0.0, clientAuth=0.0/0.0)
   [junit4]   2> 2585396 INFO  (SUITE-SimpleMLTQParserTest-seed#[A9C4229C0DE00686]-worker) [     ] o.a.s.SolrTestCaseJ4 ####initCore
   [junit4]   2> 2585396 INFO  (SUITE-SimpleMLTQParserTest-seed#[A9C4229C0DE00686]-worker) [     ] o.a.s.c.SolrResourceLoader [null] Added 2 libs to classloader, from paths: [/home/jenkins/workspace/Lucene-Solr-8.2-Linux/solr/core/src/test-files/solr/collection1/lib, /home/jenkins/workspace/Lucene-Solr-8.2-Linux/solr/core/src/test-files/solr/collection1/lib/classes]
   [junit4]   2> 2585411 INFO  (SUITE-SimpleMLTQParserTest-seed#[A9C4229C0DE00686]-worker) [     ] o.a.s.c.SolrConfig Using Lucene MatchVersion: 8.2.1
   [junit4]   2> 2585442 INFO  (SUITE-SimpleMLTQParserTest-seed#[A9C4229C0DE00686]-worker) [     ] o.a.s.s.IndexSchema [null] Schema name=test
   [junit4]   2> 2585545 INFO  (SUITE-SimpleMLTQParserTest-seed#[A9C4229C0DE00686]-worker) [     ] o.a.s.s.IndexSchema Loaded schema test/1.0 with uniqueid field id
   [junit4]   2> 2585677 INFO  (SUITE-SimpleMLTQParserTest-seed#[A9C4229C0DE00686]-worker) [     ] o.a.s.h.c.HttpShardHandlerFactory Host whitelist initialized: WhitelistHostChecker [whitelistHosts=null, whitelistHostCheckingEnabled=true]
   [junit4]   2> 2585678 WARN  (SUITE-SimpleMLTQParserTest-seed#[A9C4229C0DE00686]-worker) [     ] o.e.j.u.s.S.config Trusting all certificates configured for Client@33dc1f09[provider=null,keyStore=null,trustStore=null]
   [junit4]   2> 2585678 WARN  (SUITE-SimpleMLTQParserTest-seed#[A9C4229C0DE00686]-worker) [     ] o.e.j.u.s.S.config No Client EndPointIdentificationAlgorithm configured for Client@33dc1f09[provider=null,keyStore=null,trustStore=null]
   [junit4]   2> 2585681 WARN  (SUITE-SimpleMLTQParserTest-seed#[A9C4229C0DE00686]-worker) [     ] o.e.j.u.s.S.config Trusting all certificates configured for Client@3151ba34[provider=null,keyStore=null,trustStore=null]
   [junit4]   2> 2585681 WARN  (SUITE-SimpleMLTQParserTest-seed#[A9C4229C0DE00686]-worker) [     ] o.e.j.u.s.S.config No Client EndPointIdentificationAlgorithm configured for Client@3151ba34[provider=null,keyStore=null,trustStore=null]
   [junit4]   2> 2585693 INFO  (SUITE-SimpleMLTQParserTest-seed#[A9C4229C0DE00686]-worker) [     ] o.a.s.c.TransientSolrCoreCacheDefault Allocating transient cache for 2147483647 transient cores
   [junit4]   2> 2585693 INFO  (SUITE-SimpleMLTQParserTest-seed#[A9C4229C0DE00686]-worker) [     ] o.a.s.h.a.MetricsHistoryHandler No .system collection, keeping metrics history in memory.
   [junit4]   2> 2585709 INFO  (SUITE-SimpleMLTQParserTest-seed#[A9C4229C0DE00686]-worker) [     ] o.a.s.m.r.SolrJmxReporter JMX monitoring for 'solr.node' (registry 'solr.node') enabled at server: com.sun.jmx.mbeanserver.JmxMBeanServer@62e81048
   [junit4]   2> 2585718 INFO  (SUITE-SimpleMLTQParserTest-seed#[A9C4229C0DE00686]-worker) [     ] o.a.s.m.r.SolrJmxReporter JMX monitoring for 'solr.jvm' (registry 'solr.jvm') enabled at server: com.sun.jmx.mbeanserver.JmxMBeanServer@62e81048
   [junit4]   2> 2585719 INFO  (SUITE-SimpleMLTQParserTest-seed#[A9C4229C0DE00686]-worker) [     ] o.a.s.m.r.SolrJmxReporter JMX monitoring for 'solr.jetty' (registry 'solr.jetty') enabled at server: com.sun.jmx.mbeanserver.JmxMBeanServer@62e81048
   [junit4]   2> 2585720 INFO  (coreLoadExecutor-13414-thread-1) [    x:collection1 ] o.a.s.c.SolrResourceLoader [null] Added 2 libs to classloader, from paths: [/home/jenkins/workspace/Lucene-Solr-8.2-Linux/solr/core/src/test-files/solr/collection1/lib, /home/jenkins/workspace/Lucene-Solr-8.2-Linux/solr/core/src/test-files/solr/collection1/lib/classes]
   [junit4]   2> 2585737 INFO  (coreLoadExecutor-13414-thread-1) [    x:collection1 ] o.a.s.c.SolrConfig Using Lucene MatchVersion: 8.2.1
   [junit4]   2> 2585765 INFO  (coreLoadExecutor-13414-thread-1) [    x:collection1 ] o.a.s.s.IndexSchema [collection1] Schema name=test
   [junit4]   2> 2585848 INFO  (coreLoadExecutor-13414-thread-1) [    x:collection1 ] o.a.s.s.IndexSchema Loaded schema test/1.0 with uniqueid field id
   [junit4]   2> 2585853 INFO  (coreLoadExecutor-13414-thread-1) [    x:collection1 ] o.a.s.c.CoreContainer Creating SolrCore 'collection1' using configuration from instancedir /home/jenkins/workspace/Lucene-Solr-8.2-Linux/solr/core/src/test-files/solr/collection1, trusted=true
   [junit4]   2> 2585854 INFO  (coreLoadExecutor-13414-thread-1) [    x:collection1 ] o.a.s.m.r.SolrJmxReporter JMX monitoring for 'solr.core.collection1' (registry 'solr.core.collection1') enabled at server: com.sun.jmx.mbeanserver.JmxMBeanServer@62e81048
   [junit4]   2> 2585854 INFO  (coreLoadExecutor-13414-thread-1) [    x:collection1 ] o.a.s.c.SolrCore [[collection1] ] Opening new SolrCore at [/home/jenkins/workspace/Lucene-Solr-8.2-Linux/solr/core/src/test-files/solr/collection1], dataDir=[/home/jenkins/workspace/Lucene-Solr-8.2-Linux/solr/build/solr-core/test/J1/temp/solr.search.mlt.SimpleMLTQParserTest_A9C4229C0DE00686-001/init-core-data-001/]
   [junit4]   2> 2585855 INFO  (coreLoadExecutor-13414-thread-1) [    x:collection1 ] o.a.s.u.RandomMergePolicy RandomMergePolicy wrapping class org.apache.lucene.index.TieredMergePolicy: [TieredMergePolicy: maxMergeAtOnce=23, maxMergeAtOnceExplicit=11, maxMergedSegmentMB=41.9619140625, floorSegmentMB=1.564453125, forceMergeDeletesPctAllowed=21.394016995093562, segmentsPerTier=29.0, maxCFSSegmentSizeMB=8.796093022207999E12, noCFSRatio=1.0, deletesPctAllowed=37.11717318582622
   [junit4]   2> 2585887 INFO  (coreLoadExecutor-13414-thread-1) [    x:collection1 ] o.a.s.u.UpdateHandler Using UpdateLog implementation: org.apache.solr.update.UpdateLog
   [junit4]   2> 2585887 INFO  (coreLoadExecutor-13414-thread-1) [    x:collection1 ] o.a.s.u.UpdateLog Initializing UpdateLog: dataDir= defaultSyncLevel=FLUSH numRecordsToKeep=100 maxNumLogsToKeep=10 numVersionBuckets=65536
   [junit4]   2> 2585888 INFO  (coreLoadExecutor-13414-thread-1) [    x:collection1 ] o.a.s.u.CommitTracker Hard AutoCommit: disabled
   [junit4]   2> 2585888 INFO  (coreLoadExecutor-13414-thread-1) [    x:collection1 ] o.a.s.u.CommitTracker Soft AutoCommit: disabled
   [junit4]   2> 2585888 INFO  (coreLoadExecutor-13414-thread-1) [    x:collection1 ] o.a.s.u.RandomMergePolicy RandomMergePolicy wrapping class org.apache.lucene.index.MockRandomMergePolicy: org.apache.lucene.index.MockRandomMergePolicy@25a3b1c5
   [junit4]   2> 2585889 INFO  (coreLoadExecutor-13414-thread-1) [    x:collection1 ] o.a.s.s.SolrIndexSearcher Opening [Searcher@4be96326[collection1] main]
   [junit4]   2> 2585889 INFO  (coreLoadExecutor-13414-thread-1) [    x:collection1 ] o.a.s.h.c.SpellCheckComponent Initializing spell checkers
   [junit4]   2> 2585977 INFO  (coreLoadExecutor-13414-thread-1) [    x:collection1 ] o.a.s.s.DirectSolrSpellChecker init: {name=direct,classname=DirectSolrSpellChecker,field=lowerfilt,minQueryLength=3}
   [junit4]   2> 2586070 INFO  (coreLoadExecutor-13414-thread-1) [    x:collection1 ] o.a.s.h.ReplicationHandler Commits will be reserved for 10000ms.
   [junit4]   2> 2586070 INFO  (coreLoadExecutor-13414-thread-1) [    x:collection1 ] o.a.s.u.UpdateLog Could not find max version in index or recent updates, using new clock 1641115340536545280
   [junit4]   2> 2586071 INFO  (searcherExecutor-13415-thread-1-processing-x:collection1) [    x:collection1 ] o.a.s.h.c.SpellCheckComponent Loading spell index for spellchecker: default
   [junit4]   2> 2586072 INFO  (searcherExecutor-13415-thread-1-processing-x:collection1) [    x:collection1 ] o.a.s.h.c.SpellCheckComponent Loading spell index for spellchecker: direct
   [junit4]   2> 2586072 INFO  (searcherExecutor-13415-thread-1-processing-x:collection1) [    x:collection1 ] o.a.s.h.c.SpellCheckComponent Loading spell index for spellchecker: wordbreak
   [junit4]   2> 2586072 INFO  (searcherExecutor-13415-thread-1-processing-x:collection1) [    x:collection1 ] o.a.s.h.c.SpellCheckComponent Loading spell index for spellchecker: multipleFields
   [junit4]   2> 2586072 INFO  (searcherExecutor-13415-thread-1-processing-x:collection1) [    x:collection1 ] o.a.s.h.c.SpellCheckComponent Loading spell index for spellchecker: jarowinkler
   [junit4]   2> 2586072 INFO  (searcherExecutor-13415-thread-1-processing-x:collection1) [    x:collection1 ] o.a.s.h.c.SpellCheckComponent Loading spell index for spellchecker: external
   [junit4]   2> 2586072 INFO  (SUITE-SimpleMLTQParserTest-seed#[A9C4229C0DE00686]-worker) [     ] o.a.s.SolrTestCaseJ4 ####initCore end
   [junit4]   2> 2586073 INFO  (searcherExecutor-13415-thread-1-processing-x:collection1) [    x:collection1 ] o.a.s.h.c.SpellCheckComponent Loading spell index for spellchecker: freq
   [junit4]   2> 2586073 INFO  (searcherExecutor-13415-thread-1-processing-x:collection1) [    x:collection1 ] o.a.s.h.c.SpellCheckComponent Loading spell index for spellchecker: fqcn
   [junit4]   2> 2586073 INFO  (searcherExecutor-13415-thread-1-processing-x:collection1) [    x:collection1 ] o.a.s.h.c.SpellCheckComponent Loading spell index for spellchecker: perDict
   [junit4]   2> 2586074 INFO  (searcherExecutor-13415-thread-1-processing-x:collection1) [    x:collection1 ] o.a.s.c.SolrCore [collection1] Registered new searcher Searcher@4be96326[collection1] main{ExitableDirectoryReader(UninvertingDirectoryReader())}
   [junit4]   2> 2586076 INFO  (TEST-SimpleMLTQParserTest.doTest-seed#[A9C4229C0DE00686]) [     ] o.a.s.SolrTestCaseJ4 ###Starting doTest
   [junit4]   2> 2586078 INFO  (TEST-SimpleMLTQParserTest.doTest-seed#[A9C4229C0DE00686]) [     ] o.a.s.u.p.LogUpdateProcessorFactory [collection1]  webapp=null path=null params={}{add=[1 (1641115340543885312)]} 0 1
   [junit4]   2> 2586080 INFO  (TEST-SimpleMLTQParserTest.doTest-seed#[A9C4229C0DE00686]) [     ] o.a.s.u.p.LogUpdateProcessorFactory [collection1]  webapp=null path=null params={}{add=[2 (1641115340545982464)]} 0 0
   [junit4]   2> 2586080 INFO  (TEST-SimpleMLTQParserTest.doTest-seed#[A9C4229C0DE00686]) [     ] o.a.s.u.p.LogUpdateProcessorFactory [collection1]  webapp=null path=null params={}{add=[3 (1641115340547031040)]} 0 0
   [junit4]   2> 2586080 INFO  (TEST-SimpleMLTQParserTest.doTest-seed#[A9C4229C0DE00686]) [     ] o.a.s.u.p.LogUpdateProcessorFactory [collection1]  webapp=null path=null params={}{add=[4 (1641115340547031041)]} 0 0
   [junit4]   2> 2586080 INFO  (TEST-SimpleMLTQParserTest.doTest-seed#[A9C4229C0DE00686]) [     ] o.a.s.u.p.LogUpdateProcessorFactory [collection1]  webapp=null path=null params={}{add=[5 (1641115340547031042)]} 0 0
   [junit4]   2> 2586080 INFO  (TEST-SimpleMLTQParserTest.doTest-seed#[A9C4229C0DE00686]) [     ] o.a.s.u.p.LogUpdateProcessorFactory [collection1]  webapp=null path=null params={}{add=[6 (1641115340547031043)]} 0 0
   [junit4]   2> 2586081 INFO  (TEST-SimpleMLTQParserTest.doTest-seed#[A9C4229C0DE00686]) [     ] o.a.s.u.p.LogUpdateProcessorFactory [collection1]  webapp=null path=null params={}{add=[7 (1641115340548079616)]} 0 0
   [junit4]   2> 2586081 INFO  (TEST-SimpleMLTQParserTest.doTest-seed#[A9C4229C0DE00686]) [     ] o.a.s.u.p.LogUpdateProcessorFactory [collection1]  webapp=null path=null params={}{add=[8 (1641115340548079617)]} 0 0
   [junit4]   2> 2586081 INFO  (TEST-SimpleMLTQParserTest.doTest-seed#[A9C4229C0DE00686]) [     ] o.a.s.u.p.LogUpdateProcessorFactory [collection1]  webapp=null path=null params={}{add=[9 (1641115340548079618)]} 0 0
   [junit4]   2> 2586081 INFO  (TEST-SimpleMLTQParserTest.doTest-seed#[A9C4229C0DE00686]) [     ] o.a.s.u.p.LogUpdateProcessorFactory [collection1]  webapp=null path=null params={}{add=[10 (1641115340548079619)]} 0 0
   [junit4]   2> 2586081 INFO  (TEST-SimpleMLTQParserTest.doTest-seed#[A9C4229C0DE00686]) [     ] o.a.s.u.p.LogUpdateProcessorFactory [collection1]  webapp=null path=null params={}{add=[12 (1641115340548079620)]} 0 0
   [junit4]   2> 2586082 INFO  (TEST-SimpleMLTQParserTest.doTest-seed#[A9C4229C0DE00686]) [     ] o.a.s.u.p.LogUpdateProcessorFactory [collection1]  webapp=null path=null params={}{add=[13 (1641115340549128192)]} 0 0
   [junit4]   2> 2586082 INFO  (TEST-SimpleMLTQParserTest.doTest-seed#[A9C4229C0DE00686]) [     ] o.a.s.u.p.LogUpdateProcessorFactory [collection1]  webapp=null path=null params={}{add=[14 (1641115340549128193)]} 0 0
   [junit4]   2> 2586087 INFO  (TEST-SimpleMLTQParserTest.doTest-seed#[A9C4229C0DE00686]) [     ] o.a.s.u.p.LogUpdateProcessorFactory [collection1]  webapp=null path=null params={}{add=[15 (1641115340549128194)]} 0 4
   [junit4]   2> 2586087 INFO  (TEST-SimpleMLTQParserTest.doTest-seed#[A9C4229C0DE00686]) [     ] o.a.s.u.p.LogUpdateProcessorFactory [collection1]  webapp=null path=null params={}{add=[16 (1641115340554371072)]} 0 0
   [junit4]   2> 2586088 INFO  (TEST-SimpleMLTQParserTest.doTest-seed#[A9C4229C0DE00686]) [     ] o.a.s.u.p.LogUpdateProcessorFactory [collection1]  webapp=null path=null params={}{add=[17 (1641115340555419648)]} 0 0
   [junit4]   2> 2586088 INFO  (TEST-SimpleMLTQParserTest.doTest-seed#[A9C4229C0DE00686]) [     ] o.a.s.u.p.LogUpdateProcessorFactory [collection1]  webapp=null path=null params={}{add=[18 (1641115340555419649)]} 0 0
   [junit4]   2> 2586088 INFO  (TEST-SimpleMLTQParserTest.doTest-seed#[A9C4229C0DE00686]) [     ] o.a.s.u.p.LogUpdateProcessorFactory [collection1]  webapp=null path=null params={}{add=[19 (1641115340555419650)]} 0 0
   [junit4]   2> 2586088 INFO  (TEST-SimpleMLTQParserTest.doTest-seed#[A9C4229C0DE00686]) [     ] o.a.s.u.p.LogUpdateProcessorFactory [collection1]  webapp=null path=null params={}{add=[20 (1641115340555419651)]} 0 0
   [junit4]   2> 2586089 INFO  (TEST-SimpleMLTQParserTest.doTest-seed#[A9C4229C0DE00686]) [     ] o.a.s.u.p.LogUpdateProcessorFactory [collection1]  webapp=null path=null params={}{add=[21 (1641115340555419652)]} 0 0
   [junit4]   2> 2586089 INFO  (TEST-SimpleMLTQParserTest.doTest-seed#[A9C4229C0DE00686]) [     ] o.a.s.u.p.LogUpdateProcessorFactory [collection1]  webapp=null path=null params={}{add=[22 (1641115340556468224)]} 0 0
   [junit4]   2> 2586089 INFO  (TEST-SimpleMLTQParserTest.doTest-seed#[A9C4229C0DE00686]) [     ] o.a.s.u.p.LogUpdateProcessorFactory [collection1]  webapp=null path=null params={}{add=[23 (1641115340556468225)]} 0 0
   [junit4]   2> 2586089 INFO  (TEST-SimpleMLTQParserTest.doTest-seed#[A9C4229C0DE00686]) [     ] o.a.s.u.p.LogUpdateProcessorFactory [collection1]  webapp=null path=null params={}{add=[24 (1641115340556468226)]} 0 0
   [junit4]   2> 2586089 INFO  (TEST-SimpleMLTQParserTest.doTest-seed#[A9C4229C0DE00686]) [     ] o.a.s.u.p.LogUpdateProcessorFactory [collection1]  webapp=null path=null params={}{add=[25 (1641115340556468227)]} 0 0
   [junit4]   2> 2586089 INFO  (TEST-SimpleMLTQParserTest.doTest-seed#[A9C4229C0DE00686]) [     ] o.a.s.u.p.LogUpdateProcessorFactory [collection1]  webapp=null path=null params={}{add=[26 (1641115340556468228)]} 0 0
   [junit4]   2> 2586090 INFO  (TEST-SimpleMLTQParserTest.doTest-seed#[A9C4229C0DE00686]) [     ] o.a.s.u.p.LogUpdateProcessorFactory [collection1]  webapp=null path=null params={}{add=[27 (1641115340557516800)]} 0 0
   [junit4]   2> 2586090 INFO  (TEST-SimpleMLTQParserTest.doTest-seed#[A9C4229C0DE00686]) [     ] o.a.s.u.p.LogUpdateProcessorFactory [collection1]  webapp=null path=null params={}{add=[28 (1641115340557516801)]} 0 0
   [junit4]   2> 2586092 INFO  (TEST-SimpleMLTQParserTest.doTest-seed#[A9C4229C0DE00686]) [     ] o.a.s.u.p.LogUpdateProcessorFactory [collection1]  webapp=null path=null params={}{add=[29 (1641115340557516802)]} 0 2
   [junit4]   2> 2586093 INFO  (TEST-SimpleMLTQParserTest.doTest-seed#[A9C4229C0DE00686]) [     ] o.a.s.u.p.LogUpdateProcessorFactory [collection1]  webapp=null path=null params={}{add=[30 (1641115340560662528)]} 0 0
   [junit4]   2> 2586093 INFO  (TEST-SimpleMLTQParserTest.doTest-seed#[A9C4229C0DE00686]) [     ] o.a.s.u.p.LogUpdateProcessorFactory [collection1]  webapp=null path=null params={}{add=[31 (1641115340560662529)]} 0 0
   [junit4]   2> 2586093 INFO  (TEST-SimpleMLTQParserTest.doTest-seed#[A9C4229C0DE00686]) [     ] o.a.s.u.p.LogUpdateProcessorFactory [collection1]  webapp=null path=null params={}{add=[32 (1641115340560662530)]} 0 0
   [junit4]   2> 2586094 INFO  (TEST-SimpleMLTQParserTest.doTest-seed#[A9C4229C0DE00686]) [     ] o.a.s.u.DirectUpdateHandler2 start commit{_version_=1641115340561711104,optimize=false,openSearcher=true,waitSearcher=true,expungeDeletes=false,softCommit=false,prepareCommit=false}
   [junit4]   2> 2586094 INFO  (TEST-SimpleMLTQParserTest.doTest-seed#[A9C4229C0DE00686]) [     ] o.a.s.u.SolrIndexWriter Calling setCommitData with IW:org.apache.solr.update.SolrIndexWriter@686efbe9 commitCommandVersion:1641115340561711104
   [junit4]   2> 2586100 INFO  (TEST-SimpleMLTQParserTest.doTest-seed#[A9C4229C0DE00686]) [     ] o.a.s.s.SolrIndexSearcher Opening [Searcher@4e4a5012[collection1] main]
   [junit4]   2> 2586101 INFO  (TEST-SimpleMLTQParserTest.doTest-seed#[A9C4229C0DE00686]) [     ] o.a.s.u.DirectUpdateHandler2 end_commit_flush
   [junit4]   2> 2586102 INFO  (searcherExecutor-13415-thread-1) [     ] o.a.s.c.SolrCore [collection1] Registered new searcher Searcher@4e4a5012[collection1] main{ExitableDirectoryReader(UninvertingDirectoryReader(Uninverting(_3(8.2.1):c31:[diagnostics={os=Linux, java.version=12.0.1, os.arch=amd64, java.runtime.version=12.0.1+12, source=merge, os.version=5.0.0-23-generic, java.vendor=AdoptOpenJDK, java.vm.version=12.0.1+12, lucene.version=8.2.1, mergeMaxNumSegments=-1, mergeFactor=3, timestamp=1565089550556}])))}
   [junit4]   2> 2586103 INFO  (TEST-SimpleMLTQParserTest.doTest-seed#[A9C4229C0DE00686]) [     ] o.a.s.u.p.LogUpdateProcessorFactory [collection1]  webapp=null path=null params={}{commit=} 0 8
   [junit4]   2> 2586104 INFO  (TEST-SimpleMLTQParserTest.doTest-seed#[A9C4229C0DE00686]) [     ] o.a.s.c.S.Request [collection1]  webapp=null path=null params={q={!mlt+qf%3Dlowerfilt}17} hits=16 status=0 QTime=1
   [junit4]   2> 2586105 ERROR (TEST-SimpleMLTQParserTest.doTest-seed#[A9C4229C0DE00686]) [     ] o.a.s.SolrTestCaseJ4 REQUEST FAILED: xpath=//result/doc[1]/str[@name='id'][.='13']
   [junit4]   2> 	xml response was: <?xml version="1.0" encoding="UTF-8"?>
   [junit4]   2> <response>
   [junit4]   2> <lst name="responseHeader"><int name="status">0</int><int name="QTime">1</int></lst><result name="response" numFound="16" start="0"><doc><str name="id">16</str><arr name="range_facet_l"><long>16</long></arr><int name="id_i1">16</int><arr name="range_facet_l_dv"><long>16</long></arr><arr name="range_facet_i_dv"><int>16</int></arr><arr name="lowerfilt"><str>The slim red fox jumped over the lazy brown dogs.</str></arr><arr name="lowerfilt1and2"><str>The slim red fox jumped over the lazy brown dogs.</str></arr><arr name="multiDefault"><str>muLti-Default</str></arr><int name="intDefault">42</int><date name="timestamp">2019-08-06T11:05:50.547Z</date><long name="_version_">1641115340554371072</long><int name="intDvoDefault">42</int></doc><doc><str name="id">18</str><arr name="range_facet_l"><long>18</long></arr><int name="id_i1">18</int><arr name="range_facet_l_dv"><long>18</long></arr><arr name="range_facet_i_dv"><int>18</int></arr><arr name="lowerfilt"><str>The quote red fox jumped over the lazy brown dogs.</str></arr><arr name="lowerfilt1and2"><str>The quote red fox jumped over the lazy brown dogs.</str></arr><arr name="multiDefault"><str>muLti-Default</str></arr><int name="intDefault">42</int><date name="timestamp">2019-08-06T11:05:50.548Z</date><long name="_version_">1641115340555419649</long><int name="intDvoDefault">42</int></doc><doc><str name="id">19</str><arr name="range_facet_l"><long>19</long></arr><int name="id_i1">19</int><arr name="range_facet_l_dv"><long>19</long></arr><arr name="range_facet_i_dv"><int>19</int></arr><arr name="lowerfilt"><str>The hose red fox jumped over the lazy brown dogs.</str></arr><arr name="lowerfilt1and2"><str>The hose red fox jumped over the lazy brown dogs.</str></arr><arr name="multiDefault"><str>muLti-Default</str></arr><int name="intDefault">42</int><date name="timestamp">2019-08-06T11:05:50.548Z</date><long name="_version_">1641115340555419650</long><int name="intDvoDefault">42</int></doc><doc><str name="id">20</str><arr name="range_facet_l"><long>20</long></arr><int name="id_i1">20</int><arr name="range_facet_l_dv"><long>20</long></arr><arr name="range_facet_i_dv"><int>20</int></arr><arr name="lowerfilt"><str>The quote red fox jumped over the lazy brown dogs.</str></arr><arr name="lowerfilt1and2"><str>The quote red fox jumped over the lazy brown dogs.</str></arr><arr name="multiDefault"><str>muLti-Default</str></arr><int name="intDefault">42</int><date name="timestamp">2019-08-06T11:05:50.548Z</date><long name="_version_">1641115340555419651</long><int name="intDvoDefault">42</int></doc><doc><str name="id">21</str><arr name="range_facet_l"><long>21</long></arr><int name="id_i1">21</int><arr name="range_facet_l_dv"><long>21</long></arr><arr name="range_facet_i_dv"><int>21</int></arr><arr name="lowerfilt"><str>The court red fox jumped over the lazy brown dogs.</str></arr><arr name="lowerfilt1and2"><str>The court red fox jumped over the lazy brown dogs.</str></arr><arr name="multiDefault"><str>muLti-Default</str></arr><int name="intDefault">42</int><date name="timestamp">2019-08-06T11:05:50.548Z</date><long name="_version_">1641115340555419652</long><int name="intDvoDefault">42</int></doc><doc><str name="id">22</str><arr name="range_facet_l"><long>22</long></arr><int name="id_i1">22</int><arr name="range_facet_l_dv"><long>22</long></arr><arr name="range_facet_i_dv"><int>22</int></arr><arr name="lowerfilt"><str>The quote red fox jumped over the lazy brown dogs.</str></arr><arr name="lowerfilt1and2"><str>The quote red fox jumped over the lazy brown dogs.</str></arr><arr name="multiDefault"><str>muLti-Default</str></arr><int name="intDefault">42</int><date name="timestamp">2019-08-06T11:05:50.549Z</date><long name="_version_">1641115340556468224</long><int name="intDvoDefault">42</int></doc><doc><str name="id">23</str><arr name="range_facet_l"><long>23</long></arr><int name="id_i1">23</int><arr name="range_facet_l_dv"><long>23</long></arr><arr name="range_facet_i_dv"><int>23</int></arr><arr name="lowerfilt"><str>The quote red fox jumped over the lazy brown dogs.</str></arr><arr name="lowerfilt1and2"><str>The quote red fox jumped over the lazy brown dogs.</str></arr><arr name="multiDefault"><str>muLti-Default</str></arr><int name="intDefault">42</int><date name="timestamp">2019-08-06T11:05:50.549Z</date><long name="_version_">1641115340556468225</long><int name="intDvoDefault">42</int></doc><doc><str name="id">24</str><arr name="range_facet_l"><long>24</long></arr><int name="id_i1">24</int><arr name="range_facet_l_dv"><long>24</long></arr><arr name="range_facet_i_dv"><int>24</int></arr><arr name="lowerfilt"><str>The file red fox jumped over the lazy brown dogs.</str></arr><arr name="lowerfilt1and2"><str>The file red fox jumped over the lazy brown dogs.</str></arr><arr name="multiDefault"><str>muLti-Default</str></arr><int name="intDefault">42</int><date name="timestamp">2019-08-06T11:05:50.549Z</date><long name="_version_">1641115340556468226</long><int name="intDvoDefault">42</int></doc><doc><str name="id">30</str><arr name="range_facet_l"><long>30</long></arr><int name="id_i1">30</int><arr name="range_facet_l_dv"><long>30</long></arr><arr name="range_facet_i_dv"><int>30</int></arr><arr name="lowerfilt"><str>The quote red fox jumped over the lazy brown dogs.</str></arr><arr name="lowerfilt1and2"><str>The quote red fox jumped over the lazy brown dogs.</str><str>red green yellow</str></arr><arr name="lowerfilt1"><str>red green yellow</str></arr><arr name="multiDefault"><str>muLti-Default</str></arr><int name="intDefault">42</int><date name="timestamp">2019-08-06T11:05:50.553Z</date><long name="_version_">1641115340560662528</long><int name="intDvoDefault">42</int></doc><doc><str name="id">31</str><arr name="range_facet_l"><long>31</long></arr><int name="id_i1">31</int><arr name="range_facet_l_dv"><long>31</long></arr><arr name="range_facet_i_dv"><int>31</int></arr><arr name="lowerfilt"><str>The fat red fox jumped over the lazy brown dogs.</str></arr><arr name="lowerfilt1and2"><str>The fat red fox jumped over the lazy brown dogs.</str><str>green blue yellow</str></arr><arr name="lowerfilt1"><str>green blue yellow</str></arr><arr name="multiDefault"><str>muLti-Default</str></arr><int name="intDefault">42</int><date name="timestamp">2019-08-06T11:05:50.553Z</date><long name="_version_">1641115340560662529</long><int name="intDvoDefault">42</int></doc></result>
   [junit4]   2> </response>
   [junit4]   2> 
   [junit4]   2> 	request was:q={!mlt+qf%3Dlowerfilt}17
   [junit4]   2> 2586106 ERROR (TEST-SimpleMLTQParserTest.doTest-seed#[A9C4229C0DE00686]) [     ] o.a.s.SolrTestCaseJ4 REQUEST FAILED: q={!mlt+qf%3Dlowerfilt}17:java.lang.RuntimeException: REQUEST FAILED: xpath=//result/doc[1]/str[@name='id'][.='13']
   [junit4]   2> 	xml response was: <?xml version="1.0" encoding="UTF-8"?>
   [junit4]   2> <response>
   [junit4]   2> <lst name="responseHeader"><int name="status">0</int><int name="QTime">1</int></lst><result name="response" numFound="16" start="0"><doc><str name="id">16</str><arr name="range_facet_l"><long>16</long></arr><int name="id_i1">16</int><arr name="range_facet_l_dv"><long>16</long></arr><arr name="range_facet_i_dv"><int>16</int></arr><arr name="lowerfilt"><str>The slim red fox jumped over the lazy brown dogs.</str></arr><arr name="lowerfilt1and2"><str>The slim red fox jumped over the lazy brown dogs.</str></arr><arr name="multiDefault"><str>muLti-Default</str></arr><int name="intDefault">42</int><date name="timestamp">2019-08-06T11:05:50.547Z</date><long name="_version_">1641115340554371072</long><int name="intDvoDefault">42</int></doc><doc><str name="id">18</str><arr name="range_facet_l"><long>18</long></arr><int name="id_i1">18</int><arr name="range_facet_l_dv"><long>18</long></arr><arr name="range_facet_i_dv"><int>18</int></arr><arr name="lowerfilt"><str>The quote red fox jumped over the lazy brown dogs.</str></arr><arr name="lowerfilt1and2"><str>The quote red fox jumped over the lazy brown dogs.</str></arr><arr name="multiDefault"><str>muLti-Default</str></arr><int name="intDefault">42</int><date name="timestamp">2019-08-06T11:05:50.548Z</date><long name="_version_">1641115340555419649</long><int name="intDvoDefault">42</int></doc><doc><str name="id">19</str><arr name="range_facet_l"><long>19</long></arr><int name="id_i1">19</int><arr name="range_facet_l_dv"><long>19</long></arr><arr name="range_facet_i_dv"><int>19</int></arr><arr name="lowerfilt"><str>The hose red fox jumped over the lazy brown dogs.</str></arr><arr name="lowerfilt1and2"><str>The hose red fox jumped over the lazy brown dogs.</str></arr><arr name="multiDefault"><str>muLti-Default</str></arr><int name="intDefault">42</int><date name="timestamp">2019-08-06T11:05:50.548Z</date><long name="_version_">1641115340555419650</long><int name="intDvoDefault">42</int></doc><doc><str name="id">20</str><arr name="range_facet_l"><long>20</long></arr><int name="id_i1">20</int><arr name="range_facet_l_dv"><long>20</long></arr><arr name="range_facet_i_dv"><int>20</int></arr><arr name="lowerfilt"><str>The quote red fox jumped over the lazy brown dogs.</str></arr><arr name="lowerfilt1and2"><str>The quote red fox jumped over the lazy brown dogs.</str></arr><arr name="multiDefault"><str>muLti-Default</str></arr><int name="intDefault">42</int><date name="timestamp">2019-08-06T11:05:50.548Z</date><long name="_version_">1641115340555419651</long><int name="intDvoDefault">42</int></doc><doc><str name="id">21</str><arr name="range_facet_l"><long>21</long></arr><int name="id_i1">21</int><arr name="range_facet_l_dv"><long>21</long></arr><arr name="range_facet_i_dv"><int>21</int></arr><arr name="lowerfilt"><str>The court red fox jumped over the lazy brown dogs.</str></arr><arr name="lowerfilt1and2"><str>The court red fox jumped over the lazy brown dogs.</str></arr><arr name="multiDefault"><str>muLti-Default</str></arr><int name="intDefault">42</int><date name="timestamp">2019-08-06T11:05:50.548Z</date><long name="_version_">1641115340555419652</long><int name="intDvoDefault">42</int></doc><doc><str name="id">22</str><arr name="range_facet_l"><long>22</long></arr><int name="id_i1">22</int><arr name="range_facet_l_dv"><long>22</long></arr><arr name="range_facet_i_dv"><int>22</int></arr><arr name="lowerfilt"><str>The quote red fox jumped over the lazy brown dogs.</str></arr><arr name="lowerfilt1and2"><str>The quote red fox jumped over the lazy brown dogs.</str></arr><arr name="multiDefault"><str>muLti-Default</str></arr><int name="intDefault">42</int><date name="timestamp">2019-08-06T11:05:50.549Z</date><long name="_version_">1641115340556468224</long><int name="intDvoDefault">42</int></doc><doc><str name="id">23</str><arr name="range_facet_l"><long>23</long></arr><int name="id_i1">23</int><arr name="range_facet_l_dv"><long>23</long></arr><arr name="range_facet_i_dv"><int>23</int></arr><arr name="lowerfilt"><str>The quote red fox jumped over the lazy brown dogs.</str></arr><arr name="lowerfilt1and2"><str>The quote red fox jumped over the lazy brown dogs.</str></arr><arr name="multiDefault"><str>muLti-Default</str></arr><int name="intDefault">42</int><date name="timestamp">2019-08-06T11:05:50.549Z</date><long name="_version_">1641115340556468225</long><int name="intDvoDefault">42</int></doc><doc><str name="id">24</str><arr name="range_facet_l"><long>24</long></arr><int name="id_i1">24</int><arr name="range_facet_l_dv"><long>24</long></arr><arr name="range_facet_i_dv"><int>24</int></arr><arr name="lowerfilt"><str>The file red fox jumped over the lazy brown dogs.</str></arr><arr name="lowerfilt1and2"><str>The file red fox jumped over the lazy brown dogs.</str></arr><arr name="multiDefault"><str>muLti-Default</str></arr><int name="intDefault">42</int><date name="timestamp">2019-08-06T11:05:50.549Z</date><long name="_version_">1641115340556468226</long><int name="intDvoDefault">42</int></doc><doc><str name="id">30</str><arr name="range_facet_l"><long>30</long></arr><int name="id_i1">30</int><arr name="range_facet_l_dv"><long>30</long></arr><arr name="range_facet_i_dv"><int>30</int></arr><arr name="lowerfilt"><str>The quote red fox jumped over the lazy brown dogs.</str></arr><arr name="lowerfilt1and2"><str>The quote red fox jumped over the lazy brown dogs.</str><str>red green yellow</str></arr><arr name="lowerfilt1"><str>red green yellow</str></arr><arr name="multiDefault"><str>muLti-Default</str></arr><int name="intDefault">42</int><date name="timestamp">2019-08-06T11:05:50.553Z</date><long name="_version_">1641115340560662528</long><int name="intDvoDefault">42</int></doc><doc><str name="id">31</str><arr name="range_facet_l"><long>31</long></arr><int name="id_i1">31</int><arr name="range_facet_l_dv"><long>31</long></arr><arr name="range_facet_i_dv"><int>31</int></arr><arr name="lowerfilt"><str>The fat red fox jumped over the lazy brown dogs.</str></arr><arr name="lowerfilt1and2"><str>The fat red fox jumped over the lazy brown dogs.</str><str>green blue yellow</str></arr><arr name="lowerfilt1"><str>green blue yellow</str></arr><arr name="multiDefault"><str>muLti-Default</str></arr><int name="intDefault">42</int><date name="timestamp">2019-08-06T11:05:50.553Z</date><long name="_version_">1641115340560662529</long><int name="intDvoDefault">42</int></doc></result>
   [junit4]   2> </response>
   [junit4]   2> 
   [junit4]   2> 	request was:q={!mlt+qf%3Dlowerfilt}17
   [junit4]   2> 	at org.apache.solr.SolrTestCaseJ4.assertQ(SolrTestCaseJ4.java:940)
   [junit4]   2> 	at org.apache.solr.SolrTestCaseJ4.assertQ(SolrTestCaseJ4.java:907)
   [junit4]   2> 	at org.apache.solr.search.mlt.SimpleMLTQParserTest.doTest(SimpleMLTQParserTest.java:82)
   [junit4]   2> 	at java.base/jdk.internal.reflect.NativeMethodAccessorImpl.invoke0(Native Method)
   [junit4]   2> 	at java.base/jdk.internal.reflect.NativeMethodAccessorImpl.invoke(NativeMethodAccessorImpl.java:62)
   [junit4]   2> 	at java.base/jdk.internal.reflect.DelegatingMethodAccessorImpl.invoke(DelegatingMethodAccessorImpl.java:43)
   [junit4]   2> 	at java.base/java.lang.reflect.Method.invoke(Method.java:567)
   [junit4]   2> 	at com.carrotsearch.randomizedtesting.RandomizedRunner.invoke(RandomizedRunner.java:1750)
   [junit4]   2> 	at com.carrotsearch.randomizedtesting.RandomizedRunner$8.evaluate(RandomizedRunner.java:938)
   [junit4]   2> 	at com.carrotsearch.randomizedtesting.RandomizedRunner$9.evaluate(RandomizedRunner.java:974)
   [junit4]   2> 	at com.carrotsearch.randomizedtesting.RandomizedRunner$10.evaluate(RandomizedRunner.java:988)
   [junit4]   2> 	at com.carrotsearch.randomizedtesting.rules.SystemPropertiesRestoreRule$1.evaluate(SystemPropertiesRestoreRule.java:57)
   [junit4]   2> 	at org.apache.lucene.util.TestRuleSetupTeardownChained$1.evaluate(TestRuleSetupTeardownChained.java:49)
   [junit4]   2> 	at org.apache.lucene.util.AbstractBeforeAfterRule$1.evaluate(AbstractBeforeAfterRule.java:45)
   [junit4]   2> 	at org.apache.lucene.util.TestRuleThreadAndTestName$1.evaluate(TestRuleThreadAndTestName.java:48)
   [junit4]   2> 	at org.apache.lucene.util.TestRuleIgnoreAfterMaxFailures$1.evaluate(TestRuleIgnoreAfterMaxFailures.java:64)
   [junit4]   2> 	at org.apache.lucene.util.TestRuleMarkFailure$1.evaluate(TestRuleMarkFailure.java:47)
   [junit4]   2> 	at com.carrotsearch.randomizedtesting.rules.StatementAdapter.evaluate(StatementAdapter.java:36)
   [junit4]   2> 	at com.carrotsearch.randomizedtesting.ThreadLeakControl$StatementRunner.run(ThreadLeakControl.java:368)
   [junit4]   2> 	at com.carrotsearch.randomizedtesting.ThreadLeakControl.forkTimeoutingTask(ThreadLeakControl.java:817)
   [junit4]   2> 	at com.carrotsearch.randomizedtesting.ThreadLeakControl$3.evaluate(ThreadLeakControl.java:468)
   [junit4]   2> 	at com.carrotsearch.randomizedtesting.RandomizedRunner.runSingleTest(RandomizedRunner.java:947)
   [junit4]   2> 	at com.carrotsearch.randomizedtesting.RandomizedRunner$5.evaluate(RandomizedRunner.java:832)
   [junit4]   2> 	at com.carrotsearch.randomizedtesting.RandomizedRunner$6.evaluate(RandomizedRunner.java:883)
   [junit4]   2> 	at com.carrotsearch.randomizedtesting.RandomizedRunner$7.evaluate(RandomizedRunner.java:894)
   [junit4]   2> 	at com.carrotsearch.randomizedtesting.rules.StatementAdapter.evaluate(StatementAdapter.java:36)
   [junit4]   2> 	at com.carrotsearch.randomizedtesting.rules.SystemPropertiesRestoreRule$1.evaluate(SystemPropertiesRestoreRule.java:57)
   [junit4]   2> 	at org.apache.lucene.util.AbstractBeforeAfterRule$1.evaluate(AbstractBeforeAfterRule.java:45)
   [junit4]   2> 	at com.carrotsearch.randomizedtesting.rules.StatementAdapter.evaluate(StatementAdapter.java:36)
   [junit4]   2> 	at org.apache.lucene.util.TestRuleStoreClassName$1.evaluate(TestRuleStoreClassName.java:41)
   [junit4]   2> 	at com.carrotsearch.randomizedtesting.rules.NoShadowingOrOverridesOnMethodsRule$1.evaluate(NoShadowingOrOverridesOnMethodsRule.java:40)
   [junit4]   2> 	at com.carrotsearch.randomizedtesting.rules.NoShadowingOrOverridesOnMethodsRule$1.evaluate(NoShadowingOrOverridesOnMethodsRule.java:40)
   [junit4]   2> 	at com.carrotsearch.randomizedtesting.rules.StatementAdapter.evaluate(StatementAdapter.java:36)
   [junit4]   2> 	at com.carrotsearch.randomizedtesting.rules.StatementAdapter.evaluate(StatementAdapter.java:36)
   [junit4]   2> 	at org.apache.lucene.util.TestRuleAssertionsRequired$1.evaluate(TestRuleAssertionsRequired.java:53)
   [junit4]   2> 	at org.apache.lucene.util.TestRuleMarkFailure$1.ev...
   [junit4]   2> 2586106 INFO  (TEST-SimpleMLTQParserTest.doTest-seed#[A9C4229C0DE00686]) [     ] o.a.s.SolrTestCaseJ4 ###Ending doTest
   [junit4]   2> NOTE: reproduce with: ant test  -Dtestcase=SimpleMLTQParserTest -Dtests.method=doTest -Dtests.seed=A9C4229C0DE00686 -Dtests.multiplier=3 -Dtests.slow=true -Dtests.locale=pt-TL -Dtests.timezone=Pacific/Chatham -Dtests.asserts=true -Dtests.file.encoding=ISO-8859-1
   [junit4] ERROR   0.04s J1 | SimpleMLTQParserTest.doTest <<<
   [junit4]    > Throwable #1: java.lang.RuntimeException: Exception during query
   [junit4]    > 	at __randomizedtesting.SeedInfo.seed([A9C4229C0DE00686:E809A38605B153F]:0)
   [junit4]    > 	at org.apache.solr.SolrTestCaseJ4.assertQ(SolrTestCaseJ4.java:947)
   [junit4]    > 	at org.apache.solr.SolrTestCaseJ4.assertQ(SolrTestCaseJ4.java:907)
   [junit4]    > 	at org.apache.solr.search.mlt.SimpleMLTQParserTest.doTest(SimpleMLTQParserTest.java:82)
   [junit4]    > 	at java.base/jdk.internal.reflect.NativeMethodAccessorImpl.invoke0(Native Method)
   [junit4]    > 	at java.base/jdk.internal.reflect.NativeMethodAccessorImpl.invoke(NativeMethodAccessorImpl.java:62)
   [junit4]    > 	at java.base/jdk.internal.reflect.DelegatingMethodAccessorImpl.invoke(DelegatingMethodAccessorImpl.java:43)
   [junit4]    > 	at java.base/java.lang.reflect.Method.invoke(Method.java:567)
   [junit4]    > 	at java.base/java.lang.Thread.run(Thread.java:835)
   [junit4]    > Caused by: java.lang.RuntimeException: REQUEST FAILED: xpath=//result/doc[1]/str[@name='id'][.='13']
   [junit4]    > 	xml response was: <?xml version="1.0" encoding="UTF-8"?>
   [junit4]    > <response>
   [junit4]    > <lst name="responseHeader"><int name="status">0</int><int name="QTime">1</int></lst><result name="response" numFound="16" start="0"><doc><str name="id">16</str><arr name="range_facet_l"><long>16</long></arr><int name="id_i1">16</int><arr name="range_facet_l_dv"><long>16</long></arr><arr name="range_facet_i_dv"><int>16</int></arr><arr name="lowerfilt"><str>The slim red fox jumped over the lazy brown dogs.</str></arr><arr name="lowerfilt1and2"><str>The slim red fox jumped over the lazy brown dogs.</str></arr><arr name="multiDefault"><str>muLti-Default</str></arr><int name="intDefault">42</int><date name="timestamp">2019-08-06T11:05:50.547Z</date><long name="_version_">1641115340554371072</long><int name="intDvoDefault">42</int></doc><doc><str name="id">18</str><arr name="range_facet_l"><long>18</long></arr><int name="id_i1">18</int><arr name="range_facet_l_dv"><long>18</long></arr><arr name="range_facet_i_dv"><int>18</int></arr><arr name="lowerfilt"><str>The quote red fox jumped over the lazy brown dogs.</str></arr><arr name="lowerfilt1and2"><str>The quote red fox jumped over the lazy brown dogs.</str></arr><arr name="multiDefault"><str>muLti-Default</str></arr><int name="intDefault">42</int><date name="timestamp">2019-08-06T11:05:50.548Z</date><long name="_version_">1641115340555419649</long><int name="intDvoDefault">42</int></doc><doc><str name="id">19</str><arr name="range_facet_l"><long>19</long></arr><int name="id_i1">19</int><arr name="range_facet_l_dv"><long>19</long></arr><arr name="range_facet_i_dv"><int>19</int></arr><arr name="lowerfilt"><str>The hose red fox jumped over the lazy brown dogs.</str></arr><arr name="lowerfilt1and2"><str>The hose red fox jumped over the lazy brown dogs.</str></arr><arr name="multiDefault"><str>muLti-Default</str></arr><int name="intDefault">42</int><date name="timestamp">2019-08-06T11:05:50.548Z</date><long name="_version_">1641115340555419650</long><int name="intDvoDefault">42</int></doc><doc><str name="id">20</str><arr name="range_facet_l"><long>20</long></arr><int name="id_i1">20</int><arr name="range_facet_l_dv"><long>20</long></arr><arr name="range_facet_i_dv"><int>20</int></arr><arr name="lowerfilt"><str>The quote red fox jumped over the lazy brown dogs.</str></arr><arr name="lowerfilt1and2"><str>The quote red fox jumped over the lazy brown dogs.</str></arr><arr name="multiDefault"><str>muLti-Default</str></arr><int name="intDefault">42</int><date name="timestamp">2019-08-06T11:05:50.548Z</date><long name="_version_">1641115340555419651</long><int name="intDvoDefault">42</int></doc><doc><str name="id">21</str><arr name="range_facet_l"><long>21</long></arr><int name="id_i1">21</int><arr name="range_facet_l_dv"><long>21</long></arr><arr name="range_facet_i_dv"><int>21</int></arr><arr name="lowerfilt"><str>The court red fox jumped over the lazy brown dogs.</str></arr><arr name="lowerfilt1and2"><str>The court red fox jumped over the lazy brown dogs.</str></arr><arr name="multiDefault"><str>muLti-Default</str></arr><int name="intDefault">42</int><date name="timestamp">2019-08-06T11:05:50.548Z</date><long name="_version_">1641115340555419652</long><int name="intDvoDefault">42</int></doc><doc><str name="id">22</str><arr name="range_facet_l"><long>22</long></arr><int name="id_i1">22</int><arr name="range_facet_l_dv"><long>22</long></arr><arr name="range_facet_i_dv"><int>22</int></arr><arr name="lowerfilt"><str>The quote red fox jumped over the lazy brown dogs.</str></arr><arr name="lowerfilt1and2"><str>The quote red fox jumped over the lazy brown dogs.</str></arr><arr name="multiDefault"><str>muLti-Default</str></arr><int name="intDefault">42</int><date name="timestamp">2019-08-06T11:05:50.549Z</date><long name="_version_">1641115340556468224</long><int name="intDvoDefault">42</int></doc><doc><str name="id">23</str><arr name="range_facet_l"><long>23</long></arr><int name="id_i1">23</int><arr name="range_facet_l_dv"><long>23</long></arr><arr name="range_facet_i_dv"><int>23</int></arr><arr name="lowerfilt"><str>The quote red fox jumped over the lazy brown dogs.</str></arr><arr name="lowerfilt1and2"><str>The quote red fox jumped over the lazy brown dogs.</str></arr><arr name="multiDefault"><str>muLti-Default</str></arr><int name="intDefault">42</int><date name="timestamp">2019-08-06T11:05:50.549Z</date><long name="_version_">1641115340556468225</long><int name="intDvoDefault">42</int></doc><doc><str name="id">24</str><arr name="range_facet_l"><long>24</long></arr><int name="id_i1">24</int><arr name="range_facet_l_dv"><long>24</long></arr><arr name="range_facet_i_dv"><int>24</int></arr><arr name="lowerfilt"><str>The file red fox jumped over the lazy brown dogs.</str></arr><arr name="lowerfilt1and2"><str>The file red fox jumped over the lazy brown dogs.</str></arr><arr name="multiDefault"><str>muLti-Default</str></arr><int name="intDefault">42</int><date name="timestamp">2019-08-06T11:05:50.549Z</date><long name="_version_">1641115340556468226</long><int name="intDvoDefault">42</int></doc><doc><str name="id">30</str><arr name="range_facet_l"><long>30</long></arr><int name="id_i1">30</int><arr name="range_facet_l_dv"><long>30</long></arr><arr name="range_facet_i_dv"><int>30</int></arr><arr name="lowerfilt"><str>The quote red fox jumped over the lazy brown dogs.</str></arr><arr name="lowerfilt1and2"><str>The quote red fox jumped over the lazy brown dogs.</str><str>red green yellow</str></arr><arr name="lowerfilt1"><str>red green yellow</str></arr><arr name="multiDefault"><str>muLti-Default</str></arr><int name="intDefault">42</int><date name="timestamp">2019-08-06T11:05:50.553Z</date><long name="_version_">1641115340560662528</long><int name="intDvoDefault">42</int></doc><doc><str name="id">31</str><arr name="range_facet_l"><long>31</long></arr><int name="id_i1">31</int><arr name="range_facet_l_dv"><long>31</long></arr><arr name="range_facet_i_dv"><int>31</int></arr><arr name="lowerfilt"><str>The fat red fox jumped over the lazy brown dogs.</str></arr><arr name="lowerfilt1and2"><str>The fat red fox jumped over the lazy brown dogs.</str><str>green blue yellow</str></arr><arr name="lowerfilt1"><str>green blue yellow</str></arr><arr name="multiDefault"><str>muLti-Default</str></arr><int name="intDefault">42</int><date name="timestamp">2019-08-06T11:05:50.553Z</date><long name="_version_">1641115340560662529</long><int name="intDvoDefault">42</int></doc></result>
   [junit4]    > </response>
   [junit4]    > 	request was:q={!mlt+qf%3Dlowerfilt}17
   [junit4]    > 	at org.apache.solr.SolrTestCaseJ4.assertQ(SolrTestCaseJ4.java:940)
   [junit4]    > 	... 40 more
   [junit4]   2> 2586108 INFO  (SUITE-SimpleMLTQParserTest-seed#[A9C4229C0DE00686]-worker) [     ] o.a.s.SolrTestCaseJ4 ###deleteCore
   [junit4]   2> 2586108 INFO  (SUITE-SimpleMLTQParserTest-seed#[A9C4229C0DE00686]-worker) [     ] o.a.s.c.CoreContainer Shutting down CoreContainer instance=2082507186
   [junit4]   2> 2586108 INFO  (coreCloseExecutor-13420-thread-1) [    x:collection1 ] o.a.s.c.SolrCore [collection1]  CLOSING SolrCore org.apache.solr.core.SolrCore@3d010dc4
   [junit4]   2> 2586108 INFO  (coreCloseExecutor-13420-thread-1) [    x:collection1 ] o.a.s.m.SolrMetricManager Closing metric reporters for registry=solr.core.collection1, tag=3d010dc4
   [junit4]   2> 2586108 INFO  (coreCloseExecutor-13420-thread-1) [    x:collection1 ] o.a.s.m.r.SolrJmxReporter Closing reporter [org.apache.solr.metrics.reporters.SolrJmxReporter@61d2a4f9: rootName = null, domain = solr.core.collection1, service url = null, agent id = null] for registry solr.core.collection1 / com.codahale.metrics.M

[...truncated too long message...]

werfilt1and2"><str>The quote red fox jumped over the lazy brown dogs.</str></arr><arr name="multiDefault"><str>muLti-Default</str></arr><int name="intDefault">42</int><date name="timestamp">2019-08-06T11:22:30.767Z</date><long name="_version_">1641116389361057792</long><int name="intDvoDefault">42</int></doc><doc><str name="id">21</str><arr name="range_facet_l"><long>21</long></arr><int name="id_i1">21</int><arr name="range_facet_l_dv"><long>21</long></arr><arr name="range_facet_i_dv"><int>21</int></arr><arr name="lowerfilt"><str>The court red fox jumped over the lazy brown dogs.</str></arr><arr name="lowerfilt1and2"><str>The court red fox jumped over the lazy brown dogs.</str></arr><arr name="multiDefault"><str>muLti-Default</str></arr><int name="intDefault">42</int><date name="timestamp">2019-08-06T11:22:30.770Z</date><long name="_version_">1641116389364203520</long><int name="intDvoDefault">42</int></doc><doc><str name="id">22</str><arr name="range_facet_l"><long>22</long></arr><int name="id_i1">22</int><arr name="range_facet_l_dv"><long>22</long></arr><arr name="range_facet_i_dv"><int>22</int></arr><arr name="lowerfilt"><str>The quote red fox jumped over the lazy brown dogs.</str></arr><arr name="lowerfilt1and2"><str>The quote red fox jumped over the lazy brown dogs.</str></arr><arr name="multiDefault"><str>muLti-Default</str></arr><int name="intDefault">42</int><date name="timestamp">2019-08-06T11:22:30.775Z</date><long name="_version_">1641116389369446400</long><int name="intDvoDefault">42</int></doc><doc><str name="id">23</str><arr name="range_facet_l"><long>23</long></arr><int name="id_i1">23</int><arr name="range_facet_l_dv"><long>23</long></arr><arr name="range_facet_i_dv"><int>23</int></arr><arr name="lowerfilt"><str>The quote red fox jumped over the lazy brown dogs.</str></arr><arr name="lowerfilt1and2"><str>The quote red fox jumped over the lazy brown dogs.</str></arr><arr name="multiDefault"><str>muLti-Default</str></arr><int name="intDefault">42</int><date name="timestamp">2019-08-06T11:22:30.777Z</date><long name="_version_">1641116389371543552</long><int name="intDvoDefault">42</int></doc><doc><str name="id">24</str><arr name="range_facet_l"><long>24</long></arr><int name="id_i1">24</int><arr name="range_facet_l_dv"><long>24</long></arr><arr name="range_facet_i_dv"><int>24</int></arr><arr name="lowerfilt"><str>The file red fox jumped over the lazy brown dogs.</str></arr><arr name="lowerfilt1and2"><str>The file red fox jumped over the lazy brown dogs.</str></arr><arr name="multiDefault"><str>muLti-Default</str></arr><int name="intDefault">42</int><date name="timestamp">2019-08-06T11:22:30.779Z</date><long name="_version_">1641116389373640704</long><int name="intDvoDefault">42</int></doc><doc><str name="id">30</str><arr name="range_facet_l"><long>30</long></arr><int name="id_i1">30</int><arr name="range_facet_l_dv"><long>30</long></arr><arr name="range_facet_i_dv"><int>30</int></arr><arr name="lowerfilt"><str>The quote red fox jumped over the lazy brown dogs.</str></arr><arr name="lowerfilt1and2"><str>The quote red fox jumped over the lazy brown dogs.</str><str>red green yellow</str></arr><arr name="lowerfilt1"><str>red green yellow</str></arr><arr name="multiDefault"><str>muLti-Default</str></arr><int name="intDefault">42</int><date name="timestamp">2019-08-06T11:22:30.797Z</date><long name="_version_">1641116389393563648</long><int name="intDvoDefault">42</int></doc><doc><str name="id">31</str><arr name="range_facet_l"><long>31</long></arr><int name="id_i1">31</int><arr name="range_facet_l_dv"><long>31</long></arr><arr name="range_facet_i_dv"><int>31</int></arr><arr name="lowerfilt"><str>The fat red fox jumped over the lazy brown dogs.</str></arr><arr name="lowerfilt1and2"><str>The fat red fox jumped over the lazy brown dogs.</str><str>green blue yellow</str></arr><arr name="lowerfilt1"><str>green blue yellow</str></arr><arr name="multiDefault"><str>muLti-Default</str></arr><int name="intDefault">42</int><date name="timestamp">2019-08-06T11:22:30.800Z</date><long name="_version_">1641116389395660800</long><int name="intDvoDefault">42</int></doc></result>
   [junit4]    > </response>
   [junit4]    > 	request was:q={!mlt+qf%3Dlowerfilt}17
   [junit4]    > 	at org.apache.solr.SolrTestCaseJ4.assertQ(SolrTestCaseJ4.java:940)
   [junit4]    > 	... 40 more
   [junit4]   2> 11534 INFO  (SUITE-SimpleMLTQParserTest-seed#[A9C4229C0DE00686]-worker) [     ] o.a.s.SolrTestCaseJ4 ###deleteCore
   [junit4]   2> 11534 INFO  (SUITE-SimpleMLTQParserTest-seed#[A9C4229C0DE00686]-worker) [     ] o.a.s.c.CoreContainer Shutting down CoreContainer instance=369800934
   [junit4]   2> 11535 INFO  (coreCloseExecutor-31-thread-1) [    x:collection1 ] o.a.s.c.SolrCore [collection1]  CLOSING SolrCore org.apache.solr.core.SolrCore@501c2b5e
   [junit4]   2> 11535 INFO  (coreCloseExecutor-31-thread-1) [    x:collection1 ] o.a.s.m.SolrMetricManager Closing metric reporters for registry=solr.core.collection1, tag=501c2b5e
   [junit4]   2> 11535 INFO  (coreCloseExecutor-31-thread-1) [    x:collection1 ] o.a.s.m.r.SolrJmxReporter Closing reporter [org.apache.solr.metrics.reporters.SolrJmxReporter@58fdb5b4: rootName = null, domain = solr.core.collection1, service url = null, agent id = null] for registry solr.core.collection1 / com.codahale.metrics.MetricRegistry@2e44c4c1
   [junit4]   2> 11566 INFO  (SUITE-SimpleMLTQParserTest-seed#[A9C4229C0DE00686]-worker) [     ] o.a.s.m.SolrMetricManager Closing metric reporters for registry=solr.node, tag=null
   [junit4]   2> 11566 INFO  (SUITE-SimpleMLTQParserTest-seed#[A9C4229C0DE00686]-worker) [     ] o.a.s.m.r.SolrJmxReporter Closing reporter [org.apache.solr.metrics.reporters.SolrJmxReporter@1b75d082: rootName = null, domain = solr.node, service url = null, agent id = null] for registry solr.node / com.codahale.metrics.MetricRegistry@6094caee
   [junit4]   2> 11573 INFO  (SUITE-SimpleMLTQParserTest-seed#[A9C4229C0DE00686]-worker) [     ] o.a.s.m.SolrMetricManager Closing metric reporters for registry=solr.jvm, tag=null
   [junit4]   2> 11573 INFO  (SUITE-SimpleMLTQParserTest-seed#[A9C4229C0DE00686]-worker) [     ] o.a.s.m.r.SolrJmxReporter Closing reporter [org.apache.solr.metrics.reporters.SolrJmxReporter@5c0f31bc: rootName = null, domain = solr.jvm, service url = null, agent id = null] for registry solr.jvm / com.codahale.metrics.MetricRegistry@52af5e0a
   [junit4]   2> 11573 INFO  (SUITE-SimpleMLTQParserTest-seed#[A9C4229C0DE00686]-worker) [     ] o.a.s.m.SolrMetricManager Closing metric reporters for registry=solr.jetty, tag=null
   [junit4]   2> 11574 INFO  (SUITE-SimpleMLTQParserTest-seed#[A9C4229C0DE00686]-worker) [     ] o.a.s.m.r.SolrJmxReporter Closing reporter [org.apache.solr.metrics.reporters.SolrJmxReporter@1c7ff2cf: rootName = null, domain = solr.jetty, service url = null, agent id = null] for registry solr.jetty / com.codahale.metrics.MetricRegistry@564ff312
   [junit4]   2> NOTE: leaving temporary files on disk at: /home/jenkins/workspace/Lucene-Solr-8.2-Linux/solr/build/solr-core/test/J0/temp/solr.search.mlt.SimpleMLTQParserTest_A9C4229C0DE00686-002
   [junit4]   2> NOTE: test params are: codec=HighCompressionCompressingStoredFields(storedFieldsFormat=CompressingStoredFieldsFormat(compressionMode=HIGH_COMPRESSION, chunkSize=19815, maxDocsPerChunk=731, blockSize=775), termVectorsFormat=CompressingTermVectorsFormat(compressionMode=HIGH_COMPRESSION, chunkSize=19815, blockSize=775)), sim=Asserting(org.apache.lucene.search.similarities.AssertingSimilarity@63971063), locale=pt-TL, timezone=Pacific/Chatham
   [junit4]   2> NOTE: Linux 5.0.0-23-generic amd64/AdoptOpenJDK 12.0.1 (64-bit)/cpus=8,threads=1,free=352210856,total=509607936
   [junit4]   2> NOTE: All tests run in this JVM: [SimpleMLTQParserTest, SimpleMLTQParserTest]
   [junit4] Completed [5/5 (5!)] on J0 in 2.56s, 1 test, 1 error <<< FAILURES!

[...truncated 15 lines...]
BUILD FAILED
/home/jenkins/workspace/Lucene-Solr-8.2-Linux/lucene/common-build.xml:1572: The following error occurred while executing this line:
/home/jenkins/workspace/Lucene-Solr-8.2-Linux/lucene/common-build.xml:1099: There were test failures: 5 suites, 5 tests, 5 errors [seed: A9C4229C0DE00686]

Total time: 14 seconds

[repro] Setting last failure code to 256

[repro] Failures:
[repro]   5/5 failed: org.apache.solr.search.mlt.SimpleMLTQParserTest
[repro] Exiting with code 256
+ mv lucene/build lucene/build.repro
+ mv solr/build solr/build.repro
+ mv lucene/build.orig lucene/build
+ mv solr/build.orig solr/build
Archiving artifacts
Setting ANT_1_8_2_HOME=/home/jenkins/tools/hudson.tasks.Ant_AntInstallation/ANT_1.8.2
[WARNINGS] Parsing warnings in console log with parser Java Compiler (javac)
Setting ANT_1_8_2_HOME=/home/jenkins/tools/hudson.tasks.Ant_AntInstallation/ANT_1.8.2
No credentials specified
Setting ANT_1_8_2_HOME=/home/jenkins/tools/hudson.tasks.Ant_AntInstallation/ANT_1.8.2
<Git Blamer> Using GitBlamer to create author and commit information for all warnings.
<Git Blamer> GIT_COMMIT=7b0c7cada62a361aa9b00ecedb804e890f1724d4, workspace=/home/jenkins/workspace/Lucene-Solr-8.2-Linux
[WARNINGS] Computing warning deltas based on reference build #525
Recording test results
Setting ANT_1_8_2_HOME=/home/jenkins/tools/hudson.tasks.Ant_AntInstallation/ANT_1.8.2
Build step 'Publish JUnit test result report' changed build result to UNSTABLE
Email was triggered for: Unstable (Test Failures)
Sending email for trigger: Unstable (Test Failures)
Setting ANT_1_8_2_HOME=/home/jenkins/tools/hudson.tasks.Ant_AntInstallation/ANT_1.8.2
Setting ANT_1_8_2_HOME=/home/jenkins/tools/hudson.tasks.Ant_AntInstallation/ANT_1.8.2
Setting ANT_1_8_2_HOME=/home/jenkins/tools/hudson.tasks.Ant_AntInstallation/ANT_1.8.2
Setting ANT_1_8_2_HOME=/home/jenkins/tools/hudson.tasks.Ant_AntInstallation/ANT_1.8.2
Setting ANT_1_8_2_HOME=/home/jenkins/tools/hudson.tasks.Ant_AntInstallation/ANT_1.8.2
Setting ANT_1_8_2_HOME=/home/jenkins/tools/hudson.tasks.Ant_AntInstallation/ANT_1.8.2

Mime
View raw message