lucene-dev mailing list archives

Site index · List index
Message view « Date » · « Thread »
Top « Date » · « Thread »
From Policeman Jenkins Server <jenk...@thetaphi.de>
Subject [JENKINS] Lucene-Solr-master-Linux (64bit/jdk-11.0.3) - Build # 24328 - Still Unstable!
Date Tue, 02 Jul 2019 02:08:36 GMT
Build: https://jenkins.thetaphi.de/job/Lucene-Solr-master-Linux/24328/
Java: 64bit/jdk-11.0.3 -XX:-UseCompressedOops -XX:+UseParallelGC

4 tests failed.
FAILED:  org.apache.lucene.util.TestRamUsageEstimator.testMap

Error Message:
expected:<25152.0> but was:<30184.0>

Stack Trace:
java.lang.AssertionError: expected:<25152.0> but was:<30184.0>
	at __randomizedtesting.SeedInfo.seed([ED7055A14021EA69:CD56E1725ADAF91B]:0)
	at org.junit.Assert.fail(Assert.java:88)
	at org.junit.Assert.failNotEquals(Assert.java:834)
	at org.junit.Assert.assertEquals(Assert.java:553)
	at org.junit.Assert.assertEquals(Assert.java:683)
	at org.apache.lucene.util.TestRamUsageEstimator.testMap(TestRamUsageEstimator.java:136)
	at java.base/jdk.internal.reflect.NativeMethodAccessorImpl.invoke0(Native Method)
	at java.base/jdk.internal.reflect.NativeMethodAccessorImpl.invoke(NativeMethodAccessorImpl.java:62)
	at java.base/jdk.internal.reflect.DelegatingMethodAccessorImpl.invoke(DelegatingMethodAccessorImpl.java:43)
	at java.base/java.lang.reflect.Method.invoke(Method.java:566)
	at com.carrotsearch.randomizedtesting.RandomizedRunner.invoke(RandomizedRunner.java:1750)
	at com.carrotsearch.randomizedtesting.RandomizedRunner$8.evaluate(RandomizedRunner.java:938)
	at com.carrotsearch.randomizedtesting.RandomizedRunner$9.evaluate(RandomizedRunner.java:974)
	at com.carrotsearch.randomizedtesting.RandomizedRunner$10.evaluate(RandomizedRunner.java:988)
	at org.apache.lucene.util.TestRuleSetupTeardownChained$1.evaluate(TestRuleSetupTeardownChained.java:49)
	at org.apache.lucene.util.AbstractBeforeAfterRule$1.evaluate(AbstractBeforeAfterRule.java:45)
	at org.apache.lucene.util.TestRuleThreadAndTestName$1.evaluate(TestRuleThreadAndTestName.java:48)
	at org.apache.lucene.util.TestRuleIgnoreAfterMaxFailures$1.evaluate(TestRuleIgnoreAfterMaxFailures.java:64)
	at org.apache.lucene.util.TestRuleMarkFailure$1.evaluate(TestRuleMarkFailure.java:47)
	at com.carrotsearch.randomizedtesting.rules.StatementAdapter.evaluate(StatementAdapter.java:36)
	at com.carrotsearch.randomizedtesting.ThreadLeakControl$StatementRunner.run(ThreadLeakControl.java:368)
	at com.carrotsearch.randomizedtesting.ThreadLeakControl.forkTimeoutingTask(ThreadLeakControl.java:817)
	at com.carrotsearch.randomizedtesting.ThreadLeakControl$3.evaluate(ThreadLeakControl.java:468)
	at com.carrotsearch.randomizedtesting.RandomizedRunner.runSingleTest(RandomizedRunner.java:947)
	at com.carrotsearch.randomizedtesting.RandomizedRunner$5.evaluate(RandomizedRunner.java:832)
	at com.carrotsearch.randomizedtesting.RandomizedRunner$6.evaluate(RandomizedRunner.java:883)
	at com.carrotsearch.randomizedtesting.RandomizedRunner$7.evaluate(RandomizedRunner.java:894)
	at org.apache.lucene.util.AbstractBeforeAfterRule$1.evaluate(AbstractBeforeAfterRule.java:45)
	at com.carrotsearch.randomizedtesting.rules.StatementAdapter.evaluate(StatementAdapter.java:36)
	at org.apache.lucene.util.TestRuleStoreClassName$1.evaluate(TestRuleStoreClassName.java:41)
	at com.carrotsearch.randomizedtesting.rules.NoShadowingOrOverridesOnMethodsRule$1.evaluate(NoShadowingOrOverridesOnMethodsRule.java:40)
	at com.carrotsearch.randomizedtesting.rules.NoShadowingOrOverridesOnMethodsRule$1.evaluate(NoShadowingOrOverridesOnMethodsRule.java:40)
	at com.carrotsearch.randomizedtesting.rules.StatementAdapter.evaluate(StatementAdapter.java:36)
	at com.carrotsearch.randomizedtesting.rules.StatementAdapter.evaluate(StatementAdapter.java:36)
	at org.apache.lucene.util.TestRuleAssertionsRequired$1.evaluate(TestRuleAssertionsRequired.java:53)
	at org.apache.lucene.util.TestRuleMarkFailure$1.evaluate(TestRuleMarkFailure.java:47)
	at org.apache.lucene.util.TestRuleIgnoreAfterMaxFailures$1.evaluate(TestRuleIgnoreAfterMaxFailures.java:64)
	at org.apache.lucene.util.TestRuleIgnoreTestSuites$1.evaluate(TestRuleIgnoreTestSuites.java:54)
	at com.carrotsearch.randomizedtesting.rules.StatementAdapter.evaluate(StatementAdapter.java:36)
	at com.carrotsearch.randomizedtesting.ThreadLeakControl$StatementRunner.run(ThreadLeakControl.java:368)
	at java.base/java.lang.Thread.run(Thread.java:834)


FAILED:  org.apache.lucene.util.TestRamUsageEstimator.testMap

Error Message:
expected:<25152.0> but was:<30184.0>

Stack Trace:
java.lang.AssertionError: expected:<25152.0> but was:<30184.0>
	at __randomizedtesting.SeedInfo.seed([ED7055A14021EA69:CD56E1725ADAF91B]:0)
	at org.junit.Assert.fail(Assert.java:88)
	at org.junit.Assert.failNotEquals(Assert.java:834)
	at org.junit.Assert.assertEquals(Assert.java:553)
	at org.junit.Assert.assertEquals(Assert.java:683)
	at org.apache.lucene.util.TestRamUsageEstimator.testMap(TestRamUsageEstimator.java:136)
	at java.base/jdk.internal.reflect.NativeMethodAccessorImpl.invoke0(Native Method)
	at java.base/jdk.internal.reflect.NativeMethodAccessorImpl.invoke(NativeMethodAccessorImpl.java:62)
	at java.base/jdk.internal.reflect.DelegatingMethodAccessorImpl.invoke(DelegatingMethodAccessorImpl.java:43)
	at java.base/java.lang.reflect.Method.invoke(Method.java:566)
	at com.carrotsearch.randomizedtesting.RandomizedRunner.invoke(RandomizedRunner.java:1750)
	at com.carrotsearch.randomizedtesting.RandomizedRunner$8.evaluate(RandomizedRunner.java:938)
	at com.carrotsearch.randomizedtesting.RandomizedRunner$9.evaluate(RandomizedRunner.java:974)
	at com.carrotsearch.randomizedtesting.RandomizedRunner$10.evaluate(RandomizedRunner.java:988)
	at org.apache.lucene.util.TestRuleSetupTeardownChained$1.evaluate(TestRuleSetupTeardownChained.java:49)
	at org.apache.lucene.util.AbstractBeforeAfterRule$1.evaluate(AbstractBeforeAfterRule.java:45)
	at org.apache.lucene.util.TestRuleThreadAndTestName$1.evaluate(TestRuleThreadAndTestName.java:48)
	at org.apache.lucene.util.TestRuleIgnoreAfterMaxFailures$1.evaluate(TestRuleIgnoreAfterMaxFailures.java:64)
	at org.apache.lucene.util.TestRuleMarkFailure$1.evaluate(TestRuleMarkFailure.java:47)
	at com.carrotsearch.randomizedtesting.rules.StatementAdapter.evaluate(StatementAdapter.java:36)
	at com.carrotsearch.randomizedtesting.ThreadLeakControl$StatementRunner.run(ThreadLeakControl.java:368)
	at com.carrotsearch.randomizedtesting.ThreadLeakControl.forkTimeoutingTask(ThreadLeakControl.java:817)
	at com.carrotsearch.randomizedtesting.ThreadLeakControl$3.evaluate(ThreadLeakControl.java:468)
	at com.carrotsearch.randomizedtesting.RandomizedRunner.runSingleTest(RandomizedRunner.java:947)
	at com.carrotsearch.randomizedtesting.RandomizedRunner$5.evaluate(RandomizedRunner.java:832)
	at com.carrotsearch.randomizedtesting.RandomizedRunner$6.evaluate(RandomizedRunner.java:883)
	at com.carrotsearch.randomizedtesting.RandomizedRunner$7.evaluate(RandomizedRunner.java:894)
	at org.apache.lucene.util.AbstractBeforeAfterRule$1.evaluate(AbstractBeforeAfterRule.java:45)
	at com.carrotsearch.randomizedtesting.rules.StatementAdapter.evaluate(StatementAdapter.java:36)
	at org.apache.lucene.util.TestRuleStoreClassName$1.evaluate(TestRuleStoreClassName.java:41)
	at com.carrotsearch.randomizedtesting.rules.NoShadowingOrOverridesOnMethodsRule$1.evaluate(NoShadowingOrOverridesOnMethodsRule.java:40)
	at com.carrotsearch.randomizedtesting.rules.NoShadowingOrOverridesOnMethodsRule$1.evaluate(NoShadowingOrOverridesOnMethodsRule.java:40)
	at com.carrotsearch.randomizedtesting.rules.StatementAdapter.evaluate(StatementAdapter.java:36)
	at com.carrotsearch.randomizedtesting.rules.StatementAdapter.evaluate(StatementAdapter.java:36)
	at org.apache.lucene.util.TestRuleAssertionsRequired$1.evaluate(TestRuleAssertionsRequired.java:53)
	at org.apache.lucene.util.TestRuleMarkFailure$1.evaluate(TestRuleMarkFailure.java:47)
	at org.apache.lucene.util.TestRuleIgnoreAfterMaxFailures$1.evaluate(TestRuleIgnoreAfterMaxFailures.java:64)
	at org.apache.lucene.util.TestRuleIgnoreTestSuites$1.evaluate(TestRuleIgnoreTestSuites.java:54)
	at com.carrotsearch.randomizedtesting.rules.StatementAdapter.evaluate(StatementAdapter.java:36)
	at com.carrotsearch.randomizedtesting.ThreadLeakControl$StatementRunner.run(ThreadLeakControl.java:368)
	at java.base/java.lang.Thread.run(Thread.java:834)


FAILED:  org.apache.lucene.util.TestRamUsageEstimator.testMap

Error Message:
expected:<25152.0> but was:<30184.0>

Stack Trace:
java.lang.AssertionError: expected:<25152.0> but was:<30184.0>
	at __randomizedtesting.SeedInfo.seed([ED7055A14021EA69:CD56E1725ADAF91B]:0)
	at org.junit.Assert.fail(Assert.java:88)
	at org.junit.Assert.failNotEquals(Assert.java:834)
	at org.junit.Assert.assertEquals(Assert.java:553)
	at org.junit.Assert.assertEquals(Assert.java:683)
	at org.apache.lucene.util.TestRamUsageEstimator.testMap(TestRamUsageEstimator.java:136)
	at java.base/jdk.internal.reflect.NativeMethodAccessorImpl.invoke0(Native Method)
	at java.base/jdk.internal.reflect.NativeMethodAccessorImpl.invoke(NativeMethodAccessorImpl.java:62)
	at java.base/jdk.internal.reflect.DelegatingMethodAccessorImpl.invoke(DelegatingMethodAccessorImpl.java:43)
	at java.base/java.lang.reflect.Method.invoke(Method.java:566)
	at com.carrotsearch.randomizedtesting.RandomizedRunner.invoke(RandomizedRunner.java:1750)
	at com.carrotsearch.randomizedtesting.RandomizedRunner$8.evaluate(RandomizedRunner.java:938)
	at com.carrotsearch.randomizedtesting.RandomizedRunner$9.evaluate(RandomizedRunner.java:974)
	at com.carrotsearch.randomizedtesting.RandomizedRunner$10.evaluate(RandomizedRunner.java:988)
	at org.apache.lucene.util.TestRuleSetupTeardownChained$1.evaluate(TestRuleSetupTeardownChained.java:49)
	at org.apache.lucene.util.AbstractBeforeAfterRule$1.evaluate(AbstractBeforeAfterRule.java:45)
	at org.apache.lucene.util.TestRuleThreadAndTestName$1.evaluate(TestRuleThreadAndTestName.java:48)
	at org.apache.lucene.util.TestRuleIgnoreAfterMaxFailures$1.evaluate(TestRuleIgnoreAfterMaxFailures.java:64)
	at org.apache.lucene.util.TestRuleMarkFailure$1.evaluate(TestRuleMarkFailure.java:47)
	at com.carrotsearch.randomizedtesting.rules.StatementAdapter.evaluate(StatementAdapter.java:36)
	at com.carrotsearch.randomizedtesting.ThreadLeakControl$StatementRunner.run(ThreadLeakControl.java:368)
	at com.carrotsearch.randomizedtesting.ThreadLeakControl.forkTimeoutingTask(ThreadLeakControl.java:817)
	at com.carrotsearch.randomizedtesting.ThreadLeakControl$3.evaluate(ThreadLeakControl.java:468)
	at com.carrotsearch.randomizedtesting.RandomizedRunner.runSingleTest(RandomizedRunner.java:947)
	at com.carrotsearch.randomizedtesting.RandomizedRunner$5.evaluate(RandomizedRunner.java:832)
	at com.carrotsearch.randomizedtesting.RandomizedRunner$6.evaluate(RandomizedRunner.java:883)
	at com.carrotsearch.randomizedtesting.RandomizedRunner$7.evaluate(RandomizedRunner.java:894)
	at org.apache.lucene.util.AbstractBeforeAfterRule$1.evaluate(AbstractBeforeAfterRule.java:45)
	at com.carrotsearch.randomizedtesting.rules.StatementAdapter.evaluate(StatementAdapter.java:36)
	at org.apache.lucene.util.TestRuleStoreClassName$1.evaluate(TestRuleStoreClassName.java:41)
	at com.carrotsearch.randomizedtesting.rules.NoShadowingOrOverridesOnMethodsRule$1.evaluate(NoShadowingOrOverridesOnMethodsRule.java:40)
	at com.carrotsearch.randomizedtesting.rules.NoShadowingOrOverridesOnMethodsRule$1.evaluate(NoShadowingOrOverridesOnMethodsRule.java:40)
	at com.carrotsearch.randomizedtesting.rules.StatementAdapter.evaluate(StatementAdapter.java:36)
	at com.carrotsearch.randomizedtesting.rules.StatementAdapter.evaluate(StatementAdapter.java:36)
	at org.apache.lucene.util.TestRuleAssertionsRequired$1.evaluate(TestRuleAssertionsRequired.java:53)
	at org.apache.lucene.util.TestRuleMarkFailure$1.evaluate(TestRuleMarkFailure.java:47)
	at org.apache.lucene.util.TestRuleIgnoreAfterMaxFailures$1.evaluate(TestRuleIgnoreAfterMaxFailures.java:64)
	at org.apache.lucene.util.TestRuleIgnoreTestSuites$1.evaluate(TestRuleIgnoreTestSuites.java:54)
	at com.carrotsearch.randomizedtesting.rules.StatementAdapter.evaluate(StatementAdapter.java:36)
	at com.carrotsearch.randomizedtesting.ThreadLeakControl$StatementRunner.run(ThreadLeakControl.java:368)
	at java.base/java.lang.Thread.run(Thread.java:834)


FAILED:  org.apache.lucene.util.TestRamUsageEstimator.testMap

Error Message:
expected:<25152.0> but was:<30184.0>

Stack Trace:
java.lang.AssertionError: expected:<25152.0> but was:<30184.0>
	at __randomizedtesting.SeedInfo.seed([ED7055A14021EA69:CD56E1725ADAF91B]:0)
	at org.junit.Assert.fail(Assert.java:88)
	at org.junit.Assert.failNotEquals(Assert.java:834)
	at org.junit.Assert.assertEquals(Assert.java:553)
	at org.junit.Assert.assertEquals(Assert.java:683)
	at org.apache.lucene.util.TestRamUsageEstimator.testMap(TestRamUsageEstimator.java:136)
	at java.base/jdk.internal.reflect.NativeMethodAccessorImpl.invoke0(Native Method)
	at java.base/jdk.internal.reflect.NativeMethodAccessorImpl.invoke(NativeMethodAccessorImpl.java:62)
	at java.base/jdk.internal.reflect.DelegatingMethodAccessorImpl.invoke(DelegatingMethodAccessorImpl.java:43)
	at java.base/java.lang.reflect.Method.invoke(Method.java:566)
	at com.carrotsearch.randomizedtesting.RandomizedRunner.invoke(RandomizedRunner.java:1750)
	at com.carrotsearch.randomizedtesting.RandomizedRunner$8.evaluate(RandomizedRunner.java:938)
	at com.carrotsearch.randomizedtesting.RandomizedRunner$9.evaluate(RandomizedRunner.java:974)
	at com.carrotsearch.randomizedtesting.RandomizedRunner$10.evaluate(RandomizedRunner.java:988)
	at org.apache.lucene.util.TestRuleSetupTeardownChained$1.evaluate(TestRuleSetupTeardownChained.java:49)
	at org.apache.lucene.util.AbstractBeforeAfterRule$1.evaluate(AbstractBeforeAfterRule.java:45)
	at org.apache.lucene.util.TestRuleThreadAndTestName$1.evaluate(TestRuleThreadAndTestName.java:48)
	at org.apache.lucene.util.TestRuleIgnoreAfterMaxFailures$1.evaluate(TestRuleIgnoreAfterMaxFailures.java:64)
	at org.apache.lucene.util.TestRuleMarkFailure$1.evaluate(TestRuleMarkFailure.java:47)
	at com.carrotsearch.randomizedtesting.rules.StatementAdapter.evaluate(StatementAdapter.java:36)
	at com.carrotsearch.randomizedtesting.ThreadLeakControl$StatementRunner.run(ThreadLeakControl.java:368)
	at com.carrotsearch.randomizedtesting.ThreadLeakControl.forkTimeoutingTask(ThreadLeakControl.java:817)
	at com.carrotsearch.randomizedtesting.ThreadLeakControl$3.evaluate(ThreadLeakControl.java:468)
	at com.carrotsearch.randomizedtesting.RandomizedRunner.runSingleTest(RandomizedRunner.java:947)
	at com.carrotsearch.randomizedtesting.RandomizedRunner$5.evaluate(RandomizedRunner.java:832)
	at com.carrotsearch.randomizedtesting.RandomizedRunner$6.evaluate(RandomizedRunner.java:883)
	at com.carrotsearch.randomizedtesting.RandomizedRunner$7.evaluate(RandomizedRunner.java:894)
	at org.apache.lucene.util.AbstractBeforeAfterRule$1.evaluate(AbstractBeforeAfterRule.java:45)
	at com.carrotsearch.randomizedtesting.rules.StatementAdapter.evaluate(StatementAdapter.java:36)
	at org.apache.lucene.util.TestRuleStoreClassName$1.evaluate(TestRuleStoreClassName.java:41)
	at com.carrotsearch.randomizedtesting.rules.NoShadowingOrOverridesOnMethodsRule$1.evaluate(NoShadowingOrOverridesOnMethodsRule.java:40)
	at com.carrotsearch.randomizedtesting.rules.NoShadowingOrOverridesOnMethodsRule$1.evaluate(NoShadowingOrOverridesOnMethodsRule.java:40)
	at com.carrotsearch.randomizedtesting.rules.StatementAdapter.evaluate(StatementAdapter.java:36)
	at com.carrotsearch.randomizedtesting.rules.StatementAdapter.evaluate(StatementAdapter.java:36)
	at org.apache.lucene.util.TestRuleAssertionsRequired$1.evaluate(TestRuleAssertionsRequired.java:53)
	at org.apache.lucene.util.TestRuleMarkFailure$1.evaluate(TestRuleMarkFailure.java:47)
	at org.apache.lucene.util.TestRuleIgnoreAfterMaxFailures$1.evaluate(TestRuleIgnoreAfterMaxFailures.java:64)
	at org.apache.lucene.util.TestRuleIgnoreTestSuites$1.evaluate(TestRuleIgnoreTestSuites.java:54)
	at com.carrotsearch.randomizedtesting.rules.StatementAdapter.evaluate(StatementAdapter.java:36)
	at com.carrotsearch.randomizedtesting.ThreadLeakControl$StatementRunner.run(ThreadLeakControl.java:368)
	at java.base/java.lang.Thread.run(Thread.java:834)




Build Log:
[...truncated 739 lines...]
   [junit4] Suite: org.apache.lucene.util.TestRamUsageEstimator
   [junit4]   2> NOTE: reproduce with: ant test  -Dtestcase=TestRamUsageEstimator -Dtests.method=testMap -Dtests.seed=ED7055A14021EA69 -Dtests.multiplier=3 -Dtests.slow=true -Dtests.locale=nd -Dtests.timezone=America/Yakutat -Dtests.asserts=true -Dtests.file.encoding=US-ASCII
   [junit4] FAILURE 0.02s J0 | TestRamUsageEstimator.testMap <<<
   [junit4]    > Throwable #1: java.lang.AssertionError: expected:<25152.0> but was:<30184.0>
   [junit4]    > 	at __randomizedtesting.SeedInfo.seed([ED7055A14021EA69:CD56E1725ADAF91B]:0)
   [junit4]    > 	at org.apache.lucene.util.TestRamUsageEstimator.testMap(TestRamUsageEstimator.java:136)
   [junit4]    > 	at java.base/jdk.internal.reflect.NativeMethodAccessorImpl.invoke0(Native Method)
   [junit4]    > 	at java.base/jdk.internal.reflect.NativeMethodAccessorImpl.invoke(NativeMethodAccessorImpl.java:62)
   [junit4]    > 	at java.base/jdk.internal.reflect.DelegatingMethodAccessorImpl.invoke(DelegatingMethodAccessorImpl.java:43)
   [junit4]    > 	at java.base/java.lang.reflect.Method.invoke(Method.java:566)
   [junit4]    > 	at java.base/java.lang.Thread.run(Thread.java:834)
   [junit4] IGNOR/A 0.00s J0 | TestRamUsageEstimator.testPrintValues
   [junit4]    > Assumption #1: Specify -Dtests.verbose=true to print constants of RamUsageEstimator.
   [junit4]   2> NOTE: test params are: codec=Asserting(Lucene80): {}, docValues:{}, maxPointsInLeafNode=1460, maxMBSortInHeap=6.927495954369251, sim=Asserting(org.apache.lucene.search.similarities.AssertingSimilarity@42401de6), locale=nd, timezone=America/Yakutat
   [junit4]   2> NOTE: Linux 4.18.0-24-generic amd64/AdoptOpenJDK 11.0.3 (64-bit)/cpus=8,threads=1,free=351571672,total=535822336
   [junit4]   2> NOTE: All tests run in this JVM: [TestBooleanQuery, TestAtomicUpdate, TestTotalHitCountCollector, TestNoDeletionPolicy, TestAnalyzerWrapper, TestPayloadsOnVectors, TestSortedSetSelector, Test2BDocs, TestWANDScorer, TestSloppyPhraseQuery, TestLucene70SegmentInfoFormat, TestSoftDeletesRetentionMergePolicy, TestNRTCachingDirectory, TestApproximationSearchEquivalence, TestBooleanSimilarity, TestBufferedIndexInput, TestDirectoryReaderReopen, TestSimilarity2, TestIndexWriterWithThreads, TestNumericUtils, TestFlushByRamOrCountsPolicy, TestVirtualMethod, TestDocIdsWriter, TestRegExp, TestConjunctions, TestReusableStringReader, TestThreadedForceMerge, TestAxiomaticF2LOG, TestStringHelper, TestFuzzyQuery, TestOmitPositions, TestMultiPhraseQuery, TestIndependenceStandardized, TestFieldsReader, TestBKD, TestPerFieldPostingsFormat, TestExceedMaxTermLength, TestBlockPostingsFormat, TestMinShouldMatch2, TestRegexpRandom, TestTimSorterWorstCase, TestAssertions, TestOrdinalMap, TestIndexWriterLockRelease, TestLatLonPointQueries, TestFieldValueQuery, TestSearcherManager, TestBlendedTermQuery, TestRollback, Test2BSortedDocValuesFixedSorted, TestTransactionRollback, TestSmallFloat, LimitedFiniteStringsIteratorTest, TestFixedBitDocIdSet, TestSimpleFSDirectory, TestSpanExplanations, TestQueryVisitor, TestSpanBoostQuery, TestInfoStream, TestCharArraySet, TestIntRange, TestLongsRef, TestLongValuesSource, TestDateTools, TestIndexWriterOnJRECrash, TestPriorityQueue, TestComplexExplanations, TestRamUsageEstimator]
   [junit4] Completed [134/521 (1!)] on J0 in 0.28s, 10 tests, 1 failure, 1 skipped <<< FAILURES!

[...truncated 66937 lines...]
[asciidoctor:convert] asciidoctor: ERROR: about-this-guide.adoc: line 1: invalid part, must have at least one section (e.g., chapter, appendix, etc.)
[asciidoctor:convert] asciidoctor: ERROR: solr-glossary.adoc: line 1: invalid part, must have at least one section (e.g., chapter, appendix, etc.)
     [java] Processed 2586 links (2116 relative) to 3396 anchors in 259 files
     [echo] Validated Links & Anchors via: /home/jenkins/workspace/Lucene-Solr-master-Linux/solr/build/solr-ref-guide/bare-bones-html/

-documentation-lint:
    [jtidy] FIXME: Broken HTML checks were disabled, as jtidy can't handle HTML5.
     [echo] Checking for broken links...
     [exec] 
     [exec] Crawl/parse...
     [exec] 
     [exec] Verify...
     [echo] Checking for malformed docs...

jar-checksums:

resolve:

ivy-availability-check:
[loadresource] Do not set property disallowed.ivy.jars.list as its length is 0.

-ivy-fail-disallowed-ivy-version:

ivy-fail:

ivy-configure:
[ivy:configure] :: loading settings :: file = /home/jenkins/workspace/Lucene-Solr-master-Linux/lucene/top-level-ivy-settings.xml

resolve:

ivy-availability-check:
[loadresource] Do not set property disallowed.ivy.jars.list as its length is 0.

-ivy-fail-disallowed-ivy-version:

ivy-fail:

ivy-configure:
[ivy:configure] :: loading settings :: file = /home/jenkins/workspace/Lucene-Solr-master-Linux/lucene/top-level-ivy-settings.xml

resolve:

resolve:

ivy-availability-check:
[loadresource] Do not set property disallowed.ivy.jars.list as its length is 0.

-ivy-fail-disallowed-ivy-version:

ivy-fail:

ivy-configure:
[ivy:configure] :: loading settings :: file = /home/jenkins/workspace/Lucene-Solr-master-Linux/lucene/top-level-ivy-settings.xml

resolve:

ivy-availability-check:
[loadresource] Do not set property disallowed.ivy.jars.list as its length is 0.

-ivy-fail-disallowed-ivy-version:

ivy-fail:

ivy-configure:
[ivy:configure] :: loading settings :: file = /home/jenkins/workspace/Lucene-Solr-master-Linux/lucene/top-level-ivy-settings.xml

resolve:

ivy-availability-check:
[loadresource] Do not set property disallowed.ivy.jars.list as its length is 0.

-ivy-fail-disallowed-ivy-version:

ivy-fail:

ivy-configure:
[ivy:configure] :: loading settings :: file = /home/jenkins/workspace/Lucene-Solr-master-Linux/lucene/top-level-ivy-settings.xml

resolve:

ivy-availability-check:
[loadresource] Do not set property disallowed.ivy.jars.list as its length is 0.

-ivy-fail-disallowed-ivy-version:

ivy-fail:

ivy-configure:
[ivy:configure] :: loading settings :: file = /home/jenkins/workspace/Lucene-Solr-master-Linux/lucene/top-level-ivy-settings.xml

resolve:

ivy-availability-check:
[loadresource] Do not set property disallowed.ivy.jars.list as its length is 0.

-ivy-fail-disallowed-ivy-version:

ivy-fail:

ivy-configure:
[ivy:configure] :: loading settings :: file = /home/jenkins/workspace/Lucene-Solr-master-Linux/lucene/top-level-ivy-settings.xml

resolve:

ivy-availability-check:
[loadresource] Do not set property disallowed.ivy.jars.list as its length is 0.

-ivy-fail-disallowed-ivy-version:

ivy-fail:

ivy-configure:
[ivy:configure] :: loading settings :: file = /home/jenkins/workspace/Lucene-Solr-master-Linux/lucene/top-level-ivy-settings.xml

resolve:

ivy-availability-check:
[loadresource] Do not set property disallowed.ivy.jars.list as its length is 0.

-ivy-fail-disallowed-ivy-version:

ivy-fail:

ivy-configure:
[ivy:configure] :: loading settings :: file = /home/jenkins/workspace/Lucene-Solr-master-Linux/lucene/top-level-ivy-settings.xml

resolve:

ivy-availability-check:
[loadresource] Do not set property disallowed.ivy.jars.list as its length is 0.

-ivy-fail-disallowed-ivy-version:

ivy-fail:

ivy-configure:
[ivy:configure] :: loading settings :: file = /home/jenkins/workspace/Lucene-Solr-master-Linux/lucene/top-level-ivy-settings.xml

resolve:

ivy-availability-check:
[loadresource] Do not set property disallowed.ivy.jars.list as its length is 0.

-ivy-fail-disallowed-ivy-version:

ivy-fail:

ivy-configure:
[ivy:configure] :: loading settings :: file = /home/jenkins/workspace/Lucene-Solr-master-Linux/lucene/top-level-ivy-settings.xml

resolve:

ivy-availability-check:
[loadresource] Do not set property disallowed.ivy.jars.list as its length is 0.

-ivy-fail-disallowed-ivy-version:

ivy-fail:

ivy-configure:
[ivy:configure] :: loading settings :: file = /home/jenkins/workspace/Lucene-Solr-master-Linux/lucene/top-level-ivy-settings.xml

resolve:

ivy-availability-check:
[loadresource] Do not set property disallowed.ivy.jars.list as its length is 0.

-ivy-fail-disallowed-ivy-version:

ivy-fail:

ivy-configure:
[ivy:configure] :: loading settings :: file = /home/jenkins/workspace/Lucene-Solr-master-Linux/lucene/top-level-ivy-settings.xml

resolve:

ivy-availability-check:
[loadresource] Do not set property disallowed.ivy.jars.list as its length is 0.

-ivy-fail-disallowed-ivy-version:

ivy-fail:

ivy-configure:
[ivy:configure] :: loading settings :: file = /home/jenkins/workspace/Lucene-Solr-master-Linux/lucene/top-level-ivy-settings.xml

resolve:

ivy-availability-check:
[loadresource] Do not set property disallowed.ivy.jars.list as its length is 0.

-ivy-fail-disallowed-ivy-version:

ivy-fail:

ivy-configure:
[ivy:configure] :: loading settings :: file = /home/jenkins/workspace/Lucene-Solr-master-Linux/lucene/top-level-ivy-settings.xml

resolve:

ivy-availability-check:
[loadresource] Do not set property disallowed.ivy.jars.list as its length is 0.

-ivy-fail-disallowed-ivy-version:

ivy-fail:

ivy-configure:
[ivy:configure] :: loading settings :: file = /home/jenkins/workspace/Lucene-Solr-master-Linux/lucene/top-level-ivy-settings.xml

resolve:

ivy-availability-check:
[loadresource] Do not set property disallowed.ivy.jars.list as its length is 0.

-ivy-fail-disallowed-ivy-version:

ivy-fail:

ivy-configure:
[ivy:configure] :: loading settings :: file = /home/jenkins/workspace/Lucene-Solr-master-Linux/lucene/top-level-ivy-settings.xml

resolve:

ivy-availability-check:
[loadresource] Do not set property disallowed.ivy.jars.list as its length is 0.

-ivy-fail-disallowed-ivy-version:

ivy-fail:

ivy-configure:
[ivy:configure] :: loading settings :: file = /home/jenkins/workspace/Lucene-Solr-master-Linux/lucene/top-level-ivy-settings.xml

resolve:

ivy-availability-check:
[loadresource] Do not set property disallowed.ivy.jars.list as its length is 0.

-ivy-fail-disallowed-ivy-version:

ivy-fail:

ivy-configure:
[ivy:configure] :: loading settings :: file = /home/jenkins/workspace/Lucene-Solr-master-Linux/lucene/top-level-ivy-settings.xml

resolve:

ivy-availability-check:
[loadresource] Do not set property disallowed.ivy.jars.list as its length is 0.

-ivy-fail-disallowed-ivy-version:

ivy-fail:

ivy-configure:
[ivy:configure] :: loading settings :: file = /home/jenkins/workspace/Lucene-Solr-master-Linux/lucene/top-level-ivy-settings.xml

resolve:

ivy-availability-check:
[loadresource] Do not set property disallowed.ivy.jars.list as its length is 0.

-ivy-fail-disallowed-ivy-version:

ivy-fail:

ivy-configure:
[ivy:configure] :: loading settings :: file = /home/jenkins/workspace/Lucene-Solr-master-Linux/lucene/top-level-ivy-settings.xml

resolve:

ivy-availability-check:
[loadresource] Do not set property disallowed.ivy.jars.list as its length is 0.

-ivy-fail-disallowed-ivy-version:

ivy-fail:

ivy-configure:
[ivy:configure] :: loading settings :: file = /home/jenkins/workspace/Lucene-Solr-master-Linux/lucene/top-level-ivy-settings.xml

resolve:

ivy-availability-check:
[loadresource] Do not set property disallowed.ivy.jars.list as its length is 0.

-ivy-fail-disallowed-ivy-version:

ivy-fail:

ivy-configure:
[ivy:configure] :: loading settings :: file = /home/jenkins/workspace/Lucene-Solr-master-Linux/lucene/top-level-ivy-settings.xml

resolve:

ivy-availability-check:
[loadresource] Do not set property disallowed.ivy.jars.list as its length is 0.

-ivy-fail-disallowed-ivy-version:

ivy-fail:

ivy-configure:
[ivy:configure] :: loading settings :: file = /home/jenkins/workspace/Lucene-Solr-master-Linux/lucene/top-level-ivy-settings.xml

resolve:

ivy-availability-check:
[loadresource] Do not set property disallowed.ivy.jars.list as its length is 0.

-ivy-fail-disallowed-ivy-version:

ivy-fail:

ivy-configure:
[ivy:configure] :: loading settings :: file = /home/jenkins/workspace/Lucene-Solr-master-Linux/lucene/top-level-ivy-settings.xml

resolve:

ivy-availability-check:
[loadresource] Do not set property disallowed.ivy.jars.list as its length is 0.

-ivy-fail-disallowed-ivy-version:

ivy-fail:

ivy-configure:
[ivy:configure] :: loading settings :: file = /home/jenkins/workspace/Lucene-Solr-master-Linux/lucene/top-level-ivy-settings.xml

resolve:

ivy-availability-check:
[loadresource] Do not set property disallowed.ivy.jars.list as its length is 0.

-ivy-fail-disallowed-ivy-version:

ivy-fail:

ivy-configure:
[ivy:configure] :: loading settings :: file = /home/jenkins/workspace/Lucene-Solr-master-Linux/lucene/top-level-ivy-settings.xml

resolve:

ivy-availability-check:
[loadresource] Do not set property disallowed.ivy.jars.list as its length is 0.

-ivy-fail-disallowed-ivy-version:

ivy-fail:

ivy-configure:
[ivy:configure] :: loading settings :: file = /home/jenkins/workspace/Lucene-Solr-master-Linux/lucene/top-level-ivy-settings.xml

common.resolve:

resolve:

ivy-availability-check:
[loadresource] Do not set property disallowed.ivy.jars.list as its length is 0.

-ivy-fail-disallowed-ivy-version:

ivy-fail:

ivy-configure:
[ivy:configure] :: loading settings :: file = /home/jenkins/workspace/Lucene-Solr-master-Linux/lucene/top-level-ivy-settings.xml

resolve:

ivy-availability-check:
[loadresource] Do not set property disallowed.ivy.jars.list as its length is 0.

-ivy-fail-disallowed-ivy-version:

ivy-fail:

ivy-configure:
[ivy:configure] :: loading settings :: file = /home/jenkins/workspace/Lucene-Solr-master-Linux/lucene/top-level-ivy-settings.xml

resolve:

ivy-availability-check:
[loadresource] Do not set property disallowed.ivy.jars.list as its length is 0.

-ivy-fail-disallowed-ivy-version:

ivy-fail:

ivy-configure:
[ivy:configure] :: loading settings :: file = /home/jenkins/workspace/Lucene-Solr-master-Linux/lucene/top-level-ivy-settings.xml

resolve:

ivy-availability-check:
[loadresource] Do not set property disallowed.ivy.jars.list as its length is 0.

-ivy-fail-disallowed-ivy-version:

ivy-fail:

ivy-configure:
[ivy:configure] :: loading settings :: file = /home/jenkins/workspace/Lucene-Solr-master-Linux/lucene/top-level-ivy-settings.xml

resolve:

ivy-availability-check:
[loadresource] Do not set property disallowed.ivy.jars.list as its length is 0.

-ivy-fail-disallowed-ivy-version:

ivy-fail:

ivy-configure:
[ivy:configure] :: loading settings :: file = /home/jenkins/workspace/Lucene-Solr-master-Linux/lucene/top-level-ivy-settings.xml

resolve:

jar-checksums:
    [mkdir] Created dir: /home/jenkins/workspace/Lucene-Solr-master-Linux/lucene/null1282561873
     [copy] Copying 38 files to /home/jenkins/workspace/Lucene-Solr-master-Linux/lucene/null1282561873
   [delete] Deleting directory /home/jenkins/workspace/Lucene-Solr-master-Linux/lucene/null1282561873

resolve-example:

ivy-availability-check:
[loadresource] Do not set property disallowed.ivy.jars.list as its length is 0.

-ivy-fail-disallowed-ivy-version:

ivy-fail:

ivy-configure:
[ivy:configure] :: loading settings :: file = /home/jenkins/workspace/Lucene-Solr-master-Linux/lucene/top-level-ivy-settings.xml

resolve:

resolve-server:

ivy-availability-check:
[loadresource] Do not set property disallowed.ivy.jars.list as its length is 0.

-ivy-fail-disallowed-ivy-version:

ivy-fail:

ivy-fail:

ivy-configure:
[ivy:configure] :: loading settings :: file = /home/jenkins/workspace/Lucene-Solr-master-Linux/lucene/top-level-ivy-settings.xml

resolve:

resolve:

ivy-availability-check:
[loadresource] Do not set property disallowed.ivy.jars.list as its length is 0.

-ivy-fail-disallowed-ivy-version:

ivy-fail:

ivy-fail:

ivy-configure:
[ivy:configure] :: loading settings :: file = /home/jenkins/workspace/Lucene-Solr-master-Linux/lucene/top-level-ivy-settings.xml

resolve:

ivy-availability-check:
[loadresource] Do not set property disallowed.ivy.jars.list as its length is 0.

-ivy-fail-disallowed-ivy-version:

ivy-fail:

ivy-fail:

ivy-configure:
[ivy:configure] :: loading settings :: file = /home/jenkins/workspace/Lucene-Solr-master-Linux/lucene/top-level-ivy-settings.xml

resolve:

ivy-availability-check:
[loadresource] Do not set property disallowed.ivy.jars.list as its length is 0.

-ivy-fail-disallowed-ivy-version:

ivy-fail:

ivy-configure:
[ivy:configure] :: loading settings :: file = /home/jenkins/workspace/Lucene-Solr-master-Linux/lucene/top-level-ivy-settings.xml

resolve:

ivy-availability-check:
[loadresource] Do not set property disallowed.ivy.jars.list as its length is 0.

-ivy-fail-disallowed-ivy-version:

ivy-fail:

ivy-fail:

ivy-configure:
[ivy:configure] :: loading settings :: file = /home/jenkins/workspace/Lucene-Solr-master-Linux/lucene/top-level-ivy-settings.xml

resolve:

ivy-availability-check:
[loadresource] Do not set property disallowed.ivy.jars.list as its length is 0.

-ivy-fail-disallowed-ivy-version:

ivy-fail:

ivy-configure:
[ivy:configure] :: loading settings :: file = /home/jenkins/workspace/Lucene-Solr-master-Linux/lucene/top-level-ivy-settings.xml

resolve:

ivy-availability-check:
[loadresource] Do not set property disallowed.ivy.jars.list as its length is 0.

-ivy-fail-disallowed-ivy-version:

ivy-fail:

ivy-fail:

ivy-configure:
[ivy:configure] :: loading settings :: file = /home/jenkins/workspace/Lucene-Solr-master-Linux/lucene/top-level-ivy-settings.xml

resolve:

ivy-availability-check:
[loadresource] Do not set property disallowed.ivy.jars.list as its length is 0.

-ivy-fail-disallowed-ivy-version:

ivy-fail:

ivy-fail:

ivy-configure:
[ivy:configure] :: loading settings :: file = /home/jenkins/workspace/Lucene-Solr-master-Linux/lucene/top-level-ivy-settings.xml

resolve:

ivy-availability-check:
[loadresource] Do not set property disallowed.ivy.jars.list as its length is 0.

-ivy-fail-disallowed-ivy-version:

ivy-fail:

ivy-fail:

ivy-configure:
[ivy:configure] :: loading settings :: file = /home/jenkins/workspace/Lucene-Solr-master-Linux/lucene/top-level-ivy-settings.xml

resolve:

ivy-availability-check:
[loadresource] Do not set property disallowed.ivy.jars.list as its length is 0.

-ivy-fail-disallowed-ivy-version:

ivy-fail:

ivy-fail:

ivy-configure:
[ivy:configure] :: loading settings :: file = /home/jenkins/workspace/Lucene-Solr-master-Linux/lucene/top-level-ivy-settings.xml

resolve:

ivy-availability-check:
[loadresource] Do not set property disallowed.ivy.jars.list as its length is 0.

-ivy-fail-disallowed-ivy-version:

ivy-fail:

ivy-fail:

ivy-configure:
[ivy:configure] :: loading settings :: file = /home/jenkins/workspace/Lucene-Solr-master-Linux/lucene/top-level-ivy-settings.xml

resolve:

ivy-availability-check:
[loadresource] Do not set property disallowed.ivy.jars.list as its length is 0.

-ivy-fail-disallowed-ivy-version:

ivy-fail:

ivy-fail:

ivy-configure:
[ivy:configure] :: loading settings :: file = /home/jenkins/workspace/Lucene-Solr-master-Linux/lucene/top-level-ivy-settings.xml

resolve:

ivy-availability-check:
[loadresource] Do not set property disallowed.ivy.jars.list as its length is 0.

-ivy-fail-disallowed-ivy-version:

ivy-fail:

ivy-fail:

ivy-configure:
[ivy:configure] :: loading settings :: file = /home/jenkins/workspace/Lucene-Solr-master-Linux/lucene/top-level-ivy-settings.xml

resolve:

ivy-availability-check:
[loadresource] Do not set property disallowed.ivy.jars.list as its length is 0.

-ivy-fail-disallowed-ivy-version:

ivy-fail:

ivy-fail:

ivy-configure:
[ivy:configure] :: loading settings :: file = /home/jenkins/workspace/Lucene-Solr-master-Linux/lucene/top-level-ivy-settings.xml

resolve:

ivy-availability-check:
[loadresource] Do not set property disallowed.ivy.jars.list as its length is 0.

-ivy-fail-disallowed-ivy-version:

ivy-fail:

ivy-fail:

ivy-configure:
[ivy:configure] :: loading settings :: file = /home/jenkins/workspace/Lucene-Solr-master-Linux/lucene/top-level-ivy-settings.xml

resolve:

ivy-availability-check:
[loadresource] Do not set property disallowed.ivy.jars.list as its length is 0.

-ivy-fail-disallowed-ivy-version:

ivy-fail:

ivy-fail:

ivy-configure:
[ivy:configure] :: loading settings :: file = /home/jenkins/workspace/Lucene-Solr-master-Linux/lucene/top-level-ivy-settings.xml

resolve:

ivy-availability-check:
[loadresource] Do not set property disallowed.ivy.jars.list as its length is 0.

-ivy-fail-disallowed-ivy-version:

ivy-fail:

ivy-fail:

ivy-configure:
[ivy:configure] :: loading settings :: file = /home/jenkins/workspace/Lucene-Solr-master-Linux/lucene/top-level-ivy-settings.xml

resolve:

jar-checksums:
    [mkdir] Created dir: /home/jenkins/workspace/Lucene-Solr-master-Linux/solr/null2009997766
     [copy] Copying 249 files to /home/jenkins/workspace/Lucene-Solr-master-Linux/solr/null2009997766
   [delete] Deleting directory /home/jenkins/workspace/Lucene-Solr-master-Linux/solr/null2009997766

check-working-copy:
[ivy:cachepath] :: resolving dependencies :: #;working@serv1.sd-datasolutions.de
[ivy:cachepath] 	confs: [default]
[ivy:cachepath] 	found org.eclipse.jgit#org.eclipse.jgit;5.3.0.201903130848-r in public
[ivy:cachepath] 	found com.jcraft#jsch;0.1.54 in public
[ivy:cachepath] 	found com.jcraft#jzlib;1.1.1 in public
[ivy:cachepath] 	found com.googlecode.javaewah#JavaEWAH;1.1.6 in public
[ivy:cachepath] 	found org.slf4j#slf4j-api;1.7.2 in public
[ivy:cachepath] 	found org.bouncycastle#bcpg-jdk15on;1.60 in public
[ivy:cachepath] 	found org.bouncycastle#bcprov-jdk15on;1.60 in public
[ivy:cachepath] 	found org.bouncycastle#bcpkix-jdk15on;1.60 in public
[ivy:cachepath] 	found org.slf4j#slf4j-nop;1.7.2 in public
[ivy:cachepath] :: resolution report :: resolve 145ms :: artifacts dl 1ms
	---------------------------------------------------------------------
	|                  |            modules            ||   artifacts   |
	|       conf       | number| search|dwnlded|evicted|| number|dwnlded|
	---------------------------------------------------------------------
	|      default     |   9   |   0   |   0   |   0   ||   9   |   0   |
	---------------------------------------------------------------------
[wc-checker] Initializing working copy...
[wc-checker] Checking working copy status...

-jenkins-base:

BUILD SUCCESSFUL
Total time: 96 minutes 22 seconds
Setting ANT_1_8_2_HOME=/home/jenkins/tools/hudson.tasks.Ant_AntInstallation/ANT_1.8.2
[Lucene-Solr-master-Linux] $ /bin/sh -xe /tmp/jenkins2698612547026936997.sh
+ mv lucene/build lucene/build.orig
+ mv solr/build solr/build.orig
+ export ANT_HOME=/home/jenkins/tools/hudson.tasks.Ant_AntInstallation/ANT_1.8.2
+ export PATH=/home/jenkins/tools/hudson.tasks.Ant_AntInstallation/ANT_1.8.2/bin:/home/jenkins/tools/java/64bit/jdk-11.0.3/bin:/usr/local/sbin:/usr/local/bin:/usr/sbin:/usr/bin:/sbin:/bin:/usr/games:/usr/local/games
+ python3 -u dev-tools/scripts/reproduceJenkinsFailures.py --no-git https://jenkins.thetaphi.de/job/Lucene-Solr-master-Linux/24328/consoleText
[repro] Jenkins log URL: https://jenkins.thetaphi.de/job/Lucene-Solr-master-Linux/24328/consoleText

[repro] Revision: 0e877aac3480847c0b587c6909bb27ebfae8b7a0

[repro] Ant options: "-Dargs=-XX:-UseCompressedOops -XX:+UseParallelGC"
[repro] Repro line:  ant test  -Dtestcase=TestRamUsageEstimator -Dtests.method=testMap -Dtests.seed=ED7055A14021EA69 -Dtests.multiplier=3 -Dtests.slow=true -Dtests.locale=nd -Dtests.timezone=America/Yakutat -Dtests.asserts=true -Dtests.file.encoding=US-ASCII

[repro] ant clean
Buildfile: /home/jenkins/workspace/Lucene-Solr-master-Linux/build.xml

clean:

clean:

clean:

BUILD SUCCESSFUL
Total time: 0 seconds
[repro] Test suites by module:
[repro]    lucene/core
[repro]       TestRamUsageEstimator
[repro] ant compile-test
Buildfile: /home/jenkins/workspace/Lucene-Solr-master-Linux/lucene/core/build.xml

-check-git-state:

-git-cleanroot:

-copy-git-state:
    [mkdir] Created dir: /home/jenkins/workspace/Lucene-Solr-master-Linux/lucene/build
     [copy] Copying 1 file to /home/jenkins/workspace/Lucene-Solr-master-Linux/lucene/build

git-autoclean:

ivy-availability-check:
[loadresource] Do not set property disallowed.ivy.jars.list as its length is 0.

-ivy-fail-disallowed-ivy-version:

ivy-fail:

ivy-configure:
[ivy:configure] :: Apache Ivy 2.4.0 - 20141213170938 :: http://ant.apache.org/ivy/ ::
[ivy:configure] :: loading settings :: file = /home/jenkins/workspace/Lucene-Solr-master-Linux/lucene/top-level-ivy-settings.xml

resolve:

init:

-clover.disable:

-clover.load:

-clover.classpath:

-clover.setup:

clover:

compile-core:
    [mkdir] Created dir: /home/jenkins/workspace/Lucene-Solr-master-Linux/lucene/build/core/classes/java
    [javac] Compiling 874 source files to /home/jenkins/workspace/Lucene-Solr-master-Linux/lucene/build/core/classes/java
    [javac] Note: /home/jenkins/workspace/Lucene-Solr-master-Linux/lucene/core/src/java/org/apache/lucene/util/fst/PositiveIntOutputs.java uses or overrides a deprecated API.
    [javac] Note: Recompile with -Xlint:deprecation for details.
    [javac] Creating empty /home/jenkins/workspace/Lucene-Solr-master-Linux/lucene/build/core/classes/java/org/apache/lucene/util/graph/package-info.class
    [javac] Creating empty /home/jenkins/workspace/Lucene-Solr-master-Linux/lucene/build/core/classes/java/org/apache/lucene/document/package-info.class
    [javac] Creating empty /home/jenkins/workspace/Lucene-Solr-master-Linux/lucene/build/core/classes/java/org/apache/lucene/package-info.class
    [javac] Creating empty /home/jenkins/workspace/Lucene-Solr-master-Linux/lucene/build/core/classes/java/org/apache/lucene/util/bkd/package-info.class
    [javac] Creating empty /home/jenkins/workspace/Lucene-Solr-master-Linux/lucene/build/core/classes/java/org/apache/lucene/codecs/compressing/package-info.class
    [javac] Creating empty /home/jenkins/workspace/Lucene-Solr-master-Linux/lucene/build/core/classes/java/org/apache/lucene/codecs/lucene60/package-info.class
    [javac] Creating empty /home/jenkins/workspace/Lucene-Solr-master-Linux/lucene/build/core/classes/java/org/apache/lucene/codecs/package-info.class
    [javac] Creating empty /home/jenkins/workspace/Lucene-Solr-master-Linux/lucene/build/core/classes/java/org/apache/lucene/codecs/lucene80/package-info.class
    [javac] Creating empty /home/jenkins/workspace/Lucene-Solr-master-Linux/lucene/build/core/classes/java/org/apache/lucene/util/package-info.class
    [javac] Creating empty /home/jenkins/workspace/Lucene-Solr-master-Linux/lucene/build/core/classes/java/org/apache/lucene/index/package-info.class
    [javac] Creating empty /home/jenkins/workspace/Lucene-Solr-master-Linux/lucene/build/core/classes/java/org/apache/lucene/util/fst/package-info.class
    [javac] Creating empty /home/jenkins/workspace/Lucene-Solr-master-Linux/lucene/build/core/classes/java/org/apache/lucene/analysis/tokenattributes/package-info.class
    [javac] Creating empty /home/jenkins/workspace/Lucene-Solr-master-Linux/lucene/build/core/classes/java/org/apache/lucene/search/package-info.class
    [javac] Creating empty /home/jenkins/workspace/Lucene-Solr-master-Linux/lucene/build/core/classes/java/org/apache/lucene/util/packed/package-info.class
    [javac] Creating empty /home/jenkins/workspace/Lucene-Solr-master-Linux/lucene/build/core/classes/java/org/apache/lucene/util/mutable/package-info.class
    [javac] Creating empty /home/jenkins/workspace/Lucene-Solr-master-Linux/lucene/build/core/classes/java/org/apache/lucene/codecs/lucene70/package-info.class
    [javac] Creating empty /home/jenkins/workspace/Lucene-Solr-master-Linux/lucene/build/core/classes/java/org/apache/lucene/codecs/perfield/package-info.class
    [javac] Creating empty /home/jenkins/workspace/Lucene-Solr-master-Linux/lucene/build/core/classes/java/org/apache/lucene/analysis/package-info.class
    [javac] Creating empty /home/jenkins/workspace/Lucene-Solr-master-Linux/lucene/build/core/classes/java/org/apache/lucene/analysis/standard/package-info.class
    [javac] Creating empty /home/jenkins/workspace/Lucene-Solr-master-Linux/lucene/build/core/classes/java/org/apache/lucene/store/package-info.class
    [javac] Creating empty /home/jenkins/workspace/Lucene-Solr-master-Linux/lucene/build/core/classes/java/org/apache/lucene/codecs/blocktree/package-info.class
    [javac] Creating empty /home/jenkins/workspace/Lucene-Solr-master-Linux/lucene/build/core/classes/java/org/apache/lucene/search/spans/package-info.class
    [javac] Creating empty /home/jenkins/workspace/Lucene-Solr-master-Linux/lucene/build/core/classes/java/org/apache/lucene/search/similarities/package-info.class
    [javac] Creating empty /home/jenkins/workspace/Lucene-Solr-master-Linux/lucene/build/core/classes/java/org/apache/lucene/util/automaton/package-info.class
    [javac] Creating empty /home/jenkins/workspace/Lucene-Solr-master-Linux/lucene/build/core/classes/java/org/apache/lucene/codecs/lucene50/package-info.class
    [javac] Creating empty /home/jenkins/workspace/Lucene-Solr-master-Linux/lucene/build/core/classes/java/org/apache/lucene/geo/package-info.class
     [copy] Copying 3 files to /home/jenkins/workspace/Lucene-Solr-master-Linux/lucene/build/core/classes/java

compile-test-framework:

-check-git-state:

-git-cleanroot:

-copy-git-state:

git-autoclean:

ivy-availability-check:
[loadresource] Do not set property disallowed.ivy.jars.list as its length is 0.

-ivy-fail-disallowed-ivy-version:

ivy-fail:

ivy-configure:
[ivy:configure] :: loading settings :: file = /home/jenkins/workspace/Lucene-Solr-master-Linux/lucene/top-level-ivy-settings.xml

resolve:

init:

compile-lucene-core:

-check-git-state:

-git-cleanroot:

-copy-git-state:

git-autoclean:

ivy-availability-check:
[loadresource] Do not set property disallowed.ivy.jars.list as its length is 0.

-ivy-fail-disallowed-ivy-version:

ivy-fail:

ivy-configure:
[ivy:configure] :: loading settings :: file = /home/jenkins/workspace/Lucene-Solr-master-Linux/lucene/top-level-ivy-settings.xml

resolve:

init:

-clover.disable:

-clover.load:

-clover.classpath:

-clover.setup:

clover:

compile-core:

compile-codecs:

-check-git-state:

-git-cleanroot:

-copy-git-state:

git-autoclean:

ivy-availability-check:
[loadresource] Do not set property disallowed.ivy.jars.list as its length is 0.

-ivy-fail-disallowed-ivy-version:

ivy-fail:

ivy-configure:
[ivy:configure] :: loading settings :: file = /home/jenkins/workspace/Lucene-Solr-master-Linux/lucene/top-level-ivy-settings.xml

resolve:

common.init:

compile-lucene-core:

init:

-clover.disable:

-clover.load:

-clover.classpath:

-clover.setup:

clover:

compile-core:
    [mkdir] Created dir: /home/jenkins/workspace/Lucene-Solr-master-Linux/lucene/build/codecs/classes/java
    [javac] Compiling 74 source files to /home/jenkins/workspace/Lucene-Solr-master-Linux/lucene/build/codecs/classes/java
    [javac] Note: Some input files use or override a deprecated API.
    [javac] Note: Recompile with -Xlint:deprecation for details.
    [javac] Creating empty /home/jenkins/workspace/Lucene-Solr-master-Linux/lucene/build/codecs/classes/java/org/apache/lucene/codecs/bloom/package-info.class
    [javac] Creating empty /home/jenkins/workspace/Lucene-Solr-master-Linux/lucene/build/codecs/classes/java/org/apache/lucene/codecs/memory/package-info.class
    [javac] Creating empty /home/jenkins/workspace/Lucene-Solr-master-Linux/lucene/build/codecs/classes/java/org/apache/lucene/codecs/simpletext/package-info.class
    [javac] Creating empty /home/jenkins/workspace/Lucene-Solr-master-Linux/lucene/build/codecs/classes/java/org/apache/lucene/codecs/blockterms/package-info.class
    [javac] Creating empty /home/jenkins/workspace/Lucene-Solr-master-Linux/lucene/build/codecs/classes/java/org/apache/lucene/codecs/blocktreeords/package-info.class
     [copy] Copying 3 files to /home/jenkins/workspace/Lucene-Solr-master-Linux/lucene/build/codecs/classes/java

-clover.disable:

-clover.load:

-clover.classpath:

-clover.setup:

clover:

common.compile-core:
    [mkdir] Created dir: /home/jenkins/workspace/Lucene-Solr-master-Linux/lucene/build/test-framework/classes/java
    [javac] Compiling 198 source files to /home/jenkins/workspace/Lucene-Solr-master-Linux/lucene/build/test-framework/classes/java
    [javac] /home/jenkins/workspace/Lucene-Solr-master-Linux/lucene/test-framework/src/java/org/apache/lucene/store/BaseDirectoryTestCase.java:416: warning: [try] auto-closeable resource output is never referenced in body of corresponding try statement
    [javac]             try (IndexOutput output = dir.createOutput(fileName, newIOContext(random()))) {
    [javac]                              ^
    [javac] /home/jenkins/workspace/Lucene-Solr-master-Linux/lucene/test-framework/src/java/org/apache/lucene/store/BaseDirectoryTestCase.java:440: warning: [try] auto-closeable resource input is never referenced in body of corresponding try statement
    [javac]                 try (IndexInput input = dir.openInput(file, newIOContext(random()))) {
    [javac]                                 ^
    [javac] /home/jenkins/workspace/Lucene-Solr-master-Linux/lucene/test-framework/src/java/org/apache/lucene/store/BaseDirectoryTestCase.java:1051: warning: [try] auto-closeable resource out is never referenced in body of corresponding try statement
    [javac]       try (IndexOutput out = dir.createOutput(name, IOContext.DEFAULT)) {
    [javac]                        ^
    [javac] /home/jenkins/workspace/Lucene-Solr-master-Linux/lucene/test-framework/src/java/org/apache/lucene/store/BaseDirectoryTestCase.java:1056: warning: [try] auto-closeable resource out is never referenced in body of corresponding try statement
    [javac]         try (IndexOutput out = dir.createOutput(name, IOContext.DEFAULT)) {
    [javac]                          ^
    [javac] Note: Some input files use or override a deprecated API.
    [javac] Note: Recompile with -Xlint:deprecation for details.
    [javac] 4 warnings
    [javac] Creating empty /home/jenkins/workspace/Lucene-Solr-master-Linux/lucene/build/test-framework/classes/java/org/apache/lucene/codecs/asserting/package-info.class
    [javac] Creating empty /home/jenkins/workspace/Lucene-Solr-master-Linux/lucene/build/test-framework/classes/java/org/apache/lucene/codecs/ramonly/package-info.class
    [javac] Creating empty /home/jenkins/workspace/Lucene-Solr-master-Linux/lucene/build/test-framework/classes/java/org/apache/lucene/mockfile/package-info.class
    [javac] Creating empty /home/jenkins/workspace/Lucene-Solr-master-Linux/lucene/build/test-framework/classes/java/org/apache/lucene/codecs/cheapbastard/package-info.class
    [javac] Creating empty /home/jenkins/workspace/Lucene-Solr-master-Linux/lucene/build/test-framework/classes/java/org/apache/lucene/codecs/mockrandom/package-info.class
    [javac] Creating empty /home/jenkins/workspace/Lucene-Solr-master-Linux/lucene/build/test-framework/classes/java/org/apache/lucene/codecs/cranky/package-info.class
    [javac] Creating empty /home/jenkins/workspace/Lucene-Solr-master-Linux/lucene/build/test-framework/classes/java/org/apache/lucene/codecs/compressing/dummy/package-info.class
     [copy] Copying 4 files to /home/jenkins/workspace/Lucene-Solr-master-Linux/lucene/build/test-framework/classes/java

compile-core:

compile-test:
    [mkdir] Created dir: /home/jenkins/workspace/Lucene-Solr-master-Linux/lucene/build/core/classes/test
    [javac] Compiling 532 source files to /home/jenkins/workspace/Lucene-Solr-master-Linux/lucene/build/core/classes/test
    [javac] /home/jenkins/workspace/Lucene-Solr-master-Linux/lucene/core/src/test/org/apache/lucene/analysis/TestAnalyzerWrapper.java:52: warning: [try] auto-closeable resource ts is never referenced in body of corresponding try statement
    [javac]     try (TokenStream ts = wrapped.tokenStream("", "text")) {
    [javac]                      ^
    [javac] /home/jenkins/workspace/Lucene-Solr-master-Linux/lucene/core/src/test/org/apache/lucene/index/TestFieldUpdatesBuffer.java:158: warning: [unchecked] unchecked cast
    [javac]       return (T) (rarely() ? value.prepareForApply(random().nextInt(100)) : value);
    [javac]                  ^
    [javac]   required: T
    [javac]   found:    BinaryDocValuesUpdate
    [javac]   where T is a type-variable:
    [javac]     T extends DocValuesUpdate declared in method <T>getRandomUpdate(boolean)
    [javac] /home/jenkins/workspace/Lucene-Solr-master-Linux/lucene/core/src/test/org/apache/lucene/index/TestFieldUpdatesBuffer.java:163: warning: [unchecked] unchecked cast
    [javac]       return (T) (rarely() ? value.prepareForApply(random().nextInt(100)) : value);
    [javac]                  ^
    [javac]   required: T
    [javac]   found:    NumericDocValuesUpdate
    [javac]   where T is a type-variable:
    [javac]     T extends DocValuesUpdate declared in method <T>getRandomUpdate(boolean)
    [javac] /home/jenkins/workspace/Lucene-Solr-master-Linux/lucene/core/src/test/org/apache/lucene/index/TestIndexWriter.java:2688: warning: [try] auto-closeable resource closeable is never referenced in body of corresponding try statement
    [javac]          Closeable closeable = () -> IOUtils.close(toClose)) {
    [javac]                    ^
    [javac] /home/jenkins/workspace/Lucene-Solr-master-Linux/lucene/core/src/test/org/apache/lucene/index/TestIndexWriter.java:3686: warning: [try] auto-closeable resource w is never referenced in body of corresponding try statement
    [javac]             try (IndexWriter w = new IndexWriter(dir, newIndexWriterConfig().setIndexCreatedVersionMajor(previousMajor))) {}
    [javac]                              ^
    [javac] /home/jenkins/workspace/Lucene-Solr-master-Linux/lucene/core/src/test/org/apache/lucene/index/TestIndexWriter.java:3689: warning: [try] auto-closeable resource w is never referenced in body of corresponding try statement
    [javac]             try (IndexWriter w = new IndexWriter(dir, newIndexWriterConfig().setOpenMode(openMode).setIndexCreatedVersionMajor(newMajor))) {}
    [javac]                              ^
    [javac] /home/jenkins/workspace/Lucene-Solr-master-Linux/lucene/core/src/test/org/apache/lucene/search/TestConstantScoreScorer.java:67: warning: [try] auto-closeable resource TestConstantScoreScorerIndex has a member method close() that could throw InterruptedException
    [javac]     try (TestConstantScoreScorerIndex index = new TestConstantScoreScorerIndex()) {
    [javac]                                       ^
    [javac] /home/jenkins/workspace/Lucene-Solr-master-Linux/lucene/core/src/test/org/apache/lucene/search/TestConstantScoreScorer.java:103: warning: [try] auto-closeable resource TestConstantScoreScorerIndex has a member method close() that could throw InterruptedException
    [javac]     try (TestConstantScoreScorerIndex index = new TestConstantScoreScorerIndex()) {
    [javac]                                       ^
    [javac] /home/jenkins/workspace/Lucene-Solr-master-Linux/lucene/core/src/test/org/apache/lucene/search/TestConstantScoreScorer.java:131: warning: [try] auto-closeable resource TestConstantScoreScorerIndex has a member method close() that could throw InterruptedException
    [javac]     try (TestConstantScoreScorerIndex index = new TestConstantScoreScorerIndex()) {
    [javac]                                       ^
    [javac] /home/jenkins/workspace/Lucene-Solr-master-Linux/lucene/core/src/test/org/apache/lucene/search/TestConstantScoreScorer.java:159: warning: [try] auto-closeable resource TestConstantScoreScorerIndex has a member method close() that could throw InterruptedException
    [javac]     try (TestConstantScoreScorerIndex index = new TestConstantScoreScorerIndex()) {
    [javac]                                       ^
    [javac] /home/jenkins/workspace/Lucene-Solr-master-Linux/lucene/core/src/test/org/apache/lucene/search/TestConstantScoreScorer.java:178: warning: [try] auto-closeable resource TestConstantScoreScorerIndex has a member method close() that could throw InterruptedException
    [javac]   static class TestConstantScoreScorerIndex implements AutoCloseable {
    [javac]          ^
    [javac] /home/jenkins/workspace/Lucene-Solr-master-Linux/lucene/core/src/test/org/apache/lucene/search/TestSearchAfter.java:220: warning: [rawtypes] found raw type: TopDocsCollector
    [javac]     final TopDocsCollector allCollector;
    [javac]           ^
    [javac]   missing type arguments for generic class TopDocsCollector<T>
    [javac]   where T is a type-variable:
    [javac]     T extends ScoreDoc declared in class TopDocsCollector
    [javac] /home/jenkins/workspace/Lucene-Solr-master-Linux/lucene/core/src/test/org/apache/lucene/search/TestSearchAfter.java:248: warning: [rawtypes] found raw type: TopDocsCollector
    [javac]       final TopDocsCollector pagedCollector;
    [javac]             ^
    [javac]   missing type arguments for generic class TopDocsCollector<T>
    [javac]   where T is a type-variable:
    [javac]     T extends ScoreDoc declared in class TopDocsCollector
    [javac] /home/jenkins/workspace/Lucene-Solr-master-Linux/lucene/core/src/test/org/apache/lucene/store/TestFileSwitchDirectory.java:179: warning: [try] auto-closeable resource indexInput is never referenced in body of corresponding try statement
    [javac]       try (IndexInput indexInput = dir.openInput("foo.tim", IOContext.DEFAULT)) {
    [javac]                       ^
    [javac] Note: Some input files use or override a deprecated API.
    [javac] Note: Recompile with -Xlint:deprecation for details.
    [javac] 14 warnings
     [copy] Copying 3 files to /home/jenkins/workspace/Lucene-Solr-master-Linux/lucene/build/core/classes/test

BUILD SUCCESSFUL
Total time: 22 seconds
[repro] ant test-nocompile -Dtests.dups=5 -Dtests.maxfailures=5 -Dtests.class="*.TestRamUsageEstimator" -Dtests.showOutput=onerror "-Dargs=-XX:-UseCompressedOops -XX:+UseParallelGC" -Dtests.seed=ED7055A14021EA69 -Dtests.multiplier=3 -Dtests.slow=true -Dtests.locale=nd -Dtests.timezone=America/Yakutat -Dtests.asserts=true -Dtests.file.encoding=US-ASCII
Buildfile: /home/jenkins/workspace/Lucene-Solr-master-Linux/lucene/core/build.xml

-clover.disable:

ivy-configure:
[ivy:configure] :: Apache Ivy 2.4.0 - 20141213170938 :: http://ant.apache.org/ivy/ ::
[ivy:configure] :: loading settings :: file = /home/jenkins/workspace/Lucene-Solr-master-Linux/lucene/top-level-ivy-settings.xml

install-junit4-taskdef:

ivy-availability-check:
[loadresource] Do not set property disallowed.ivy.jars.list as its length is 0.

-ivy-fail-disallowed-ivy-version:

ivy-fail:

resolve-groovy:
[ivy:cachepath] :: resolving dependencies :: org.codehaus.groovy#groovy-all-caller;working
[ivy:cachepath] 	confs: [default]
[ivy:cachepath] 	found org.codehaus.groovy#groovy-all;2.4.16 in public
[ivy:cachepath] :: resolution report :: resolve 22ms :: artifacts dl 1ms
	---------------------------------------------------------------------
	|                  |            modules            ||   artifacts   |
	|       conf       | number| search|dwnlded|evicted|| number|dwnlded|
	---------------------------------------------------------------------
	|      default     |   1   |   0   |   0   |   0   ||   1   |   0   |
	---------------------------------------------------------------------

-init-totals:

-test:
    [mkdir] Created dir: /home/jenkins/workspace/Lucene-Solr-master-Linux/lucene/build/core/test
[junit4:pickseed] Seed property 'tests.seed' already defined: ED7055A14021EA69
    [mkdir] Created dir: /home/jenkins/workspace/Lucene-Solr-master-Linux/lucene/build/core/test/temp
   [junit4] <JUnit4> says jolly good day! Master seed: ED7055A14021EA69
   [junit4] Executing 5 suites with 3 JVMs.
   [junit4] 
   [junit4] Started J1 PID(27900@localhost).
   [junit4] Started J0 PID(27899@localhost).
   [junit4] Started J2 PID(27901@localhost).
   [junit4] Suite: org.apache.lucene.util.TestRamUsageEstimator
   [junit4] OK      0.04s J1 | TestRamUsageEstimator.testSanity
   [junit4]   2> NOTE: reproduce with: ant test  -Dtestcase=TestRamUsageEstimator -Dtests.method=testMap -Dtests.seed=ED7055A14021EA69 -Dtests.multiplier=3 -Dtests.slow=true -Dtests.badapples=true -Dtests.locale=nd -Dtests.timezone=America/Yakutat -Dtests.asserts=true -Dtests.file.encoding=US-ASCII
   [junit4] FAILURE 0.12s J1 | TestRamUsageEstimator.testMap <<<
   [junit4]    > Throwable #1: java.lang.AssertionError: expected:<25152.0> but was:<30184.0>
   [junit4]    > 	at __randomizedtesting.SeedInfo.seed([ED7055A14021EA69:CD56E1725ADAF91B]:0)
   [junit4]    > 	at org.apache.lucene.util.TestRamUsageEstimator.testMap(TestRamUsageEstimator.java:136)
   [junit4]    > 	at java.base/jdk.internal.reflect.NativeMethodAccessorImpl.invoke0(Native Method)
   [junit4]    > 	at java.base/jdk.internal.reflect.NativeMethodAccessorImpl.invoke(NativeMethodAccessorImpl.java:62)
   [junit4]    > 	at java.base/jdk.internal.reflect.DelegatingMethodAccessorImpl.invoke(DelegatingMethodAccessorImpl.java:43)
   [junit4]    > 	at java.base/java.lang.reflect.Method.invoke(Method.java:566)
   [junit4]    > 	at java.base/java.lang.Thread.run(Thread.java:834)
   [junit4] OK      0.06s J1 | TestRamUsageEstimator.testBytesRefHash
   [junit4] OK      0.01s J1 | TestRamUsageEstimator.testHotspotBean
   [junit4] OK      0.02s J1 | TestRamUsageEstimator.testStaticOverloads
   [junit4] OK      0.00s J1 | TestRamUsageEstimator.testReferenceSize
   [junit4] OK      0.03s J1 | TestRamUsageEstimator.testCollection
   [junit4] OK      0.07s J1 | TestRamUsageEstimator.testQuery
   [junit4] OK      0.02s J1 | TestRamUsageEstimator.testStrings
   [junit4] IGNOR/A 0.02s J1 | TestRamUsageEstimator.testPrintValues
   [junit4]    > Assumption #1: Specify -Dtests.verbose=true to print constants of RamUsageEstimator.
   [junit4]   2> NOTE: test params are: codec=Asserting(Lucene80): {}, docValues:{}, maxPointsInLeafNode=1460, maxMBSortInHeap=6.927495954369251, sim=Asserting(org.apache.lucene.search.similarities.AssertingSimilarity@76f38ecf), locale=nd, timezone=America/Yakutat
   [junit4]   2> NOTE: Linux 4.18.0-24-generic amd64/AdoptOpenJDK 11.0.3 (64-bit)/cpus=8,threads=1,free=433950472,total=514850816
   [junit4]   2> NOTE: All tests run in this JVM: [TestRamUsageEstimator]
   [junit4] Completed [1/5 (1!)] on J1 in 1.39s, 10 tests, 1 failure, 1 skipped <<< FAILURES!
   [junit4] 
   [junit4] Suite: org.apache.lucene.util.TestRamUsageEstimator
   [junit4] OK      0.05s J2 | TestRamUsageEstimator.testSanity
   [junit4]   2> NOTE: reproduce with: ant test  -Dtestcase=TestRamUsageEstimator -Dtests.method=testMap -Dtests.seed=ED7055A14021EA69 -Dtests.multiplier=3 -Dtests.slow=true -Dtests.badapples=true -Dtests.locale=nd -Dtests.timezone=America/Yakutat -Dtests.asserts=true -Dtests.file.encoding=US-ASCII
   [junit4] FAILURE 0.16s J2 | TestRamUsageEstimator.testMap <<<
   [junit4]    > Throwable #1: java.lang.AssertionError: expected:<25152.0> but was:<30184.0>
   [junit4]    > 	at __randomizedtesting.SeedInfo.seed([ED7055A14021EA69:CD56E1725ADAF91B]:0)
   [junit4]    > 	at org.apache.lucene.util.TestRamUsageEstimator.testMap(TestRamUsageEstimator.java:136)
   [junit4]    > 	at java.base/jdk.internal.reflect.NativeMethodAccessorImpl.invoke0(Native Method)
   [junit4]    > 	at java.base/jdk.internal.reflect.NativeMethodAccessorImpl.invoke(NativeMethodAccessorImpl.java:62)
   [junit4]    > 	at java.base/jdk.internal.reflect.DelegatingMethodAccessorImpl.invoke(DelegatingMethodAccessorImpl.java:43)
   [junit4]    > 	at java.base/java.lang.reflect.Method.invoke(Method.java:566)
   [junit4]    > 	at java.base/java.lang.Thread.run(Thread.java:834)
   [junit4] OK      0.03s J2 | TestRamUsageEstimator.testBytesRefHash
   [junit4] OK      0.01s J2 | TestRamUsageEstimator.testHotspotBean
   [junit4] OK      0.01s J2 | TestRamUsageEstimator.testStaticOverloads
   [junit4] OK      0.01s J2 | TestRamUsageEstimator.testReferenceSize
   [junit4] OK      0.09s J2 | TestRamUsageEstimator.testCollection
   [junit4] OK      0.05s J2 | TestRamUsageEstimator.testQuery
   [junit4] OK      0.00s J2 | TestRamUsageEstimator.testStrings
   [junit4] IGNOR/A 0.01s J2 | TestRamUsageEstimator.testPrintValues
   [junit4]    > Assumption #1: Specify -Dtests.verbose=true to print constants of RamUsageEstimator.
   [junit4]   2> NOTE: test params are: codec=Asserting(Lucene80): {}, docValues:{}, maxPointsInLeafNode=1460, maxMBSortInHeap=6.927495954369251, sim=Asserting(org.apache.lucene.search.similarities.AssertingSimilarity@94cbfec), locale=nd, timezone=America/Yakutat
   [junit4]   2> NOTE: Linux 4.18.0-24-generic amd64/AdoptOpenJDK 11.0.3 (64-bit)/cpus=8,threads=1,free=433932592,total=514850816
   [junit4]   2> NOTE: All tests run in this JVM: [TestRamUsageEstimator]
   [junit4] Completed [2/5 (2!)] on J2 in 1.43s, 10 tests, 1 failure, 1 skipped <<< FAILURES!
   [junit4] 
   [junit4] Suite: org.apache.lucene.util.TestRamUsageEstimator
   [junit4] OK      0.06s J0 | TestRamUsageEstimator.testSanity
   [junit4]   2> NOTE: reproduce with: ant test  -Dtestcase=TestRamUsageEstimator -Dtests.method=testMap -Dtests.seed=ED7055A14021EA69 -Dtests.multiplier=3 -Dtests.slow=true -Dtests.badapples=true -Dtests.locale=nd -Dtests.timezone=America/Yakutat -Dtests.asserts=true -Dtests.file.encoding=US-ASCII
   [junit4] FAILURE 0.16s J0 | TestRamUsageEstimator.testMap <<<
   [junit4]    > Throwable #1: java.lang.AssertionError: expected:<25152.0> but was:<30184.0>
   [junit4]    > 	at __randomizedtesting.SeedInfo.seed([ED7055A14021EA69:CD56E1725ADAF91B]:0)
   [junit4]    > 	at org.apache.lucene.util.TestRamUsageEstimator.testMap(TestRamUsageEstimator.java:136)
   [junit4]    > 	at java.base/jdk.internal.reflect.NativeMethodAccessorImpl.invoke0(Native Method)
   [junit4]    > 	at java.base/jdk.internal.reflect.NativeMethodAccessorImpl.invoke(NativeMethodAccessorImpl.java:62)
   [junit4]    > 	at java.base/jdk.internal.reflect.DelegatingMethodAccessorImpl.invoke(DelegatingMethodAccessorImpl.java:43)
   [junit4]    > 	at java.base/java.lang.reflect.Method.invoke(Method.java:566)
   [junit4]    > 	at java.base/java.lang.Thread.run(Thread.java:834)
   [junit4] OK      0.03s J0 | TestRamUsageEstimator.testBytesRefHash
   [junit4] OK      0.03s J0 | TestRamUsageEstimator.testHotspotBean
   [junit4] OK      0.02s J0 | TestRamUsageEstimator.testStaticOverloads
   [junit4] OK      0.00s J0 | TestRamUsageEstimator.testReferenceSize
   [junit4] OK      0.03s J0 | TestRamUsageEstimator.testCollection
   [junit4] OK      0.04s J0 | TestRamUsageEstimator.testQuery
   [junit4] OK      0.00s J0 | TestRamUsageEstimator.testStrings
   [junit4] IGNOR/A 0.01s J0 | TestRamUsageEstimator.testPrintValues
   [junit4]    > Assumption #1: Specify -Dtests.verbose=true to print constants of RamUsageEstimator.
   [junit4]   2> NOTE: test params are: codec=Asserting(Lucene80): {}, docValues:{}, maxPointsInLeafNode=1460, maxMBSortInHeap=6.927495954369251, sim=Asserting(org.apache.lucene.search.similarities.AssertingSimilarity@76f38ecf), locale=nd, timezone=America/Yakutat
   [junit4]   2> NOTE: Linux 4.18.0-24-generic amd64/AdoptOpenJDK 11.0.3 (64-bit)/cpus=8,threads=1,free=431239760,total=514850816
   [junit4]   2> NOTE: All tests run in this JVM: [TestRamUsageEstimator]
   [junit4] Completed [3/5 (3!)] on J0 in 1.41s, 10 tests, 1 failure, 1 skipped <<< FAILURES!
   [junit4] 
   [junit4] Suite: org.apache.lucene.util.TestRamUsageEstimator
   [junit4] OK      0.00s J1 | TestRamUsageEstimator.testSanity
   [junit4]   2> NOTE: reproduce with: ant test  -Dtestcase=TestRamUsageEstimator -Dtests.method=testMap -Dtests.seed=ED7055A14021EA69 -Dtests.multiplier=3 -Dtests.slow=true -Dtests.badapples=true -Dtests.locale=nd -Dtests.timezone=America/Yakutat -Dtests.asserts=true -Dtests.file.encoding=US-ASCII
   [junit4] FAILURE 0.05s J1 | TestRamUsageEstimator.testMap <<<
   [junit4]    > Throwable #1: java.lang.AssertionError: expected:<25152.0> but was:<30184.0>
   [junit4]    > 	at __randomizedtesting.SeedInfo.seed([ED7055A14021EA69:CD56E1725ADAF91B]:0)
   [junit4]    > 	at org.apache.lucene.util.TestRamUsageEstimator.testMap(TestRamUsageEstimator.java:136)
   [junit4]    > 	at java.base/jdk.internal.reflect.NativeMethodAccessorImpl.invoke0(Native Method)
   [junit4]    > 	at java.base/jdk.internal.reflect.NativeMethodAccessorImpl.invoke(NativeMethodAccessorImpl.java:62)
   [junit4]    > 	at java.base/jdk.internal.reflect.DelegatingMethodAccessorImpl.invoke(DelegatingMethodAccessorImpl.java:43)
   [junit4]    > 	at java.base/java.lang.reflect.Method.invoke(Method.java:566)
   [junit4]    > 	at java.base/java.lang.Thread.run(Thread.java:834)
   [junit4] OK      0.02s J1 | TestRamUsageEstimator.testBytesRefHash
   [junit4] OK      0.00s J1 | TestRamUsageEstimator.testHotspotBean
   [junit4] OK      0.00s J1 | TestRamUsageEstimator.testStaticOverloads
   [junit4] OK      0.02s J1 | TestRamUsageEstimator.testReferenceSize
   [junit4] OK      0.02s J1 | TestRamUsageEstimator.testCollection
   [junit4] OK      0.01s J1 | TestRamUsageEstimator.testQuery
   [junit4] OK      0.00s J1 | TestRamUsageEstimator.testStrings
   [junit4] IGNOR/A 0.00s J1 | TestRamUsageEstimator.testPrintValues
   [junit4]    > Assumption #1: Specify -Dtests.verbose=true to print constants of RamUsageEstimator.
   [junit4]   2> NOTE: test params are: codec=Asserting(Lucene80): {}, docValues:{}, maxPointsInLeafNode=1460, maxMBSortInHeap=6.927495954369251, sim=Asserting(org.apache.lucene.search.similarities.AssertingSimilarity@38633369), locale=nd, timezone=America/Yakutat
   [junit4]   2> NOTE: Linux 4.18.0-24-generic amd64/AdoptOpenJDK 11.0.3 (64-bit)/cpus=8,threads=1,free=401611232,total=514850816
   [junit4]   2> NOTE: All tests run in this JVM: [TestRamUsageEstimator, TestRamUsageEstimator]
   [junit4] Completed [4/5 (4!)] on J1 in 0.27s, 10 tests, 1 failure, 1 skipped <<< FAILURES!
   [junit4] 
   [junit4] Suite: org.apache.lucene.util.TestRamUsageEstimator
   [junit4] OK      0.00s J2 | TestRamUsageEstimator.testSanity
   [junit4]   2> NOTE: reproduce with: ant test  -Dtestcase=TestRamUsageEstimator -Dtests.method=testMap -Dtests.seed=ED7055A14021EA69 -Dtests.multiplier=3 -Dtests.slow=true -Dtests.badapples=true -Dtests.locale=nd -Dtests.timezone=America/Yakutat -Dtests.asserts=true -Dtests.file.encoding=US-ASCII
   [junit4] FAILURE 0.03s J2 | TestRamUsageEstimator.testMap <<<
   [junit4]    > Throwable #1: java.lang.AssertionError: expected:<25152.0> but was:<30184.0>
   [junit4]    > 	at __randomizedtesting.SeedInfo.seed([ED7055A14021EA69:CD56E1725ADAF91B]:0)
   [junit4]    > 	at org.apache.lucene.util.TestRamUsageEstimator.testMap(TestRamUsageEstimator.java:136)
   [junit4]    > 	at java.base/jdk.internal.reflect.NativeMethodAccessorImpl.invoke0(Native Method)
   [junit4]    > 	at java.base/jdk.internal.reflect.NativeMethodAccessorImpl.invoke(NativeMethodAccessorImpl.java:62)
   [junit4]    > 	at java.base/jdk.internal.reflect.DelegatingMethodAccessorImpl.invoke(DelegatingMethodAccessorImpl.java:43)
   [junit4]    > 	at java.base/java.lang.reflect.Method.invoke(Method.java:566)
   [junit4]    > 	at java.base/java.lang.Thread.run(Thread.java:834)
   [junit4] OK      0.02s J2 | TestRamUsageEstimator.testBytesRefHash
   [junit4] OK      0.00s J2 | TestRamUsageEstimator.testHotspotBean
   [junit4] OK      0.01s J2 | TestRamUsageEstimator.testStaticOverloads
   [junit4] OK      0.01s J2 | TestRamUsageEstimator.testReferenceSize
   [junit4] OK      0.02s J2 | TestRamUsageEstimator.testCollection
   [junit4] OK      0.01s J2 | TestRamUsageEstimator.testQuery
   [junit4] OK      0.00s J2 | TestRamUsageEstimator.testStrings
   [junit4] IGNOR/A 0.00s J2 | TestRamUsageEstimator.testPrintValues
   [junit4]    > Assumption #1: Specify -Dtests.verbose=true to print constants of RamUsageEstimator.
   [junit4]   2> NOTE: test params are: codec=Asserting(Lucene80): {}, docValues:{}, maxPointsInLeafNode=1460, maxMBSortInHeap=6.927495954369251, sim=Asserting(org.apache.lucene.search.similarities.AssertingSimilarity@662c6bc5), locale=nd, timezone=America/Yakutat
   [junit4]   2> NOTE: Linux 4.18.0-24-generic amd64/AdoptOpenJDK 11.0.3 (64-bit)/cpus=8,threads=1,free=404288408,total=514850816
   [junit4]   2> NOTE: All tests run in this JVM: [TestRamUsageEstimator, TestRamUsageEstimator]
   [junit4] Completed [5/5 (5!)] on J2 in 0.26s, 10 tests, 1 failure, 1 skipped <<< FAILURES!
   [junit4] 
   [junit4] 
   [junit4] Tests with failures [seed: ED7055A14021EA69]:
   [junit4]   - org.apache.lucene.util.TestRamUsageEstimator.testMap
   [junit4]   - org.apache.lucene.util.TestRamUsageEstimator.testMap
   [junit4]   - org.apache.lucene.util.TestRamUsageEstimator.testMap
   [junit4]   - org.apache.lucene.util.TestRamUsageEstimator.testMap
   [junit4]   - org.apache.lucene.util.TestRamUsageEstimator.testMap
   [junit4] 
   [junit4] 
   [junit4] JVM J0:     0.76 ..     2.84 =     2.08s
   [junit4] JVM J1:     0.76 ..     3.34 =     2.58s
   [junit4] JVM J2:     0.79 ..     3.35 =     2.56s
   [junit4] Execution time total: 3.36 sec.
   [junit4] Tests summary: 5 suites, 50 tests, 5 failures, 5 ignored (5 assumptions)

BUILD FAILED
/home/jenkins/workspace/Lucene-Solr-master-Linux/lucene/common-build.xml:1492: The following error occurred while executing this line:
/home/jenkins/workspace/Lucene-Solr-master-Linux/lucene/common-build.xml:1019: There were test failures: 5 suites, 50 tests, 5 failures, 5 ignored (5 assumptions) [seed: ED7055A14021EA69]

Total time: 5 seconds

[repro] Setting last failure code to 256

[repro] Failures:
[repro]   5/5 failed: org.apache.lucene.util.TestRamUsageEstimator
[repro] Exiting with code 256
+ mv lucene/build lucene/build.repro
+ mv solr/build solr/build.repro
mv: cannot stat 'solr/build': No such file or directory
+ true
+ mv lucene/build.orig lucene/build
+ mv solr/build.orig solr/build
Archiving artifacts
Setting ANT_1_8_2_HOME=/home/jenkins/tools/hudson.tasks.Ant_AntInstallation/ANT_1.8.2
[WARNINGS] Parsing warnings in console log with parser Java Compiler (javac)
Setting ANT_1_8_2_HOME=/home/jenkins/tools/hudson.tasks.Ant_AntInstallation/ANT_1.8.2
No credentials specified
Setting ANT_1_8_2_HOME=/home/jenkins/tools/hudson.tasks.Ant_AntInstallation/ANT_1.8.2
<Git Blamer> Using GitBlamer to create author and commit information for all warnings.
<Git Blamer> GIT_COMMIT=0e877aac3480847c0b587c6909bb27ebfae8b7a0, workspace=/home/jenkins/workspace/Lucene-Solr-master-Linux
[WARNINGS] Computing warning deltas based on reference build #24327
Recording test results
Setting ANT_1_8_2_HOME=/home/jenkins/tools/hudson.tasks.Ant_AntInstallation/ANT_1.8.2
Build step 'Publish JUnit test result report' changed build result to UNSTABLE
Email was triggered for: Unstable (Test Failures)
Sending email for trigger: Unstable (Test Failures)
Setting ANT_1_8_2_HOME=/home/jenkins/tools/hudson.tasks.Ant_AntInstallation/ANT_1.8.2
Setting ANT_1_8_2_HOME=/home/jenkins/tools/hudson.tasks.Ant_AntInstallation/ANT_1.8.2
Setting ANT_1_8_2_HOME=/home/jenkins/tools/hudson.tasks.Ant_AntInstallation/ANT_1.8.2
Setting ANT_1_8_2_HOME=/home/jenkins/tools/hudson.tasks.Ant_AntInstallation/ANT_1.8.2
Setting ANT_1_8_2_HOME=/home/jenkins/tools/hudson.tasks.Ant_AntInstallation/ANT_1.8.2
Setting ANT_1_8_2_HOME=/home/jenkins/tools/hudson.tasks.Ant_AntInstallation/ANT_1.8.2

Mime
View raw message