lucene-dev mailing list archives

Site index · List index
Message view « Date » · « Thread »
Top « Date » · « Thread »
From Policeman Jenkins Server <jenk...@thetaphi.de>
Subject [JENKINS] Lucene-Solr-master-Linux (64bit/jdk-11) - Build # 24202 - Failure!
Date Sun, 09 Jun 2019 00:07:41 GMT
Build: https://jenkins.thetaphi.de/job/Lucene-Solr-master-Linux/24202/
Java: 64bit/jdk-11 -XX:+UseCompressedOops -XX:+UseParallelGC

9 tests failed.
FAILED:  junit.framework.TestSuite.org.apache.solr.cloud.TestCloudSearcherWarming

Error Message:
1 thread leaked from SUITE scope at org.apache.solr.cloud.TestCloudSearcherWarming:     1) Thread[id=3314, name=Thread-650, state=RUNNABLE, group=TGRP-TestCloudSearcherWarming]         at java.base@11/java.net.Inet6AddressImpl.lookupAllHostAddr(Native Method)         at java.base@11/java.net.InetAddress$PlatformNameService.lookupAllHostAddr(InetAddress.java:928)         at java.base@11/java.net.InetAddress.getAddressesFromNameService(InetAddress.java:1514)         at java.base@11/java.net.InetAddress$NameServiceAddresses.get(InetAddress.java:847)         at java.base@11/java.net.InetAddress.getAllByName0(InetAddress.java:1504)         at java.base@11/java.net.InetAddress.getLocalHost(InetAddress.java:1636)         at app//org.apache.solr.handler.admin.SystemInfoHandler.initHostname(SystemInfoHandler.java:111)         at app//org.apache.solr.handler.admin.SystemInfoHandler.<init>(SystemInfoHandler.java:98)         at app//org.apache.solr.handler.admin.SystemInfoHandler.<init>(SystemInfoHandler.java:92)         at jdk.internal.reflect.GeneratedConstructorAccessor77.newInstance(Unknown Source)         at java.base@11/jdk.internal.reflect.DelegatingConstructorAccessorImpl.newInstance(DelegatingConstructorAccessorImpl.java:45)         at java.base@11/java.lang.reflect.Constructor.newInstance(Constructor.java:490)         at app//org.apache.solr.core.SolrResourceLoader.newInstance(SolrResourceLoader.java:638)         at app//org.apache.solr.core.SolrResourceLoader.newInstance(SolrResourceLoader.java:591)         at app//org.apache.solr.core.SolrResourceLoader.newInstance(SolrResourceLoader.java:584)         at app//org.apache.solr.core.SolrCore.createInstance(SolrCore.java:812)         at app//org.apache.solr.core.PluginBag.createPlugin(PluginBag.java:141)         at app//org.apache.solr.core.PluginBag.init(PluginBag.java:277)         at app//org.apache.solr.core.RequestHandlers.initHandlersFromConfig(RequestHandlers.java:130)         at app//org.apache.solr.core.SolrCore.<init>(SolrCore.java:984)         at app//org.apache.solr.core.SolrCore.reload(SolrCore.java:671)         at app//org.apache.solr.core.CoreContainer.reload(CoreContainer.java:1491)         at app//org.apache.solr.core.SolrCore.lambda$getConfListener$21(SolrCore.java:3044)         at app//org.apache.solr.core.SolrCore$$Lambda$636/0x00000001006ef840.run(Unknown Source)         at app//org.apache.solr.cloud.ZkController.lambda$fireEventListeners$14(ZkController.java:2509)         at app//org.apache.solr.cloud.ZkController$$Lambda$1029/0x0000000100af4840.run(Unknown Source)         at java.base@11/java.lang.Thread.run(Thread.java:834)

Stack Trace:
com.carrotsearch.randomizedtesting.ThreadLeakError: 1 thread leaked from SUITE scope at org.apache.solr.cloud.TestCloudSearcherWarming: 
   1) Thread[id=3314, name=Thread-650, state=RUNNABLE, group=TGRP-TestCloudSearcherWarming]
        at java.base@11/java.net.Inet6AddressImpl.lookupAllHostAddr(Native Method)
        at java.base@11/java.net.InetAddress$PlatformNameService.lookupAllHostAddr(InetAddress.java:928)
        at java.base@11/java.net.InetAddress.getAddressesFromNameService(InetAddress.java:1514)
        at java.base@11/java.net.InetAddress$NameServiceAddresses.get(InetAddress.java:847)
        at java.base@11/java.net.InetAddress.getAllByName0(InetAddress.java:1504)
        at java.base@11/java.net.InetAddress.getLocalHost(InetAddress.java:1636)
        at app//org.apache.solr.handler.admin.SystemInfoHandler.initHostname(SystemInfoHandler.java:111)
        at app//org.apache.solr.handler.admin.SystemInfoHandler.<init>(SystemInfoHandler.java:98)
        at app//org.apache.solr.handler.admin.SystemInfoHandler.<init>(SystemInfoHandler.java:92)
        at jdk.internal.reflect.GeneratedConstructorAccessor77.newInstance(Unknown Source)
        at java.base@11/jdk.internal.reflect.DelegatingConstructorAccessorImpl.newInstance(DelegatingConstructorAccessorImpl.java:45)
        at java.base@11/java.lang.reflect.Constructor.newInstance(Constructor.java:490)
        at app//org.apache.solr.core.SolrResourceLoader.newInstance(SolrResourceLoader.java:638)
        at app//org.apache.solr.core.SolrResourceLoader.newInstance(SolrResourceLoader.java:591)
        at app//org.apache.solr.core.SolrResourceLoader.newInstance(SolrResourceLoader.java:584)
        at app//org.apache.solr.core.SolrCore.createInstance(SolrCore.java:812)
        at app//org.apache.solr.core.PluginBag.createPlugin(PluginBag.java:141)
        at app//org.apache.solr.core.PluginBag.init(PluginBag.java:277)
        at app//org.apache.solr.core.RequestHandlers.initHandlersFromConfig(RequestHandlers.java:130)
        at app//org.apache.solr.core.SolrCore.<init>(SolrCore.java:984)
        at app//org.apache.solr.core.SolrCore.reload(SolrCore.java:671)
        at app//org.apache.solr.core.CoreContainer.reload(CoreContainer.java:1491)
        at app//org.apache.solr.core.SolrCore.lambda$getConfListener$21(SolrCore.java:3044)
        at app//org.apache.solr.core.SolrCore$$Lambda$636/0x00000001006ef840.run(Unknown Source)
        at app//org.apache.solr.cloud.ZkController.lambda$fireEventListeners$14(ZkController.java:2509)
        at app//org.apache.solr.cloud.ZkController$$Lambda$1029/0x0000000100af4840.run(Unknown Source)
        at java.base@11/java.lang.Thread.run(Thread.java:834)
	at __randomizedtesting.SeedInfo.seed([BFD2C1D54168B6F]:0)


FAILED:  junit.framework.TestSuite.org.apache.solr.cloud.TestCloudSearcherWarming

Error Message:
There are still zombie threads that couldn't be terminated:    1) Thread[id=3314, name=Thread-650, state=RUNNABLE, group=TGRP-TestCloudSearcherWarming]         at java.base@11/java.net.Inet6AddressImpl.lookupAllHostAddr(Native Method)         at java.base@11/java.net.InetAddress$PlatformNameService.lookupAllHostAddr(InetAddress.java:928)         at java.base@11/java.net.InetAddress.getAddressesFromNameService(InetAddress.java:1514)         at java.base@11/java.net.InetAddress$NameServiceAddresses.get(InetAddress.java:847)         at java.base@11/java.net.InetAddress.getAllByName0(InetAddress.java:1504)         at java.base@11/java.net.InetAddress.getLocalHost(InetAddress.java:1636)         at app//org.apache.solr.handler.admin.SystemInfoHandler.initHostname(SystemInfoHandler.java:111)         at app//org.apache.solr.handler.admin.SystemInfoHandler.<init>(SystemInfoHandler.java:98)         at app//org.apache.solr.handler.admin.SystemInfoHandler.<init>(SystemInfoHandler.java:92)         at jdk.internal.reflect.GeneratedConstructorAccessor77.newInstance(Unknown Source)         at java.base@11/jdk.internal.reflect.DelegatingConstructorAccessorImpl.newInstance(DelegatingConstructorAccessorImpl.java:45)         at java.base@11/java.lang.reflect.Constructor.newInstance(Constructor.java:490)         at app//org.apache.solr.core.SolrResourceLoader.newInstance(SolrResourceLoader.java:638)         at app//org.apache.solr.core.SolrResourceLoader.newInstance(SolrResourceLoader.java:591)         at app//org.apache.solr.core.SolrResourceLoader.newInstance(SolrResourceLoader.java:584)         at app//org.apache.solr.core.SolrCore.createInstance(SolrCore.java:812)         at app//org.apache.solr.core.PluginBag.createPlugin(PluginBag.java:141)         at app//org.apache.solr.core.PluginBag.init(PluginBag.java:277)         at app//org.apache.solr.core.RequestHandlers.initHandlersFromConfig(RequestHandlers.java:130)         at app//org.apache.solr.core.SolrCore.<init>(SolrCore.java:984)         at app//org.apache.solr.core.SolrCore.reload(SolrCore.java:671)         at app//org.apache.solr.core.CoreContainer.reload(CoreContainer.java:1491)         at app//org.apache.solr.core.SolrCore.lambda$getConfListener$21(SolrCore.java:3044)         at app//org.apache.solr.core.SolrCore$$Lambda$636/0x00000001006ef840.run(Unknown Source)         at app//org.apache.solr.cloud.ZkController.lambda$fireEventListeners$14(ZkController.java:2509)         at app//org.apache.solr.cloud.ZkController$$Lambda$1029/0x0000000100af4840.run(Unknown Source)         at java.base@11/java.lang.Thread.run(Thread.java:834)

Stack Trace:
com.carrotsearch.randomizedtesting.ThreadLeakError: There are still zombie threads that couldn't be terminated:
   1) Thread[id=3314, name=Thread-650, state=RUNNABLE, group=TGRP-TestCloudSearcherWarming]
        at java.base@11/java.net.Inet6AddressImpl.lookupAllHostAddr(Native Method)
        at java.base@11/java.net.InetAddress$PlatformNameService.lookupAllHostAddr(InetAddress.java:928)
        at java.base@11/java.net.InetAddress.getAddressesFromNameService(InetAddress.java:1514)
        at java.base@11/java.net.InetAddress$NameServiceAddresses.get(InetAddress.java:847)
        at java.base@11/java.net.InetAddress.getAllByName0(InetAddress.java:1504)
        at java.base@11/java.net.InetAddress.getLocalHost(InetAddress.java:1636)
        at app//org.apache.solr.handler.admin.SystemInfoHandler.initHostname(SystemInfoHandler.java:111)
        at app//org.apache.solr.handler.admin.SystemInfoHandler.<init>(SystemInfoHandler.java:98)
        at app//org.apache.solr.handler.admin.SystemInfoHandler.<init>(SystemInfoHandler.java:92)
        at jdk.internal.reflect.GeneratedConstructorAccessor77.newInstance(Unknown Source)
        at java.base@11/jdk.internal.reflect.DelegatingConstructorAccessorImpl.newInstance(DelegatingConstructorAccessorImpl.java:45)
        at java.base@11/java.lang.reflect.Constructor.newInstance(Constructor.java:490)
        at app//org.apache.solr.core.SolrResourceLoader.newInstance(SolrResourceLoader.java:638)
        at app//org.apache.solr.core.SolrResourceLoader.newInstance(SolrResourceLoader.java:591)
        at app//org.apache.solr.core.SolrResourceLoader.newInstance(SolrResourceLoader.java:584)
        at app//org.apache.solr.core.SolrCore.createInstance(SolrCore.java:812)
        at app//org.apache.solr.core.PluginBag.createPlugin(PluginBag.java:141)
        at app//org.apache.solr.core.PluginBag.init(PluginBag.java:277)
        at app//org.apache.solr.core.RequestHandlers.initHandlersFromConfig(RequestHandlers.java:130)
        at app//org.apache.solr.core.SolrCore.<init>(SolrCore.java:984)
        at app//org.apache.solr.core.SolrCore.reload(SolrCore.java:671)
        at app//org.apache.solr.core.CoreContainer.reload(CoreContainer.java:1491)
        at app//org.apache.solr.core.SolrCore.lambda$getConfListener$21(SolrCore.java:3044)
        at app//org.apache.solr.core.SolrCore$$Lambda$636/0x00000001006ef840.run(Unknown Source)
        at app//org.apache.solr.cloud.ZkController.lambda$fireEventListeners$14(ZkController.java:2509)
        at app//org.apache.solr.cloud.ZkController$$Lambda$1029/0x0000000100af4840.run(Unknown Source)
        at java.base@11/java.lang.Thread.run(Thread.java:834)
	at __randomizedtesting.SeedInfo.seed([BFD2C1D54168B6F]:0)


FAILED:  junit.framework.TestSuite.org.apache.solr.response.transform.TestSubQueryTransformerDistrib

Error Message:
Timeout occurred while waiting response from server at: http://127.0.0.1:39931/solr

Stack Trace:
org.apache.solr.client.solrj.SolrServerException: Timeout occurred while waiting response from server at: http://127.0.0.1:39931/solr
	at __randomizedtesting.SeedInfo.seed([BFD2C1D54168B6F]:0)
	at org.apache.solr.client.solrj.impl.HttpSolrClient.executeMethod(HttpSolrClient.java:667)
	at org.apache.solr.client.solrj.impl.HttpSolrClient.request(HttpSolrClient.java:262)
	at org.apache.solr.client.solrj.impl.HttpSolrClient.request(HttpSolrClient.java:245)
	at org.apache.solr.client.solrj.impl.LBSolrClient.doRequest(LBSolrClient.java:368)
	at org.apache.solr.client.solrj.impl.LBSolrClient.request(LBSolrClient.java:296)
	at org.apache.solr.client.solrj.impl.BaseCloudSolrClient.sendRequest(BaseCloudSolrClient.java:1068)
	at org.apache.solr.client.solrj.impl.BaseCloudSolrClient.requestWithRetryOnStaleState(BaseCloudSolrClient.java:837)
	at org.apache.solr.client.solrj.impl.BaseCloudSolrClient.request(BaseCloudSolrClient.java:769)
	at org.apache.solr.client.solrj.SolrRequest.process(SolrRequest.java:211)
	at org.apache.solr.client.solrj.SolrRequest.process(SolrRequest.java:228)
	at org.apache.solr.response.transform.TestSubQueryTransformerDistrib.setupCluster(TestSubQueryTransformerDistrib.java:89)
	at java.base/jdk.internal.reflect.NativeMethodAccessorImpl.invoke0(Native Method)
	at java.base/jdk.internal.reflect.NativeMethodAccessorImpl.invoke(NativeMethodAccessorImpl.java:62)
	at java.base/jdk.internal.reflect.DelegatingMethodAccessorImpl.invoke(DelegatingMethodAccessorImpl.java:43)
	at java.base/java.lang.reflect.Method.invoke(Method.java:566)
	at com.carrotsearch.randomizedtesting.RandomizedRunner.invoke(RandomizedRunner.java:1750)
	at com.carrotsearch.randomizedtesting.RandomizedRunner$6.evaluate(RandomizedRunner.java:878)
	at com.carrotsearch.randomizedtesting.RandomizedRunner$7.evaluate(RandomizedRunner.java:894)
	at com.carrotsearch.randomizedtesting.rules.StatementAdapter.evaluate(StatementAdapter.java:36)
	at com.carrotsearch.randomizedtesting.rules.SystemPropertiesRestoreRule$1.evaluate(SystemPropertiesRestoreRule.java:57)
	at org.apache.lucene.util.AbstractBeforeAfterRule$1.evaluate(AbstractBeforeAfterRule.java:45)
	at com.carrotsearch.randomizedtesting.rules.StatementAdapter.evaluate(StatementAdapter.java:36)
	at org.apache.lucene.util.TestRuleStoreClassName$1.evaluate(TestRuleStoreClassName.java:41)
	at com.carrotsearch.randomizedtesting.rules.NoShadowingOrOverridesOnMethodsRule$1.evaluate(NoShadowingOrOverridesOnMethodsRule.java:40)
	at com.carrotsearch.randomizedtesting.rules.NoShadowingOrOverridesOnMethodsRule$1.evaluate(NoShadowingOrOverridesOnMethodsRule.java:40)
	at com.carrotsearch.randomizedtesting.rules.StatementAdapter.evaluate(StatementAdapter.java:36)
	at com.carrotsearch.randomizedtesting.rules.StatementAdapter.evaluate(StatementAdapter.java:36)
	at org.apache.lucene.util.TestRuleAssertionsRequired$1.evaluate(TestRuleAssertionsRequired.java:53)
	at org.apache.lucene.util.TestRuleMarkFailure$1.evaluate(TestRuleMarkFailure.java:47)
	at org.apache.lucene.util.TestRuleIgnoreAfterMaxFailures$1.evaluate(TestRuleIgnoreAfterMaxFailures.java:64)
	at org.apache.lucene.util.TestRuleIgnoreTestSuites$1.evaluate(TestRuleIgnoreTestSuites.java:54)
	at com.carrotsearch.randomizedtesting.rules.StatementAdapter.evaluate(StatementAdapter.java:36)
	at com.carrotsearch.randomizedtesting.ThreadLeakControl$StatementRunner.run(ThreadLeakControl.java:368)
	at java.base/java.lang.Thread.run(Thread.java:834)
Caused by: java.net.SocketTimeoutException: Read timed out
	at java.base/java.net.SocketInputStream.socketRead0(Native Method)
	at java.base/java.net.SocketInputStream.socketRead(SocketInputStream.java:115)
	at java.base/java.net.SocketInputStream.read(SocketInputStream.java:168)
	at java.base/java.net.SocketInputStream.read(SocketInputStream.java:140)
	at org.apache.http.impl.io.SessionInputBufferImpl.streamRead(SessionInputBufferImpl.java:137)
	at org.apache.http.impl.io.SessionInputBufferImpl.fillBuffer(SessionInputBufferImpl.java:153)
	at org.apache.http.impl.io.SessionInputBufferImpl.readLine(SessionInputBufferImpl.java:282)
	at org.apache.http.impl.conn.DefaultHttpResponseParser.parseHead(DefaultHttpResponseParser.java:138)
	at org.apache.http.impl.conn.DefaultHttpResponseParser.parseHead(DefaultHttpResponseParser.java:56)
	at org.apache.http.impl.io.AbstractMessageParser.parse(AbstractMessageParser.java:259)
	at org.apache.http.impl.DefaultBHttpClientConnection.receiveResponseHeader(DefaultBHttpClientConnection.java:163)
	at org.apache.http.impl.conn.CPoolProxy.receiveResponseHeader(CPoolProxy.java:165)
	at org.apache.http.protocol.HttpRequestExecutor.doReceiveResponse(HttpRequestExecutor.java:273)
	at org.apache.http.protocol.HttpRequestExecutor.execute(HttpRequestExecutor.java:125)
	at org.apache.http.impl.execchain.MainClientExec.execute(MainClientExec.java:272)
	at org.apache.http.impl.execchain.ProtocolExec.execute(ProtocolExec.java:185)
	at org.apache.http.impl.execchain.RetryExec.execute(RetryExec.java:89)
	at org.apache.http.impl.execchain.RedirectExec.execute(RedirectExec.java:110)
	at org.apache.http.impl.client.InternalHttpClient.doExecute(InternalHttpClient.java:185)
	at org.apache.http.impl.client.CloseableHttpClient.execute(CloseableHttpClient.java:83)
	at org.apache.http.impl.client.CloseableHttpClient.execute(CloseableHttpClient.java:56)
	at org.apache.solr.client.solrj.impl.HttpSolrClient.executeMethod(HttpSolrClient.java:555)
	... 33 more


FAILED:  org.apache.solr.TestDistributedMissingSort.test

Error Message:
Error from server at http://127.0.0.1:44411/a/j/collection1: org.apache.solr.client.solrj.SolrServerException: Timeout occured while waiting response from server at: http://[ff01::114]:33332/a/j/select

Stack Trace:
org.apache.solr.client.solrj.impl.HttpSolrClient$RemoteSolrException: Error from server at http://127.0.0.1:44411/a/j/collection1: org.apache.solr.client.solrj.SolrServerException: Timeout occured while waiting response from server at: http://[ff01::114]:33332/a/j/select
	at __randomizedtesting.SeedInfo.seed([BFD2C1D54168B6F:83A913C7FAEAE697]:0)
	at org.apache.solr.client.solrj.impl.HttpSolrClient.executeMethod(HttpSolrClient.java:656)
	at org.apache.solr.client.solrj.impl.HttpSolrClient.request(HttpSolrClient.java:262)
	at org.apache.solr.client.solrj.impl.HttpSolrClient.request(HttpSolrClient.java:245)
	at org.apache.solr.client.solrj.SolrRequest.process(SolrRequest.java:211)
	at org.apache.solr.client.solrj.SolrClient.query(SolrClient.java:987)
	at org.apache.solr.client.solrj.SolrClient.query(SolrClient.java:1002)
	at org.apache.solr.BaseDistributedSearchTestCase.queryServer(BaseDistributedSearchTestCase.java:626)
	at org.apache.solr.BaseDistributedSearchTestCase.query(BaseDistributedSearchTestCase.java:678)
	at org.apache.solr.BaseDistributedSearchTestCase.query(BaseDistributedSearchTestCase.java:656)
	at org.apache.solr.BaseDistributedSearchTestCase.query(BaseDistributedSearchTestCase.java:635)
	at org.apache.solr.TestDistributedMissingSort.testSortMissingLast(TestDistributedMissingSort.java:106)
	at org.apache.solr.TestDistributedMissingSort.test(TestDistributedMissingSort.java:43)
	at java.base/jdk.internal.reflect.NativeMethodAccessorImpl.invoke0(Native Method)
	at java.base/jdk.internal.reflect.NativeMethodAccessorImpl.invoke(NativeMethodAccessorImpl.java:62)
	at java.base/jdk.internal.reflect.DelegatingMethodAccessorImpl.invoke(DelegatingMethodAccessorImpl.java:43)
	at java.base/java.lang.reflect.Method.invoke(Method.java:566)
	at com.carrotsearch.randomizedtesting.RandomizedRunner.invoke(RandomizedRunner.java:1750)
	at com.carrotsearch.randomizedtesting.RandomizedRunner$8.evaluate(RandomizedRunner.java:938)
	at com.carrotsearch.randomizedtesting.RandomizedRunner$9.evaluate(RandomizedRunner.java:974)
	at com.carrotsearch.randomizedtesting.RandomizedRunner$10.evaluate(RandomizedRunner.java:988)
	at org.apache.solr.BaseDistributedSearchTestCase$ShardsRepeatRule$ShardsRepeatStatement.callStatement(BaseDistributedSearchTestCase.java:1108)
	at org.apache.solr.BaseDistributedSearchTestCase$ShardsRepeatRule$ShardsStatement.evaluate(BaseDistributedSearchTestCase.java:1054)
	at com.carrotsearch.randomizedtesting.rules.SystemPropertiesRestoreRule$1.evaluate(SystemPropertiesRestoreRule.java:57)
	at org.apache.lucene.util.TestRuleSetupTeardownChained$1.evaluate(TestRuleSetupTeardownChained.java:49)
	at org.apache.lucene.util.AbstractBeforeAfterRule$1.evaluate(AbstractBeforeAfterRule.java:45)
	at org.apache.lucene.util.TestRuleThreadAndTestName$1.evaluate(TestRuleThreadAndTestName.java:48)
	at org.apache.lucene.util.TestRuleIgnoreAfterMaxFailures$1.evaluate(TestRuleIgnoreAfterMaxFailures.java:64)
	at org.apache.lucene.util.TestRuleMarkFailure$1.evaluate(TestRuleMarkFailure.java:47)
	at com.carrotsearch.randomizedtesting.rules.StatementAdapter.evaluate(StatementAdapter.java:36)
	at com.carrotsearch.randomizedtesting.ThreadLeakControl$StatementRunner.run(ThreadLeakControl.java:368)
	at com.carrotsearch.randomizedtesting.ThreadLeakControl.forkTimeoutingTask(ThreadLeakControl.java:817)
	at com.carrotsearch.randomizedtesting.ThreadLeakControl$3.evaluate(ThreadLeakControl.java:468)
	at com.carrotsearch.randomizedtesting.RandomizedRunner.runSingleTest(RandomizedRunner.java:947)
	at com.carrotsearch.randomizedtesting.RandomizedRunner$5.evaluate(RandomizedRunner.java:832)
	at com.carrotsearch.randomizedtesting.RandomizedRunner$6.evaluate(RandomizedRunner.java:883)
	at com.carrotsearch.randomizedtesting.RandomizedRunner$7.evaluate(RandomizedRunner.java:894)
	at com.carrotsearch.randomizedtesting.rules.StatementAdapter.evaluate(StatementAdapter.java:36)
	at com.carrotsearch.randomizedtesting.rules.SystemPropertiesRestoreRule$1.evaluate(SystemPropertiesRestoreRule.java:57)
	at org.apache.lucene.util.AbstractBeforeAfterRule$1.evaluate(AbstractBeforeAfterRule.java:45)
	at com.carrotsearch.randomizedtesting.rules.StatementAdapter.evaluate(StatementAdapter.java:36)
	at org.apache.lucene.util.TestRuleStoreClassName$1.evaluate(TestRuleStoreClassName.java:41)
	at com.carrotsearch.randomizedtesting.rules.NoShadowingOrOverridesOnMethodsRule$1.evaluate(NoShadowingOrOverridesOnMethodsRule.java:40)
	at com.carrotsearch.randomizedtesting.rules.NoShadowingOrOverridesOnMethodsRule$1.evaluate(NoShadowingOrOverridesOnMethodsRule.java:40)
	at com.carrotsearch.randomizedtesting.rules.StatementAdapter.evaluate(StatementAdapter.java:36)
	at com.carrotsearch.randomizedtesting.rules.StatementAdapter.evaluate(StatementAdapter.java:36)
	at org.apache.lucene.util.TestRuleAssertionsRequired$1.evaluate(TestRuleAssertionsRequired.java:53)
	at org.apache.lucene.util.TestRuleMarkFailure$1.evaluate(TestRuleMarkFailure.java:47)
	at org.apache.lucene.util.TestRuleIgnoreAfterMaxFailures$1.evaluate(TestRuleIgnoreAfterMaxFailures.java:64)
	at org.apache.lucene.util.TestRuleIgnoreTestSuites$1.evaluate(TestRuleIgnoreTestSuites.java:54)
	at com.carrotsearch.randomizedtesting.rules.StatementAdapter.evaluate(StatementAdapter.java:36)
	at com.carrotsearch.randomizedtesting.ThreadLeakControl$StatementRunner.run(ThreadLeakControl.java:368)
	at java.base/java.lang.Thread.run(Thread.java:834)


FAILED:  org.apache.solr.cloud.LeaderFailoverAfterPartitionTest.test

Error Message:
No registered leader was found after waiting for 10000ms , collection: collection1 slice: shard1 saw state=DocCollection(collection1//collections/collection1/state.json/4)={   "pullReplicas":"0",   "replicationFactor":"1",   "shards":{     "shard1":{       "range":"80000000-ffffffff",       "state":"active",       "replicas":{"core_node4":{           "core":"collection1_shard1_replica_n1",           "base_url":"http://127.0.0.1:33091",           "node_name":"127.0.0.1:33091_",           "state":"down",           "type":"NRT"}}},     "shard2":{       "range":"0-7fffffff",       "state":"active",       "replicas":{         "core_node3":{           "core":"collection1_shard2_replica_n2",           "base_url":"http://127.0.0.1:44443",           "node_name":"127.0.0.1:44443_",           "state":"active",           "type":"NRT",           "leader":"true"},         "core_node6":{           "core":"collection1_shard2_replica_n5",           "base_url":"http://127.0.0.1:46189",           "node_name":"127.0.0.1:46189_",           "state":"down",           "type":"NRT"}}}},   "router":{"name":"compositeId"},   "maxShardsPerNode":"1",   "autoAddReplicas":"false",   "nrtReplicas":"1",   "tlogReplicas":"0"} with live_nodes=[127.0.0.1:33091_, 127.0.0.1:46189_, 127.0.0.1:40799_, 127.0.0.1:44443_]

Stack Trace:
org.apache.solr.common.SolrException: No registered leader was found after waiting for 10000ms , collection: collection1 slice: shard1 saw state=DocCollection(collection1//collections/collection1/state.json/4)={
  "pullReplicas":"0",
  "replicationFactor":"1",
  "shards":{
    "shard1":{
      "range":"80000000-ffffffff",
      "state":"active",
      "replicas":{"core_node4":{
          "core":"collection1_shard1_replica_n1",
          "base_url":"http://127.0.0.1:33091",
          "node_name":"127.0.0.1:33091_",
          "state":"down",
          "type":"NRT"}}},
    "shard2":{
      "range":"0-7fffffff",
      "state":"active",
      "replicas":{
        "core_node3":{
          "core":"collection1_shard2_replica_n2",
          "base_url":"http://127.0.0.1:44443",
          "node_name":"127.0.0.1:44443_",
          "state":"active",
          "type":"NRT",
          "leader":"true"},
        "core_node6":{
          "core":"collection1_shard2_replica_n5",
          "base_url":"http://127.0.0.1:46189",
          "node_name":"127.0.0.1:46189_",
          "state":"down",
          "type":"NRT"}}}},
  "router":{"name":"compositeId"},
  "maxShardsPerNode":"1",
  "autoAddReplicas":"false",
  "nrtReplicas":"1",
  "tlogReplicas":"0"} with live_nodes=[127.0.0.1:33091_, 127.0.0.1:46189_, 127.0.0.1:40799_, 127.0.0.1:44443_]
	at __randomizedtesting.SeedInfo.seed([BFD2C1D54168B6F:83A913C7FAEAE697]:0)
	at org.apache.solr.common.cloud.ZkStateReader.getLeaderRetry(ZkStateReader.java:929)
	at org.apache.solr.cloud.AbstractFullDistribZkTestBase.createJettys(AbstractFullDistribZkTestBase.java:561)
	at org.apache.solr.cloud.AbstractFullDistribZkTestBase.createServers(AbstractFullDistribZkTestBase.java:358)
	at org.apache.solr.BaseDistributedSearchTestCase$ShardsRepeatRule$ShardsFixedStatement.callStatement(BaseDistributedSearchTestCase.java:1080)
	at org.apache.solr.BaseDistributedSearchTestCase$ShardsRepeatRule$ShardsStatement.evaluate(BaseDistributedSearchTestCase.java:1054)
	at com.carrotsearch.randomizedtesting.rules.SystemPropertiesRestoreRule$1.evaluate(SystemPropertiesRestoreRule.java:57)
	at org.apache.lucene.util.TestRuleSetupTeardownChained$1.evaluate(TestRuleSetupTeardownChained.java:49)
	at org.apache.lucene.util.AbstractBeforeAfterRule$1.evaluate(AbstractBeforeAfterRule.java:45)
	at org.apache.lucene.util.TestRuleThreadAndTestName$1.evaluate(TestRuleThreadAndTestName.java:48)
	at org.apache.lucene.util.TestRuleIgnoreAfterMaxFailures$1.evaluate(TestRuleIgnoreAfterMaxFailures.java:64)
	at org.apache.lucene.util.TestRuleMarkFailure$1.evaluate(TestRuleMarkFailure.java:47)
	at com.carrotsearch.randomizedtesting.rules.StatementAdapter.evaluate(StatementAdapter.java:36)
	at com.carrotsearch.randomizedtesting.ThreadLeakControl$StatementRunner.run(ThreadLeakControl.java:368)
	at com.carrotsearch.randomizedtesting.ThreadLeakControl.forkTimeoutingTask(ThreadLeakControl.java:817)
	at com.carrotsearch.randomizedtesting.ThreadLeakControl$3.evaluate(ThreadLeakControl.java:468)
	at com.carrotsearch.randomizedtesting.RandomizedRunner.runSingleTest(RandomizedRunner.java:947)
	at com.carrotsearch.randomizedtesting.RandomizedRunner$5.evaluate(RandomizedRunner.java:832)
	at com.carrotsearch.randomizedtesting.RandomizedRunner$6.evaluate(RandomizedRunner.java:883)
	at com.carrotsearch.randomizedtesting.RandomizedRunner$7.evaluate(RandomizedRunner.java:894)
	at com.carrotsearch.randomizedtesting.rules.StatementAdapter.evaluate(StatementAdapter.java:36)
	at com.carrotsearch.randomizedtesting.rules.SystemPropertiesRestoreRule$1.evaluate(SystemPropertiesRestoreRule.java:57)
	at org.apache.lucene.util.AbstractBeforeAfterRule$1.evaluate(AbstractBeforeAfterRule.java:45)
	at com.carrotsearch.randomizedtesting.rules.StatementAdapter.evaluate(StatementAdapter.java:36)
	at org.apache.lucene.util.TestRuleStoreClassName$1.evaluate(TestRuleStoreClassName.java:41)
	at com.carrotsearch.randomizedtesting.rules.NoShadowingOrOverridesOnMethodsRule$1.evaluate(NoShadowingOrOverridesOnMethodsRule.java:40)
	at com.carrotsearch.randomizedtesting.rules.NoShadowingOrOverridesOnMethodsRule$1.evaluate(NoShadowingOrOverridesOnMethodsRule.java:40)
	at com.carrotsearch.randomizedtesting.rules.StatementAdapter.evaluate(StatementAdapter.java:36)
	at com.carrotsearch.randomizedtesting.rules.StatementAdapter.evaluate(StatementAdapter.java:36)
	at org.apache.lucene.util.TestRuleAssertionsRequired$1.evaluate(TestRuleAssertionsRequired.java:53)
	at org.apache.lucene.util.TestRuleMarkFailure$1.evaluate(TestRuleMarkFailure.java:47)
	at org.apache.lucene.util.TestRuleIgnoreAfterMaxFailures$1.evaluate(TestRuleIgnoreAfterMaxFailures.java:64)
	at org.apache.lucene.util.TestRuleIgnoreTestSuites$1.evaluate(TestRuleIgnoreTestSuites.java:54)
	at com.carrotsearch.randomizedtesting.rules.StatementAdapter.evaluate(StatementAdapter.java:36)
	at com.carrotsearch.randomizedtesting.ThreadLeakControl$StatementRunner.run(ThreadLeakControl.java:368)
	at java.base/java.lang.Thread.run(Thread.java:834)


FAILED:  org.apache.solr.cloud.PeerSyncReplicationTest.test

Error Message:
There are still nodes recoverying - waited for 30 seconds

Stack Trace:
java.lang.AssertionError: There are still nodes recoverying - waited for 30 seconds
	at __randomizedtesting.SeedInfo.seed([BFD2C1D54168B6F:83A913C7FAEAE697]:0)
	at org.junit.Assert.fail(Assert.java:88)
	at org.apache.solr.cloud.AbstractDistribZkTestBase.waitForRecoveriesToFinish(AbstractDistribZkTestBase.java:195)
	at org.apache.solr.cloud.AbstractFullDistribZkTestBase.waitForRecoveriesToFinish(AbstractFullDistribZkTestBase.java:1038)
	at org.apache.solr.cloud.AbstractFullDistribZkTestBase.waitForThingsToLevelOut(AbstractFullDistribZkTestBase.java:1595)
	at org.apache.solr.cloud.PeerSyncReplicationTest.test(PeerSyncReplicationTest.java:116)
	at java.base/jdk.internal.reflect.NativeMethodAccessorImpl.invoke0(Native Method)
	at java.base/jdk.internal.reflect.NativeMethodAccessorImpl.invoke(NativeMethodAccessorImpl.java:62)
	at java.base/jdk.internal.reflect.DelegatingMethodAccessorImpl.invoke(DelegatingMethodAccessorImpl.java:43)
	at java.base/java.lang.reflect.Method.invoke(Method.java:566)
	at com.carrotsearch.randomizedtesting.RandomizedRunner.invoke(RandomizedRunner.java:1750)
	at com.carrotsearch.randomizedtesting.RandomizedRunner$8.evaluate(RandomizedRunner.java:938)
	at com.carrotsearch.randomizedtesting.RandomizedRunner$9.evaluate(RandomizedRunner.java:974)
	at com.carrotsearch.randomizedtesting.RandomizedRunner$10.evaluate(RandomizedRunner.java:988)
	at org.apache.solr.BaseDistributedSearchTestCase$ShardsRepeatRule$ShardsFixedStatement.callStatement(BaseDistributedSearchTestCase.java:1082)
	at org.apache.solr.BaseDistributedSearchTestCase$ShardsRepeatRule$ShardsStatement.evaluate(BaseDistributedSearchTestCase.java:1054)
	at com.carrotsearch.randomizedtesting.rules.SystemPropertiesRestoreRule$1.evaluate(SystemPropertiesRestoreRule.java:57)
	at org.apache.lucene.util.TestRuleSetupTeardownChained$1.evaluate(TestRuleSetupTeardownChained.java:49)
	at org.apache.lucene.util.AbstractBeforeAfterRule$1.evaluate(AbstractBeforeAfterRule.java:45)
	at org.apache.lucene.util.TestRuleThreadAndTestName$1.evaluate(TestRuleThreadAndTestName.java:48)
	at org.apache.lucene.util.TestRuleIgnoreAfterMaxFailures$1.evaluate(TestRuleIgnoreAfterMaxFailures.java:64)
	at org.apache.lucene.util.TestRuleMarkFailure$1.evaluate(TestRuleMarkFailure.java:47)
	at com.carrotsearch.randomizedtesting.rules.StatementAdapter.evaluate(StatementAdapter.java:36)
	at com.carrotsearch.randomizedtesting.ThreadLeakControl$StatementRunner.run(ThreadLeakControl.java:368)
	at com.carrotsearch.randomizedtesting.ThreadLeakControl.forkTimeoutingTask(ThreadLeakControl.java:817)
	at com.carrotsearch.randomizedtesting.ThreadLeakControl$3.evaluate(ThreadLeakControl.java:468)
	at com.carrotsearch.randomizedtesting.RandomizedRunner.runSingleTest(RandomizedRunner.java:947)
	at com.carrotsearch.randomizedtesting.RandomizedRunner$5.evaluate(RandomizedRunner.java:832)
	at com.carrotsearch.randomizedtesting.RandomizedRunner$6.evaluate(RandomizedRunner.java:883)
	at com.carrotsearch.randomizedtesting.RandomizedRunner$7.evaluate(RandomizedRunner.java:894)
	at com.carrotsearch.randomizedtesting.rules.StatementAdapter.evaluate(StatementAdapter.java:36)
	at com.carrotsearch.randomizedtesting.rules.SystemPropertiesRestoreRule$1.evaluate(SystemPropertiesRestoreRule.java:57)
	at org.apache.lucene.util.AbstractBeforeAfterRule$1.evaluate(AbstractBeforeAfterRule.java:45)
	at com.carrotsearch.randomizedtesting.rules.StatementAdapter.evaluate(StatementAdapter.java:36)
	at org.apache.lucene.util.TestRuleStoreClassName$1.evaluate(TestRuleStoreClassName.java:41)
	at com.carrotsearch.randomizedtesting.rules.NoShadowingOrOverridesOnMethodsRule$1.evaluate(NoShadowingOrOverridesOnMethodsRule.java:40)
	at com.carrotsearch.randomizedtesting.rules.NoShadowingOrOverridesOnMethodsRule$1.evaluate(NoShadowingOrOverridesOnMethodsRule.java:40)
	at com.carrotsearch.randomizedtesting.rules.StatementAdapter.evaluate(StatementAdapter.java:36)
	at com.carrotsearch.randomizedtesting.rules.StatementAdapter.evaluate(StatementAdapter.java:36)
	at org.apache.lucene.util.TestRuleAssertionsRequired$1.evaluate(TestRuleAssertionsRequired.java:53)
	at org.apache.lucene.util.TestRuleMarkFailure$1.evaluate(TestRuleMarkFailure.java:47)
	at org.apache.lucene.util.TestRuleIgnoreAfterMaxFailures$1.evaluate(TestRuleIgnoreAfterMaxFailures.java:64)
	at org.apache.lucene.util.TestRuleIgnoreTestSuites$1.evaluate(TestRuleIgnoreTestSuites.java:54)
	at com.carrotsearch.randomizedtesting.rules.StatementAdapter.evaluate(StatementAdapter.java:36)
	at com.carrotsearch.randomizedtesting.ThreadLeakControl$StatementRunner.run(ThreadLeakControl.java:368)
	at java.base/java.lang.Thread.run(Thread.java:834)


FAILED:  org.apache.solr.cloud.TestCloudSearcherWarming.testPeersyncFailureReplicationSuccess

Error Message:
No live SolrServers available to handle this request:[http://127.0.0.1:44499/solr/testPeersyncFailureReplicationSuccess]

Stack Trace:
org.apache.solr.client.solrj.SolrServerException: No live SolrServers available to handle this request:[http://127.0.0.1:44499/solr/testPeersyncFailureReplicationSuccess]
	at __randomizedtesting.SeedInfo.seed([BFD2C1D54168B6F:DFAC4F5285A8BC0C]:0)
	at org.apache.solr.client.solrj.impl.LBSolrClient.request(LBSolrClient.java:345)
	at org.apache.solr.client.solrj.impl.BaseCloudSolrClient.sendRequest(BaseCloudSolrClient.java:1068)
	at org.apache.solr.client.solrj.impl.BaseCloudSolrClient.requestWithRetryOnStaleState(BaseCloudSolrClient.java:837)
	at org.apache.solr.client.solrj.impl.BaseCloudSolrClient.request(BaseCloudSolrClient.java:769)
	at org.apache.solr.client.solrj.SolrClient.request(SolrClient.java:1274)
	at org.apache.solr.cloud.TestCloudSearcherWarming.testPeersyncFailureReplicationSuccess(TestCloudSearcherWarming.java:154)
	at java.base/jdk.internal.reflect.NativeMethodAccessorImpl.invoke0(Native Method)
	at java.base/jdk.internal.reflect.NativeMethodAccessorImpl.invoke(NativeMethodAccessorImpl.java:62)
	at java.base/jdk.internal.reflect.DelegatingMethodAccessorImpl.invoke(DelegatingMethodAccessorImpl.java:43)
	at java.base/java.lang.reflect.Method.invoke(Method.java:566)
	at com.carrotsearch.randomizedtesting.RandomizedRunner.invoke(RandomizedRunner.java:1750)
	at com.carrotsearch.randomizedtesting.RandomizedRunner$8.evaluate(RandomizedRunner.java:938)
	at com.carrotsearch.randomizedtesting.RandomizedRunner$9.evaluate(RandomizedRunner.java:974)
	at com.carrotsearch.randomizedtesting.RandomizedRunner$10.evaluate(RandomizedRunner.java:988)
	at com.carrotsearch.randomizedtesting.rules.SystemPropertiesRestoreRule$1.evaluate(SystemPropertiesRestoreRule.java:57)
	at org.apache.lucene.util.TestRuleSetupTeardownChained$1.evaluate(TestRuleSetupTeardownChained.java:49)
	at org.apache.lucene.util.AbstractBeforeAfterRule$1.evaluate(AbstractBeforeAfterRule.java:45)
	at org.apache.lucene.util.TestRuleThreadAndTestName$1.evaluate(TestRuleThreadAndTestName.java:48)
	at org.apache.lucene.util.TestRuleIgnoreAfterMaxFailures$1.evaluate(TestRuleIgnoreAfterMaxFailures.java:64)
	at org.apache.lucene.util.TestRuleMarkFailure$1.evaluate(TestRuleMarkFailure.java:47)
	at com.carrotsearch.randomizedtesting.rules.StatementAdapter.evaluate(StatementAdapter.java:36)
	at com.carrotsearch.randomizedtesting.ThreadLeakControl$StatementRunner.run(ThreadLeakControl.java:368)
	at com.carrotsearch.randomizedtesting.ThreadLeakControl.forkTimeoutingTask(ThreadLeakControl.java:817)
	at com.carrotsearch.randomizedtesting.ThreadLeakControl$3.evaluate(ThreadLeakControl.java:468)
	at com.carrotsearch.randomizedtesting.RandomizedRunner.runSingleTest(RandomizedRunner.java:947)
	at com.carrotsearch.randomizedtesting.RandomizedRunner$5.evaluate(RandomizedRunner.java:832)
	at com.carrotsearch.randomizedtesting.RandomizedRunner$6.evaluate(RandomizedRunner.java:883)
	at com.carrotsearch.randomizedtesting.RandomizedRunner$7.evaluate(RandomizedRunner.java:894)
	at com.carrotsearch.randomizedtesting.rules.StatementAdapter.evaluate(StatementAdapter.java:36)
	at com.carrotsearch.randomizedtesting.rules.SystemPropertiesRestoreRule$1.evaluate(SystemPropertiesRestoreRule.java:57)
	at org.apache.lucene.util.AbstractBeforeAfterRule$1.evaluate(AbstractBeforeAfterRule.java:45)
	at com.carrotsearch.randomizedtesting.rules.StatementAdapter.evaluate(StatementAdapter.java:36)
	at org.apache.lucene.util.TestRuleStoreClassName$1.evaluate(TestRuleStoreClassName.java:41)
	at com.carrotsearch.randomizedtesting.rules.NoShadowingOrOverridesOnMethodsRule$1.evaluate(NoShadowingOrOverridesOnMethodsRule.java:40)
	at com.carrotsearch.randomizedtesting.rules.NoShadowingOrOverridesOnMethodsRule$1.evaluate(NoShadowingOrOverridesOnMethodsRule.java:40)
	at com.carrotsearch.randomizedtesting.rules.StatementAdapter.evaluate(StatementAdapter.java:36)
	at com.carrotsearch.randomizedtesting.rules.StatementAdapter.evaluate(StatementAdapter.java:36)
	at org.apache.lucene.util.TestRuleAssertionsRequired$1.evaluate(TestRuleAssertionsRequired.java:53)
	at org.apache.lucene.util.TestRuleMarkFailure$1.evaluate(TestRuleMarkFailure.java:47)
	at org.apache.lucene.util.TestRuleIgnoreAfterMaxFailures$1.evaluate(TestRuleIgnoreAfterMaxFailures.java:64)
	at org.apache.lucene.util.TestRuleIgnoreTestSuites$1.evaluate(TestRuleIgnoreTestSuites.java:54)
	at com.carrotsearch.randomizedtesting.rules.StatementAdapter.evaluate(StatementAdapter.java:36)
	at com.carrotsearch.randomizedtesting.ThreadLeakControl$StatementRunner.run(ThreadLeakControl.java:368)
	at java.base/java.lang.Thread.run(Thread.java:834)
Caused by: org.apache.solr.client.solrj.impl.HttpSolrClient$RemoteSolrException: Error from server at http://127.0.0.1:44499/solr/testPeersyncFailureReplicationSuccess: 1 out of 2 the property overlay to be of version 0 within 30 seconds! Failed cores: [http://127.0.0.1:44499/solr/testPeersyncFailureReplicationSuccess_shard1_replica_n1/]
	at org.apache.solr.client.solrj.impl.HttpSolrClient.executeMethod(HttpSolrClient.java:656)
	at org.apache.solr.client.solrj.impl.HttpSolrClient.request(HttpSolrClient.java:262)
	at org.apache.solr.client.solrj.impl.HttpSolrClient.request(HttpSolrClient.java:245)
	at org.apache.solr.client.solrj.impl.LBSolrClient.doRequest(LBSolrClient.java:368)
	at org.apache.solr.client.solrj.impl.LBSolrClient.request(LBSolrClient.java:296)
	... 43 more


FAILED:  org.apache.solr.cloud.UnloadDistributedZkTest.test

Error Message:
Captured an uncaught exception in thread: Thread[id=14147, name=testExecutor-2688-thread-7, state=RUNNABLE, group=TGRP-UnloadDistributedZkTest]

Stack Trace:
com.carrotsearch.randomizedtesting.UncaughtExceptionError: Captured an uncaught exception in thread: Thread[id=14147, name=testExecutor-2688-thread-7, state=RUNNABLE, group=TGRP-UnloadDistributedZkTest]
	at __randomizedtesting.SeedInfo.seed([BFD2C1D54168B6F:83A913C7FAEAE697]:0)
Caused by: org.apache.solr.client.solrj.impl.HttpSolrClient$RemoteSolrException: Error from server at http://127.0.0.1:36027: ADDREPLICA failed to create replica
	at __randomizedtesting.SeedInfo.seed([BFD2C1D54168B6F]:0)
	at org.apache.solr.client.solrj.impl.HttpSolrClient.executeMethod(HttpSolrClient.java:656)
	at org.apache.solr.client.solrj.impl.HttpSolrClient.request(HttpSolrClient.java:262)
	at org.apache.solr.client.solrj.impl.HttpSolrClient.request(HttpSolrClient.java:245)
	at org.apache.solr.client.solrj.SolrRequest.process(SolrRequest.java:211)
	at org.apache.solr.client.solrj.SolrRequest.process(SolrRequest.java:228)
	at org.apache.solr.cloud.BasicDistributedZkTest.lambda$createCollectionInOneInstance$2(BasicDistributedZkTest.java:760)
	at org.apache.solr.common.util.ExecutorUtil$MDCAwareThreadPoolExecutor.lambda$execute$0(ExecutorUtil.java:209)
	at java.base/java.util.concurrent.ThreadPoolExecutor.runWorker(ThreadPoolExecutor.java:1128)
	at java.base/java.util.concurrent.ThreadPoolExecutor$Worker.run(ThreadPoolExecutor.java:628)
	at java.base/java.lang.Thread.run(Thread.java:834)


FAILED:  org.apache.solr.cloud.autoscaling.AutoAddReplicasIntegrationTest.testSimple

Error Message:
Waiting for collection testSimple2 Timeout waiting to see state for collection=testSimple2 :DocCollection(testSimple2//collections/testSimple2/state.json/30)={   "pullReplicas":"0",   "replicationFactor":"2",   "shards":{     "shard1":{       "range":"80000000-ffffffff",       "state":"active",       "replicas":{         "core_node3":{           "core":"testSimple2_shard1_replica_n1",           "base_url":"http://127.0.0.1:40361/solr",           "node_name":"127.0.0.1:40361_solr",           "state":"active",           "type":"NRT",           "force_set_state":"false",           "leader":"true"},         "core_node5":{           "core":"testSimple2_shard1_replica_n2",           "base_url":"http://127.0.0.1:44815/solr",           "node_name":"127.0.0.1:44815_solr",           "state":"down",           "type":"NRT",           "force_set_state":"false"},         "core_node12":{           "core":"testSimple2_shard1_replica_n11",           "base_url":"http://127.0.0.1:40361/solr",           "node_name":"127.0.0.1:40361_solr",           "state":"down",           "type":"NRT",           "force_set_state":"false"}}},     "shard2":{       "range":"0-7fffffff",       "state":"active",       "replicas":{         "core_node7":{           "core":"testSimple2_shard2_replica_n4",           "base_url":"http://127.0.0.1:40361/solr",           "node_name":"127.0.0.1:40361_solr",           "state":"active",           "type":"NRT",           "force_set_state":"false",           "leader":"true"},         "core_node10":{           "core":"testSimple2_shard2_replica_n9",           "base_url":"http://127.0.0.1:40361/solr",           "node_name":"127.0.0.1:40361_solr",           "state":"active",           "type":"NRT",           "force_set_state":"false"}}}},   "router":{"name":"compositeId"},   "maxShardsPerNode":"2",   "autoAddReplicas":"true",   "nrtReplicas":"2",   "tlogReplicas":"0"} Live Nodes: [127.0.0.1:40361_solr, 127.0.0.1:40423_solr] Last available state: DocCollection(testSimple2//collections/testSimple2/state.json/30)={   "pullReplicas":"0",   "replicationFactor":"2",   "shards":{     "shard1":{       "range":"80000000-ffffffff",       "state":"active",       "replicas":{         "core_node3":{           "core":"testSimple2_shard1_replica_n1",           "base_url":"http://127.0.0.1:40361/solr",           "node_name":"127.0.0.1:40361_solr",           "state":"active",           "type":"NRT",           "force_set_state":"false",           "leader":"true"},         "core_node5":{           "core":"testSimple2_shard1_replica_n2",           "base_url":"http://127.0.0.1:44815/solr",           "node_name":"127.0.0.1:44815_solr",           "state":"down",           "type":"NRT",           "force_set_state":"false"},         "core_node12":{           "core":"testSimple2_shard1_replica_n11",           "base_url":"http://127.0.0.1:40361/solr",           "node_name":"127.0.0.1:40361_solr",           "state":"down",           "type":"NRT",           "force_set_state":"false"}}},     "shard2":{       "range":"0-7fffffff",       "state":"active",       "replicas":{         "core_node7":{           "core":"testSimple2_shard2_replica_n4",           "base_url":"http://127.0.0.1:40361/solr",           "node_name":"127.0.0.1:40361_solr",           "state":"active",           "type":"NRT",           "force_set_state":"false",           "leader":"true"},         "core_node10":{           "core":"testSimple2_shard2_replica_n9",           "base_url":"http://127.0.0.1:40361/solr",           "node_name":"127.0.0.1:40361_solr",           "state":"active",           "type":"NRT",           "force_set_state":"false"}}}},   "router":{"name":"compositeId"},   "maxShardsPerNode":"2",   "autoAddReplicas":"true",   "nrtReplicas":"2",   "tlogReplicas":"0"}

Stack Trace:
java.lang.AssertionError: Waiting for collection testSimple2
Timeout waiting to see state for collection=testSimple2 :DocCollection(testSimple2//collections/testSimple2/state.json/30)={
  "pullReplicas":"0",
  "replicationFactor":"2",
  "shards":{
    "shard1":{
      "range":"80000000-ffffffff",
      "state":"active",
      "replicas":{
        "core_node3":{
          "core":"testSimple2_shard1_replica_n1",
          "base_url":"http://127.0.0.1:40361/solr",
          "node_name":"127.0.0.1:40361_solr",
          "state":"active",
          "type":"NRT",
          "force_set_state":"false",
          "leader":"true"},
        "core_node5":{
          "core":"testSimple2_shard1_replica_n2",
          "base_url":"http://127.0.0.1:44815/solr",
          "node_name":"127.0.0.1:44815_solr",
          "state":"down",
          "type":"NRT",
          "force_set_state":"false"},
        "core_node12":{
          "core":"testSimple2_shard1_replica_n11",
          "base_url":"http://127.0.0.1:40361/solr",
          "node_name":"127.0.0.1:40361_solr",
          "state":"down",
          "type":"NRT",
          "force_set_state":"false"}}},
    "shard2":{
      "range":"0-7fffffff",
      "state":"active",
      "replicas":{
        "core_node7":{
          "core":"testSimple2_shard2_replica_n4",
          "base_url":"http://127.0.0.1:40361/solr",
          "node_name":"127.0.0.1:40361_solr",
          "state":"active",
          "type":"NRT",
          "force_set_state":"false",
          "leader":"true"},
        "core_node10":{
          "core":"testSimple2_shard2_replica_n9",
          "base_url":"http://127.0.0.1:40361/solr",
          "node_name":"127.0.0.1:40361_solr",
          "state":"active",
          "type":"NRT",
          "force_set_state":"false"}}}},
  "router":{"name":"compositeId"},
  "maxShardsPerNode":"2",
  "autoAddReplicas":"true",
  "nrtReplicas":"2",
  "tlogReplicas":"0"}
Live Nodes: [127.0.0.1:40361_solr, 127.0.0.1:40423_solr]
Last available state: DocCollection(testSimple2//collections/testSimple2/state.json/30)={
  "pullReplicas":"0",
  "replicationFactor":"2",
  "shards":{
    "shard1":{
      "range":"80000000-ffffffff",
      "state":"active",
      "replicas":{
        "core_node3":{
          "core":"testSimple2_shard1_replica_n1",
          "base_url":"http://127.0.0.1:40361/solr",
          "node_name":"127.0.0.1:40361_solr",
          "state":"active",
          "type":"NRT",
          "force_set_state":"false",
          "leader":"true"},
        "core_node5":{
          "core":"testSimple2_shard1_replica_n2",
          "base_url":"http://127.0.0.1:44815/solr",
          "node_name":"127.0.0.1:44815_solr",
          "state":"down",
          "type":"NRT",
          "force_set_state":"false"},
        "core_node12":{
          "core":"testSimple2_shard1_replica_n11",
          "base_url":"http://127.0.0.1:40361/solr",
          "node_name":"127.0.0.1:40361_solr",
          "state":"down",
          "type":"NRT",
          "force_set_state":"false"}}},
    "shard2":{
      "range":"0-7fffffff",
      "state":"active",
      "replicas":{
        "core_node7":{
          "core":"testSimple2_shard2_replica_n4",
          "base_url":"http://127.0.0.1:40361/solr",
          "node_name":"127.0.0.1:40361_solr",
          "state":"active",
          "type":"NRT",
          "force_set_state":"false",
          "leader":"true"},
        "core_node10":{
          "core":"testSimple2_shard2_replica_n9",
          "base_url":"http://127.0.0.1:40361/solr",
          "node_name":"127.0.0.1:40361_solr",
          "state":"active",
          "type":"NRT",
          "force_set_state":"false"}}}},
  "router":{"name":"compositeId"},
  "maxShardsPerNode":"2",
  "autoAddReplicas":"true",
  "nrtReplicas":"2",
  "tlogReplicas":"0"}
	at __randomizedtesting.SeedInfo.seed([BFD2C1D54168B6F:334E08E373E55FBE]:0)
	at org.junit.Assert.fail(Assert.java:88)
	at org.apache.solr.cloud.SolrCloudTestCase.waitForState(SolrCloudTestCase.java:310)
	at org.apache.solr.cloud.autoscaling.AutoAddReplicasIntegrationTest.testSimple(AutoAddReplicasIntegrationTest.java:169)
	at java.base/jdk.internal.reflect.NativeMethodAccessorImpl.invoke0(Native Method)
	at java.base/jdk.internal.reflect.NativeMethodAccessorImpl.invoke(NativeMethodAccessorImpl.java:62)
	at java.base/jdk.internal.reflect.DelegatingMethodAccessorImpl.invoke(DelegatingMethodAccessorImpl.java:43)
	at java.base/java.lang.reflect.Method.invoke(Method.java:566)
	at com.carrotsearch.randomizedtesting.RandomizedRunner.invoke(RandomizedRunner.java:1750)
	at com.carrotsearch.randomizedtesting.RandomizedRunner$8.evaluate(RandomizedRunner.java:938)
	at com.carrotsearch.randomizedtesting.RandomizedRunner$9.evaluate(RandomizedRunner.java:974)
	at com.carrotsearch.randomizedtesting.RandomizedRunner$10.evaluate(RandomizedRunner.java:988)
	at com.carrotsearch.randomizedtesting.rules.SystemPropertiesRestoreRule$1.evaluate(SystemPropertiesRestoreRule.java:57)
	at org.apache.lucene.util.TestRuleSetupTeardownChained$1.evaluate(TestRuleSetupTeardownChained.java:49)
	at org.apache.lucene.util.AbstractBeforeAfterRule$1.evaluate(AbstractBeforeAfterRule.java:45)
	at org.apache.lucene.util.TestRuleThreadAndTestName$1.evaluate(TestRuleThreadAndTestName.java:48)
	at org.apache.lucene.util.TestRuleIgnoreAfterMaxFailures$1.evaluate(TestRuleIgnoreAfterMaxFailures.java:64)
	at org.apache.lucene.util.TestRuleMarkFailure$1.evaluate(TestRuleMarkFailure.java:47)
	at com.carrotsearch.randomizedtesting.rules.StatementAdapter.evaluate(StatementAdapter.java:36)
	at com.carrotsearch.randomizedtesting.ThreadLeakControl$StatementRunner.run(ThreadLeakControl.java:368)
	at com.carrotsearch.randomizedtesting.ThreadLeakControl.forkTimeoutingTask(ThreadLeakControl.java:817)
	at com.carrotsearch.randomizedtesting.ThreadLeakControl$3.evaluate(ThreadLeakControl.java:468)
	at com.carrotsearch.randomizedtesting.RandomizedRunner.runSingleTest(RandomizedRunner.java:947)
	at com.carrotsearch.randomizedtesting.RandomizedRunner$5.evaluate(RandomizedRunner.java:832)
	at com.carrotsearch.randomizedtesting.RandomizedRunner$6.evaluate(RandomizedRunner.java:883)
	at com.carrotsearch.randomizedtesting.RandomizedRunner$7.evaluate(RandomizedRunner.java:894)
	at com.carrotsearch.randomizedtesting.rules.StatementAdapter.evaluate(StatementAdapter.java:36)
	at com.carrotsearch.randomizedtesting.rules.SystemPropertiesRestoreRule$1.evaluate(SystemPropertiesRestoreRule.java:57)
	at org.apache.lucene.util.AbstractBeforeAfterRule$1.evaluate(AbstractBeforeAfterRule.java:45)
	at com.carrotsearch.randomizedtesting.rules.StatementAdapter.evaluate(StatementAdapter.java:36)
	at org.apache.lucene.util.TestRuleStoreClassName$1.evaluate(TestRuleStoreClassName.java:41)
	at com.carrotsearch.randomizedtesting.rules.NoShadowingOrOverridesOnMethodsRule$1.evaluate(NoShadowingOrOverridesOnMethodsRule.java:40)
	at com.carrotsearch.randomizedtesting.rules.NoShadowingOrOverridesOnMethodsRule$1.evaluate(NoShadowingOrOverridesOnMethodsRule.java:40)
	at com.carrotsearch.randomizedtesting.rules.StatementAdapter.evaluate(StatementAdapter.java:36)
	at com.carrotsearch.randomizedtesting.rules.StatementAdapter.evaluate(StatementAdapter.java:36)
	at org.apache.lucene.util.TestRuleAssertionsRequired$1.evaluate(TestRuleAssertionsRequired.java:53)
	at org.apache.lucene.util.TestRuleMarkFailure$1.evaluate(TestRuleMarkFailure.java:47)
	at org.apache.lucene.util.TestRuleIgnoreAfterMaxFailures$1.evaluate(TestRuleIgnoreAfterMaxFailures.java:64)
	at org.apache.lucene.util.TestRuleIgnoreTestSuites$1.evaluate(TestRuleIgnoreTestSuites.java:54)
	at com.carrotsearch.randomizedtesting.rules.StatementAdapter.evaluate(StatementAdapter.java:36)
	at com.carrotsearch.randomizedtesting.ThreadLeakControl$StatementRunner.run(ThreadLeakControl.java:368)
	at java.base/java.lang.Thread.run(Thread.java:834)




Build Log:
[...truncated 12478 lines...]
   [junit4] Suite: org.apache.solr.cloud.LeaderFailoverAfterPartitionTest
   [junit4]   2> Creating dataDir: /home/jenkins/workspace/Lucene-Solr-master-Linux/solr/build/solr-core/test/J0/temp/solr.cloud.LeaderFailoverAfterPartitionTest_BFD2C1D54168B6F-001/init-core-data-001
   [junit4]   2> 100552 WARN  (SUITE-LeaderFailoverAfterPartitionTest-seed#[BFD2C1D54168B6F]-worker) [     ] o.a.s.SolrTestCaseJ4 startTrackingSearchers: numOpens=1 numCloses=1
   [junit4]   2> 100553 INFO  (SUITE-LeaderFailoverAfterPartitionTest-seed#[BFD2C1D54168B6F]-worker) [     ] o.a.s.SolrTestCaseJ4 Using PointFields (NUMERIC_POINTS_SYSPROP=true) w/NUMERIC_DOCVALUES_SYSPROP=false
   [junit4]   2> 100554 INFO  (SUITE-LeaderFailoverAfterPartitionTest-seed#[BFD2C1D54168B6F]-worker) [     ] o.a.s.SolrTestCaseJ4 Randomized ssl (false) and clientAuth (false) via: @org.apache.solr.SolrTestCaseJ4$SuppressSSL(bugUrl="https://issues.apache.org/jira/browse/SOLR-5776")
   [junit4]   2> 100554 INFO  (SUITE-LeaderFailoverAfterPartitionTest-seed#[BFD2C1D54168B6F]-worker) [     ] o.a.s.SolrTestCaseJ4 SecureRandom sanity checks: test.solr.allowed.securerandom=null & java.security.egd=file:/dev/./urandom
   [junit4]   2> 100554 INFO  (SUITE-LeaderFailoverAfterPartitionTest-seed#[BFD2C1D54168B6F]-worker) [     ] o.a.s.BaseDistributedSearchTestCase Setting hostContext system property: /
   [junit4]   2> 100558 INFO  (TEST-LeaderFailoverAfterPartitionTest.test-seed#[BFD2C1D54168B6F]) [     ] o.a.s.c.ZkTestServer STARTING ZK TEST SERVER
   [junit4]   2> 100566 INFO  (ZkTestServer Run Thread) [     ] o.a.s.c.ZkTestServer client port:0.0.0.0/0.0.0.0:0
   [junit4]   2> 100566 INFO  (ZkTestServer Run Thread) [     ] o.a.s.c.ZkTestServer Starting server
   [junit4]   2> 100666 INFO  (TEST-LeaderFailoverAfterPartitionTest.test-seed#[BFD2C1D54168B6F]) [     ] o.a.s.c.ZkTestServer start zk server on port:46699
   [junit4]   2> 100666 INFO  (TEST-LeaderFailoverAfterPartitionTest.test-seed#[BFD2C1D54168B6F]) [     ] o.a.s.c.ZkTestServer parse host and port list: 127.0.0.1:46699
   [junit4]   2> 100666 INFO  (TEST-LeaderFailoverAfterPartitionTest.test-seed#[BFD2C1D54168B6F]) [     ] o.a.s.c.ZkTestServer connecting to 127.0.0.1 46699
   [junit4]   2> 100672 INFO  (TEST-LeaderFailoverAfterPartitionTest.test-seed#[BFD2C1D54168B6F]) [     ] o.a.s.c.c.ConnectionManager Waiting for client to connect to ZooKeeper
   [junit4]   2> 100692 INFO  (zkConnectionManagerCallback-324-thread-1) [     ] o.a.s.c.c.ConnectionManager zkClient has connected
   [junit4]   2> 100692 INFO  (TEST-LeaderFailoverAfterPartitionTest.test-seed#[BFD2C1D54168B6F]) [     ] o.a.s.c.c.ConnectionManager Client is connected to ZooKeeper
   [junit4]   2> 100706 INFO  (TEST-LeaderFailoverAfterPartitionTest.test-seed#[BFD2C1D54168B6F]) [     ] o.a.s.c.c.ConnectionManager Waiting for client to connect to ZooKeeper
   [junit4]   2> 100709 INFO  (zkConnectionManagerCallback-326-thread-1) [     ] o.a.s.c.c.ConnectionManager zkClient has connected
   [junit4]   2> 100709 INFO  (TEST-LeaderFailoverAfterPartitionTest.test-seed#[BFD2C1D54168B6F]) [     ] o.a.s.c.c.ConnectionManager Client is connected to ZooKeeper
   [junit4]   2> 100714 INFO  (TEST-LeaderFailoverAfterPartitionTest.test-seed#[BFD2C1D54168B6F]) [     ] o.a.s.c.ZkTestServer put /home/jenkins/workspace/Lucene-Solr-master-Linux/solr/core/src/test-files/solr/collection1/conf/solrconfig-tlog.xml to /configs/conf1/solrconfig.xml
   [junit4]   2> 100717 INFO  (TEST-LeaderFailoverAfterPartitionTest.test-seed#[BFD2C1D54168B6F]) [     ] o.a.s.c.ZkTestServer put /home/jenkins/workspace/Lucene-Solr-master-Linux/solr/core/src/test-files/solr/collection1/conf/schema.xml to /configs/conf1/schema.xml
   [junit4]   2> 100722 INFO  (TEST-LeaderFailoverAfterPartitionTest.test-seed#[BFD2C1D54168B6F]) [     ] o.a.s.c.ZkTestServer put /home/jenkins/workspace/Lucene-Solr-master-Linux/solr/core/src/test-files/solr/collection1/conf/solrconfig.snippet.randomindexconfig.xml to /configs/conf1/solrconfig.snippet.randomindexconfig.xml
   [junit4]   2> 100723 INFO  (TEST-LeaderFailoverAfterPartitionTest.test-seed#[BFD2C1D54168B6F]) [     ] o.a.s.c.ZkTestServer put /home/jenkins/workspace/Lucene-Solr-master-Linux/solr/core/src/test-files/solr/collection1/conf/stopwords.txt to /configs/conf1/stopwords.txt
   [junit4]   2> 100724 INFO  (TEST-LeaderFailoverAfterPartitionTest.test-seed#[BFD2C1D54168B6F]) [     ] o.a.s.c.ZkTestServer put /home/jenkins/workspace/Lucene-Solr-master-Linux/solr/core/src/test-files/solr/collection1/conf/protwords.txt to /configs/conf1/protwords.txt
   [junit4]   2> 100724 INFO  (TEST-LeaderFailoverAfterPartitionTest.test-seed#[BFD2C1D54168B6F]) [     ] o.a.s.c.ZkTestServer put /home/jenkins/workspace/Lucene-Solr-master-Linux/solr/core/src/test-files/solr/collection1/conf/currency.xml to /configs/conf1/currency.xml
   [junit4]   2> 100726 INFO  (TEST-LeaderFailoverAfterPartitionTest.test-seed#[BFD2C1D54168B6F]) [     ] o.a.s.c.ZkTestServer put /home/jenkins/workspace/Lucene-Solr-master-Linux/solr/core/src/test-files/solr/collection1/conf/enumsConfig.xml to /configs/conf1/enumsConfig.xml
   [junit4]   2> 100727 INFO  (TEST-LeaderFailoverAfterPartitionTest.test-seed#[BFD2C1D54168B6F]) [     ] o.a.s.c.ZkTestServer put /home/jenkins/workspace/Lucene-Solr-master-Linux/solr/core/src/test-files/solr/collection1/conf/open-exchange-rates.json to /configs/conf1/open-exchange-rates.json
   [junit4]   2> 100728 INFO  (TEST-LeaderFailoverAfterPartitionTest.test-seed#[BFD2C1D54168B6F]) [     ] o.a.s.c.ZkTestServer put /home/jenkins/workspace/Lucene-Solr-master-Linux/solr/core/src/test-files/solr/collection1/conf/mapping-ISOLatin1Accent.txt to /configs/conf1/mapping-ISOLatin1Accent.txt
   [junit4]   2> 100729 INFO  (TEST-LeaderFailoverAfterPartitionTest.test-seed#[BFD2C1D54168B6F]) [     ] o.a.s.c.ZkTestServer put /home/jenkins/workspace/Lucene-Solr-master-Linux/solr/core/src/test-files/solr/collection1/conf/old_synonyms.txt to /configs/conf1/old_synonyms.txt
   [junit4]   2> 100731 INFO  (TEST-LeaderFailoverAfterPartitionTest.test-seed#[BFD2C1D54168B6F]) [     ] o.a.s.c.ZkTestServer put /home/jenkins/workspace/Lucene-Solr-master-Linux/solr/core/src/test-files/solr/collection1/conf/synonyms.txt to /configs/conf1/synonyms.txt
   [junit4]   2> 100732 INFO  (TEST-LeaderFailoverAfterPartitionTest.test-seed#[BFD2C1D54168B6F]) [     ] o.a.s.c.AbstractFullDistribZkTestBase Will use NRT replicas unless explicitly asked otherwise
   [junit4]   2> 100830 WARN  (TEST-LeaderFailoverAfterPartitionTest.test-seed#[BFD2C1D54168B6F]) [     ] o.e.j.s.AbstractConnector Ignoring deprecated socket close linger time
   [junit4]   2> 100831 INFO  (TEST-LeaderFailoverAfterPartitionTest.test-seed#[BFD2C1D54168B6F]) [     ] o.a.s.c.s.e.JettySolrRunner Start Jetty (original configured port=0)
   [junit4]   2> 100832 INFO  (TEST-LeaderFailoverAfterPartitionTest.test-seed#[BFD2C1D54168B6F]) [     ] o.a.s.c.s.e.JettySolrRunner Trying to start Jetty on port 0 try number 1 ...
   [junit4]   2> 100832 INFO  (TEST-LeaderFailoverAfterPartitionTest.test-seed#[BFD2C1D54168B6F]) [     ] o.e.j.s.Server jetty-9.4.14.v20181114; built: 2018-11-14T21:20:31.478Z; git: c4550056e785fb5665914545889f21dc136ad9e6; jvm 11+28
   [junit4]   2> 100834 INFO  (TEST-LeaderFailoverAfterPartitionTest.test-seed#[BFD2C1D54168B6F]) [     ] o.e.j.s.session DefaultSessionIdManager workerName=node0
   [junit4]   2> 100834 INFO  (TEST-LeaderFailoverAfterPartitionTest.test-seed#[BFD2C1D54168B6F]) [     ] o.e.j.s.session No SessionScavenger set, using defaults
   [junit4]   2> 100834 INFO  (TEST-LeaderFailoverAfterPartitionTest.test-seed#[BFD2C1D54168B6F]) [     ] o.e.j.s.session node0 Scavenging every 600000ms
   [junit4]   2> 100835 INFO  (TEST-LeaderFailoverAfterPartitionTest.test-seed#[BFD2C1D54168B6F]) [     ] o.e.j.s.h.ContextHandler Started o.e.j.s.ServletContextHandler@370db71e{/,null,AVAILABLE}
   [junit4]   2> 100838 INFO  (TEST-LeaderFailoverAfterPartitionTest.test-seed#[BFD2C1D54168B6F]) [     ] o.e.j.s.AbstractConnector Started ServerConnector@3fce907d{HTTP/1.1,[http/1.1, h2c]}{127.0.0.1:41695}
   [junit4]   2> 100839 INFO  (TEST-LeaderFailoverAfterPartitionTest.test-seed#[BFD2C1D54168B6F]) [     ] o.e.j.s.Server Started @100870ms
   [junit4]   2> 100839 INFO  (TEST-LeaderFailoverAfterPartitionTest.test-seed#[BFD2C1D54168B6F]) [     ] o.a.s.c.s.e.JettySolrRunner Jetty properties: {hostContext=/, solr.data.dir=/home/jenkins/workspace/Lucene-Solr-master-Linux/solr/build/solr-core/test/J0/temp/solr.cloud.LeaderFailoverAfterPartitionTest_BFD2C1D54168B6F-001/tempDir-001/control/data, hostPort=40799, coreRootDirectory=/home/jenkins/workspace/Lucene-Solr-master-Linux/solr/build/solr-core/test/J0/temp/solr.cloud.LeaderFailoverAfterPartitionTest_BFD2C1D54168B6F-001/control-001/cores}
   [junit4]   2> 100839 ERROR (TEST-LeaderFailoverAfterPartitionTest.test-seed#[BFD2C1D54168B6F]) [     ] o.a.s.u.StartupLoggingUtils Missing Java Option solr.log.dir. Logging may be missing or incomplete.
   [junit4]   2> 100839 INFO  (TEST-LeaderFailoverAfterPartitionTest.test-seed#[BFD2C1D54168B6F]) [     ] o.a.s.s.SolrDispatchFilter Using logger factory org.apache.logging.slf4j.Log4jLoggerFactory
   [junit4]   2> 100839 INFO  (TEST-LeaderFailoverAfterPartitionTest.test-seed#[BFD2C1D54168B6F]) [     ] o.a.s.s.SolrDispatchFilter  ___      _       Welcome to Apache Solr? version 9.0.0
   [junit4]   2> 100839 INFO  (TEST-LeaderFailoverAfterPartitionTest.test-seed#[BFD2C1D54168B6F]) [     ] o.a.s.s.SolrDispatchFilter / __| ___| |_ _   Starting in cloud mode on port null
   [junit4]   2> 100839 INFO  (TEST-LeaderFailoverAfterPartitionTest.test-seed#[BFD2C1D54168B6F]) [     ] o.a.s.s.SolrDispatchFilter \__ \/ _ \ | '_|  Install dir: null
   [junit4]   2> 100839 INFO  (TEST-LeaderFailoverAfterPartitionTest.test-seed#[BFD2C1D54168B6F]) [     ] o.a.s.s.SolrDispatchFilter |___/\___/_|_|    Start time: 2019-06-08T23:11:22.474773Z
   [junit4]   2> 100848 INFO  (TEST-LeaderFailoverAfterPartitionTest.test-seed#[BFD2C1D54168B6F]) [     ] o.a.s.c.c.ConnectionManager Waiting for client to connect to ZooKeeper
   [junit4]   2> 100850 INFO  (zkConnectionManagerCallback-328-thread-1) [     ] o.a.s.c.c.ConnectionManager zkClient has connected
   [junit4]   2> 100850 INFO  (TEST-LeaderFailoverAfterPartitionTest.test-seed#[BFD2C1D54168B6F]) [     ] o.a.s.c.c.ConnectionManager Client is connected to ZooKeeper
   [junit4]   2> 100953 INFO  (TEST-LeaderFailoverAfterPartitionTest.test-seed#[BFD2C1D54168B6F]) [     ] o.a.s.s.SolrDispatchFilter Loading solr.xml from SolrHome (not found in ZooKeeper)
   [junit4]   2> 100953 INFO  (TEST-LeaderFailoverAfterPartitionTest.test-seed#[BFD2C1D54168B6F]) [     ] o.a.s.c.SolrXmlConfig Loading container configuration from /home/jenkins/workspace/Lucene-Solr-master-Linux/solr/build/solr-core/test/J0/temp/solr.cloud.LeaderFailoverAfterPartitionTest_BFD2C1D54168B6F-001/control-001/solr.xml
   [junit4]   2> 100957 INFO  (TEST-LeaderFailoverAfterPartitionTest.test-seed#[BFD2C1D54168B6F]) [     ] o.a.s.c.SolrXmlConfig Configuration parameter autoReplicaFailoverWorkLoopDelay is ignored
   [junit4]   2> 100957 INFO  (TEST-LeaderFailoverAfterPartitionTest.test-seed#[BFD2C1D54168B6F]) [     ] o.a.s.c.SolrXmlConfig Configuration parameter autoReplicaFailoverBadNodeExpiration is ignored
   [junit4]   2> 100958 INFO  (TEST-LeaderFailoverAfterPartitionTest.test-seed#[BFD2C1D54168B6F]) [     ] o.a.s.c.SolrXmlConfig MBean server found: com.sun.jmx.mbeanserver.JmxMBeanServer@3824b4e5, but no JMX reporters were configured - adding default JMX reporter.
   [junit4]   2> 101064 INFO  (TEST-LeaderFailoverAfterPartitionTest.test-seed#[BFD2C1D54168B6F]) [     ] o.a.s.h.c.HttpShardHandlerFactory Host whitelist initialized: WhitelistHostChecker [whitelistHosts=null, whitelistHostCheckingEnabled=false]
   [junit4]   2> 101069 WARN  (TEST-LeaderFailoverAfterPartitionTest.test-seed#[BFD2C1D54168B6F]) [     ] o.e.j.u.s.S.config No Client EndPointIdentificationAlgorithm configured for SslContextFactory@39e8a7be[provider=null,keyStore=null,trustStore=null]
   [junit4]   2> 101083 WARN  (TEST-LeaderFailoverAfterPartitionTest.test-seed#[BFD2C1D54168B6F]) [     ] o.e.j.u.s.S.config No Client EndPointIdentificationAlgorithm configured for SslContextFactory@668aee4b[provider=null,keyStore=null,trustStore=null]
   [junit4]   2> 101084 INFO  (TEST-LeaderFailoverAfterPartitionTest.test-seed#[BFD2C1D54168B6F]) [     ] o.a.s.c.ZkContainer Zookeeper client=127.0.0.1:46699/solr
   [junit4]   2> 101085 INFO  (TEST-LeaderFailoverAfterPartitionTest.test-seed#[BFD2C1D54168B6F]) [     ] o.a.s.c.c.ConnectionManager Waiting for client to connect to ZooKeeper
   [junit4]   2> 101086 INFO  (zkConnectionManagerCallback-335-thread-1) [     ] o.a.s.c.c.ConnectionManager zkClient has connected
   [junit4]   2> 101086 INFO  (TEST-LeaderFailoverAfterPartitionTest.test-seed#[BFD2C1D54168B6F]) [     ] o.a.s.c.c.ConnectionManager Client is connected to ZooKeeper
   [junit4]   2> 101189 INFO  (TEST-LeaderFailoverAfterPartitionTest.test-seed#[BFD2C1D54168B6F]) [n:127.0.0.1:40799_     ] o.a.s.c.c.ConnectionManager Waiting for client to connect to ZooKeeper
   [junit4]   2> 101190 INFO  (zkConnectionManagerCallback-337-thread-1) [     ] o.a.s.c.c.ConnectionManager zkClient has connected
   [junit4]   2> 101190 INFO  (TEST-LeaderFailoverAfterPartitionTest.test-seed#[BFD2C1D54168B6F]) [n:127.0.0.1:40799_     ] o.a.s.c.c.ConnectionManager Client is connected to ZooKeeper
   [junit4]   2> 101281 INFO  (TEST-LeaderFailoverAfterPartitionTest.test-seed#[BFD2C1D54168B6F]) [n:127.0.0.1:40799_     ] o.a.s.c.OverseerElectionContext I am going to be the leader 127.0.0.1:40799_
   [junit4]   2> 101282 INFO  (TEST-LeaderFailoverAfterPartitionTest.test-seed#[BFD2C1D54168B6F]) [n:127.0.0.1:40799_     ] o.a.s.c.Overseer Overseer (id=72393847292231684-127.0.0.1:40799_-n_0000000000) starting
   [junit4]   2> 101289 INFO  (TEST-LeaderFailoverAfterPartitionTest.test-seed#[BFD2C1D54168B6F]) [n:127.0.0.1:40799_     ] o.a.s.c.c.ConnectionManager Waiting for client to connect to ZooKeeper
   [junit4]   2> 101291 INFO  (zkConnectionManagerCallback-344-thread-1) [     ] o.a.s.c.c.ConnectionManager zkClient has connected
   [junit4]   2> 101291 INFO  (TEST-LeaderFailoverAfterPartitionTest.test-seed#[BFD2C1D54168B6F]) [n:127.0.0.1:40799_     ] o.a.s.c.c.ConnectionManager Client is connected to ZooKeeper
   [junit4]   2> 101293 INFO  (TEST-LeaderFailoverAfterPartitionTest.test-seed#[BFD2C1D54168B6F]) [n:127.0.0.1:40799_     ] o.a.s.c.s.i.ZkClientClusterStateProvider Cluster at 127.0.0.1:46699/solr ready
   [junit4]   2> 101294 INFO  (OverseerStateUpdate-72393847292231684-127.0.0.1:40799_-n_0000000000) [n:127.0.0.1:40799_     ] o.a.s.c.Overseer Starting to work on the main queue : 127.0.0.1:40799_
   [junit4]   2> 101301 INFO  (TEST-LeaderFailoverAfterPartitionTest.test-seed#[BFD2C1D54168B6F]) [n:127.0.0.1:40799_     ] o.a.s.c.ZkController Register node as live in ZooKeeper:/live_nodes/127.0.0.1:40799_
   [junit4]   2> 101303 INFO  (zkCallback-343-thread-1) [     ] o.a.s.c.c.ZkStateReader Updated live nodes from ZooKeeper... (0) -> (1)
   [junit4]   2> 101304 INFO  (zkCallback-336-thread-1) [     ] o.a.s.c.c.ZkStateReader Updated live nodes from ZooKeeper... (0) -> (1)
   [junit4]   2> 101335 INFO  (TEST-LeaderFailoverAfterPartitionTest.test-seed#[BFD2C1D54168B6F]) [n:127.0.0.1:40799_     ] o.a.s.h.a.MetricsHistoryHandler No .system collection, keeping metrics history in memory.
   [junit4]   2> 101351 INFO  (TEST-LeaderFailoverAfterPartitionTest.test-seed#[BFD2C1D54168B6F]) [n:127.0.0.1:40799_     ] o.a.s.m.r.SolrJmxReporter JMX monitoring for 'solr.node' (registry 'solr.node') enabled at server: com.sun.jmx.mbeanserver.JmxMBeanServer@3824b4e5
   [junit4]   2> 101359 INFO  (TEST-LeaderFailoverAfterPartitionTest.test-seed#[BFD2C1D54168B6F]) [n:127.0.0.1:40799_     ] o.a.s.m.r.SolrJmxReporter JMX monitoring for 'solr.jvm' (registry 'solr.jvm') enabled at server: com.sun.jmx.mbeanserver.JmxMBeanServer@3824b4e5
   [junit4]   2> 101359 INFO  (TEST-LeaderFailoverAfterPartitionTest.test-seed#[BFD2C1D54168B6F]) [n:127.0.0.1:40799_     ] o.a.s.m.r.SolrJmxReporter JMX monitoring for 'solr.jetty' (registry 'solr.jetty') enabled at server: com.sun.jmx.mbeanserver.JmxMBeanServer@3824b4e5
   [junit4]   2> 101360 INFO  (TEST-LeaderFailoverAfterPartitionTest.test-seed#[BFD2C1D54168B6F]) [n:127.0.0.1:40799_     ] o.a.s.c.CorePropertiesLocator Found 0 core definitions underneath /home/jenkins/workspace/Lucene-Solr-master-Linux/solr/build/solr-core/test/J0/temp/solr.cloud.LeaderFailoverAfterPartitionTest_BFD2C1D54168B6F-001/control-001/cores
   [junit4]   2> 101374 INFO  (TEST-LeaderFailoverAfterPartitionTest.test-seed#[BFD2C1D54168B6F]) [     ] o.a.s.c.c.ConnectionManager Waiting for client to connect to ZooKeeper
   [junit4]   2> 101376 INFO  (zkConnectionManagerCallback-350-thread-1) [     ] o.a.s.c.c.ConnectionManager zkClient has connected
   [junit4]   2> 101376 INFO  (TEST-LeaderFailoverAfterPartitionTest.test-seed#[BFD2C1D54168B6F]) [     ] o.a.s.c.c.ConnectionManager Client is connected to ZooKeeper
   [junit4]   2> 101378 INFO  (TEST-LeaderFailoverAfterPartitionTest.test-seed#[BFD2C1D54168B6F]) [     ] o.a.s.c.c.ZkStateReader Updated live nodes from ZooKeeper... (0) -> (1)
   [junit4]   2> 101379 INFO  (TEST-LeaderFailoverAfterPartitionTest.test-seed#[BFD2C1D54168B6F]) [     ] o.a.s.c.s.i.ZkClientClusterStateProvider Cluster at 127.0.0.1:46699/solr ready
   [junit4]   2> 101380 INFO  (SocketProxy-Acceptor-40799) [     ] o.a.s.c.s.c.SocketProxy accepted Socket[addr=/127.0.0.1,port=40626,localport=40799], receiveBufferSize:531000
   [junit4]   2> 101384 INFO  (SocketProxy-Acceptor-40799) [     ] o.a.s.c.s.c.SocketProxy proxy connection Socket[addr=/127.0.0.1,port=41695,localport=35962], receiveBufferSize=530904
   [junit4]   2> 101385 INFO  (qtp1966800184-734) [n:127.0.0.1:40799_     ] o.a.s.h.a.CollectionsHandler Invoked Collection Action :create with params collection.configName=conf1&name=control_collection&nrtReplicas=1&action=CREATE&numShards=1&createNodeSet=127.0.0.1:40799_&wt=javabin&version=2 and sendToOCPQueue=true
   [junit4]   2> 101390 INFO  (OverseerThreadFactory-192-thread-1-processing-n:127.0.0.1:40799_) [n:127.0.0.1:40799_     ] o.a.s.c.a.c.CreateCollectionCmd Create collection control_collection
   [junit4]   2> 101499 INFO  (SocketProxy-Acceptor-40799) [     ] o.a.s.c.s.c.SocketProxy accepted Socket[addr=/127.0.0.1,port=40630,localport=40799], receiveBufferSize:531000
   [junit4]   2> 101499 INFO  (SocketProxy-Acceptor-40799) [     ] o.a.s.c.s.c.SocketProxy proxy connection Socket[addr=/127.0.0.1,port=41695,localport=35966], receiveBufferSize=530904
   [junit4]   2> 101501 INFO  (qtp1966800184-733) [n:127.0.0.1:40799_    x:control_collection_shard1_replica_n1 ] o.a.s.h.a.CoreAdminOperation core create command qt=/admin/cores&collection.configName=conf1&newCollection=true&name=control_collection_shard1_replica_n1&action=CREATE&numShards=1&collection=control_collection&shard=shard1&wt=javabin&version=2&replicaType=NRT
   [junit4]   2> 101501 INFO  (qtp1966800184-733) [n:127.0.0.1:40799_    x:control_collection_shard1_replica_n1 ] o.a.s.c.TransientSolrCoreCacheDefault Allocating transient cache for 4 transient cores
   [junit4]   2> 102521 INFO  (qtp1966800184-733) [n:127.0.0.1:40799_ c:control_collection s:shard1  x:control_collection_shard1_replica_n1 ] o.a.s.c.SolrConfig Using Lucene MatchVersion: 9.0.0
   [junit4]   2> 102544 INFO  (qtp1966800184-733) [n:127.0.0.1:40799_ c:control_collection s:shard1  x:control_collection_shard1_replica_n1 ] o.a.s.s.IndexSchema [control_collection_shard1_replica_n1] Schema name=test
   [junit4]   2> 102675 INFO  (qtp1966800184-733) [n:127.0.0.1:40799_ c:control_collection s:shard1  x:control_collection_shard1_replica_n1 ] o.a.s.s.IndexSchema Loaded schema test/1.0 with uniqueid field id
   [junit4]   2> 102707 INFO  (qtp1966800184-733) [n:127.0.0.1:40799_ c:control_collection s:shard1  x:control_collection_shard1_replica_n1 ] o.a.s.c.CoreContainer Creating SolrCore 'control_collection_shard1_replica_n1' using configuration from collection control_collection, trusted=true
   [junit4]   2> 102707 INFO  (qtp1966800184-733) [n:127.0.0.1:40799_ c:control_collection s:shard1  x:control_collection_shard1_replica_n1 ] o.a.s.m.r.SolrJmxReporter JMX monitoring for 'solr.core.control_collection.shard1.replica_n1' (registry 'solr.core.control_collection.shard1.replica_n1') enabled at server: com.sun.jmx.mbeanserver.JmxMBeanServer@3824b4e5
   [junit4]   2> 102707 INFO  (qtp1966800184-733) [n:127.0.0.1:40799_ c:control_collection s:shard1  x:control_collection_shard1_replica_n1 ] o.a.s.c.SolrCore [[control_collection_shard1_replica_n1] ] Opening new SolrCore at [/home/jenkins/workspace/Lucene-Solr-master-Linux/solr/build/solr-core/test/J0/temp/solr.cloud.LeaderFailoverAfterPartitionTest_BFD2C1D54168B6F-001/control-001/cores/control_collection_shard1_replica_n1], dataDir=[/home/jenkins/workspace/Lucene-Solr-master-Linux/solr/build/solr-core/test/J0/temp/solr.cloud.LeaderFailoverAfterPartitionTest_BFD2C1D54168B6F-001/control-001/cores/control_collection_shard1_replica_n1/data/]
   [junit4]   2> 102712 INFO  (qtp1966800184-733) [n:127.0.0.1:40799_ c:control_collection s:shard1  x:control_collection_shard1_replica_n1 ] o.a.s.u.RandomMergePolicy RandomMergePolicy wrapping class org.apache.lucene.index.TieredMergePolicy: [TieredMergePolicy: maxMergeAtOnce=47, maxMergeAtOnceExplicit=27, maxMergedSegmentMB=1.44140625, floorSegmentMB=0.642578125, forceMergeDeletesPctAllowed=29.34363569059025, segmentsPerTier=30.0, maxCFSSegmentSizeMB=8.796093022207999E12, noCFSRatio=1.0, deletesPctAllowed=48.474188966477726
   [junit4]   2> 102718 WARN  (qtp1966800184-733) [n:127.0.0.1:40799_ c:control_collection s:shard1  x:control_collection_shard1_replica_n1 ] o.a.s.c.RequestHandlers INVALID paramSet a in requestHandler {type = requestHandler,name = /dump,class = DumpRequestHandler,attributes = {initParams=a, name=/dump, class=DumpRequestHandler},args = {defaults={a=A,b=B}}}
   [junit4]   2> 102757 INFO  (qtp1966800184-733) [n:127.0.0.1:40799_ c:control_collection s:shard1  x:control_collection_shard1_replica_n1 ] o.a.s.u.UpdateHandler Using UpdateLog implementation: org.apache.solr.update.UpdateLog
   [junit4]   2> 102757 INFO  (qtp1966800184-733) [n:127.0.0.1:40799_ c:control_collection s:shard1  x:control_collection_shard1_replica_n1 ] o.a.s.u.UpdateLog Initializing UpdateLog: dataDir= defaultSyncLevel=FLUSH numRecordsToKeep=100 maxNumLogsToKeep=10 numVersionBuckets=65536
   [junit4]   2> 102758 INFO  (qtp1966800184-733) [n:127.0.0.1:40799_ c:control_collection s:shard1  x:control_collection_shard1_replica_n1 ] o.a.s.u.CommitTracker Hard AutoCommit: disabled
   [junit4]   2> 102758 INFO  (qtp1966800184-733) [n:127.0.0.1:40799_ c:control_collection s:shard1  x:control_collection_shard1_replica_n1 ] o.a.s.u.CommitTracker Soft AutoCommit: disabled
   [junit4]   2> 102759 INFO  (qtp1966800184-733) [n:127.0.0.1:40799_ c:control_collection s:shard1  x:control_collection_shard1_replica_n1 ] o.a.s.u.RandomMergePolicy RandomMergePolicy wrapping class org.apache.lucene.index.LogByteSizeMergePolicy: [LogByteSizeMergePolicy: minMergeSize=1677721, mergeFactor=29, maxMergeSize=2147483648, maxMergeSizeForForcedMerge=9223372036854775807, calibrateSizeByDeletes=false, maxMergeDocs=2147483647, maxCFSSegmentSizeMB=8.796093022207999E12, noCFSRatio=0.5728871384687072]
   [junit4]   2> 102770 INFO  (qtp1966800184-733) [n:127.0.0.1:40799_ c:control_collection s:shard1  x:control_collection_shard1_replica_n1 ] o.a.s.s.SolrIndexSearcher Opening [Searcher@710f575c[control_collection_shard1_replica_n1] main]
   [junit4]   2> 102774 INFO  (qtp1966800184-733) [n:127.0.0.1:40799_ c:control_collection s:shard1  x:control_collection_shard1_replica_n1 ] o.a.s.r.ManagedResourceStorage Configured ZooKeeperStorageIO with znodeBase: /configs/conf1
   [junit4]   2> 102774 INFO  (qtp1966800184-733) [n:127.0.0.1:40799_ c:control_collection s:shard1  x:control_collection_shard1_replica_n1 ] o.a.s.r.ManagedResourceStorage Loaded null at path _rest_managed.json using ZooKeeperStorageIO:path=/configs/conf1
   [junit4]   2> 102774 INFO  (qtp1966800184-733) [n:127.0.0.1:40799_ c:control_collection s:shard1  x:control_collection_shard1_replica_n1 ] o.a.s.h.ReplicationHandler Commits will be reserved for 10000ms.
   [junit4]   2> 102775 INFO  (qtp1966800184-733) [n:127.0.0.1:40799_ c:control_collection s:shard1  x:control_collection_shard1_replica_n1 ] o.a.s.u.UpdateLog Could not find max version in index or recent updates, using new clock 1635815768100700160
   [junit4]   2> 102777 INFO  (searcherExecutor-197-thread-1-processing-n:127.0.0.1:40799_ x:control_collection_shard1_replica_n1 c:control_collection s:shard1) [n:127.0.0.1:40799_ c:control_collection s:shard1  x:control_collection_shard1_replica_n1 ] o.a.s.c.SolrCore [control_collection_shard1_replica_n1] Registered new searcher Searcher@710f575c[control_collection_shard1_replica_n1] main{ExitableDirectoryReader(UninvertingDirectoryReader())}
   [junit4]   2> 102783 INFO  (qtp1966800184-733) [n:127.0.0.1:40799_ c:control_collection s:shard1  x:control_collection_shard1_replica_n1 ] o.a.s.c.ZkShardTerms Successful update of terms at /collections/control_collection/terms/shard1 to Terms{values={core_node2=0}, version=0}
   [junit4]   2> 102783 INFO  (qtp1966800184-733) [n:127.0.0.1:40799_ c:control_collection s:shard1  x:control_collection_shard1_replica_n1 ] o.a.s.c.ShardLeaderElectionContextBase make sure parent is created /collections/control_collection/leaders/shard1
   [junit4]   2> 102788 INFO  (qtp1966800184-733) [n:127.0.0.1:40799_ c:control_collection s:shard1  x:control_collection_shard1_replica_n1 ] o.a.s.c.ShardLeaderElectionContext Enough replicas found to continue.
   [junit4]   2> 102788 INFO  (qtp1966800184-733) [n:127.0.0.1:40799_ c:control_collection s:shard1  x:control_collection_shard1_replica_n1 ] o.a.s.c.ShardLeaderElectionContext I may be the new leader - try and sync
   [junit4]   2> 102788 INFO  (qtp1966800184-733) [n:127.0.0.1:40799_ c:control_collection s:shard1  x:control_collection_shard1_replica_n1 ] o.a.s.c.SyncStrategy Sync replicas to http://127.0.0.1:40799/control_collection_shard1_replica_n1/
   [junit4]   2> 102789 INFO  (qtp1966800184-733) [n:127.0.0.1:40799_ c:control_collection s:shard1  x:control_collection_shard1_replica_n1 ] o.a.s.c.SyncStrategy Sync Success - now sync replicas to me
   [junit4]   2> 102789 INFO  (qtp1966800184-733) [n:127.0.0.1:40799_ c:control_collection s:shard1  x:control_collection_shard1_replica_n1 ] o.a.s.c.SyncStrategy http://127.0.0.1:40799/control_collection_shard1_replica_n1/ has no replicas
   [junit4]   2> 102789 INFO  (qtp1966800184-733) [n:127.0.0.1:40799_ c:control_collection s:shard1  x:control_collection_shard1_replica_n1 ] o.a.s.c.ShardLeaderElectionContextBase Creating leader registration node /collections/control_collection/leaders/shard1/leader after winning as /collections/control_collection/leader_elect/shard1/election/72393847292231684-core_node2-n_0000000000
   [junit4]   2> 102791 INFO  (qtp1966800184-733) [n:127.0.0.1:40799_ c:control_collection s:shard1  x:control_collection_shard1_replica_n1 ] o.a.s.c.ShardLeaderElectionContext I am the new leader: http://127.0.0.1:40799/control_collection_shard1_replica_n1/ shard1
   [junit4]   2> 102892 INFO  (zkCallback-336-thread-1) [     ] o.a.s.c.c.ZkStateReader A cluster state change: [WatchedEvent state:SyncConnected type:NodeDataChanged path:/collections/control_collection/state.json] for collection [control_collection] has occurred - updating... (live nodes size: [1])
   [junit4]   2> 102896 INFO  (qtp1966800184-733) [n:127.0.0.1:40799_ c:control_collection s:shard1  x:control_collection_shard1_replica_n1 ] o.a.s.c.ZkController I am the leader, no recovery necessary
   [junit4]   2> 102898 INFO  (qtp1966800184-733) [n:127.0.0.1:40799_ c:control_collection s:shard1  x:control_collection_shard1_replica_n1 ] o.a.s.s.HttpSolrCall [admin] webapp=null path=/admin/cores params={qt=/admin/cores&collection.configName=conf1&newCollection=true&name=control_collection_shard1_replica_n1&action=CREATE&numShards=1&collection=control_collection&shard=shard1&wt=javabin&version=2&replicaType=NRT} status=0 QTime=1397
   [junit4]   2> 102901 INFO  (zkCallback-336-thread-2) [     ] o.a.s.c.c.ZkStateReader A cluster state change: [WatchedEvent state:SyncConnected type:NodeDataChanged path:/collections/control_collection/state.json] for collection [control_collection] has occurred - updating... (live nodes size: [1])
   [junit4]   2> 102903 INFO  (qtp1966800184-734) [n:127.0.0.1:40799_     ] o.a.s.h.a.CollectionsHandler Wait for new collection to be active for at most 45 seconds. Check all shard replicas
   [junit4]   2> 103003 INFO  (zkCallback-336-thread-1) [     ] o.a.s.c.c.ZkStateReader A cluster state change: [WatchedEvent state:SyncConnected type:NodeDataChanged path:/collections/control_collection/state.json] for collection [control_collection] has occurred - updating... (live nodes size: [1])
   [junit4]   2> 103003 INFO  (zkCallback-336-thread-2) [     ] o.a.s.c.c.ZkStateReader A cluster state change: [WatchedEvent state:SyncConnected type:NodeDataChanged path:/collections/control_collection/state.json] for collection [control_collection] has occurred - updating... (live nodes size: [1])
   [junit4]   2> 103003 INFO  (zkCallback-336-thread-3) [     ] o.a.s.c.c.ZkStateReader A cluster state change: [WatchedEvent state:SyncConnected type:NodeDataChanged path:/collections/control_collection/state.json] for collection [control_collection] has occurred - updating... (live nodes size: [1])
   [junit4]   2> 103004 INFO  (qtp1966800184-734) [n:127.0.0.1:40799_     ] o.a.s.s.HttpSolrCall [admin] webapp=null path=/admin/collections params={collection.configName=conf1&name=control_collection&nrtReplicas=1&action=CREATE&numShards=1&createNodeSet=127.0.0.1:40799_&wt=javabin&version=2} status=0 QTime=1618
   [junit4]   2> 103113 INFO  (TEST-LeaderFailoverAfterPartitionTest.test-seed#[BFD2C1D54168B6F]) [     ] o.a.s.c.c.ConnectionManager Waiting for client to connect to ZooKeeper
   [junit4]   2> 103115 INFO  (zkConnectionManagerCallback-356-thread-1) [     ] o.a.s.c.c.ConnectionManager zkClient has connected
   [junit4]   2> 103115 INFO  (TEST-LeaderFailoverAfterPartitionTest.test-seed#[BFD2C1D54168B6F]) [     ] o.a.s.c.c.ConnectionManager Client is connected to ZooKeeper
   [junit4]   2> 103117 INFO  (TEST-LeaderFailoverAfterPartitionTest.test-seed#[BFD2C1D54168B6F]) [     ] o.a.s.c.c.ZkStateReader Updated live nodes from ZooKeeper... (0) -> (1)
   [junit4]   2> 103117 INFO  (TEST-LeaderFailoverAfterPartitionTest.test-seed#[BFD2C1D54168B6F]) [     ] o.a.s.c.s.i.ZkClientClusterStateProvider Cluster at 127.0.0.1:46699/solr ready
   [junit4]   2> 103117 INFO  (TEST-LeaderFailoverAfterPartitionTest.test-seed#[BFD2C1D54168B6F]) [     ] o.a.s.c.ChaosMonkey monkey: init - expire sessions:false cause connection loss:false
   [junit4]   2> 103118 INFO  (SocketProxy-Acceptor-40799) [     ] o.a.s.c.s.c.SocketProxy accepted Socket[addr=/127.0.0.1,port=40638,localport=40799], receiveBufferSize:531000
   [junit4]   2> 103119 INFO  (SocketProxy-Acceptor-40799) [     ] o.a.s.c.s.c.SocketProxy proxy connection Socket[addr=/127.0.0.1,port=41695,localport=35974], receiveBufferSize=530904
   [junit4]   2> 103120 INFO  (qtp1966800184-735) [n:127.0.0.1:40799_     ] o.a.s.h.a.CollectionsHandler Invoked Collection Action :create with params collection.configName=conf1&name=collection1&nrtReplicas=1&action=CREATE&numShards=2&createNodeSet=&stateFormat=2&wt=javabin&version=2 and sendToOCPQueue=true
   [junit4]   2> 103125 INFO  (OverseerThreadFactory-192-thread-2-processing-n:127.0.0.1:40799_) [n:127.0.0.1:40799_     ] o.a.s.c.a.c.CreateCollectionCmd Create collection collection1
   [junit4]   2> 103125 INFO  (OverseerCollectionConfigSetProcessor-72393847292231684-127.0.0.1:40799_-n_0000000000) [n:127.0.0.1:40799_     ] o.a.s.c.OverseerTaskQueue Response ZK path: /overseer/collection-queue-work/qnr-0000000000 doesn't exist.  Requestor may have disconnected from ZooKeeper
   [junit4]   2> 103328 WARN  (OverseerThreadFactory-192-thread-2-processing-n:127.0.0.1:40799_) [n:127.0.0.1:40799_     ] o.a.s.c.a.c.CreateCollectionCmd It is unusual to create a collection (collection1) without cores.
   [junit4]   2> 103332 INFO  (qtp1966800184-735) [n:127.0.0.1:40799_     ] o.a.s.h.a.CollectionsHandler Wait for new collection to be active for at most 45 seconds. Check all shard replicas
   [junit4]   2> 103333 INFO  (qtp1966800184-735) [n:127.0.0.1:40799_     ] o.a.s.s.HttpSolrCall [admin] webapp=null path=/admin/collections params={collection.configName=conf1&name=collection1&nrtReplicas=1&action=CREATE&numShards=2&createNodeSet=&stateFormat=2&wt=javabin&version=2} status=0 QTime=212
   [junit4]   2> 103340 INFO  (TEST-LeaderFailoverAfterPartitionTest.test-seed#[BFD2C1D54168B6F]) [     ] o.a.s.c.AbstractFullDistribZkTestBase Creating jetty instances pullReplicaCount=0 numOtherReplicas=3
   [junit4]   2> 103437 INFO  (TEST-LeaderFailoverAfterPartitionTest.test-seed#[BFD2C1D54168B6F]) [     ] o.a.s.c.AbstractFullDistribZkTestBase create jetty 1 in directory /home/jenkins/workspace/Lucene-Solr-master-Linux/solr/build/solr-core/test/J0/temp/solr.cloud.LeaderFailoverAfterPartitionTest_BFD2C1D54168B6F-001/shard-1-001 of type NRT
   [junit4]   2> 103439 WARN  (closeThreadPool-357-thread-1) [     ] o.e.j.s.AbstractConnector Ignoring deprecated socket close linger time
   [junit4]   2> 103439 INFO  (closeThreadPool-357-thread-1) [     ] o.a.s.c.s.e.JettySolrRunner Start Jetty (original configured port=0)
   [junit4]   2> 103439 INFO  (closeThreadPool-357-thread-1) [     ] o.a.s.c.s.e.JettySolrRunner Trying to start Jetty on port 0 try number 1 ...
   [junit4]   2> 103439 INFO  (closeThreadPool-357-thread-1) [     ] o.e.j.s.Server jetty-9.4.14.v20181114; built: 2018-11-14T21:20:31.478Z; git: c4550056e785fb5665914545889f21dc136ad9e6; jvm 11+28
   [junit4]   2> 103462 INFO  (closeThreadPool-357-thread-1) [     ] o.e.j.s.session DefaultSessionIdManager workerName=node0
   [junit4]   2> 103462 INFO  (closeThreadPool-357-thread-1) [     ] o.e.j.s.session No SessionScavenger set, using defaults
   [junit4]   2> 103462 INFO  (closeThreadPool-357-thread-1) [     ] o.e.j.s.session node0 Scavenging every 600000ms
   [junit4]   2> 103463 INFO  (closeThreadPool-357-thread-1) [     ] o.e.j.s.h.ContextHandler Started o.e.j.s.ServletContextHandler@160d15a7{/,null,AVAILABLE}
   [junit4]   2> 103479 INFO  (closeThreadPool-357-thread-1) [     ] o.e.j.s.AbstractConnector Started ServerConnector@3a3abf29{HTTP/1.1,[http/1.1, h2c]}{127.0.0.1:44019}
   [junit4]   2> 103479 INFO  (closeThreadPool-357-thread-1) [     ] o.e.j.s.Server Started @103510ms
   [junit4]   2> 103479 INFO  (closeThreadPool-357-thread-1) [     ] o.a.s.c.s.e.JettySolrRunner Jetty properties: {hostContext=/, solrconfig=solrconfig.xml, solr.data.dir=/home/jenkins/workspace/Lucene-Solr-master-Linux/solr/build/solr-core/test/J0/temp/solr.cloud.LeaderFailoverAfterPartitionTest_BFD2C1D54168B6F-001/tempDir-001/jetty1, hostPort=46189, coreRootDirectory=/home/jenkins/workspace/Lucene-Solr-master-Linux/solr/build/solr-core/test/J0/temp/solr.cloud.LeaderFailoverAfterPartitionTest_BFD2C1D54168B6F-001/shard-1-001/cores}
   [junit4]   2> 103480 ERROR (closeThreadPool-357-thread-1) [     ] o.a.s.u.StartupLoggingUtils Missing Java Option solr.log.dir. Logging may be missing or incomplete.
   [junit4]   2> 103480 INFO  (closeThreadPool-357-thread-1) [     ] o.a.s.s.SolrDispatchFilter Using logger factory org.apache.logging.slf4j.Log4jLoggerFactory
   [junit4]   2> 103480 INFO  (closeThreadPool-357-thread-1) [     ] o.a.s.s.SolrDispatchFilter  ___      _       Welcome to Apache Solr? version 9.0.0
   [junit4]   2> 103480 INFO  (closeThreadPool-357-thread-1) [     ] o.a.s.s.SolrDispatchFilter / __| ___| |_ _   Starting in cloud mode on port null
   [junit4]   2> 103480 INFO  (closeThreadPool-357-thread-1) [     ] o.a.s.s.SolrDispatchFilter \__ \/ _ \ | '_|  Install dir: null
   [junit4]   2> 103480 INFO  (closeThreadPool-357-thread-1) [     ] o.a.s.s.SolrDispatchFilter |___/\___/_|_|    Start time: 2019-06-08T23:11:25.115384Z
   [junit4]   2> 103508 INFO  (closeThreadPool-357-thread-1) [     ] o.a.s.c.c.ConnectionManager Waiting for client to connect to ZooKeeper
   [junit4]   2> 103524 INFO  (zkConnectionManagerCallback-359-thread-1) [     ] o.a.s.c.c.ConnectionManager zkClient has connected
   [junit4]   2> 103524 INFO  (closeThreadPool-357-thread-1) [     ] o.a.s.c.c.ConnectionManager Client is connected to ZooKeeper
   [junit4]   2> 103542 INFO  (TEST-LeaderFailoverAfterPartitionTest.test-seed#[BFD2C1D54168B6F]) [     ] o.a.s.c.AbstractFullDistribZkTestBase create jetty 2 in directory /home/jenkins/workspace/Lucene-Solr-master-Linux/solr/build/solr-core/test/J0/temp/solr.cloud.LeaderF

[...truncated too long message...]

.0.1:36027: ADDREPLICA failed to create replica
   [junit4]    > 	at __randomizedtesting.SeedInfo.seed([BFD2C1D54168B6F]:0)
   [junit4]    > 	at org.apache.solr.client.solrj.impl.HttpSolrClient.executeMethod(HttpSolrClient.java:656)
   [junit4]    > 	at org.apache.solr.client.solrj.impl.HttpSolrClient.request(HttpSolrClient.java:262)
   [junit4]    > 	at org.apache.solr.client.solrj.impl.HttpSolrClient.request(HttpSolrClient.java:245)
   [junit4]    > 	at org.apache.solr.client.solrj.SolrRequest.process(SolrRequest.java:211)
   [junit4]    > 	at org.apache.solr.client.solrj.SolrRequest.process(SolrRequest.java:228)
   [junit4]    > 	at org.apache.solr.cloud.BasicDistributedZkTest.lambda$createCollectionInOneInstance$2(BasicDistributedZkTest.java:760)
   [junit4]    > 	at org.apache.solr.common.util.ExecutorUtil$MDCAwareThreadPoolExecutor.lambda$execute$0(ExecutorUtil.java:209)
   [junit4]    > 	at java.base/java.util.concurrent.ThreadPoolExecutor.runWorker(ThreadPoolExecutor.java:1128)
   [junit4]    > 	at java.base/java.util.concurrent.ThreadPoolExecutor$Worker.run(ThreadPoolExecutor.java:628)
   [junit4]    > 	at java.base/java.lang.Thread.run(Thread.java:834)
   [junit4]   2> 1793409 INFO  (SUITE-UnloadDistributedZkTest-seed#[BFD2C1D54168B6F]-worker) [     ] o.a.s.SolrTestCaseJ4 ------------------------------------------------------- Done waiting for tracked resources to be released
   [junit4]   2> Jun 08, 2019 11:39:35 PM com.carrotsearch.randomizedtesting.ThreadLeakControl checkThreadLeaks
   [junit4]   2> WARNING: Will linger awaiting termination of 1 leaked thread(s).
   [junit4]   2> NOTE: test params are: codec=Lucene80, sim=Asserting(org.apache.lucene.search.similarities.AssertingSimilarity@7a40464d), locale=en-LR, timezone=Canada/Central
   [junit4]   2> NOTE: Linux 4.18.0-17-generic amd64/Oracle Corporation 11 (64-bit)/cpus=8,threads=1,free=314404792,total=429916160
   [junit4]   2> NOTE: All tests run in this JVM: [SimpleCollectionCreateDeleteTest, TestComplexPhraseLeadingWildcard, TestSolrCloudWithSecureImpersonation, TestDelegationWithHadoopAuth, TestHttpShardHandlerFactory, TaggingAttributeTest, ClassificationUpdateProcessorIntegrationTest, TestSolrCoreProperties, LeaderFailoverAfterPartitionTest, UpdateRequestProcessorFactoryTest, StressHdfsTest, QueryResultKeyTest, TestCodecSupport, HdfsTlogReplayBufferedWhileIndexingTest, TestSubQueryTransformerCrossCore, BitVectorTest, SimpleMLTQParserTest, QueryEqualityTest, TestNonDefinedSimilarityFactory, TestSuggestSpellingConverter, TestLeaderElectionZkExpiry, PKIAuthenticationIntegrationTest, TestCloudRecovery, DocValuesMissingTest, AnalysisAfterCoreReloadTest, DistribDocExpirationUpdateProcessorTest, TestStressUserVersions, TestFieldCacheSortRandom, SampleTest, TestConfigSetImmutable, TestCustomSort, SolrSlf4jReporterTest, TestExportWriter, TestLegacyNumericRangeQueryBuilder, TestOverriddenPrefixQueryForCustomFieldType, TestRTimerTree, MoreLikeThisHandlerTest, ConcurrentCreateRoutedAliasTest, TestRequestStatusCollectionAPI, PeerSyncWithBufferUpdatesTest, BlockDirectoryTest, TestXIncludeConfig, JvmMetricsTest, TestJettySolrRunner, PeerSyncReplicationTest, TestChildDocTransformer, MetricUtilsTest, DeleteLastCustomShardedReplicaTest, NumericFieldsTest, SolrMetricManagerTest, SharedFSAutoReplicaFailoverTest, TestRawTransformer, TestPseudoReturnFields, FieldMutatingUpdateProcessorTest, TestLegacyTerms, OverseerStatusTest, TestSimTriggerIntegration, TestSmileRequest, CreateCollectionCleanupTest, CursorPagingTest, SubstringBytesRefFilterTest, MetricsHandlerTest, BooleanFieldTest, TestStressLiveNodes, TestDFISimilarityFactory, TestReplicationHandlerDiskOverFlow, ReturnFieldsTest, TestFieldCollectionResource, TestManagedResourceStorage, ScheduledTriggerIntegrationTest, TestUninvertingReader, RulesTest, TestPostingsSolrHighlighter, TestExtendedDismaxParser, TestDistributedMissingSort, TestSimDistribStateManager, SpellCheckComponentTest, HttpSolrCallGetCoreTest, ZkShardTermsTest, AdminHandlersProxyTest, TestNestedUpdateProcessor, TestSolrDeletionPolicy2, TestMergePolicyConfig, TestConfigSetsAPIZkFailure, TestSegmentSorting, TestIntervalFaceting, UnloadDistributedZkTest]
   [junit4] Completed [739/861 (7!)] on J0 in 88.96s, 1 test, 1 error <<< FAILURES!

[...truncated 49279 lines...]
-ecj-javadoc-lint-tests:
    [mkdir] Created dir: /tmp/ecj673367070
 [ecj-lint] Compiling 48 source files to /tmp/ecj673367070
 [ecj-lint] invalid Class-Path header in manifest of jar file: /home/jenkins/.ivy2/cache/org.restlet.jee/org.restlet/jars/org.restlet-2.3.0.jar
 [ecj-lint] invalid Class-Path header in manifest of jar file: /home/jenkins/.ivy2/cache/org.restlet.jee/org.restlet.ext.servlet/jars/org.restlet.ext.servlet-2.3.0.jar
 [ecj-lint] ----------
 [ecj-lint] 1. ERROR in /home/jenkins/workspace/Lucene-Solr-master-Linux/solr/contrib/dataimporthandler/src/test/org/apache/solr/handler/dataimport/MockInitialContextFactory.java (at line 23)
 [ecj-lint] 	import javax.naming.NamingException;
 [ecj-lint] 	       ^^^^^^^^^^^^^^^^^^^^^^^^^^^^
 [ecj-lint] The type javax.naming.NamingException is not accessible
 [ecj-lint] ----------
 [ecj-lint] 2. ERROR in /home/jenkins/workspace/Lucene-Solr-master-Linux/solr/contrib/dataimporthandler/src/test/org/apache/solr/handler/dataimport/MockInitialContextFactory.java (at line 28)
 [ecj-lint] 	public class MockInitialContextFactory implements InitialContextFactory {
 [ecj-lint] 	             ^^^^^^^^^^^^^^^^^^^^^^^^^
 [ecj-lint] The type MockInitialContextFactory must implement the inherited abstract method InitialContextFactory.getInitialContext(Hashtable<?,?>)
 [ecj-lint] ----------
 [ecj-lint] 3. ERROR in /home/jenkins/workspace/Lucene-Solr-master-Linux/solr/contrib/dataimporthandler/src/test/org/apache/solr/handler/dataimport/MockInitialContextFactory.java (at line 30)
 [ecj-lint] 	private final javax.naming.Context context;
 [ecj-lint] 	              ^^^^^^^^^^^^^^^^^^^^
 [ecj-lint] The type javax.naming.Context is not accessible
 [ecj-lint] ----------
 [ecj-lint] 4. ERROR in /home/jenkins/workspace/Lucene-Solr-master-Linux/solr/contrib/dataimporthandler/src/test/org/apache/solr/handler/dataimport/MockInitialContextFactory.java (at line 33)
 [ecj-lint] 	context = mock(javax.naming.Context.class);
 [ecj-lint] 	^^^^^^^
 [ecj-lint] context cannot be resolved to a variable
 [ecj-lint] ----------
 [ecj-lint] 5. ERROR in /home/jenkins/workspace/Lucene-Solr-master-Linux/solr/contrib/dataimporthandler/src/test/org/apache/solr/handler/dataimport/MockInitialContextFactory.java (at line 33)
 [ecj-lint] 	context = mock(javax.naming.Context.class);
 [ecj-lint] 	               ^^^^^^^^^^^^^^^^^^^^
 [ecj-lint] The type javax.naming.Context is not accessible
 [ecj-lint] ----------
 [ecj-lint] 6. ERROR in /home/jenkins/workspace/Lucene-Solr-master-Linux/solr/contrib/dataimporthandler/src/test/org/apache/solr/handler/dataimport/MockInitialContextFactory.java (at line 36)
 [ecj-lint] 	when(context.lookup(anyString())).thenAnswer(invocation -> objects.get(invocation.getArgument(0)));
 [ecj-lint] 	     ^^^^^^^
 [ecj-lint] context cannot be resolved
 [ecj-lint] ----------
 [ecj-lint] 7. ERROR in /home/jenkins/workspace/Lucene-Solr-master-Linux/solr/contrib/dataimporthandler/src/test/org/apache/solr/handler/dataimport/MockInitialContextFactory.java (at line 38)
 [ecj-lint] 	} catch (NamingException e) {
 [ecj-lint] 	         ^^^^^^^^^^^^^^^
 [ecj-lint] NamingException cannot be resolved to a type
 [ecj-lint] ----------
 [ecj-lint] 8. ERROR in /home/jenkins/workspace/Lucene-Solr-master-Linux/solr/contrib/dataimporthandler/src/test/org/apache/solr/handler/dataimport/MockInitialContextFactory.java (at line 45)
 [ecj-lint] 	public javax.naming.Context getInitialContext(Hashtable env) {
 [ecj-lint] 	       ^^^^^^^^^^^^^^^^^^^^
 [ecj-lint] The type javax.naming.Context is not accessible
 [ecj-lint] ----------
 [ecj-lint] 9. ERROR in /home/jenkins/workspace/Lucene-Solr-master-Linux/solr/contrib/dataimporthandler/src/test/org/apache/solr/handler/dataimport/MockInitialContextFactory.java (at line 46)
 [ecj-lint] 	return context;
 [ecj-lint] 	       ^^^^^^^
 [ecj-lint] context cannot be resolved to a variable
 [ecj-lint] ----------
 [ecj-lint] 9 problems (9 errors)

BUILD FAILED
/home/jenkins/workspace/Lucene-Solr-master-Linux/build.xml:634: The following error occurred while executing this line:
/home/jenkins/workspace/Lucene-Solr-master-Linux/build.xml:101: The following error occurred while executing this line:
/home/jenkins/workspace/Lucene-Solr-master-Linux/solr/build.xml:651: The following error occurred while executing this line:
/home/jenkins/workspace/Lucene-Solr-master-Linux/solr/common-build.xml:479: The following error occurred while executing this line:
/home/jenkins/workspace/Lucene-Solr-master-Linux/lucene/common-build.xml:2015: The following error occurred while executing this line:
/home/jenkins/workspace/Lucene-Solr-master-Linux/lucene/common-build.xml:2048: Compile failed; see the compiler error output for details.

Total time: 96 minutes 34 seconds
Build step 'Invoke Ant' marked build as failure
Archiving artifacts
Setting ANT_1_8_2_HOME=/home/jenkins/tools/hudson.tasks.Ant_AntInstallation/ANT_1.8.2
[WARNINGS] Skipping publisher since build result is FAILURE
Recording test results
Setting ANT_1_8_2_HOME=/home/jenkins/tools/hudson.tasks.Ant_AntInstallation/ANT_1.8.2
Email was triggered for: Failure - Any
Sending email for trigger: Failure - Any
Setting ANT_1_8_2_HOME=/home/jenkins/tools/hudson.tasks.Ant_AntInstallation/ANT_1.8.2
Setting ANT_1_8_2_HOME=/home/jenkins/tools/hudson.tasks.Ant_AntInstallation/ANT_1.8.2
Setting ANT_1_8_2_HOME=/home/jenkins/tools/hudson.tasks.Ant_AntInstallation/ANT_1.8.2
Setting ANT_1_8_2_HOME=/home/jenkins/tools/hudson.tasks.Ant_AntInstallation/ANT_1.8.2
Setting ANT_1_8_2_HOME=/home/jenkins/tools/hudson.tasks.Ant_AntInstallation/ANT_1.8.2
Setting ANT_1_8_2_HOME=/home/jenkins/tools/hudson.tasks.Ant_AntInstallation/ANT_1.8.2

Mime
View raw message