lucene-dev mailing list archives

Site index · List index
Message view « Date » · « Thread »
Top « Date » · « Thread »
From Jan Høydahl <jan....@cominvent.com>
Subject Re: [JENKINS] Lucene-Solr-8.1-Linux (64bit/jdk-11.0.2) - Build # 391 - Still Unstable!
Date Thu, 06 Jun 2019 13:55:08 GMT
I think this test needs to be BadApple’d now?

Jan Høydahl

> 6. jun. 2019 kl. 13:38 skrev Policeman Jenkins Server <jenkins@thetaphi.de>:
> 
> Build: https://jenkins.thetaphi.de/job/Lucene-Solr-8.1-Linux/391/
> Java: 64bit/jdk-11.0.2 -XX:-UseCompressedOops -XX:+UseConcMarkSweepGC
> 
> 9 tests failed.
> FAILED:  org.apache.solr.security.BasicAuthIntegrationTest.testBasicAuth
> 
> Error Message:
> Expected metric minimums for prefix SECURITY./authentication.: {failMissingCredentials=2, authenticated=19, passThrough=9, failWrongCredentials=1, requests=31, errors=0}, but got: {failMissingCredentials=2, authenticated=16, passThrough=11, totalTime=9122740, failWrongCredentials=1, requestTimes=1258, requests=30, errors=0}
> 
> Stack Trace:
> java.lang.AssertionError: Expected metric minimums for prefix SECURITY./authentication.: {failMissingCredentials=2, authenticated=19, passThrough=9, failWrongCredentials=1, requests=31, errors=0}, but got: {failMissingCredentials=2, authenticated=16, passThrough=11, totalTime=9122740, failWrongCredentials=1, requestTimes=1258, requests=30, errors=0}
>    at __randomizedtesting.SeedInfo.seed([B3A7C371A669098D:FC9B563023A8AF7]:0)
>    at org.junit.Assert.fail(Assert.java:88)
>    at org.junit.Assert.assertTrue(Assert.java:41)
>    at org.apache.solr.cloud.SolrCloudAuthTestCase.assertAuthMetricsMinimums(SolrCloudAuthTestCase.java:129)
>    at org.apache.solr.cloud.SolrCloudAuthTestCase.assertAuthMetricsMinimums(SolrCloudAuthTestCase.java:83)
>    at org.apache.solr.security.BasicAuthIntegrationTest.testBasicAuth(BasicAuthIntegrationTest.java:306)
>    at java.base/jdk.internal.reflect.NativeMethodAccessorImpl.invoke0(Native Method)
>    at java.base/jdk.internal.reflect.NativeMethodAccessorImpl.invoke(NativeMethodAccessorImpl.java:62)
>    at java.base/jdk.internal.reflect.DelegatingMethodAccessorImpl.invoke(DelegatingMethodAccessorImpl.java:43)
>    at java.base/java.lang.reflect.Method.invoke(Method.java:566)
>    at com.carrotsearch.randomizedtesting.RandomizedRunner.invoke(RandomizedRunner.java:1750)
>    at com.carrotsearch.randomizedtesting.RandomizedRunner$8.evaluate(RandomizedRunner.java:938)
>    at com.carrotsearch.randomizedtesting.RandomizedRunner$9.evaluate(RandomizedRunner.java:974)
>    at com.carrotsearch.randomizedtesting.RandomizedRunner$10.evaluate(RandomizedRunner.java:988)
>    at com.carrotsearch.randomizedtesting.rules.SystemPropertiesRestoreRule$1.evaluate(SystemPropertiesRestoreRule.java:57)
>    at org.apache.lucene.util.TestRuleSetupTeardownChained$1.evaluate(TestRuleSetupTeardownChained.java:49)
>    at org.apache.lucene.util.AbstractBeforeAfterRule$1.evaluate(AbstractBeforeAfterRule.java:45)
>    at org.apache.lucene.util.TestRuleThreadAndTestName$1.evaluate(TestRuleThreadAndTestName.java:48)
>    at org.apache.lucene.util.TestRuleIgnoreAfterMaxFailures$1.evaluate(TestRuleIgnoreAfterMaxFailures.java:64)
>    at org.apache.lucene.util.TestRuleMarkFailure$1.evaluate(TestRuleMarkFailure.java:47)
>    at com.carrotsearch.randomizedtesting.rules.StatementAdapter.evaluate(StatementAdapter.java:36)
>    at com.carrotsearch.randomizedtesting.ThreadLeakControl$StatementRunner.run(ThreadLeakControl.java:368)
>    at com.carrotsearch.randomizedtesting.ThreadLeakControl.forkTimeoutingTask(ThreadLeakControl.java:817)
>    at com.carrotsearch.randomizedtesting.ThreadLeakControl$3.evaluate(ThreadLeakControl.java:468)
>    at com.carrotsearch.randomizedtesting.RandomizedRunner.runSingleTest(RandomizedRunner.java:947)
>    at com.carrotsearch.randomizedtesting.RandomizedRunner$5.evaluate(RandomizedRunner.java:832)
>    at com.carrotsearch.randomizedtesting.RandomizedRunner$6.evaluate(RandomizedRunner.java:883)
>    at com.carrotsearch.randomizedtesting.RandomizedRunner$7.evaluate(RandomizedRunner.java:894)
>    at com.carrotsearch.randomizedtesting.rules.StatementAdapter.evaluate(StatementAdapter.java:36)
>    at com.carrotsearch.randomizedtesting.rules.SystemPropertiesRestoreRule$1.evaluate(SystemPropertiesRestoreRule.java:57)
>    at org.apache.lucene.util.AbstractBeforeAfterRule$1.evaluate(AbstractBeforeAfterRule.java:45)
>    at com.carrotsearch.randomizedtesting.rules.StatementAdapter.evaluate(StatementAdapter.java:36)
>    at org.apache.lucene.util.TestRuleStoreClassName$1.evaluate(TestRuleStoreClassName.java:41)
>    at com.carrotsearch.randomizedtesting.rules.NoShadowingOrOverridesOnMethodsRule$1.evaluate(NoShadowingOrOverridesOnMethodsRule.java:40)
>    at com.carrotsearch.randomizedtesting.rules.NoShadowingOrOverridesOnMethodsRule$1.evaluate(NoShadowingOrOverridesOnMethodsRule.java:40)
>    at com.carrotsearch.randomizedtesting.rules.StatementAdapter.evaluate(StatementAdapter.java:36)
>    at com.carrotsearch.randomizedtesting.rules.StatementAdapter.evaluate(StatementAdapter.java:36)
>    at org.apache.lucene.util.TestRuleAssertionsRequired$1.evaluate(TestRuleAssertionsRequired.java:53)
>    at org.apache.lucene.util.TestRuleMarkFailure$1.evaluate(TestRuleMarkFailure.java:47)
>    at org.apache.lucene.util.TestRuleIgnoreAfterMaxFailures$1.evaluate(TestRuleIgnoreAfterMaxFailures.java:64)
>    at org.apache.lucene.util.TestRuleIgnoreTestSuites$1.evaluate(TestRuleIgnoreTestSuites.java:54)
>    at com.carrotsearch.randomizedtesting.rules.StatementAdapter.evaluate(StatementAdapter.java:36)
>    at com.carrotsearch.randomizedtesting.ThreadLeakControl$StatementRunner.run(ThreadLeakControl.java:368)
>    at java.base/java.lang.Thread.run(Thread.java:834)
> 
> 
> FAILED:  org.apache.solr.security.BasicAuthIntegrationTest.testBasicAuth
> 
> Error Message:
> Expected metric minimums for prefix SECURITY./authentication.: {failMissingCredentials=2, authenticated=19, passThrough=9, failWrongCredentials=1, requests=31, errors=0}, but got: {failMissingCredentials=2, authenticated=16, passThrough=10, totalTime=3671810, failWrongCredentials=1, requestTimes=1763, requests=29, errors=0}
> 
> Stack Trace:
> java.lang.AssertionError: Expected metric minimums for prefix SECURITY./authentication.: {failMissingCredentials=2, authenticated=19, passThrough=9, failWrongCredentials=1, requests=31, errors=0}, but got: {failMissingCredentials=2, authenticated=16, passThrough=10, totalTime=3671810, failWrongCredentials=1, requestTimes=1763, requests=29, errors=0}
>    at __randomizedtesting.SeedInfo.seed([B3A7C371A669098D:FC9B563023A8AF7]:0)
>    at org.junit.Assert.fail(Assert.java:88)
>    at org.junit.Assert.assertTrue(Assert.java:41)
>    at org.apache.solr.cloud.SolrCloudAuthTestCase.assertAuthMetricsMinimums(SolrCloudAuthTestCase.java:129)
>    at org.apache.solr.cloud.SolrCloudAuthTestCase.assertAuthMetricsMinimums(SolrCloudAuthTestCase.java:83)
>    at org.apache.solr.security.BasicAuthIntegrationTest.testBasicAuth(BasicAuthIntegrationTest.java:306)
>    at java.base/jdk.internal.reflect.NativeMethodAccessorImpl.invoke0(Native Method)
>    at java.base/jdk.internal.reflect.NativeMethodAccessorImpl.invoke(NativeMethodAccessorImpl.java:62)
>    at java.base/jdk.internal.reflect.DelegatingMethodAccessorImpl.invoke(DelegatingMethodAccessorImpl.java:43)
>    at java.base/java.lang.reflect.Method.invoke(Method.java:566)
>    at com.carrotsearch.randomizedtesting.RandomizedRunner.invoke(RandomizedRunner.java:1750)
>    at com.carrotsearch.randomizedtesting.RandomizedRunner$8.evaluate(RandomizedRunner.java:938)
>    at com.carrotsearch.randomizedtesting.RandomizedRunner$9.evaluate(RandomizedRunner.java:974)
>    at com.carrotsearch.randomizedtesting.RandomizedRunner$10.evaluate(RandomizedRunner.java:988)
>    at com.carrotsearch.randomizedtesting.rules.SystemPropertiesRestoreRule$1.evaluate(SystemPropertiesRestoreRule.java:57)
>    at org.apache.lucene.util.TestRuleSetupTeardownChained$1.evaluate(TestRuleSetupTeardownChained.java:49)
>    at org.apache.lucene.util.AbstractBeforeAfterRule$1.evaluate(AbstractBeforeAfterRule.java:45)
>    at org.apache.lucene.util.TestRuleThreadAndTestName$1.evaluate(TestRuleThreadAndTestName.java:48)
>    at org.apache.lucene.util.TestRuleIgnoreAfterMaxFailures$1.evaluate(TestRuleIgnoreAfterMaxFailures.java:64)
>    at org.apache.lucene.util.TestRuleMarkFailure$1.evaluate(TestRuleMarkFailure.java:47)
>    at com.carrotsearch.randomizedtesting.rules.StatementAdapter.evaluate(StatementAdapter.java:36)
>    at com.carrotsearch.randomizedtesting.ThreadLeakControl$StatementRunner.run(ThreadLeakControl.java:368)
>    at com.carrotsearch.randomizedtesting.ThreadLeakControl.forkTimeoutingTask(ThreadLeakControl.java:817)
>    at com.carrotsearch.randomizedtesting.ThreadLeakControl$3.evaluate(ThreadLeakControl.java:468)
>    at com.carrotsearch.randomizedtesting.RandomizedRunner.runSingleTest(RandomizedRunner.java:947)
>    at com.carrotsearch.randomizedtesting.RandomizedRunner$5.evaluate(RandomizedRunner.java:832)
>    at com.carrotsearch.randomizedtesting.RandomizedRunner$6.evaluate(RandomizedRunner.java:883)
>    at com.carrotsearch.randomizedtesting.RandomizedRunner$7.evaluate(RandomizedRunner.java:894)
>    at com.carrotsearch.randomizedtesting.rules.StatementAdapter.evaluate(StatementAdapter.java:36)
>    at com.carrotsearch.randomizedtesting.rules.SystemPropertiesRestoreRule$1.evaluate(SystemPropertiesRestoreRule.java:57)
>    at org.apache.lucene.util.AbstractBeforeAfterRule$1.evaluate(AbstractBeforeAfterRule.java:45)
>    at com.carrotsearch.randomizedtesting.rules.StatementAdapter.evaluate(StatementAdapter.java:36)
>    at org.apache.lucene.util.TestRuleStoreClassName$1.evaluate(TestRuleStoreClassName.java:41)
>    at com.carrotsearch.randomizedtesting.rules.NoShadowingOrOverridesOnMethodsRule$1.evaluate(NoShadowingOrOverridesOnMethodsRule.java:40)
>    at com.carrotsearch.randomizedtesting.rules.NoShadowingOrOverridesOnMethodsRule$1.evaluate(NoShadowingOrOverridesOnMethodsRule.java:40)
>    at com.carrotsearch.randomizedtesting.rules.StatementAdapter.evaluate(StatementAdapter.java:36)
>    at com.carrotsearch.randomizedtesting.rules.StatementAdapter.evaluate(StatementAdapter.java:36)
>    at org.apache.lucene.util.TestRuleAssertionsRequired$1.evaluate(TestRuleAssertionsRequired.java:53)
>    at org.apache.lucene.util.TestRuleMarkFailure$1.evaluate(TestRuleMarkFailure.java:47)
>    at org.apache.lucene.util.TestRuleIgnoreAfterMaxFailures$1.evaluate(TestRuleIgnoreAfterMaxFailures.java:64)
>    at org.apache.lucene.util.TestRuleIgnoreTestSuites$1.evaluate(TestRuleIgnoreTestSuites.java:54)
>    at com.carrotsearch.randomizedtesting.rules.StatementAdapter.evaluate(StatementAdapter.java:36)
>    at com.carrotsearch.randomizedtesting.ThreadLeakControl$StatementRunner.run(ThreadLeakControl.java:368)
>    at java.base/java.lang.Thread.run(Thread.java:834)
> 
> 
> FAILED:  org.apache.solr.security.BasicAuthIntegrationTest.testBasicAuth
> 
> Error Message:
> Expected metric minimums for prefix SECURITY./authentication.: {failMissingCredentials=2, authenticated=19, passThrough=9, failWrongCredentials=1, requests=31, errors=0}, but got: {failMissingCredentials=2, authenticated=16, passThrough=10, totalTime=3466326, failWrongCredentials=1, requestTimes=1855, requests=29, errors=0}
> 
> Stack Trace:
> java.lang.AssertionError: Expected metric minimums for prefix SECURITY./authentication.: {failMissingCredentials=2, authenticated=19, passThrough=9, failWrongCredentials=1, requests=31, errors=0}, but got: {failMissingCredentials=2, authenticated=16, passThrough=10, totalTime=3466326, failWrongCredentials=1, requestTimes=1855, requests=29, errors=0}
>    at __randomizedtesting.SeedInfo.seed([B3A7C371A669098D:FC9B563023A8AF7]:0)
>    at org.junit.Assert.fail(Assert.java:88)
>    at org.junit.Assert.assertTrue(Assert.java:41)
>    at org.apache.solr.cloud.SolrCloudAuthTestCase.assertAuthMetricsMinimums(SolrCloudAuthTestCase.java:129)
>    at org.apache.solr.cloud.SolrCloudAuthTestCase.assertAuthMetricsMinimums(SolrCloudAuthTestCase.java:83)
>    at org.apache.solr.security.BasicAuthIntegrationTest.testBasicAuth(BasicAuthIntegrationTest.java:306)
>    at java.base/jdk.internal.reflect.NativeMethodAccessorImpl.invoke0(Native Method)
>    at java.base/jdk.internal.reflect.NativeMethodAccessorImpl.invoke(NativeMethodAccessorImpl.java:62)
>    at java.base/jdk.internal.reflect.DelegatingMethodAccessorImpl.invoke(DelegatingMethodAccessorImpl.java:43)
>    at java.base/java.lang.reflect.Method.invoke(Method.java:566)
>    at com.carrotsearch.randomizedtesting.RandomizedRunner.invoke(RandomizedRunner.java:1750)
>    at com.carrotsearch.randomizedtesting.RandomizedRunner$8.evaluate(RandomizedRunner.java:938)
>    at com.carrotsearch.randomizedtesting.RandomizedRunner$9.evaluate(RandomizedRunner.java:974)
>    at com.carrotsearch.randomizedtesting.RandomizedRunner$10.evaluate(RandomizedRunner.java:988)
>    at com.carrotsearch.randomizedtesting.rules.SystemPropertiesRestoreRule$1.evaluate(SystemPropertiesRestoreRule.java:57)
>    at org.apache.lucene.util.TestRuleSetupTeardownChained$1.evaluate(TestRuleSetupTeardownChained.java:49)
>    at org.apache.lucene.util.AbstractBeforeAfterRule$1.evaluate(AbstractBeforeAfterRule.java:45)
>    at org.apache.lucene.util.TestRuleThreadAndTestName$1.evaluate(TestRuleThreadAndTestName.java:48)
>    at org.apache.lucene.util.TestRuleIgnoreAfterMaxFailures$1.evaluate(TestRuleIgnoreAfterMaxFailures.java:64)
>    at org.apache.lucene.util.TestRuleMarkFailure$1.evaluate(TestRuleMarkFailure.java:47)
>    at com.carrotsearch.randomizedtesting.rules.StatementAdapter.evaluate(StatementAdapter.java:36)
>    at com.carrotsearch.randomizedtesting.ThreadLeakControl$StatementRunner.run(ThreadLeakControl.java:368)
>    at com.carrotsearch.randomizedtesting.ThreadLeakControl.forkTimeoutingTask(ThreadLeakControl.java:817)
>    at com.carrotsearch.randomizedtesting.ThreadLeakControl$3.evaluate(ThreadLeakControl.java:468)
>    at com.carrotsearch.randomizedtesting.RandomizedRunner.runSingleTest(RandomizedRunner.java:947)
>    at com.carrotsearch.randomizedtesting.RandomizedRunner$5.evaluate(RandomizedRunner.java:832)
>    at com.carrotsearch.randomizedtesting.RandomizedRunner$6.evaluate(RandomizedRunner.java:883)
>    at com.carrotsearch.randomizedtesting.RandomizedRunner$7.evaluate(RandomizedRunner.java:894)
>    at com.carrotsearch.randomizedtesting.rules.StatementAdapter.evaluate(StatementAdapter.java:36)
>    at com.carrotsearch.randomizedtesting.rules.SystemPropertiesRestoreRule$1.evaluate(SystemPropertiesRestoreRule.java:57)
>    at org.apache.lucene.util.AbstractBeforeAfterRule$1.evaluate(AbstractBeforeAfterRule.java:45)
>    at com.carrotsearch.randomizedtesting.rules.StatementAdapter.evaluate(StatementAdapter.java:36)
>    at org.apache.lucene.util.TestRuleStoreClassName$1.evaluate(TestRuleStoreClassName.java:41)
>    at com.carrotsearch.randomizedtesting.rules.NoShadowingOrOverridesOnMethodsRule$1.evaluate(NoShadowingOrOverridesOnMethodsRule.java:40)
>    at com.carrotsearch.randomizedtesting.rules.NoShadowingOrOverridesOnMethodsRule$1.evaluate(NoShadowingOrOverridesOnMethodsRule.java:40)
>    at com.carrotsearch.randomizedtesting.rules.StatementAdapter.evaluate(StatementAdapter.java:36)
>    at com.carrotsearch.randomizedtesting.rules.StatementAdapter.evaluate(StatementAdapter.java:36)
>    at org.apache.lucene.util.TestRuleAssertionsRequired$1.evaluate(TestRuleAssertionsRequired.java:53)
>    at org.apache.lucene.util.TestRuleMarkFailure$1.evaluate(TestRuleMarkFailure.java:47)
>    at org.apache.lucene.util.TestRuleIgnoreAfterMaxFailures$1.evaluate(TestRuleIgnoreAfterMaxFailures.java:64)
>    at org.apache.lucene.util.TestRuleIgnoreTestSuites$1.evaluate(TestRuleIgnoreTestSuites.java:54)
>    at com.carrotsearch.randomizedtesting.rules.StatementAdapter.evaluate(StatementAdapter.java:36)
>    at com.carrotsearch.randomizedtesting.ThreadLeakControl$StatementRunner.run(ThreadLeakControl.java:368)
>    at java.base/java.lang.Thread.run(Thread.java:834)
> 
> 
> FAILED:  org.apache.solr.security.BasicAuthIntegrationTest.testBasicAuth
> 
> Error Message:
> Expected metric minimums for prefix SECURITY./authentication.: {failMissingCredentials=2, authenticated=19, passThrough=9, failWrongCredentials=1, requests=31, errors=0}, but got: {failMissingCredentials=2, authenticated=17, passThrough=12, totalTime=6454094, failWrongCredentials=1, requestTimes=1691, requests=32, errors=0}
> 
> Stack Trace:
> java.lang.AssertionError: Expected metric minimums for prefix SECURITY./authentication.: {failMissingCredentials=2, authenticated=19, passThrough=9, failWrongCredentials=1, requests=31, errors=0}, but got: {failMissingCredentials=2, authenticated=17, passThrough=12, totalTime=6454094, failWrongCredentials=1, requestTimes=1691, requests=32, errors=0}
>    at __randomizedtesting.SeedInfo.seed([B3A7C371A669098D:FC9B563023A8AF7]:0)
>    at org.junit.Assert.fail(Assert.java:88)
>    at org.junit.Assert.assertTrue(Assert.java:41)
>    at org.apache.solr.cloud.SolrCloudAuthTestCase.assertAuthMetricsMinimums(SolrCloudAuthTestCase.java:129)
>    at org.apache.solr.cloud.SolrCloudAuthTestCase.assertAuthMetricsMinimums(SolrCloudAuthTestCase.java:83)
>    at org.apache.solr.security.BasicAuthIntegrationTest.testBasicAuth(BasicAuthIntegrationTest.java:306)
>    at java.base/jdk.internal.reflect.NativeMethodAccessorImpl.invoke0(Native Method)
>    at java.base/jdk.internal.reflect.NativeMethodAccessorImpl.invoke(NativeMethodAccessorImpl.java:62)
>    at java.base/jdk.internal.reflect.DelegatingMethodAccessorImpl.invoke(DelegatingMethodAccessorImpl.java:43)
>    at java.base/java.lang.reflect.Method.invoke(Method.java:566)
>    at com.carrotsearch.randomizedtesting.RandomizedRunner.invoke(RandomizedRunner.java:1750)
>    at com.carrotsearch.randomizedtesting.RandomizedRunner$8.evaluate(RandomizedRunner.java:938)
>    at com.carrotsearch.randomizedtesting.RandomizedRunner$9.evaluate(RandomizedRunner.java:974)
>    at com.carrotsearch.randomizedtesting.RandomizedRunner$10.evaluate(RandomizedRunner.java:988)
>    at com.carrotsearch.randomizedtesting.rules.SystemPropertiesRestoreRule$1.evaluate(SystemPropertiesRestoreRule.java:57)
>    at org.apache.lucene.util.TestRuleSetupTeardownChained$1.evaluate(TestRuleSetupTeardownChained.java:49)
>    at org.apache.lucene.util.AbstractBeforeAfterRule$1.evaluate(AbstractBeforeAfterRule.java:45)
>    at org.apache.lucene.util.TestRuleThreadAndTestName$1.evaluate(TestRuleThreadAndTestName.java:48)
>    at org.apache.lucene.util.TestRuleIgnoreAfterMaxFailures$1.evaluate(TestRuleIgnoreAfterMaxFailures.java:64)
>    at org.apache.lucene.util.TestRuleMarkFailure$1.evaluate(TestRuleMarkFailure.java:47)
>    at com.carrotsearch.randomizedtesting.rules.StatementAdapter.evaluate(StatementAdapter.java:36)
>    at com.carrotsearch.randomizedtesting.ThreadLeakControl$StatementRunner.run(ThreadLeakControl.java:368)
>    at com.carrotsearch.randomizedtesting.ThreadLeakControl.forkTimeoutingTask(ThreadLeakControl.java:817)
>    at com.carrotsearch.randomizedtesting.ThreadLeakControl$3.evaluate(ThreadLeakControl.java:468)
>    at com.carrotsearch.randomizedtesting.RandomizedRunner.runSingleTest(RandomizedRunner.java:947)
>    at com.carrotsearch.randomizedtesting.RandomizedRunner$5.evaluate(RandomizedRunner.java:832)
>    at com.carrotsearch.randomizedtesting.RandomizedRunner$6.evaluate(RandomizedRunner.java:883)
>    at com.carrotsearch.randomizedtesting.RandomizedRunner$7.evaluate(RandomizedRunner.java:894)
>    at com.carrotsearch.randomizedtesting.rules.StatementAdapter.evaluate(StatementAdapter.java:36)
>    at com.carrotsearch.randomizedtesting.rules.SystemPropertiesRestoreRule$1.evaluate(SystemPropertiesRestoreRule.java:57)
>    at org.apache.lucene.util.AbstractBeforeAfterRule$1.evaluate(AbstractBeforeAfterRule.java:45)
>    at com.carrotsearch.randomizedtesting.rules.StatementAdapter.evaluate(StatementAdapter.java:36)
>    at org.apache.lucene.util.TestRuleStoreClassName$1.evaluate(TestRuleStoreClassName.java:41)
>    at com.carrotsearch.randomizedtesting.rules.NoShadowingOrOverridesOnMethodsRule$1.evaluate(NoShadowingOrOverridesOnMethodsRule.java:40)
>    at com.carrotsearch.randomizedtesting.rules.NoShadowingOrOverridesOnMethodsRule$1.evaluate(NoShadowingOrOverridesOnMethodsRule.java:40)
>    at com.carrotsearch.randomizedtesting.rules.StatementAdapter.evaluate(StatementAdapter.java:36)
>    at com.carrotsearch.randomizedtesting.rules.StatementAdapter.evaluate(StatementAdapter.java:36)
>    at org.apache.lucene.util.TestRuleAssertionsRequired$1.evaluate(TestRuleAssertionsRequired.java:53)
>    at org.apache.lucene.util.TestRuleMarkFailure$1.evaluate(TestRuleMarkFailure.java:47)
>    at org.apache.lucene.util.TestRuleIgnoreAfterMaxFailures$1.evaluate(TestRuleIgnoreAfterMaxFailures.java:64)
>    at org.apache.lucene.util.TestRuleIgnoreTestSuites$1.evaluate(TestRuleIgnoreTestSuites.java:54)
>    at com.carrotsearch.randomizedtesting.rules.StatementAdapter.evaluate(StatementAdapter.java:36)
>    at com.carrotsearch.randomizedtesting.ThreadLeakControl$StatementRunner.run(ThreadLeakControl.java:368)
>    at java.base/java.lang.Thread.run(Thread.java:834)
> 
> 
> FAILED:  org.apache.solr.security.JWTAuthPluginIntegrationTest.createCollectionUpdateAndQueryDistributed
> 
> Error Message:
> Expected metric minimums for prefix SECURITY./authentication.: {failMissingCredentials=0, authenticated=3, passThrough=0, failWrongCredentials=0, requests=3, errors=0}, but got: {failMissingCredentials=0, authenticated=2, passThrough=0, totalTime=22158698, failWrongCredentials=0, requestTimes=164, requests=2, errors=0}
> 
> Stack Trace:
> java.lang.AssertionError: Expected metric minimums for prefix SECURITY./authentication.: {failMissingCredentials=0, authenticated=3, passThrough=0, failWrongCredentials=0, requests=3, errors=0}, but got: {failMissingCredentials=0, authenticated=2, passThrough=0, totalTime=22158698, failWrongCredentials=0, requestTimes=164, requests=2, errors=0}
>    at __randomizedtesting.SeedInfo.seed([B3A7C371A669098D:B58FC11FC4DE9F3E]:0)
>    at org.junit.Assert.fail(Assert.java:88)
>    at org.junit.Assert.assertTrue(Assert.java:41)
>    at org.apache.solr.cloud.SolrCloudAuthTestCase.assertAuthMetricsMinimums(SolrCloudAuthTestCase.java:129)
>    at org.apache.solr.cloud.SolrCloudAuthTestCase.assertAuthMetricsMinimums(SolrCloudAuthTestCase.java:83)
>    at org.apache.solr.security.JWTAuthPluginIntegrationTest.createCollectionUpdateAndQueryDistributed(JWTAuthPluginIntegrationTest.java:176)
>    at java.base/jdk.internal.reflect.NativeMethodAccessorImpl.invoke0(Native Method)
>    at java.base/jdk.internal.reflect.NativeMethodAccessorImpl.invoke(NativeMethodAccessorImpl.java:62)
>    at java.base/jdk.internal.reflect.DelegatingMethodAccessorImpl.invoke(DelegatingMethodAccessorImpl.java:43)
>    at java.base/java.lang.reflect.Method.invoke(Method.java:566)
>    at com.carrotsearch.randomizedtesting.RandomizedRunner.invoke(RandomizedRunner.java:1750)
>    at com.carrotsearch.randomizedtesting.RandomizedRunner$8.evaluate(RandomizedRunner.java:938)
>    at com.carrotsearch.randomizedtesting.RandomizedRunner$9.evaluate(RandomizedRunner.java:974)
>    at com.carrotsearch.randomizedtesting.RandomizedRunner$10.evaluate(RandomizedRunner.java:988)
>    at com.carrotsearch.randomizedtesting.rules.SystemPropertiesRestoreRule$1.evaluate(SystemPropertiesRestoreRule.java:57)
>    at org.apache.lucene.util.TestRuleSetupTeardownChained$1.evaluate(TestRuleSetupTeardownChained.java:49)
>    at org.apache.lucene.util.AbstractBeforeAfterRule$1.evaluate(AbstractBeforeAfterRule.java:45)
>    at org.apache.lucene.util.TestRuleThreadAndTestName$1.evaluate(TestRuleThreadAndTestName.java:48)
>    at org.apache.lucene.util.TestRuleIgnoreAfterMaxFailures$1.evaluate(TestRuleIgnoreAfterMaxFailures.java:64)
>    at org.apache.lucene.util.TestRuleMarkFailure$1.evaluate(TestRuleMarkFailure.java:47)
>    at com.carrotsearch.randomizedtesting.rules.StatementAdapter.evaluate(StatementAdapter.java:36)
>    at com.carrotsearch.randomizedtesting.ThreadLeakControl$StatementRunner.run(ThreadLeakControl.java:368)
>    at com.carrotsearch.randomizedtesting.ThreadLeakControl.forkTimeoutingTask(ThreadLeakControl.java:817)
>    at com.carrotsearch.randomizedtesting.ThreadLeakControl$3.evaluate(ThreadLeakControl.java:468)
>    at com.carrotsearch.randomizedtesting.RandomizedRunner.runSingleTest(RandomizedRunner.java:947)
>    at com.carrotsearch.randomizedtesting.RandomizedRunner$5.evaluate(RandomizedRunner.java:832)
>    at com.carrotsearch.randomizedtesting.RandomizedRunner$6.evaluate(RandomizedRunner.java:883)
>    at com.carrotsearch.randomizedtesting.RandomizedRunner$7.evaluate(RandomizedRunner.java:894)
>    at com.carrotsearch.randomizedtesting.rules.StatementAdapter.evaluate(StatementAdapter.java:36)
>    at com.carrotsearch.randomizedtesting.rules.SystemPropertiesRestoreRule$1.evaluate(SystemPropertiesRestoreRule.java:57)
>    at org.apache.lucene.util.AbstractBeforeAfterRule$1.evaluate(AbstractBeforeAfterRule.java:45)
>    at com.carrotsearch.randomizedtesting.rules.StatementAdapter.evaluate(StatementAdapter.java:36)
>    at org.apache.lucene.util.TestRuleStoreClassName$1.evaluate(TestRuleStoreClassName.java:41)
>    at com.carrotsearch.randomizedtesting.rules.NoShadowingOrOverridesOnMethodsRule$1.evaluate(NoShadowingOrOverridesOnMethodsRule.java:40)
>    at com.carrotsearch.randomizedtesting.rules.NoShadowingOrOverridesOnMethodsRule$1.evaluate(NoShadowingOrOverridesOnMethodsRule.java:40)
>    at com.carrotsearch.randomizedtesting.rules.StatementAdapter.evaluate(StatementAdapter.java:36)
>    at com.carrotsearch.randomizedtesting.rules.StatementAdapter.evaluate(StatementAdapter.java:36)
>    at org.apache.lucene.util.TestRuleAssertionsRequired$1.evaluate(TestRuleAssertionsRequired.java:53)
>    at org.apache.lucene.util.TestRuleMarkFailure$1.evaluate(TestRuleMarkFailure.java:47)
>    at org.apache.lucene.util.TestRuleIgnoreAfterMaxFailures$1.evaluate(TestRuleIgnoreAfterMaxFailures.java:64)
>    at org.apache.lucene.util.TestRuleIgnoreTestSuites$1.evaluate(TestRuleIgnoreTestSuites.java:54)
>    at com.carrotsearch.randomizedtesting.rules.StatementAdapter.evaluate(StatementAdapter.java:36)
>    at com.carrotsearch.randomizedtesting.ThreadLeakControl$StatementRunner.run(ThreadLeakControl.java:368)
>    at java.base/java.lang.Thread.run(Thread.java:834)
> 
> 
> FAILED:  org.apache.solr.security.JWTAuthPluginIntegrationTest.createCollectionUpdateAndQueryDistributed
> 
> Error Message:
> Expected metric minimums for prefix SECURITY./authentication.: {failMissingCredentials=0, authenticated=3, passThrough=0, failWrongCredentials=0, requests=3, errors=0}, but got: {failMissingCredentials=0, authenticated=2, passThrough=0, totalTime=1360490, failWrongCredentials=0, requestTimes=217, requests=2, errors=0}
> 
> Stack Trace:
> java.lang.AssertionError: Expected metric minimums for prefix SECURITY./authentication.: {failMissingCredentials=0, authenticated=3, passThrough=0, failWrongCredentials=0, requests=3, errors=0}, but got: {failMissingCredentials=0, authenticated=2, passThrough=0, totalTime=1360490, failWrongCredentials=0, requestTimes=217, requests=2, errors=0}
>    at __randomizedtesting.SeedInfo.seed([B3A7C371A669098D:B58FC11FC4DE9F3E]:0)
>    at org.junit.Assert.fail(Assert.java:88)
>    at org.junit.Assert.assertTrue(Assert.java:41)
>    at org.apache.solr.cloud.SolrCloudAuthTestCase.assertAuthMetricsMinimums(SolrCloudAuthTestCase.java:129)
>    at org.apache.solr.cloud.SolrCloudAuthTestCase.assertAuthMetricsMinimums(SolrCloudAuthTestCase.java:83)
>    at org.apache.solr.security.JWTAuthPluginIntegrationTest.createCollectionUpdateAndQueryDistributed(JWTAuthPluginIntegrationTest.java:176)
>    at java.base/jdk.internal.reflect.NativeMethodAccessorImpl.invoke0(Native Method)
>    at java.base/jdk.internal.reflect.NativeMethodAccessorImpl.invoke(NativeMethodAccessorImpl.java:62)
>    at java.base/jdk.internal.reflect.DelegatingMethodAccessorImpl.invoke(DelegatingMethodAccessorImpl.java:43)
>    at java.base/java.lang.reflect.Method.invoke(Method.java:566)
>    at com.carrotsearch.randomizedtesting.RandomizedRunner.invoke(RandomizedRunner.java:1750)
>    at com.carrotsearch.randomizedtesting.RandomizedRunner$8.evaluate(RandomizedRunner.java:938)
>    at com.carrotsearch.randomizedtesting.RandomizedRunner$9.evaluate(RandomizedRunner.java:974)
>    at com.carrotsearch.randomizedtesting.RandomizedRunner$10.evaluate(RandomizedRunner.java:988)
>    at com.carrotsearch.randomizedtesting.rules.SystemPropertiesRestoreRule$1.evaluate(SystemPropertiesRestoreRule.java:57)
>    at org.apache.lucene.util.TestRuleSetupTeardownChained$1.evaluate(TestRuleSetupTeardownChained.java:49)
>    at org.apache.lucene.util.AbstractBeforeAfterRule$1.evaluate(AbstractBeforeAfterRule.java:45)
>    at org.apache.lucene.util.TestRuleThreadAndTestName$1.evaluate(TestRuleThreadAndTestName.java:48)
>    at org.apache.lucene.util.TestRuleIgnoreAfterMaxFailures$1.evaluate(TestRuleIgnoreAfterMaxFailures.java:64)
>    at org.apache.lucene.util.TestRuleMarkFailure$1.evaluate(TestRuleMarkFailure.java:47)
>    at com.carrotsearch.randomizedtesting.rules.StatementAdapter.evaluate(StatementAdapter.java:36)
>    at com.carrotsearch.randomizedtesting.ThreadLeakControl$StatementRunner.run(ThreadLeakControl.java:368)
>    at com.carrotsearch.randomizedtesting.ThreadLeakControl.forkTimeoutingTask(ThreadLeakControl.java:817)
>    at com.carrotsearch.randomizedtesting.ThreadLeakControl$3.evaluate(ThreadLeakControl.java:468)
>    at com.carrotsearch.randomizedtesting.RandomizedRunner.runSingleTest(RandomizedRunner.java:947)
>    at com.carrotsearch.randomizedtesting.RandomizedRunner$5.evaluate(RandomizedRunner.java:832)
>    at com.carrotsearch.randomizedtesting.RandomizedRunner$6.evaluate(RandomizedRunner.java:883)
>    at com.carrotsearch.randomizedtesting.RandomizedRunner$7.evaluate(RandomizedRunner.java:894)
>    at com.carrotsearch.randomizedtesting.rules.StatementAdapter.evaluate(StatementAdapter.java:36)
>    at com.carrotsearch.randomizedtesting.rules.SystemPropertiesRestoreRule$1.evaluate(SystemPropertiesRestoreRule.java:57)
>    at org.apache.lucene.util.AbstractBeforeAfterRule$1.evaluate(AbstractBeforeAfterRule.java:45)
>    at com.carrotsearch.randomizedtesting.rules.StatementAdapter.evaluate(StatementAdapter.java:36)
>    at org.apache.lucene.util.TestRuleStoreClassName$1.evaluate(TestRuleStoreClassName.java:41)
>    at com.carrotsearch.randomizedtesting.rules.NoShadowingOrOverridesOnMethodsRule$1.evaluate(NoShadowingOrOverridesOnMethodsRule.java:40)
>    at com.carrotsearch.randomizedtesting.rules.NoShadowingOrOverridesOnMethodsRule$1.evaluate(NoShadowingOrOverridesOnMethodsRule.java:40)
>    at com.carrotsearch.randomizedtesting.rules.StatementAdapter.evaluate(StatementAdapter.java:36)
>    at com.carrotsearch.randomizedtesting.rules.StatementAdapter.evaluate(StatementAdapter.java:36)
>    at org.apache.lucene.util.TestRuleAssertionsRequired$1.evaluate(TestRuleAssertionsRequired.java:53)
>    at org.apache.lucene.util.TestRuleMarkFailure$1.evaluate(TestRuleMarkFailure.java:47)
>    at org.apache.lucene.util.TestRuleIgnoreAfterMaxFailures$1.evaluate(TestRuleIgnoreAfterMaxFailures.java:64)
>    at org.apache.lucene.util.TestRuleIgnoreTestSuites$1.evaluate(TestRuleIgnoreTestSuites.java:54)
>    at com.carrotsearch.randomizedtesting.rules.StatementAdapter.evaluate(StatementAdapter.java:36)
>    at com.carrotsearch.randomizedtesting.ThreadLeakControl$StatementRunner.run(ThreadLeakControl.java:368)
>    at java.base/java.lang.Thread.run(Thread.java:834)
> 
> 
> FAILED:  org.apache.solr.security.JWTAuthPluginIntegrationTest.createCollectionUpdateAndQueryDistributed
> 
> Error Message:
> Expected metric minimums for prefix SECURITY./authentication.: {failMissingCredentials=0, authenticated=3, passThrough=0, failWrongCredentials=0, requests=3, errors=0}, but got: {failMissingCredentials=0, authenticated=2, passThrough=0, totalTime=1001498, failWrongCredentials=0, requestTimes=230, requests=2, errors=0}
> 
> Stack Trace:
> java.lang.AssertionError: Expected metric minimums for prefix SECURITY./authentication.: {failMissingCredentials=0, authenticated=3, passThrough=0, failWrongCredentials=0, requests=3, errors=0}, but got: {failMissingCredentials=0, authenticated=2, passThrough=0, totalTime=1001498, failWrongCredentials=0, requestTimes=230, requests=2, errors=0}
>    at __randomizedtesting.SeedInfo.seed([B3A7C371A669098D:B58FC11FC4DE9F3E]:0)
>    at org.junit.Assert.fail(Assert.java:88)
>    at org.junit.Assert.assertTrue(Assert.java:41)
>    at org.apache.solr.cloud.SolrCloudAuthTestCase.assertAuthMetricsMinimums(SolrCloudAuthTestCase.java:129)
>    at org.apache.solr.cloud.SolrCloudAuthTestCase.assertAuthMetricsMinimums(SolrCloudAuthTestCase.java:83)
>    at org.apache.solr.security.JWTAuthPluginIntegrationTest.createCollectionUpdateAndQueryDistributed(JWTAuthPluginIntegrationTest.java:176)
>    at java.base/jdk.internal.reflect.NativeMethodAccessorImpl.invoke0(Native Method)
>    at java.base/jdk.internal.reflect.NativeMethodAccessorImpl.invoke(NativeMethodAccessorImpl.java:62)
>    at java.base/jdk.internal.reflect.DelegatingMethodAccessorImpl.invoke(DelegatingMethodAccessorImpl.java:43)
>    at java.base/java.lang.reflect.Method.invoke(Method.java:566)
>    at com.carrotsearch.randomizedtesting.RandomizedRunner.invoke(RandomizedRunner.java:1750)
>    at com.carrotsearch.randomizedtesting.RandomizedRunner$8.evaluate(RandomizedRunner.java:938)
>    at com.carrotsearch.randomizedtesting.RandomizedRunner$9.evaluate(RandomizedRunner.java:974)
>    at com.carrotsearch.randomizedtesting.RandomizedRunner$10.evaluate(RandomizedRunner.java:988)
>    at com.carrotsearch.randomizedtesting.rules.SystemPropertiesRestoreRule$1.evaluate(SystemPropertiesRestoreRule.java:57)
>    at org.apache.lucene.util.TestRuleSetupTeardownChained$1.evaluate(TestRuleSetupTeardownChained.java:49)
>    at org.apache.lucene.util.AbstractBeforeAfterRule$1.evaluate(AbstractBeforeAfterRule.java:45)
>    at org.apache.lucene.util.TestRuleThreadAndTestName$1.evaluate(TestRuleThreadAndTestName.java:48)
>    at org.apache.lucene.util.TestRuleIgnoreAfterMaxFailures$1.evaluate(TestRuleIgnoreAfterMaxFailures.java:64)
>    at org.apache.lucene.util.TestRuleMarkFailure$1.evaluate(TestRuleMarkFailure.java:47)
>    at com.carrotsearch.randomizedtesting.rules.StatementAdapter.evaluate(StatementAdapter.java:36)
>    at com.carrotsearch.randomizedtesting.ThreadLeakControl$StatementRunner.run(ThreadLeakControl.java:368)
>    at com.carrotsearch.randomizedtesting.ThreadLeakControl.forkTimeoutingTask(ThreadLeakControl.java:817)
>    at com.carrotsearch.randomizedtesting.ThreadLeakControl$3.evaluate(ThreadLeakControl.java:468)
>    at com.carrotsearch.randomizedtesting.RandomizedRunner.runSingleTest(RandomizedRunner.java:947)
>    at com.carrotsearch.randomizedtesting.RandomizedRunner$5.evaluate(RandomizedRunner.java:832)
>    at com.carrotsearch.randomizedtesting.RandomizedRunner$6.evaluate(RandomizedRunner.java:883)
>    at com.carrotsearch.randomizedtesting.RandomizedRunner$7.evaluate(RandomizedRunner.java:894)
>    at com.carrotsearch.randomizedtesting.rules.StatementAdapter.evaluate(StatementAdapter.java:36)
>    at com.carrotsearch.randomizedtesting.rules.SystemPropertiesRestoreRule$1.evaluate(SystemPropertiesRestoreRule.java:57)
>    at org.apache.lucene.util.AbstractBeforeAfterRule$1.evaluate(AbstractBeforeAfterRule.java:45)
>    at com.carrotsearch.randomizedtesting.rules.StatementAdapter.evaluate(StatementAdapter.java:36)
>    at org.apache.lucene.util.TestRuleStoreClassName$1.evaluate(TestRuleStoreClassName.java:41)
>    at com.carrotsearch.randomizedtesting.rules.NoShadowingOrOverridesOnMethodsRule$1.evaluate(NoShadowingOrOverridesOnMethodsRule.java:40)
>    at com.carrotsearch.randomizedtesting.rules.NoShadowingOrOverridesOnMethodsRule$1.evaluate(NoShadowingOrOverridesOnMethodsRule.java:40)
>    at com.carrotsearch.randomizedtesting.rules.StatementAdapter.evaluate(StatementAdapter.java:36)
>    at com.carrotsearch.randomizedtesting.rules.StatementAdapter.evaluate(StatementAdapter.java:36)
>    at org.apache.lucene.util.TestRuleAssertionsRequired$1.evaluate(TestRuleAssertionsRequired.java:53)
>    at org.apache.lucene.util.TestRuleMarkFailure$1.evaluate(TestRuleMarkFailure.java:47)
>    at org.apache.lucene.util.TestRuleIgnoreAfterMaxFailures$1.evaluate(TestRuleIgnoreAfterMaxFailures.java:64)
>    at org.apache.lucene.util.TestRuleIgnoreTestSuites$1.evaluate(TestRuleIgnoreTestSuites.java:54)
>    at com.carrotsearch.randomizedtesting.rules.StatementAdapter.evaluate(StatementAdapter.java:36)
>    at com.carrotsearch.randomizedtesting.ThreadLeakControl$StatementRunner.run(ThreadLeakControl.java:368)
>    at java.base/java.lang.Thread.run(Thread.java:834)
> 
> 
> FAILED:  org.apache.solr.security.JWTAuthPluginIntegrationTest.createCollectionUpdateAndQueryDistributed
> 
> Error Message:
> Expected metric minimums for prefix SECURITY./authentication.: {failMissingCredentials=0, authenticated=3, passThrough=0, failWrongCredentials=0, requests=3, errors=0}, but got: {failMissingCredentials=0, authenticated=2, passThrough=0, totalTime=7856214, failWrongCredentials=0, requestTimes=168, requests=2, errors=0}
> 
> Stack Trace:
> java.lang.AssertionError: Expected metric minimums for prefix SECURITY./authentication.: {failMissingCredentials=0, authenticated=3, passThrough=0, failWrongCredentials=0, requests=3, errors=0}, but got: {failMissingCredentials=0, authenticated=2, passThrough=0, totalTime=7856214, failWrongCredentials=0, requestTimes=168, requests=2, errors=0}
>    at __randomizedtesting.SeedInfo.seed([B3A7C371A669098D:B58FC11FC4DE9F3E]:0)
>    at org.junit.Assert.fail(Assert.java:88)
>    at org.junit.Assert.assertTrue(Assert.java:41)
>    at org.apache.solr.cloud.SolrCloudAuthTestCase.assertAuthMetricsMinimums(SolrCloudAuthTestCase.java:129)
>    at org.apache.solr.cloud.SolrCloudAuthTestCase.assertAuthMetricsMinimums(SolrCloudAuthTestCase.java:83)
>    at org.apache.solr.security.JWTAuthPluginIntegrationTest.createCollectionUpdateAndQueryDistributed(JWTAuthPluginIntegrationTest.java:176)
>    at java.base/jdk.internal.reflect.NativeMethodAccessorImpl.invoke0(Native Method)
>    at java.base/jdk.internal.reflect.NativeMethodAccessorImpl.invoke(NativeMethodAccessorImpl.java:62)
>    at java.base/jdk.internal.reflect.DelegatingMethodAccessorImpl.invoke(DelegatingMethodAccessorImpl.java:43)
>    at java.base/java.lang.reflect.Method.invoke(Method.java:566)
>    at com.carrotsearch.randomizedtesting.RandomizedRunner.invoke(RandomizedRunner.java:1750)
>    at com.carrotsearch.randomizedtesting.RandomizedRunner$8.evaluate(RandomizedRunner.java:938)
>    at com.carrotsearch.randomizedtesting.RandomizedRunner$9.evaluate(RandomizedRunner.java:974)
>    at com.carrotsearch.randomizedtesting.RandomizedRunner$10.evaluate(RandomizedRunner.java:988)
>    at com.carrotsearch.randomizedtesting.rules.SystemPropertiesRestoreRule$1.evaluate(SystemPropertiesRestoreRule.java:57)
>    at org.apache.lucene.util.TestRuleSetupTeardownChained$1.evaluate(TestRuleSetupTeardownChained.java:49)
>    at org.apache.lucene.util.AbstractBeforeAfterRule$1.evaluate(AbstractBeforeAfterRule.java:45)
>    at org.apache.lucene.util.TestRuleThreadAndTestName$1.evaluate(TestRuleThreadAndTestName.java:48)
>    at org.apache.lucene.util.TestRuleIgnoreAfterMaxFailures$1.evaluate(TestRuleIgnoreAfterMaxFailures.java:64)
>    at org.apache.lucene.util.TestRuleMarkFailure$1.evaluate(TestRuleMarkFailure.java:47)
>    at com.carrotsearch.randomizedtesting.rules.StatementAdapter.evaluate(StatementAdapter.java:36)
>    at com.carrotsearch.randomizedtesting.ThreadLeakControl$StatementRunner.run(ThreadLeakControl.java:368)
>    at com.carrotsearch.randomizedtesting.ThreadLeakControl.forkTimeoutingTask(ThreadLeakControl.java:817)
>    at com.carrotsearch.randomizedtesting.ThreadLeakControl$3.evaluate(ThreadLeakControl.java:468)
>    at com.carrotsearch.randomizedtesting.RandomizedRunner.runSingleTest(RandomizedRunner.java:947)
>    at com.carrotsearch.randomizedtesting.RandomizedRunner$5.evaluate(RandomizedRunner.java:832)
>    at com.carrotsearch.randomizedtesting.RandomizedRunner$6.evaluate(RandomizedRunner.java:883)
>    at com.carrotsearch.randomizedtesting.RandomizedRunner$7.evaluate(RandomizedRunner.java:894)
>    at com.carrotsearch.randomizedtesting.rules.StatementAdapter.evaluate(StatementAdapter.java:36)
>    at com.carrotsearch.randomizedtesting.rules.SystemPropertiesRestoreRule$1.evaluate(SystemPropertiesRestoreRule.java:57)
>    at org.apache.lucene.util.AbstractBeforeAfterRule$1.evaluate(AbstractBeforeAfterRule.java:45)
>    at com.carrotsearch.randomizedtesting.rules.StatementAdapter.evaluate(StatementAdapter.java:36)
>    at org.apache.lucene.util.TestRuleStoreClassName$1.evaluate(TestRuleStoreClassName.java:41)
>    at com.carrotsearch.randomizedtesting.rules.NoShadowingOrOverridesOnMethodsRule$1.evaluate(NoShadowingOrOverridesOnMethodsRule.java:40)
>    at com.carrotsearch.randomizedtesting.rules.NoShadowingOrOverridesOnMethodsRule$1.evaluate(NoShadowingOrOverridesOnMethodsRule.java:40)
>    at com.carrotsearch.randomizedtesting.rules.StatementAdapter.evaluate(StatementAdapter.java:36)
>    at com.carrotsearch.randomizedtesting.rules.StatementAdapter.evaluate(StatementAdapter.java:36)
>    at org.apache.lucene.util.TestRuleAssertionsRequired$1.evaluate(TestRuleAssertionsRequired.java:53)
>    at org.apache.lucene.util.TestRuleMarkFailure$1.evaluate(TestRuleMarkFailure.java:47)
>    at org.apache.lucene.util.TestRuleIgnoreAfterMaxFailures$1.evaluate(TestRuleIgnoreAfterMaxFailures.java:64)
>    at org.apache.lucene.util.TestRuleIgnoreTestSuites$1.evaluate(TestRuleIgnoreTestSuites.java:54)
>    at com.carrotsearch.randomizedtesting.rules.StatementAdapter.evaluate(StatementAdapter.java:36)
>    at com.carrotsearch.randomizedtesting.ThreadLeakControl$StatementRunner.run(ThreadLeakControl.java:368)
>    at java.base/java.lang.Thread.run(Thread.java:834)
> 
> 
> FAILED:  org.apache.solr.security.JWTAuthPluginIntegrationTest.createCollectionUpdateAndQueryDistributed
> 
> Error Message:
> Expected metric minimums for prefix SECURITY./authentication.: {failMissingCredentials=0, authenticated=3, passThrough=0, failWrongCredentials=0, requests=3, errors=0}, but got: {failMissingCredentials=0, authenticated=2, passThrough=0, totalTime=7876269, failWrongCredentials=0, requestTimes=237, requests=2, errors=0}
> 
> Stack Trace:
> java.lang.AssertionError: Expected metric minimums for prefix SECURITY./authentication.: {failMissingCredentials=0, authenticated=3, passThrough=0, failWrongCredentials=0, requests=3, errors=0}, but got: {failMissingCredentials=0, authenticated=2, passThrough=0, totalTime=7876269, failWrongCredentials=0, requestTimes=237, requests=2, errors=0}
>    at __randomizedtesting.SeedInfo.seed([B3A7C371A669098D:B58FC11FC4DE9F3E]:0)
>    at org.junit.Assert.fail(Assert.java:88)
>    at org.junit.Assert.assertTrue(Assert.java:41)
>    at org.apache.solr.cloud.SolrCloudAuthTestCase.assertAuthMetricsMinimums(SolrCloudAuthTestCase.java:129)
>    at org.apache.solr.cloud.SolrCloudAuthTestCase.assertAuthMetricsMinimums(SolrCloudAuthTestCase.java:83)
>    at org.apache.solr.security.JWTAuthPluginIntegrationTest.createCollectionUpdateAndQueryDistributed(JWTAuthPluginIntegrationTest.java:176)
>    at java.base/jdk.internal.reflect.NativeMethodAccessorImpl.invoke0(Native Method)
>    at java.base/jdk.internal.reflect.NativeMethodAccessorImpl.invoke(NativeMethodAccessorImpl.java:62)
>    at java.base/jdk.internal.reflect.DelegatingMethodAccessorImpl.invoke(DelegatingMethodAccessorImpl.java:43)
>    at java.base/java.lang.reflect.Method.invoke(Method.java:566)
>    at com.carrotsearch.randomizedtesting.RandomizedRunner.invoke(RandomizedRunner.java:1750)
>    at com.carrotsearch.randomizedtesting.RandomizedRunner$8.evaluate(RandomizedRunner.java:938)
>    at com.carrotsearch.randomizedtesting.RandomizedRunner$9.evaluate(RandomizedRunner.java:974)
>    at com.carrotsearch.randomizedtesting.RandomizedRunner$10.evaluate(RandomizedRunner.java:988)
>    at com.carrotsearch.randomizedtesting.rules.SystemPropertiesRestoreRule$1.evaluate(SystemPropertiesRestoreRule.java:57)
>    at org.apache.lucene.util.TestRuleSetupTeardownChained$1.evaluate(TestRuleSetupTeardownChained.java:49)
>    at org.apache.lucene.util.AbstractBeforeAfterRule$1.evaluate(AbstractBeforeAfterRule.java:45)
>    at org.apache.lucene.util.TestRuleThreadAndTestName$1.evaluate(TestRuleThreadAndTestName.java:48)
>    at org.apache.lucene.util.TestRuleIgnoreAfterMaxFailures$1.evaluate(TestRuleIgnoreAfterMaxFailures.java:64)
>    at org.apache.lucene.util.TestRuleMarkFailure$1.evaluate(TestRuleMarkFailure.java:47)
>    at com.carrotsearch.randomizedtesting.rules.StatementAdapter.evaluate(StatementAdapter.java:36)
>    at com.carrotsearch.randomizedtesting.ThreadLeakControl$StatementRunner.run(ThreadLeakControl.java:368)
>    at com.carrotsearch.randomizedtesting.ThreadLeakControl.forkTimeoutingTask(ThreadLeakControl.java:817)
>    at com.carrotsearch.randomizedtesting.ThreadLeakControl$3.evaluate(ThreadLeakControl.java:468)
>    at com.carrotsearch.randomizedtesting.RandomizedRunner.runSingleTest(RandomizedRunner.java:947)
>    at com.carrotsearch.randomizedtesting.RandomizedRunner$5.evaluate(RandomizedRunner.java:832)
>    at com.carrotsearch.randomizedtesting.RandomizedRunner$6.evaluate(RandomizedRunner.java:883)
>    at com.carrotsearch.randomizedtesting.RandomizedRunner$7.evaluate(RandomizedRunner.java:894)
>    at com.carrotsearch.randomizedtesting.rules.StatementAdapter.evaluate(StatementAdapter.java:36)
>    at com.carrotsearch.randomizedtesting.rules.SystemPropertiesRestoreRule$1.evaluate(SystemPropertiesRestoreRule.java:57)
>    at org.apache.lucene.util.AbstractBeforeAfterRule$1.evaluate(AbstractBeforeAfterRule.java:45)
>    at com.carrotsearch.randomizedtesting.rules.StatementAdapter.evaluate(StatementAdapter.java:36)
>    at org.apache.lucene.util.TestRuleStoreClassName$1.evaluate(TestRuleStoreClassName.java:41)
>    at com.carrotsearch.randomizedtesting.rules.NoShadowingOrOverridesOnMethodsRule$1.evaluate(NoShadowingOrOverridesOnMethodsRule.java:40)
>    at com.carrotsearch.randomizedtesting.rules.NoShadowingOrOverridesOnMethodsRule$1.evaluate(NoShadowingOrOverridesOnMethodsRule.java:40)
>    at com.carrotsearch.randomizedtesting.rules.StatementAdapter.evaluate(StatementAdapter.java:36)
>    at com.carrotsearch.randomizedtesting.rules.StatementAdapter.evaluate(StatementAdapter.java:36)
>    at org.apache.lucene.util.TestRuleAssertionsRequired$1.evaluate(TestRuleAssertionsRequired.java:53)
>    at org.apache.lucene.util.TestRuleMarkFailure$1.evaluate(TestRuleMarkFailure.java:47)
>    at org.apache.lucene.util.TestRuleIgnoreAfterMaxFailures$1.evaluate(TestRuleIgnoreAfterMaxFailures.java:64)
>    at org.apache.lucene.util.TestRuleIgnoreTestSuites$1.evaluate(TestRuleIgnoreTestSuites.java:54)
>    at com.carrotsearch.randomizedtesting.rules.StatementAdapter.evaluate(StatementAdapter.java:36)
>    at com.carrotsearch.randomizedtesting.ThreadLeakControl$StatementRunner.run(ThreadLeakControl.java:368)
>    at java.base/java.lang.Thread.run(Thread.java:834)
> 
> 
> 
> 
> Build Log:
> [...truncated 2079 lines...]
>   [junit4] JVM J2: stderr was not empty, see: /home/jenkins/workspace/Lucene-Solr-8.1-Linux/lucene/build/core/test/temp/junit4-J2-20190606_101010_0223178573656301588713.syserr
>   [junit4] >>> JVM J2 emitted unexpected output (verbatim) ----
>   [junit4] OpenJDK 64-Bit Server VM warning: Option UseConcMarkSweepGC was deprecated in version 9.0 and will likely be removed in a future release.
>   [junit4] <<< JVM J2: EOF ----
> 
> [...truncated 5 lines...]
>   [junit4] JVM J1: stderr was not empty, see: /home/jenkins/workspace/Lucene-Solr-8.1-Linux/lucene/build/core/test/temp/junit4-J1-20190606_101010_0226170335670131464154.syserr
>   [junit4] >>> JVM J1 emitted unexpected output (verbatim) ----
>   [junit4] OpenJDK 64-Bit Server VM warning: Option UseConcMarkSweepGC was deprecated in version 9.0 and will likely be removed in a future release.
>   [junit4] <<< JVM J1: EOF ----
> 
> [...truncated 5 lines...]
>   [junit4] JVM J0: stderr was not empty, see: /home/jenkins/workspace/Lucene-Solr-8.1-Linux/lucene/build/core/test/temp/junit4-J0-20190606_101010_0225453688893641453363.syserr
>   [junit4] >>> JVM J0 emitted unexpected output (verbatim) ----
>   [junit4] OpenJDK 64-Bit Server VM warning: Option UseConcMarkSweepGC was deprecated in version 9.0 and will likely be removed in a future release.
>   [junit4] <<< JVM J0: EOF ----
> 
> [...truncated 304 lines...]
>   [junit4] JVM J1: stderr was not empty, see: /home/jenkins/workspace/Lucene-Solr-8.1-Linux/lucene/build/test-framework/test/temp/junit4-J1-20190606_102408_26717638426519244830812.syserr
>   [junit4] >>> JVM J1 emitted unexpected output (verbatim) ----
>   [junit4] OpenJDK 64-Bit Server VM warning: Option UseConcMarkSweepGC was deprecated in version 9.0 and will likely be removed in a future release.
>   [junit4] <<< JVM J1: EOF ----
> 
> [...truncated 3 lines...]
>   [junit4] JVM J2: stderr was not empty, see: /home/jenkins/workspace/Lucene-Solr-8.1-Linux/lucene/build/test-framework/test/temp/junit4-J2-20190606_102408_26217137341780471471922.syserr
>   [junit4] >>> JVM J2 emitted unexpected output (verbatim) ----
>   [junit4] OpenJDK 64-Bit Server VM warning: Option UseConcMarkSweepGC was deprecated in version 9.0 and will likely be removed in a future release.
>   [junit4] <<< JVM J2: EOF ----
> 
> [...truncated 3 lines...]
>   [junit4] JVM J0: stderr was not empty, see: /home/jenkins/workspace/Lucene-Solr-8.1-Linux/lucene/build/test-framework/test/temp/junit4-J0-20190606_102408_2623976922691820120164.syserr
>   [junit4] >>> JVM J0 emitted unexpected output (verbatim) ----
>   [junit4] OpenJDK 64-Bit Server VM warning: Option UseConcMarkSweepGC was deprecated in version 9.0 and will likely be removed in a future release.
>   [junit4] <<< JVM J0: EOF ----
> 
> [...truncated 1080 lines...]
>   [junit4] JVM J2: stderr was not empty, see: /home/jenkins/workspace/Lucene-Solr-8.1-Linux/lucene/build/analysis/common/test/temp/junit4-J2-20190606_102611_72417526216642824670313.syserr
>   [junit4] >>> JVM J2 emitted unexpected output (verbatim) ----
>   [junit4] OpenJDK 64-Bit Server VM warning: Option UseConcMarkSweepGC was deprecated in version 9.0 and will likely be removed in a future release.
>   [junit4] <<< JVM J2: EOF ----
> 
> [...truncated 3 lines...]
>   [junit4] JVM J0: stderr was not empty, see: /home/jenkins/workspace/Lucene-Solr-8.1-Linux/lucene/build/analysis/common/test/temp/junit4-J0-20190606_102611_719852626999793260963.syserr
>   [junit4] >>> JVM J0 emitted unexpected output (verbatim) ----
>   [junit4] OpenJDK 64-Bit Server VM warning: Option UseConcMarkSweepGC was deprecated in version 9.0 and will likely be removed in a future release.
>   [junit4] <<< JVM J0: EOF ----
> 
> [...truncated 3 lines...]
>   [junit4] JVM J1: stderr was not empty, see: /home/jenkins/workspace/Lucene-Solr-8.1-Linux/lucene/build/analysis/common/test/temp/junit4-J1-20190606_102611_72515223450414021034820.syserr
>   [junit4] >>> JVM J1 emitted unexpected output (verbatim) ----
>   [junit4] OpenJDK 64-Bit Server VM warning: Option UseConcMarkSweepGC was deprecated in version 9.0 and will likely be removed in a future release.
>   [junit4] <<< JVM J1: EOF ----
> 
> [...truncated 250 lines...]
>   [junit4] JVM J2: stderr was not empty, see: /home/jenkins/workspace/Lucene-Solr-8.1-Linux/lucene/build/analysis/icu/test/temp/junit4-J2-20190606_102854_585158898133324691342.syserr
>   [junit4] >>> JVM J2 emitted unexpected output (verbatim) ----
>   [junit4] OpenJDK 64-Bit Server VM warning: Option UseConcMarkSweepGC was deprecated in version 9.0 and will likely be removed in a future release.
>   [junit4] <<< JVM J2: EOF ----
> 
> [...truncated 5 lines...]
>   [junit4] JVM J1: stderr was not empty, see: /home/jenkins/workspace/Lucene-Solr-8.1-Linux/lucene/build/analysis/icu/test/temp/junit4-J1-20190606_102854_5858723534077649582202.syserr
>   [junit4] >>> JVM J1 emitted unexpected output (verbatim) ----
>   [junit4] OpenJDK 64-Bit Server VM warning: Option UseConcMarkSweepGC was deprecated in version 9.0 and will likely be removed in a future release.
>   [junit4] <<< JVM J1: EOF ----
> 
> [...truncated 6 lines...]
>   [junit4] JVM J0: stderr was not empty, see: /home/jenkins/workspace/Lucene-Solr-8.1-Linux/lucene/build/analysis/icu/test/temp/junit4-J0-20190606_102854_5855429800023397898597.syserr
>   [junit4] >>> JVM J0 emitted unexpected output (verbatim) ----
>   [junit4] OpenJDK 64-Bit Server VM warning: Option UseConcMarkSweepGC was deprecated in version 9.0 and will likely be removed in a future release.
>   [junit4] <<< JVM J0: EOF ----
> 
> [...truncated 253 lines...]
>   [junit4] JVM J1: stderr was not empty, see: /home/jenkins/workspace/Lucene-Solr-8.1-Linux/lucene/build/analysis/kuromoji/test/temp/junit4-J1-20190606_102911_6224134852082203621476.syserr
>   [junit4] >>> JVM J1 emitted unexpected output (verbatim) ----
>   [junit4] OpenJDK 64-Bit Server VM warning: Option UseConcMarkSweepGC was deprecated in version 9.0 and will likely be removed in a future release.
>   [junit4] <<< JVM J1: EOF ----
> 
> [...truncated 3 lines...]
>   [junit4] JVM J0: stderr was not empty, see: /home/jenkins/workspace/Lucene-Solr-8.1-Linux/lucene/build/analysis/kuromoji/test/temp/junit4-J0-20190606_102911_6228454560780787305251.syserr
>   [junit4] >>> JVM J0 emitted unexpected output (verbatim) ----
>   [junit4] OpenJDK 64-Bit Server VM warning: Option UseConcMarkSweepGC was deprecated in version 9.0 and will likely be removed in a future release.
>   [junit4] <<< JVM J0: EOF ----
> 
> [...truncated 3 lines...]
>   [junit4] JVM J2: stderr was not empty, see: /home/jenkins/workspace/Lucene-Solr-8.1-Linux/lucene/build/analysis/kuromoji/test/temp/junit4-J2-20190606_102911_6223310164457398028019.syserr
>   [junit4] >>> JVM J2 emitted unexpected output (verbatim) ----
>   [junit4] OpenJDK 64-Bit Server VM warning: Option UseConcMarkSweepGC was deprecated in version 9.0 and will likely be removed in a future release.
>   [junit4] <<< JVM J2: EOF ----
> 
> [...truncated 162 lines...]
>   [junit4] JVM J1: stderr was not empty, see: /home/jenkins/workspace/Lucene-Solr-8.1-Linux/lucene/build/analysis/morfologik/test/temp/junit4-J1-20190606_102946_60512724686803781418437.syserr
>   [junit4] >>> JVM J1 emitted unexpected output (verbatim) ----
>   [junit4] OpenJDK 64-Bit Server VM warning: Option UseConcMarkSweepGC was deprecated in version 9.0 and will likely be removed in a future release.
>   [junit4] <<< JVM J1: EOF ----
> 
> [...truncated 3 lines...]
>   [junit4] JVM J0: stderr was not empty, see: /home/jenkins/workspace/Lucene-Solr-8.1-Linux/lucene/build/analysis/morfologik/test/temp/junit4-J0-20190606_102946_6054414456364243391770.syserr
>   [junit4] >>> JVM J0 emitted unexpected output (verbatim) ----
>   [junit4] OpenJDK 64-Bit Server VM warning: Option UseConcMarkSweepGC was deprecated in version 9.0 and will likely be removed in a future release.
>   [junit4] <<< JVM J0: EOF ----
> 
> [...truncated 3 lines...]
>   [junit4] JVM J2: stderr was not empty, see: /home/jenkins/workspace/Lucene-Solr-8.1-Linux/lucene/build/analysis/morfologik/test/temp/junit4-J2-20190606_102946_6063408042784737797267.syserr
>   [junit4] >>> JVM J2 emitted unexpected output (verbatim) ----
>   [junit4] OpenJDK 64-Bit Server VM warning: Option UseConcMarkSweepGC was deprecated in version 9.0 and will likely be removed in a future release.
>   [junit4] <<< JVM J2: EOF ----
> 
> [...truncated 207 lines...]
>   [junit4] JVM J0: stderr was not empty, see: /home/jenkins/workspace/Lucene-Solr-8.1-Linux/lucene/build/analysis/nori/test/temp/junit4-J0-20190606_102953_42417065596118402391802.syserr
>   [junit4] >>> JVM J0 emitted unexpected output (verbatim) ----
>   [junit4] OpenJDK 64-Bit Server VM warning: Option UseConcMarkSweepGC was deprecated in version 9.0 and will likely be removed in a future release.
>   [junit4] <<< JVM J0: EOF ----
> 
> [...truncated 3 lines...]
>   [junit4] JVM J2: stderr was not empty, see: /home/jenkins/workspace/Lucene-Solr-8.1-Linux/lucene/build/analysis/nori/test/temp/junit4-J2-20190606_102953_4241724093646560888609.syserr
>   [junit4] >>> JVM J2 emitted unexpected output (verbatim) ----
>   [junit4] OpenJDK 64-Bit Server VM warning: Option UseConcMarkSweepGC was deprecated in version 9.0 and will likely be removed in a future release.
>   [junit4] <<< JVM J2: EOF ----
> 
> [...truncated 3 lines...]
>   [junit4] JVM J1: stderr was not empty, see: /home/jenkins/workspace/Lucene-Solr-8.1-Linux/lucene/build/analysis/nori/test/temp/junit4-J1-20190606_102953_4242226717897687509810.syserr
>   [junit4] >>> JVM J1 emitted unexpected output (verbatim) ----
>   [junit4] OpenJDK 64-Bit Server VM warning: Option UseConcMarkSweepGC was deprecated in version 9.0 and will likely be removed in a future release.
>   [junit4] <<< JVM J1: EOF ----
> 
> [...truncated 168 lines...]
>   [junit4] JVM J2: stderr was not empty, see: /home/jenkins/workspace/Lucene-Solr-8.1-Linux/lucene/build/analysis/opennlp/test/temp/junit4-J2-20190606_103010_85515681467792717380741.syserr
>   [junit4] >>> JVM J2 emitted unexpected output (verbatim) ----
>   [junit4] OpenJDK 64-Bit Server VM warning: Option UseConcMarkSweepGC was deprecated in version 9.0 and will likely be removed in a future release.
>   [junit4] <<< JVM J2: EOF ----
> 
> [...truncated 6 lines...]
>   [junit4] JVM J0: stderr was not empty, see: /home/jenkins/workspace/Lucene-Solr-8.1-Linux/lucene/build/analysis/opennlp/test/temp/junit4-J0-20190606_103010_85515478358636839838379.syserr
>   [junit4] >>> JVM J0 emitted unexpected output (verbatim) ----
>   [junit4] OpenJDK 64-Bit Server VM warning: Option UseConcMarkSweepGC was deprecated in version 9.0 and will likely be removed in a future release.
>   [junit4] <<< JVM J0: EOF ----
> 
>   [junit4] JVM J1: stderr was not empty, see: /home/jenkins/workspace/Lucene-Solr-8.1-Linux/lucene/build/analysis/opennlp/test/temp/junit4-J1-20190606_103010_85514370193089023628703.syserr
>   [junit4] >>> JVM J1 emitted unexpected output (verbatim) ----
>   [junit4] OpenJDK 64-Bit Server VM warning: Option UseConcMarkSweepGC was deprecated in version 9.0 and will likely be removed in a future release.
>   [junit4] <<< JVM J1: EOF ----
> 
> [...truncated 176 lines...]
>   [junit4] JVM J1: stderr was not empty, see: /home/jenkins/workspace/Lucene-Solr-8.1-Linux/lucene/build/analysis/phonetic/test/temp/junit4-J1-20190606_103015_81216339774148986316135.syserr
>   [junit4] >>> JVM J1 emitted unexpected output (verbatim) ----
>   [junit4] OpenJDK 64-Bit Server VM warning: Option UseConcMarkSweepGC was deprecated in version 9.0 and will likely be removed in a future release.
>   [junit4] <<< JVM J1: EOF ----
> 
> [...truncated 3 lines...]
>   [junit4] JVM J2: stderr was not empty, see: /home/jenkins/workspace/Lucene-Solr-8.1-Linux/lucene/build/analysis/phonetic/test/temp/junit4-J2-20190606_103015_8126401745526630646969.syserr
>   [junit4] >>> JVM J2 emitted unexpected output (verbatim) ----
>   [junit4] OpenJDK 64-Bit Server VM warning: Option UseConcMarkSweepGC was deprecated in version 9.0 and will likely be removed in a future release.
>   [junit4] <<< JVM J2: EOF ----
> 
> [...truncated 3 lines...]
>   [junit4] JVM J0: stderr was not empty, see: /home/jenkins/workspace/Lucene-Solr-8.1-Linux/lucene/build/analysis/phonetic/test/temp/junit4-J0-20190606_103015_8128273843441833717747.syserr
>   [junit4] >>> JVM J0 emitted unexpected output (verbatim) ----
>   [junit4] OpenJDK 64-Bit Server VM warning: Option UseConcMarkSweepGC was deprecated in version 9.0 and will likely be removed in a future release.
>   [junit4] <<< JVM J0: EOF ----
> 
> [...truncated 161 lines...]
>   [junit4] JVM J0: stderr was not empty, see: /home/jenkins/workspace/Lucene-Solr-8.1-Linux/lucene/build/analysis/smartcn/test/temp/junit4-J0-20190606_103039_94314069790179146888775.syserr
>   [junit4] >>> JVM J0 emitted unexpected output (verbatim) ----
>   [junit4] OpenJDK 64-Bit Server VM warning: Option UseConcMarkSweepGC was deprecated in version 9.0 and will likely be removed in a future release.
>   [junit4] <<< JVM J0: EOF ----
> 
> [...truncated 3 lines...]
>   [junit4] JVM J1: stderr was not empty, see: /home/jenkins/workspace/Lucene-Solr-8.1-Linux/lucene/build/analysis/smartcn/test/temp/junit4-J1-20190606_103039_9435627847991327835278.syserr
>   [junit4] >>> JVM J1 emitted unexpected output (verbatim) ----
>   [junit4] OpenJDK 64-Bit Server VM warning: Option UseConcMarkSweepGC was deprecated in version 9.0 and will likely be removed in a future release.
>   [junit4] <<< JVM J1: EOF ----
> 
> [...truncated 162 lines...]
>   [junit4] JVM J1: stderr was not empty, see: /home/jenkins/workspace/Lucene-Solr-8.1-Linux/lucene/build/analysis/stempel/test/temp/junit4-J1-20190606_103053_6475067724223303401419.syserr
>   [junit4] >>> JVM J1 emitted unexpected output (verbatim) ----
>   [junit4] OpenJDK 64-Bit Server VM warning: Option UseConcMarkSweepGC was deprecated in version 9.0 and will likely be removed in a future release.
>   [junit4] <<< JVM J1: EOF ----
> 
> [...truncated 3 lines...]
>   [junit4] JVM J2: stderr was not empty, see: /home/jenkins/workspace/Lucene-Solr-8.1-Linux/lucene/build/analysis/stempel/test/temp/junit4-J2-20190606_103053_6478807863563775408062.syserr
>   [junit4] >>> JVM J2 emitted unexpected output (verbatim) ----
>   [junit4] OpenJDK 64-Bit Server VM warning: Option UseConcMarkSweepGC was deprecated in version 9.0 and will likely be removed in a future release.
>   [junit4] <<< JVM J2: EOF ----
> 
> [...truncated 3 lines...]
>   [junit4] JVM J0: stderr was not empty, see: /home/jenkins/workspace/Lucene-Solr-8.1-Linux/lucene/build/analysis/stempel/test/temp/junit4-J0-20190606_103053_64717713775142512380267.syserr
>   [junit4] >>> JVM J0 emitted unexpected output (verbatim) ----
>   [junit4] OpenJDK 64-Bit Server VM warning: Option UseConcMarkSweepGC was deprecated in version 9.0 and will likely be removed in a future release.
>   [junit4] <<< JVM J0: EOF ----
> 
> [...truncated 177 lines...]
>   [junit4] JVM J2: stderr was not empty, see: /home/jenkins/workspace/Lucene-Solr-8.1-Linux/lucene/build/backward-codecs/test/temp/junit4-J2-20190606_103058_1161852707235050122453.syserr
>   [junit4] >>> JVM J2 emitted unexpected output (verbatim) ----
>   [junit4] OpenJDK 64-Bit Server VM warning: Option UseConcMarkSweepGC was deprecated in version 9.0 and will likely be removed in a future release.
>   [junit4] <<< JVM J2: EOF ----
> 
> [...truncated 19 lines...]
>   [junit4] JVM J0: stderr was not empty, see: /home/jenkins/workspace/Lucene-Solr-8.1-Linux/lucene/build/backward-codecs/test/temp/junit4-J0-20190606_103058_1164796823507214232608.syserr
>   [junit4] >>> JVM J0 emitted unexpected output (verbatim) ----
>   [junit4] OpenJDK 64-Bit Server VM warning: Option UseConcMarkSweepGC was deprecated in version 9.0 and will likely be removed in a future release.
>   [junit4] <<< JVM J0: EOF ----
> 
> [...truncated 9 lines...]
>   [junit4] JVM J1: stderr was not empty, see: /home/jenkins/workspace/Lucene-Solr-8.1-Linux/lucene/build/backward-codecs/test/temp/junit4-J1-20190606_103058_11616550301768407683431.syserr
>   [junit4] >>> JVM J1 emitted unexpected output (verbatim) ----
>   [junit4] OpenJDK 64-Bit Server VM warning: Option UseConcMarkSweepGC was deprecated in version 9.0 and will likely be removed in a future release.
>   [junit4] <<< JVM J1: EOF ----
> 
> [...truncated 1539 lines...]
>   [junit4] JVM J2: stderr was not empty, see: /home/jenkins/workspace/Lucene-Solr-8.1-Linux/lucene/build/benchmark/test/temp/junit4-J2-20190606_103452_99712048091746778637979.syserr
>   [junit4] >>> JVM J2 emitted unexpected output (verbatim) ----
>   [junit4] OpenJDK 64-Bit Server VM warning: Option UseConcMarkSweepGC was deprecated in version 9.0 and will likely be removed in a future release.
>   [junit4] <<< JVM J2: EOF ----
> 
> [...truncated 12 lines...]
>   [junit4] JVM J1: stderr was not empty, see: /home/jenkins/workspace/Lucene-Solr-8.1-Linux/lucene/build/benchmark/test/temp/junit4-J1-20190606_103452_99710924738278760508257.syserr
>   [junit4] >>> JVM J1 emitted unexpected output (verbatim) ----
>   [junit4] OpenJDK 64-Bit Server VM warning: Option UseConcMarkSweepGC was deprecated in version 9.0 and will likely be removed in a future release.
>   [junit4] <<< JVM J1: EOF ----
> 
>   [junit4] JVM J0: stderr was not empty, see: /home/jenkins/workspace/Lucene-Solr-8.1-Linux/lucene/build/benchmark/test/temp/junit4-J0-20190606_103452_9972815748515463772830.syserr
>   [junit4] >>> JVM J0 emitted unexpected output (verbatim) ----
>   [junit4] OpenJDK 64-Bit Server VM warning: Option UseConcMarkSweepGC was deprecated in version 9.0 and will likely be removed in a future release.
>   [junit4] <<< JVM J0: EOF ----
> 
> [...truncated 253 lines...]
>   [junit4] JVM J1: stderr was not empty, see: /home/jenkins/workspace/Lucene-Solr-8.1-Linux/lucene/build/classification/test/temp/junit4-J1-20190606_103505_3724111063186807896294.syserr
>   [junit4] >>> JVM J1 emitted unexpected output (verbatim) ----
>   [junit4] OpenJDK 64-Bit Server VM warning: Option UseConcMarkSweepGC was deprecated in version 9.0 and will likely be removed in a future release.
>   [junit4] <<< JVM J1: EOF ----
> 
>   [junit4] JVM J0: stderr was not empty, see: /home/jenkins/workspace/Lucene-Solr-8.1-Linux/lucene/build/classification/test/temp/junit4-J0-20190606_103505_37217955118366134669688.syserr
>   [junit4] >>> JVM J0 emitted unexpected output (verbatim) ----
>   [junit4] OpenJDK 64-Bit Server VM warning: Option UseConcMarkSweepGC was deprecated in version 9.0 and will likely be removed in a future release.
>   [junit4] <<< JVM J0: EOF ----
> 
> [...truncated 3 lines...]
>   [junit4] JVM J2: stderr was not empty, see: /home/jenkins/workspace/Lucene-Solr-8.1-Linux/lucene/build/classification/test/temp/junit4-J2-20190606_103505_37215639331377818295607.syserr
>   [junit4] >>> JVM J2 emitted unexpected output (verbatim) ----
>   [junit4] OpenJDK 64-Bit Server VM warning: Option UseConcMarkSweepGC was deprecated in version 9.0 and will likely be removed in a future release.
>   [junit4] <<< JVM J2: EOF ----
> 
> [...truncated 257 lines...]
>   [junit4] JVM J1: stderr was not empty, see: /home/jenkins/workspace/Lucene-Solr-8.1-Linux/lucene/build/codecs/test/temp/junit4-J1-20190606_103522_9192346468738586293031.syserr
>   [junit4] >>> JVM J1 emitted unexpected output (verbatim) ----
>   [junit4] OpenJDK 64-Bit Server VM warning: Option UseConcMarkSweepGC was deprecated in version 9.0 and will likely be removed in a future release.
>   [junit4] <<< JVM J1: EOF ----
> 
> [...truncated 7 lines...]
>   [junit4] JVM J0: stderr was not empty, see: /home/jenkins/workspace/Lucene-Solr-8.1-Linux/lucene/build/codecs/test/temp/junit4-J0-20190606_103522_9193448065923551790745.syserr
>   [junit4] >>> JVM J0 emitted unexpected output (verbatim) ----
>   [junit4] OpenJDK 64-Bit Server VM warning: Option UseConcMarkSweepGC was deprecated in version 9.0 and will likely be removed in a future release.
>   [junit4] <<< JVM J0: EOF ----
> 
> [...truncated 4 lines...]
>   [junit4] JVM J2: stderr was not empty, see: /home/jenkins/workspace/Lucene-Solr-8.1-Linux/lucene/build/codecs/test/temp/junit4-J2-20190606_103522_91910468640772795757784.syserr
>   [junit4] >>> JVM J2 emitted unexpected output (verbatim) ----
>   [junit4] OpenJDK 64-Bit Server VM warning: Option UseConcMarkSweepGC was deprecated in version 9.0 and will likely be removed in a future release.
>   [junit4] <<< JVM J2: EOF ----
> 
> [...truncated 236 lines...]
>   [junit4] JVM J1: stderr was not empty, see: /home/jenkins/workspace/Lucene-Solr-8.1-Linux/lucene/build/demo/test/temp/junit4-J1-20190606_104005_48114619799596883513626.syserr
>   [junit4] >>> JVM J1 emitted unexpected output (verbatim) ----
>   [junit4] OpenJDK 64-Bit Server VM warning: Option UseConcMarkSweepGC was deprecated in version 9.0 and will likely be removed in a future release.
>   [junit4] <<< JVM J1: EOF ----
> 
>   [junit4] JVM J0: stderr was not empty, see: /home/jenkins/workspace/Lucene-Solr-8.1-Linux/lucene/build/demo/test/temp/junit4-J0-20190606_104005_4811871472873174612614.syserr
>   [junit4] >>> JVM J0 emitted unexpected output (verbatim) ----
>   [junit4] OpenJDK 64-Bit Server VM warning: Option UseConcMarkSweepGC was deprecated in version 9.0 and will likely be removed in a future release.
>   [junit4] <<< JVM J0: EOF ----
> 
>   [junit4] JVM J2: stderr was not empty, see: /home/jenkins/workspace/Lucene-Solr-8.1-Linux/lucene/build/demo/test/temp/junit4-J2-20190606_104005_48117948109998683931770.syserr
>   [junit4] >>> JVM J2 emitted unexpected output (verbatim) ----
>   [junit4] OpenJDK 64-Bit Server VM warning: Option UseConcMarkSweepGC was deprecated in version 9.0 and will likely be removed in a future release.
>   [junit4] <<< JVM J2: EOF ----
> 
> [...truncated 173 lines...]
>   [junit4] JVM J2: stderr was not empty, see: /home/jenkins/workspace/Lucene-Solr-8.1-Linux/lucene/build/expressions/test/temp/junit4-J2-20190606_104010_21610915730124051594954.syserr
>   [junit4] >>> JVM J2 emitted unexpected output (verbatim) ----
>   [junit4] OpenJDK 64-Bit Server VM warning: Option UseConcMarkSweepGC was deprecated in version 9.0 and will likely be removed in a future release.
>   [junit4] <<< JVM J2: EOF ----
> 
>   [junit4] JVM J1: stderr was not empty, see: /home/jenkins/workspace/Lucene-Solr-8.1-Linux/lucene/build/expressions/test/temp/junit4-J1-20190606_104010_21312327599045814683773.syserr
>   [junit4] >>> JVM J1 emitted unexpected output (verbatim) ----
>   [junit4] OpenJDK 64-Bit Server VM warning: Option UseConcMarkSweepGC was deprecated in version 9.0 and will likely be removed in a future release.
>   [junit4] <<< JVM J1: EOF ----
> 
> [...truncated 6 lines...]
>   [junit4] JVM J0: stderr was not empty, see: /home/jenkins/workspace/Lucene-Solr-8.1-Linux/lucene/build/expressions/test/temp/junit4-J0-20190606_104010_21311178080837467411663.syserr
>   [junit4] >>> JVM J0 emitted unexpected output (verbatim) ----
>   [junit4] OpenJDK 64-Bit Server VM warning: Option UseConcMarkSweepGC was deprecated in version 9.0 and will likely be removed in a future release.
>   [junit4] <<< JVM J0: EOF ----
> 
> [...truncated 234 lines...]
>   [junit4] JVM J0: stderr was not empty, see: /home/jenkins/workspace/Lucene-Solr-8.1-Linux/lucene/build/facet/test/temp/junit4-J0-20190606_104020_4334638152414046070184.syserr
>   [junit4] >>> JVM J0 emitted unexpected output (verbatim) ----
>   [junit4] OpenJDK 64-Bit Server VM warning: Option UseConcMarkSweepGC was deprecated in version 9.0 and will likely be removed in a future release.
>   [junit4] <<< JVM J0: EOF ----
> 
> [...truncated 6 lines...]
>   [junit4] JVM J1: stderr was not empty, see: /home/jenkins/workspace/Lucene-Solr-8.1-Linux/lucene/build/facet/test/temp/junit4-J1-20190606_104020_43314138326157811672827.syserr
>   [junit4] >>> JVM J1 emitted unexpected output (verbatim) ----
>   [junit4] OpenJDK 64-Bit Server VM warning: Option UseConcMarkSweepGC was deprecated in version 9.0 and will likely be removed in a future release.
>   [junit4] <<< JVM J1: EOF ----
> 
>   [junit4] JVM J2: stderr was not empty, see: /home/jenkins/workspace/Lucene-Solr-8.1-Linux/lucene/build/facet/test/temp/junit4-J2-20190606_104020_43310172008682746908564.syserr
>   [junit4] >>> JVM J2 emitted unexpected output (verbatim) ----
>   [junit4] OpenJDK 64-Bit Server VM warning: Option UseConcMarkSweepGC was deprecated in version 9.0 and will likely be removed in a future release.
>   [junit4] <<< JVM J2: EOF ----
> 
> [...truncated 182 lines...]
>   [junit4] JVM J0: stderr was not empty, see: /home/jenkins/workspace/Lucene-Solr-8.1-Linux/lucene/build/grouping/test/temp/junit4-J0-20190606_104103_7507448566588483783061.syserr
>   [junit4] >>> JVM J0 emitted unexpected output (verbatim) ----
>   [junit4] OpenJDK 64-Bit Server VM warning: Option UseConcMarkSweepGC was deprecated in version 9.0 and will likely be removed in a future release.
>   [junit4] <<< JVM J0: EOF ----
> 
> [...truncated 3 lines...]
>   [junit4] JVM J1: stderr was not empty, see: /home/jenkins/workspace/Lucene-Solr-8.1-Linux/lucene/build/grouping/test/temp/junit4-J1-20190606_104103_75012311877033489139780.syserr
>   [junit4] >>> JVM J1 emitted unexpected output (verbatim) ----
>   [junit4] OpenJDK 64-Bit Server VM warning: Option UseConcMarkSweepGC was deprecated in version 9.0 and will likely be removed in a future release.
>   [junit4] <<< JVM J1: EOF ----
> 
> [...truncated 3 lines...]
>   [junit4] JVM J2: stderr was not empty, see: /home/jenkins/workspace/Lucene-Solr-8.1-Linux/lucene/build/grouping/test/temp/junit4-J2-20190606_104103_7509924293309498185915.syserr
>   [junit4] >>> JVM J2 emitted unexpected output (verbatim) ----
>   [junit4] OpenJDK 64-Bit Server VM warning: Option UseConcMarkSweepGC was deprecated in version 9.0 and will likely be removed in a future release.
>   [junit4] <<< JVM J2: EOF ----
> 
> [...truncated 246 lines...]
>   [junit4] JVM J0: stderr was not empty, see: /home/jenkins/workspace/Lucene-Solr-8.1-Linux/lucene/build/highlighter/test/temp/junit4-J0-20190606_104122_53614169462663560166259.syserr
>   [junit4] >>> JVM J0 emitted unexpected output (verbatim) ----
>   [junit4] OpenJDK 64-Bit Server VM warning: Option UseConcMarkSweepGC was deprecated in version 9.0 and will likely be removed in a future release.
>   [junit4] <<< JVM J0: EOF ----
> 
> [...truncated 3 lines...]
>   [junit4] JVM J1: stderr was not empty, see: /home/jenkins/workspace/Lucene-Solr-8.1-Linux/lucene/build/highlighter/test/temp/junit4-J1-20190606_104122_53612737591512411860132.syserr
>   [junit4] >>> JVM J1 emitted unexpected output (verbatim) ----
>   [junit4] OpenJDK 64-Bit Server VM warning: Option UseConcMarkSweepGC was deprecated in version 9.0 and will likely be removed in a future release.
>   [junit4] <<< JVM J1: EOF ----
> 
> [...truncated 12 lines...]
>   [junit4] JVM J2: stderr was not empty, see: /home/jenkins/workspace/Lucene-Solr-8.1-Linux/lucene/build/highlighter/test/temp/junit4-J2-20190606_104122_53710787538590565196397.syserr
>   [junit4] >>> JVM J2 emitted unexpected output (verbatim) ----
>   [junit4] OpenJDK 64-Bit Server VM warning: Option UseConcMarkSweepGC was deprecated in version 9.0 and will likely be removed in a future release.
>   [junit4] <<< JVM J2: EOF ----
> 
> [...truncated 169 lines...]
>   [junit4] JVM J2: stderr was not empty, see: /home/jenkins/workspace/Lucene-Solr-8.1-Linux/lucene/build/join/test/temp/junit4-J2-20190606_104150_25317737303861472431267.syserr
>   [junit4] >>> JVM J2 emitted unexpected output (verbatim) ----
>   [junit4] OpenJDK 64-Bit Server VM warning: Option UseConcMarkSweepGC was deprecated in version 9.0 and will likely be removed in a future release.
>   [junit4] <<< JVM J2: EOF ----
> 
>   [junit4] JVM J1: stderr was not empty, see: /home/jenkins/workspace/Lucene-Solr-8.1-Linux/lucene/build/join/test/temp/junit4-J1-20190606_104150_2521788274744412956386.syserr
>   [junit4] >>> JVM J1 emitted unexpected output (verbatim) ----
>   [junit4] OpenJDK 64-Bit Server VM warning: Option UseConcMarkSweepGC was deprecated in version 9.0 and will likely be removed in a future release.
>   [junit4] <<< JVM J1: EOF ----
> 
> [...truncated 6 lines...]
>   [junit4] JVM J0: stderr was not empty, see: /home/jenkins/workspace/Lucene-Solr-8.1-Linux/lucene/build/join/test/temp/junit4-J0-20190606_104150_2528926040805091932572.syserr
>   [junit4] >>> JVM J0 emitted unexpected output (verbatim) ----
>   [junit4] OpenJDK 64-Bit Server VM warning: Option UseConcMarkSweepGC was deprecated in version 9.0 and will likely be removed in a future release.
>   [junit4] <<< JVM J0: EOF ----
> 
> [...truncated 303 lines...]
>   [junit4] JVM J0: stderr was not empty, see: /home/jenkins/workspace/Lucene-Solr-8.1-Linux/lucene/build/luke/test/temp/junit4-J0-20190606_104222_8275510159832429959254.syserr
>   [junit4] >>> JVM J0 emitted unexpected output (verbatim) ----
>   [junit4] OpenJDK 64-Bit Server VM warning: Option UseConcMarkSweepGC was deprecated in version 9.0 and will likely be removed in a future release.
>   [junit4] <<< JVM J0: EOF ----
> 
>   [junit4] JVM J2: stderr was not empty, see: /home/jenkins/workspace/Lucene-Solr-8.1-Linux/lucene/build/luke/test/temp/junit4-J2-20190606_104222_8304197683461370913771.syserr
>   [junit4] >>> JVM J2 emitted unexpected output (verbatim) ----
>   [junit4] OpenJDK 64-Bit Server VM warning: Option UseConcMarkSweepGC was deprecated in version 9.0 and will likely be removed in a future release.
>   [junit4] <<< JVM J2: EOF ----
> 
> [...truncated 3 lines...]
>   [junit4] JVM J1: stderr was not empty, see: /home/jenkins/workspace/Lucene-Solr-8.1-Linux/lucene/build/luke/test/temp/junit4-J1-20190606_104222_8275114813958274244189.syserr
>   [junit4] >>> JVM J1 emitted unexpected output (verbatim) ----
>   [junit4] OpenJDK 64-Bit Server VM warning: Option UseConcMarkSweepGC was deprecated in version 9.0 and will likely be removed in a future release.
>   [junit4] <<< JVM J1: EOF ----
> 
> [...truncated 157 lines...]
>   [junit4] JVM J0: stderr was not empty, see: /home/jenkins/workspace/Lucene-Solr-8.1-Linux/lucene/build/memory/test/temp/junit4-J0-20190606_104232_3943328994394214244655.syserr
>   [junit4] >>> JVM J0 emitted unexpected output (verbatim) ----
>   [junit4] OpenJDK 64-Bit Server VM warning: Option UseConcMarkSweepGC was deprecated in version 9.0 and will likely be removed in a future release.
>   [junit4] <<< JVM J0: EOF ----
> 
> [...truncated 3 lines...]
>   [junit4] JVM J1: stderr was not empty, see: /home/jenkins/workspace/Lucene-Solr-8.1-Linux/lucene/build/memory/test/temp/junit4-J1-20190606_104232_39410789626656214197459.syserr
>   [junit4] >>> JVM J1 emitted unexpected output (verbatim) ----
>   [junit4] OpenJDK 64-Bit Server VM warning: Option UseConcMarkSweepGC was deprecated in version 9.0 and will likely be removed in a future release.
>   [junit4] <<< JVM J1: EOF ----
> 
> [...truncated 179 lines...]
>   [junit4] JVM J0: stderr was not empty, see: /home/jenkins/workspace/Lucene-Solr-8.1-Linux/lucene/build/misc/test/temp/junit4-J0-20190606_104253_5136512634731785770428.syserr
>   [junit4] >>> JVM J0 emitted unexpected output (verbatim) ----
>   [junit4] OpenJDK 64-Bit Server VM warning: Option UseConcMarkSweepGC was deprecated in version 9.0 and will likely be removed in a future release.
>   [junit4] <<< JVM J0: EOF ----
> 
> [...truncated 3 lines...]
>   [junit4] JVM J2: stderr was not empty, see: /home/jenkins/workspace/Lucene-Solr-8.1-Linux/lucene/build/misc/test/temp/junit4-J2-20190606_104253_51312435756567164438616.syserr
>   [junit4] >>> JVM J2 emitted unexpected output (verbatim) ----
>   [junit4] OpenJDK 64-Bit Server VM warning: Option UseConcMarkSweepGC was deprecated in version 9.0 and will likely be removed in a future release.
>   [junit4] <<< JVM J2: EOF ----
> 
> [...truncated 9 lines...]
>   [junit4] JVM J1: stderr was not empty, see: /home/jenkins/workspace/Lucene-Solr-8.1-Linux/lucene/build/misc/test/temp/junit4-J1-20190606_104253_5136672609203866454273.syserr
>   [junit4] >>> JVM J1 emitted unexpected output (verbatim) ----
>   [junit4] OpenJDK 64-Bit Server VM warning: Option UseConcMarkSweepGC was deprecated in version 9.0 and will likely be removed in a future release.
>   [junit4] <<< JVM J1: EOF ----
> 
> [...truncated 306 lines...]
>   [junit4] JVM J1: stderr was not empty, see: /home/jenkins/workspace/Lucene-Solr-8.1-Linux/lucene/build/queries/test/temp/junit4-J1-20190606_104328_3398265269807697343073.syserr
>   [junit4] >>> JVM J1 emitted unexpected output (verbatim) ----
>   [junit4] OpenJDK 64-Bit Server VM warning: Option UseConcMarkSweepGC was deprecated in version 9.0 and will likely be removed in a future release.
>   [junit4] <<< JVM J1: EOF ----
> 
> [...truncated 6 lines...]
>   [junit4] JVM J2: stderr was not empty, see: /home/jenkins/workspace/Lucene-Solr-8.1-Linux/lucene/build/queries/test/temp/junit4-J2-20190606_104328_33910757544888305020602.syserr
>   [junit4] >>> JVM J2 emitted unexpected output (verbatim) ----
>   [junit4] OpenJDK 64-Bit Server VM warning: Option UseConcMarkSweepGC was deprecated in version 9.0 and will likely be removed in a future release.
>   [junit4] <<< JVM J2: EOF ----
> 
>   [junit4] JVM J0: stderr was not empty, see: /home/jenkins/workspace/Lucene-Solr-8.1-Linux/lucene/build/queries/test/temp/junit4-J0-20190606_104328_3393669807123795754981.syserr
>   [junit4] >>> JVM J0 emitted unexpected output (verbatim) ----
>   [junit4] OpenJDK 64-Bit Server VM warning: Option UseConcMarkSweepGC was deprecated in version 9.0 and will likely be removed in a future release.
>   [junit4] <<< JVM J0: EOF ----
> 
> [...truncated 231 lines...]
>   [junit4] JVM J0: stderr was not empty, see: /home/jenkins/workspace/Lucene-Solr-8.1-Linux/lucene/build/queryparser/test/temp/junit4-J0-20190606_104340_4449469854896841466689.syserr
>   [junit4] >>> JVM J0 emitted unexpected output (verbatim) ----
>   [junit4] OpenJDK 64-Bit Server VM warning: Option UseConcMarkSweepGC was deprecated in version 9.0 and will likely be removed in a future release.
>   [junit4] <<< JVM J0: EOF ----
> 
> [...truncated 3 lines...]
>   [junit4] JVM J2: stderr was not empty, see: /home/jenkins/workspace/Lucene-Solr-8.1-Linux/lucene/build/queryparser/test/temp/junit4-J2-20190606_104340_44417197796743133602854.syserr
>   [junit4] >>> JVM J2 emitted unexpected output (verbatim) ----
>   [junit4] OpenJDK 64-Bit Server VM warning: Option UseConcMarkSweepGC was deprecated in version 9.0 and will likely be removed in a future release.
>   [junit4] <<< JVM J2: EOF ----
> 
> [...truncated 3 lines...]
>   [junit4] JVM J1: stderr was not empty, see: /home/jenkins/workspace/Lucene-Solr-8.1-Linux/lucene/build/queryparser/test/temp/junit4-J1-20190606_104340_4444049700290928422759.syserr
>   [junit4] >>> JVM J1 emitted unexpected output (verbatim) ----
>   [junit4] OpenJDK 64-Bit Server VM warning: Option UseConcMarkSweepGC was deprecated in version 9.0 and will likely be removed in a future release.
>   [junit4] <<< JVM J1: EOF ----
> 
> [...truncated 216 lines...]
>   [junit4] JVM J1: stderr was not empty, see: /home/jenkins/workspace/Lucene-Solr-8.1-Linux/lucene/build/replicator/test/temp/junit4-J1-20190606_104353_4707128538386582428293.syserr
>   [junit4] >>> JVM J1 emitted unexpected output (verbatim) ----
>   [junit4] OpenJDK 64-Bit Server VM warning: Option UseConcMarkSweepGC was deprecated in version 9.0 and will likely be removed in a future release.
>   [junit4] <<< JVM J1: EOF ----
> 
> [...truncated 3 lines...]
>   [junit4] JVM J2: stderr was not empty, see: /home/jenkins/workspace/Lucene-Solr-8.1-Linux/lucene/build/replicator/test/temp/junit4-J2-20190606_104353_4711319523820485048248.syserr
>   [junit4] >>> JVM J2 emitted unexpected output (verbatim) ----
>   [junit4] OpenJDK 64-Bit Server VM warning: Option UseConcMarkSweepGC was deprecated in version 9.0 and will likely be removed in a future release.
>   [junit4] <<< JVM J2: EOF ----
> 
> [...truncated 3 lines...]
>   [junit4] JVM J0: stderr was not empty, see: /home/jenkins/workspace/Lucene-Solr-8.1-Linux/lucene/build/replicator/test/temp/junit4-J0-20190606_104353_46812542047783818350267.syserr
>   [junit4] >>> JVM J0 emitted unexpected output (verbatim) ----
>   [junit4] OpenJDK 64-Bit Server VM warning: Option UseConcMarkSweepGC was deprecated in version 9.0 and will likely be removed in a future release.
>   [junit4] <<< JVM J0: EOF ----
> 
> [...truncated 250 lines...]
>   [junit4] JVM J1: stderr was not empty, see: /home/jenkins/workspace/Lucene-Solr-8.1-Linux/lucene/build/sandbox/test/temp/junit4-J1-20190606_104410_95816030345375976583180.syserr
>   [junit4] >>> JVM J1 emitted unexpected output (verbatim) ----
>   [junit4] OpenJDK 64-Bit Server VM warning: Option UseConcMarkSweepGC was deprecated in version 9.0 and will likely be removed in a future release.
>   [junit4] <<< JVM J1: EOF ----
> 
> [...truncated 3 lines...]
>   [junit4] JVM J0: stderr was not empty, see: /home/jenkins/workspace/Lucene-Solr-8.1-Linux/lucene/build/sandbox/test/temp/junit4-J0-20190606_104410_95815328449258752463889.syserr
>   [junit4] >>> JVM J0 emitted unexpected output (verbatim) ----
>   [junit4] OpenJDK 64-Bit Server VM warning: Option UseConcMarkSweepGC was deprecated in version 9.0 and will likely be removed in a future release.
>   [junit4] <<< JVM J0: EOF ----
> 
> [...truncated 3 lines...]
>   [junit4] JVM J2: stderr was not empty, see: /home/jenkins/workspace/Lucene-Solr-8.1-Linux/lucene/build/sandbox/test/temp/junit4-J2-20190606_104410_9581245977120647135191.syserr
>   [junit4] >>> JVM J2 emitted unexpected output (verbatim) ----
>   [junit4] OpenJDK 64-Bit Server VM warning: Option UseConcMarkSweepGC was deprecated in version 9.0 and will likely be removed in a future release.
>   [junit4] <<< JVM J2: EOF ----
> 
> [...truncated 299 lines...]
>   [junit4] JVM J0: stderr was not empty, see: /home/jenkins/workspace/Lucene-Solr-8.1-Linux/lucene/build/spatial-extras/test/temp/junit4-J0-20190606_104529_2787635788283781556643.syserr
>   [junit4] >>> JVM J0 emitted unexpected output (verbatim) ----
>   [junit4] OpenJDK 64-Bit Server VM warning: Option UseConcMarkSweepGC was deprecated in version 9.0 and will likely be removed in a future release.
>   [junit4] <<< JVM J0: EOF ----
> 
> [...truncated 3 lines...]
>   [junit4] JVM J1: stderr was not empty, see: /home/jenkins/workspace/Lucene-Solr-8.1-Linux/lucene/build/spatial-extras/test/temp/junit4-J1-20190606_104529_278800357269745407434.syserr
>   [junit4] >>> JVM J1 emitted unexpected output (verbatim) ----
>   [junit4] OpenJDK 64-Bit Server VM warning: Option UseConcMarkSweepGC was deprecated in version 9.0 and will likely be removed in a future release.
>   [junit4] <<< JVM J1: EOF ----
> 
> [...truncated 3 lines...]
>   [junit4] JVM J2: stderr was not empty, see: /home/jenkins/workspace/Lucene-Solr-8.1-Linux/lucene/build/spatial-extras/test/temp/junit4-J2-20190606_104529_2786523690777775353537.syserr
>   [junit4] >>> JVM J2 emitted unexpected output (verbatim) ----
>   [junit4] OpenJDK 64-Bit Server VM warning: Option UseConcMarkSweepGC was deprecated in version 9.0 and will likely be removed in a future release.
>   [junit4] <<< JVM J2: EOF ----
> 
> [...truncated 153 lines...]
>   [junit4] JVM J0: stderr was not empty, see: /home/jenkins/workspace/Lucene-Solr-8.1-Linux/lucene/build/spatial/test/temp/junit4-J0-20190606_104557_62011858308666542660787.syserr
>   [junit4] >>> JVM J0 emitted unexpected output (verbatim) ----
>   [junit4] OpenJDK 64-Bit Server VM warning: Option UseConcMarkSweepGC was deprecated in version 9.0 and will likely be removed in a future release.
>   [junit4] <<< JVM J0: EOF ----
> 
> [...truncated 187 lines...]
>   [junit4] JVM J2: stderr was not empty, see: /home/jenkins/workspace/Lucene-Solr-8.1-Linux/lucene/build/spatial3d/test/temp/junit4-J2-20190606_104600_30114315239675569364214.syserr
>   [junit4] >>> JVM J2 emitted unexpected output (verbatim) ----
>   [junit4] OpenJDK 64-Bit Server VM warning: Option UseConcMarkSweepGC was deprecated in version 9.0 and will likely be removed in a future release.
>   [junit4] <<< JVM J2: EOF ----
> 
>   [junit4] JVM J0: stderr was not empty, see: /home/jenkins/workspace/Lucene-Solr-8.1-Linux/lucene/build/spatial3d/test/temp/junit4-J0-20190606_104600_30112385245265493142298.syserr
>   [junit4] >>> JVM J0 emitted unexpected output (verbatim) ----
>   [junit4] OpenJDK 64-Bit Server VM warning: Option UseConcMarkSweepGC was deprecated in version 9.0 and will likely be removed in a future release.
>   [junit4] <<< JVM J0: EOF ----
> 
> [...truncated 6 lines...]
>   [junit4] JVM J1: stderr was not empty, see: /home/jenkins/workspace/Lucene-Solr-8.1-Linux/lucene/build/spatial3d/test/temp/junit4-J1-20190606_104600_3015589527073552897830.syserr
>   [junit4] >>> JVM J1 emitted unexpected output (verbatim) ----
>   [junit4] OpenJDK 64-Bit Server VM warning: Option UseConcMarkSweepGC was deprecated in version 9.0 and will likely be removed in a future release.
>   [junit4] <<< JVM J1: EOF ----
> 
> [...truncated 261 lines...]
>   [junit4] JVM J0: stderr was not empty, see: /home/jenkins/workspace/Lucene-Solr-8.1-Linux/lucene/build/suggest/test/temp/junit4-J0-20190606_104735_1426830862347556870910.syserr
>   [junit4] >>> JVM J0 emitted unexpected output (verbatim) ----
>   [junit4] OpenJDK 64-Bit Server VM warning: Option UseConcMarkSweepGC was deprecated in version 9.0 and will likely be removed in a future release.
>   [junit4] <<< JVM J0: EOF ----
> 
> [...truncated 3 lines...]
>   [junit4] JVM J2: stderr was not empty, see: /home/jenkins/workspace/Lucene-Solr-8.1-Linux/lucene/build/suggest/test/temp/junit4-J2-20190606_104735_1555671438209779962430.syserr
>   [junit4] >>> JVM J2 emitted unexpected output (verbatim) ----
>   [junit4] OpenJDK 64-Bit Server VM warning: Option UseConcMarkSweepGC was deprecated in version 9.0 and will likely be removed in a future release.
>   [junit4] <<< JVM J2: EOF ----
> 
> [...truncated 3 lines...]
>   [junit4] JVM J1: stderr was not empty, see: /home/jenkins/workspace/Lucene-Solr-8.1-Linux/lucene/build/suggest/test/temp/junit4-J1-20190606_104735_1427246135838971376923.syserr
>   [junit4] >>> JVM J1 emitted unexpected output (verbatim) ----
>   [junit4] OpenJDK 64-Bit Server VM warning: Option UseConcMarkSweepGC was deprecated in version 9.0 and will likely be removed in a future release.
>   [junit4] <<< JVM J1: EOF ----
> 
> [...truncated 2333 lines...]
>   [junit4] Suite: org.apache.solr.security.BasicAuthIntegrationTest
>   [junit4]   2> Creating dataDir: /home/jenkins/workspace/Lucene-Solr-8.1-Linux/solr/build/solr-core/test/J0/temp/solr.security.BasicAuthIntegrationTest_B3A7C371A669098D-001/init-core-data-001
>   [junit4]   2> 461336 WARN  (SUITE-BasicAuthIntegrationTest-seed#[B3A7C371A669098D]-worker) [    ] o.a.s.SolrTestCaseJ4 startTrackingSearchers: numOpens=1 numCloses=1
>   [junit4]   2> 461341 INFO  (SUITE-BasicAuthIntegrationTest-seed#[B3A7C371A669098D]-worker) [    ] o.a.s.SolrTestCaseJ4 Using PointFields (NUMERIC_POINTS_SYSPROP=true) w/NUMERIC_DOCVALUES_SYSPROP=false
>   [junit4]   2> 461342 INFO  (SUITE-BasicAuthIntegrationTest-seed#[B3A7C371A669098D]-worker) [    ] o.a.s.SolrTestCaseJ4 Randomized ssl (false) and clientAuth (true) via: @org.apache.solr.util.RandomizeSSL(reason="", ssl=0.0/0.0, value=0.0/0.0, clientAuth=0.0/0.0)
>   [junit4]   2> 461342 INFO  (SUITE-BasicAuthIntegrationTest-seed#[B3A7C371A669098D]-worker) [    ] o.a.s.SolrTestCaseJ4 SecureRandom sanity checks: test.solr.allowed.securerandom=null & java.security.egd=file:/dev/./urandom
>   [junit4]   2> 461345 INFO  (TEST-BasicAuthIntegrationTest.testBasicAuth-seed#[B3A7C371A669098D]) [    ] o.a.s.SolrTestCaseJ4 ###Starting testBasicAuth
>   [junit4]   2> 461346 INFO  (TEST-BasicAuthIntegrationTest.testBasicAuth-seed#[B3A7C371A669098D]) [    ] o.a.s.c.MiniSolrCloudCluster Starting cluster of 3 servers in /home/jenkins/workspace/Lucene-Solr-8.1-Linux/solr/build/solr-core/test/J0/temp/solr.security.BasicAuthIntegrationTest_B3A7C371A669098D-001/tempDir-001
>   [junit4]   2> 461347 INFO  (TEST-BasicAuthIntegrationTest.testBasicAuth-seed#[B3A7C371A669098D]) [    ] o.a.s.c.ZkTestServer STARTING ZK TEST SERVER
>   [junit4]   2> 461353 INFO  (ZkTestServer Run Thread) [    ] o.a.s.c.ZkTestServer client port:0.0.0.0/0.0.0.0:0
>   [junit4]   2> 461353 INFO  (ZkTestServer Run Thread) [    ] o.a.s.c.ZkTestServer Starting server
>   [junit4]   2> 461451 INFO  (TEST-BasicAuthIntegrationTest.testBasicAuth-seed#[B3A7C371A669098D]) [    ] o.a.s.c.ZkTestServer start zk server on port:41029
>   [junit4]   2> 461451 INFO  (TEST-BasicAuthIntegrationTest.testBasicAuth-seed#[B3A7C371A669098D]) [    ] o.a.s.c.ZkTestServer parse host and port list: 127.0.0.1:41029
>   [junit4]   2> 461451 INFO  (TEST-BasicAuthIntegrationTest.testBasicAuth-seed#[B3A7C371A669098D]) [    ] o.a.s.c.ZkTestServer connectin
> 
> [...truncated too long message...]
> 
> a.s.m.r.SolrJmxReporter Closing reporter [org.apache.solr.metrics.reporters.SolrJmxReporter@7a76c1d6: rootName = solr_33043, domain = solr.node, service url = null, agent id = null] for registry solr.node / com.codahale.metrics.MetricRegistry@79d6a15b
>   [junit4]   2> 49329 INFO  (jetty-closer-627-thread-1) [    ] o.a.s.m.SolrMetricManager Closing metric reporters for registry=solr.jvm, tag=null
>   [junit4]   2> 49329 INFO  (jetty-closer-627-thread-1) [    ] o.a.s.m.r.SolrJmxReporter Closing reporter [org.apache.solr.metrics.reporters.SolrJmxReporter@3a36e69a: rootName = solr_37407, domain = solr.jvm, service url = null, agent id = null] for registry solr.jvm / com.codahale.metrics.MetricRegistry@39f6241f
>   [junit4]   2> 49330 INFO  (jetty-closer-627-thread-2) [    ] o.a.s.m.SolrMetricManager Closing metric reporters for registry=solr.jvm, tag=null
>   [junit4]   2> 49330 INFO  (jetty-closer-627-thread-2) [    ] o.a.s.m.r.SolrJmxReporter Closing reporter [org.apache.solr.metrics.reporters.SolrJmxReporter@4aac78a8: rootName = solr_33043, domain = solr.jvm, service url = null, agent id = null] for registry solr.jvm / com.codahale.metrics.MetricRegistry@39f6241f
>   [junit4]   2> 49331 INFO  (jetty-closer-627-thread-1) [    ] o.a.s.m.SolrMetricManager Closing metric reporters for registry=solr.jetty, tag=null
>   [junit4]   2> 49331 INFO  (jetty-closer-627-thread-1) [    ] o.a.s.m.r.SolrJmxReporter Closing reporter [org.apache.solr.metrics.reporters.SolrJmxReporter@313cae0c: rootName = solr_37407, domain = solr.jetty, service url = null, agent id = null] for registry solr.jetty / com.codahale.metrics.MetricRegistry@22b1871e
>   [junit4]   2> 49331 INFO  (jetty-closer-627-thread-1) [    ] o.a.s.m.SolrMetricManager Closing metric reporters for registry=solr.cluster, tag=null
>   [junit4]   2> 49331 INFO  (jetty-closer-627-thread-2) [    ] o.a.s.m.SolrMetricManager Closing metric reporters for registry=solr.jetty, tag=null
>   [junit4]   2> 49331 INFO  (jetty-closer-627-thread-2) [    ] o.a.s.m.r.SolrJmxReporter Closing reporter [org.apache.solr.metrics.reporters.SolrJmxReporter@73fe4050: rootName = solr_33043, domain = solr.jetty, service url = null, agent id = null] for registry solr.jetty / com.codahale.metrics.MetricRegistry@22b1871e
>   [junit4]   2> 49331 INFO  (jetty-closer-627-thread-2) [    ] o.a.s.m.SolrMetricManager Closing metric reporters for registry=solr.cluster, tag=null
>   [junit4]   2> 49332 INFO  (closeThreadPool-634-thread-2) [    ] o.a.s.c.Overseer Overseer (id=72379794047631368-127.0.0.1:37407_solr-n_0000000000) closing
>   [junit4]   2> 49332 INFO  (OverseerStateUpdate-72379794047631368-127.0.0.1:37407_solr-n_0000000000) [n:127.0.0.1:37407_solr    ] o.a.s.c.Overseer Overseer Loop exiting : 127.0.0.1:37407_solr
>   [junit4]   2> 49332 INFO  (OverseerAutoScalingTriggerThread-72379794047631368-127.0.0.1:37407_solr-n_0000000000) [    ] o.a.s.c.a.OverseerTriggerThread OverseerTriggerThread woken up but we are closed, exiting.
>   [junit4]   2> 49339 INFO  (closeThreadPool-634-thread-1) [    ] o.a.s.c.Overseer Overseer (id=72379794047631368-127.0.0.1:37407_solr-n_0000000000) closing
>   [junit4]   2> 49339 WARN  (NIOServerCxn.Factory:0.0.0.0/0.0.0.0:0) [    ] o.a.z.s.NIOServerCnxn Unable to read additional data from client sessionid 0x101250a09200009, likely client has closed socket
>   [junit4]   2> 49339 INFO  (jetty-closer-627-thread-1) [    ] o.a.s.c.Overseer Overseer (id=72379794047631368-127.0.0.1:37407_solr-n_0000000000) closing
>   [junit4]   2> 49339 WARN  (NIOServerCxn.Factory:0.0.0.0/0.0.0.0:0) [    ] o.a.z.s.NIOServerCnxn Unable to read additional data from client sessionid 0x101250a09200006, likely client has closed socket
>   [junit4]   2> 49339 WARN  (NIOServerCxn.Factory:0.0.0.0/0.0.0.0:0) [    ] o.a.z.s.NIOServerCnxn Unable to read additional data from client sessionid 0x101250a09200008, likely client has closed socket
>   [junit4]   2> 49346 INFO  (zkCallback-618-thread-1) [    ] o.a.s.c.c.ZkStateReader Updated live nodes from ZooKeeper... (2) -> (0)
>   [junit4]   2> 49347 INFO  (jetty-closer-627-thread-1) [    ] o.e.j.s.AbstractConnector Stopped ServerConnector@4590e44b{HTTP/1.1,[http/1.1, h2c]}{127.0.0.1:0}
>   [junit4]   2> 49348 INFO  (jetty-closer-627-thread-1) [    ] o.e.j.s.h.ContextHandler Stopped o.e.j.s.ServletContextHandler@1acb5240{/solr,null,UNAVAILABLE}
>   [junit4]   2> 49348 INFO  (jetty-closer-627-thread-1) [    ] o.e.j.s.session node0 Stopped scavenging
>   [junit4]   2> 49349 INFO  (jetty-closer-627-thread-2) [    ] o.e.j.s.AbstractConnector Stopped ServerConnector@5564b233{HTTP/1.1,[http/1.1, h2c]}{127.0.0.1:0}
>   [junit4]   2> 49349 INFO  (jetty-closer-627-thread-2) [    ] o.e.j.s.h.ContextHandler Stopped o.e.j.s.ServletContextHandler@1bb6e7ab{/solr,null,UNAVAILABLE}
>   [junit4]   2> 49349 INFO  (jetty-closer-627-thread-2) [    ] o.e.j.s.session node0 Stopped scavenging
>   [junit4]   2> 49350 INFO  (TEST-JWTAuthPluginIntegrationTest.infoRequestWithoutToken-seed#[B3A7C371A669098D]) [    ] o.a.s.c.ZkTestServer Shutting down ZkTestServer.
>   [junit4]   2> 49350 WARN  (ZkTestServer Run Thread) [    ] o.a.s.c.ZkTestServer Watch limit violations: 
>   [junit4]   2> Maximum concurrent create/delete watches above limit:
>   [junit4]   2> 
>   [junit4]   2>    5    /solr/aliases.json
>   [junit4]   2>    5    /solr/clusterprops.json
>   [junit4]   2>    2    /solr/security.json
>   [junit4]   2> 
>   [junit4]   2> Maximum concurrent data watches above limit:
>   [junit4]   2> 
>   [junit4]   2>    5    /solr/clusterstate.json
>   [junit4]   2>    5    /solr/clusterprops.json
>   [junit4]   2> 
>   [junit4]   2> Maximum concurrent children watches above limit:
>   [junit4]   2> 
>   [junit4]   2>    5    /solr/live_nodes
>   [junit4]   2>    5    /solr/collections
>   [junit4]   2> 
>   [junit4]   2> 49351 INFO  (TEST-JWTAuthPluginIntegrationTest.infoRequestWithoutToken-seed#[B3A7C371A669098D]) [    ] o.a.s.c.ZkTestServer parse host and port list: 127.0.0.1:42629
>   [junit4]   2> 49351 INFO  (TEST-JWTAuthPluginIntegrationTest.infoRequestWithoutToken-seed#[B3A7C371A669098D]) [    ] o.a.s.c.ZkTestServer connecting to 127.0.0.1 42629
>   [junit4]   2> 49352 INFO  (TEST-JWTAuthPluginIntegrationTest.infoRequestWithoutToken-seed#[B3A7C371A669098D]) [    ] o.a.s.SolrTestCaseJ4 ###Ending infoRequestWithoutToken
>   [junit4] OK      0.58s J1 | JWTAuthPluginIntegrationTest.infoRequestWithoutToken
>   [junit4]   2> NOTE: leaving temporary files on disk at: /home/jenkins/workspace/Lucene-Solr-8.1-Linux/solr/build/solr-core/test/J1/temp/solr.security.JWTAuthPluginIntegrationTest_B3A7C371A669098D-002
>   [junit4]   2> Jun 06, 2019 11:37:27 AM com.carrotsearch.randomizedtesting.ThreadLeakControl checkThreadLeaks
>   [junit4]   2> WARNING: Will linger awaiting termination of 1 leaked thread(s).
>   [junit4]   2> NOTE: test params are: codec=Asserting(Lucene80), sim=Asserting(org.apache.lucene.search.similarities.AssertingSimilarity@6e1b69b9), locale=fr-TN, timezone=America/Fort_Wayne
>   [junit4]   2> NOTE: Linux 4.18.0-17-generic amd64/Oracle Corporation 11.0.2 (64-bit)/cpus=8,threads=1,free=370213552,total=518979584
>   [junit4]   2> NOTE: All tests run in this JVM: [BasicAuthIntegrationTest, JWTAuthPluginIntegrationTest, BasicAuthIntegrationTest, JWTAuthPluginIntegrationTest]
>   [junit4] Completed [10/10 (10!)] on J1 in 8.76s, 3 tests, 1 failure <<< FAILURES!
> 
> [...truncated 1 lines...]
>   [junit4] JVM J1: stderr was not empty, see: /home/jenkins/workspace/Lucene-Solr-8.1-Linux/solr/build/solr-core/test/temp/junit4-J1-20190606_113637_45310839599299182614461.syserr
>   [junit4] >>> JVM J1 emitted unexpected output (verbatim) ----
>   [junit4] OpenJDK 64-Bit Server VM warning: Option UseConcMarkSweepGC was deprecated in version 9.0 and will likely be removed in a future release.
>   [junit4] <<< JVM J1: EOF ----
> 
> [...truncated 19 lines...]
> BUILD FAILED
> /home/jenkins/workspace/Lucene-Solr-8.1-Linux/lucene/common-build.xml:1572: The following error occurred while executing this line:
> /home/jenkins/workspace/Lucene-Solr-8.1-Linux/lucene/common-build.xml:1099: There were test failures: 10 suites, 20 tests, 10 failures [seed: B3A7C371A669098D]
> 
> Total time: 53 seconds
> 
> [repro] Setting last failure code to 256
> 
> [repro] Failures:
> [repro]   5/5 failed: org.apache.solr.security.BasicAuthIntegrationTest
> [repro]   5/5 failed: org.apache.solr.security.JWTAuthPluginIntegrationTest
> [repro] Exiting with code 256
> + mv lucene/build lucene/build.repro
> + mv solr/build solr/build.repro
> + mv lucene/build.orig lucene/build
> + mv solr/build.orig solr/build
> Archiving artifacts
> Setting ANT_1_8_2_HOME=/home/jenkins/tools/hudson.tasks.Ant_AntInstallation/ANT_1.8.2
> [WARNINGS] Parsing warnings in console log with parser Java Compiler (javac)
> Setting ANT_1_8_2_HOME=/home/jenkins/tools/hudson.tasks.Ant_AntInstallation/ANT_1.8.2
> No credentials specified
> Setting ANT_1_8_2_HOME=/home/jenkins/tools/hudson.tasks.Ant_AntInstallation/ANT_1.8.2
> <Git Blamer> Using GitBlamer to create author and commit information for all warnings.
> <Git Blamer> GIT_COMMIT=02a207edd3b858bfeb7c91f0584a278e8825394d, workspace=/home/jenkins/workspace/Lucene-Solr-8.1-Linux
> [WARNINGS] Computing warning deltas based on reference build #390
> Recording test results
> Setting ANT_1_8_2_HOME=/home/jenkins/tools/hudson.tasks.Ant_AntInstallation/ANT_1.8.2
> Build step 'Publish JUnit test result report' changed build result to UNSTABLE
> Email was triggered for: Unstable (Test Failures)
> Sending email for trigger: Unstable (Test Failures)
> Setting ANT_1_8_2_HOME=/home/jenkins/tools/hudson.tasks.Ant_AntInstallation/ANT_1.8.2
> Setting ANT_1_8_2_HOME=/home/jenkins/tools/hudson.tasks.Ant_AntInstallation/ANT_1.8.2
> Setting ANT_1_8_2_HOME=/home/jenkins/tools/hudson.tasks.Ant_AntInstallation/ANT_1.8.2
> Setting ANT_1_8_2_HOME=/home/jenkins/tools/hudson.tasks.Ant_AntInstallation/ANT_1.8.2
> Setting ANT_1_8_2_HOME=/home/jenkins/tools/hudson.tasks.Ant_AntInstallation/ANT_1.8.2
> Setting ANT_1_8_2_HOME=/home/jenkins/tools/hudson.tasks.Ant_AntInstallation/ANT_1.8.2
> 
> ---------------------------------------------------------------------
> To unsubscribe, e-mail: dev-unsubscribe@lucene.apache.org
> For additional commands, e-mail: dev-help@lucene.apache.org

---------------------------------------------------------------------
To unsubscribe, e-mail: dev-unsubscribe@lucene.apache.org
For additional commands, e-mail: dev-help@lucene.apache.org


Mime
View raw message