lucene-dev mailing list archives

Site index · List index
Message view « Date » · « Thread »
Top « Date » · « Thread »
From Apache Jenkins Server <jenk...@builds.apache.org>
Subject [JENKINS] Lucene-Solr-Tests-8.1 - Build # 59 - Unstable
Date Sat, 01 Jun 2019 21:24:01 GMT
Build: https://builds.apache.org/job/Lucene-Solr-Tests-8.1/59/

1 tests failed.
FAILED:  org.apache.solr.cloud.MetricsHistoryWithAuthIntegrationTest.testValuesAreCollected

Error Message:
Expected memory.heap.used > 0 in history

Stack Trace:
java.lang.AssertionError: Expected memory.heap.used > 0 in history
	at __randomizedtesting.SeedInfo.seed([797E8C9A30851C5C:5183D1FDE1618319]:0)
	at org.junit.Assert.fail(Assert.java:88)
	at org.junit.Assert.assertTrue(Assert.java:41)
	at org.apache.solr.cloud.MetricsHistoryWithAuthIntegrationTest.testValuesAreCollected(MetricsHistoryWithAuthIntegrationTest.java:91)
	at sun.reflect.NativeMethodAccessorImpl.invoke0(Native Method)
	at sun.reflect.NativeMethodAccessorImpl.invoke(NativeMethodAccessorImpl.java:62)
	at sun.reflect.DelegatingMethodAccessorImpl.invoke(DelegatingMethodAccessorImpl.java:43)
	at java.lang.reflect.Method.invoke(Method.java:498)
	at com.carrotsearch.randomizedtesting.RandomizedRunner.invoke(RandomizedRunner.java:1750)
	at com.carrotsearch.randomizedtesting.RandomizedRunner$8.evaluate(RandomizedRunner.java:938)
	at com.carrotsearch.randomizedtesting.RandomizedRunner$9.evaluate(RandomizedRunner.java:974)
	at com.carrotsearch.randomizedtesting.RandomizedRunner$10.evaluate(RandomizedRunner.java:988)
	at com.carrotsearch.randomizedtesting.rules.SystemPropertiesRestoreRule$1.evaluate(SystemPropertiesRestoreRule.java:57)
	at org.apache.lucene.util.TestRuleSetupTeardownChained$1.evaluate(TestRuleSetupTeardownChained.java:49)
	at org.apache.lucene.util.AbstractBeforeAfterRule$1.evaluate(AbstractBeforeAfterRule.java:45)
	at org.apache.lucene.util.TestRuleThreadAndTestName$1.evaluate(TestRuleThreadAndTestName.java:48)
	at org.apache.lucene.util.TestRuleIgnoreAfterMaxFailures$1.evaluate(TestRuleIgnoreAfterMaxFailures.java:64)
	at org.apache.lucene.util.TestRuleMarkFailure$1.evaluate(TestRuleMarkFailure.java:47)
	at com.carrotsearch.randomizedtesting.rules.StatementAdapter.evaluate(StatementAdapter.java:36)
	at com.carrotsearch.randomizedtesting.ThreadLeakControl$StatementRunner.run(ThreadLeakControl.java:368)
	at com.carrotsearch.randomizedtesting.ThreadLeakControl.forkTimeoutingTask(ThreadLeakControl.java:817)
	at com.carrotsearch.randomizedtesting.ThreadLeakControl$3.evaluate(ThreadLeakControl.java:468)
	at com.carrotsearch.randomizedtesting.RandomizedRunner.runSingleTest(RandomizedRunner.java:947)
	at com.carrotsearch.randomizedtesting.RandomizedRunner$5.evaluate(RandomizedRunner.java:832)
	at com.carrotsearch.randomizedtesting.RandomizedRunner$6.evaluate(RandomizedRunner.java:883)
	at com.carrotsearch.randomizedtesting.RandomizedRunner$7.evaluate(RandomizedRunner.java:894)
	at com.carrotsearch.randomizedtesting.rules.StatementAdapter.evaluate(StatementAdapter.java:36)
	at com.carrotsearch.randomizedtesting.rules.SystemPropertiesRestoreRule$1.evaluate(SystemPropertiesRestoreRule.java:57)
	at org.apache.lucene.util.AbstractBeforeAfterRule$1.evaluate(AbstractBeforeAfterRule.java:45)
	at com.carrotsearch.randomizedtesting.rules.StatementAdapter.evaluate(StatementAdapter.java:36)
	at org.apache.lucene.util.TestRuleStoreClassName$1.evaluate(TestRuleStoreClassName.java:41)
	at com.carrotsearch.randomizedtesting.rules.NoShadowingOrOverridesOnMethodsRule$1.evaluate(NoShadowingOrOverridesOnMethodsRule.java:40)
	at com.carrotsearch.randomizedtesting.rules.NoShadowingOrOverridesOnMethodsRule$1.evaluate(NoShadowingOrOverridesOnMethodsRule.java:40)
	at com.carrotsearch.randomizedtesting.rules.StatementAdapter.evaluate(StatementAdapter.java:36)
	at com.carrotsearch.randomizedtesting.rules.StatementAdapter.evaluate(StatementAdapter.java:36)
	at com.carrotsearch.randomizedtesting.rules.StatementAdapter.evaluate(StatementAdapter.java:36)
	at org.apache.lucene.util.TestRuleAssertionsRequired$1.evaluate(TestRuleAssertionsRequired.java:53)
	at org.apache.lucene.util.TestRuleMarkFailure$1.evaluate(TestRuleMarkFailure.java:47)
	at org.apache.lucene.util.TestRuleIgnoreAfterMaxFailures$1.evaluate(TestRuleIgnoreAfterMaxFailures.java:64)
	at org.apache.lucene.util.TestRuleIgnoreTestSuites$1.evaluate(TestRuleIgnoreTestSuites.java:54)
	at com.carrotsearch.randomizedtesting.rules.StatementAdapter.evaluate(StatementAdapter.java:36)
	at com.carrotsearch.randomizedtesting.ThreadLeakControl$StatementRunner.run(ThreadLeakControl.java:368)
	at java.lang.Thread.run(Thread.java:748)




Build Log:
[...truncated 12900 lines...]
   [junit4] Suite: org.apache.solr.cloud.MetricsHistoryWithAuthIntegrationTest
   [junit4]   2> 53655 INFO  (SUITE-MetricsHistoryWithAuthIntegrationTest-seed#[797E8C9A30851C5C]-worker)
[    ] o.a.s.SolrTestCaseJ4 SecureRandom sanity checks: test.solr.allowed.securerandom=null
& java.security.egd=file:/dev/./urandom
   [junit4]   2> Creating dataDir: /home/jenkins/jenkins-slave/workspace/Lucene-Solr-Tests-8.1/solr/build/solr-core/test/J0/temp/solr.cloud.MetricsHistoryWithAuthIntegrationTest_797E8C9A30851C5C-001/init-core-data-001
   [junit4]   2> 53689 WARN  (SUITE-MetricsHistoryWithAuthIntegrationTest-seed#[797E8C9A30851C5C]-worker)
[    ] o.a.s.SolrTestCaseJ4 startTrackingSearchers: numOpens=4 numCloses=4
   [junit4]   2> 53689 INFO  (SUITE-MetricsHistoryWithAuthIntegrationTest-seed#[797E8C9A30851C5C]-worker)
[    ] o.a.s.SolrTestCaseJ4 Using PointFields (NUMERIC_POINTS_SYSPROP=true) w/NUMERIC_DOCVALUES_SYSPROP=false
   [junit4]   2> 53692 INFO  (SUITE-MetricsHistoryWithAuthIntegrationTest-seed#[797E8C9A30851C5C]-worker)
[    ] o.a.s.SolrTestCaseJ4 Randomized ssl (true) and clientAuth (false) via: @org.apache.solr.util.RandomizeSSL(reason=,
ssl=NaN, value=NaN, clientAuth=NaN)
   [junit4]   2> 54187 INFO  (SUITE-MetricsHistoryWithAuthIntegrationTest-seed#[797E8C9A30851C5C]-worker)
[    ] o.a.s.c.MiniSolrCloudCluster Starting cluster of 1 servers in /home/jenkins/jenkins-slave/workspace/Lucene-Solr-Tests-8.1/solr/build/solr-core/test/J0/temp/solr.cloud.MetricsHistoryWithAuthIntegrationTest_797E8C9A30851C5C-001/tempDir-001
   [junit4]   2> 54307 INFO  (SUITE-MetricsHistoryWithAuthIntegrationTest-seed#[797E8C9A30851C5C]-worker)
[    ] o.a.s.c.ZkTestServer STARTING ZK TEST SERVER
   [junit4]   2> 54486 INFO  (ZkTestServer Run Thread) [    ] o.a.s.c.ZkTestServer client
port:0.0.0.0/0.0.0.0:0
   [junit4]   2> 54486 INFO  (ZkTestServer Run Thread) [    ] o.a.s.c.ZkTestServer Starting
server
   [junit4]   2> 55016 INFO  (SUITE-MetricsHistoryWithAuthIntegrationTest-seed#[797E8C9A30851C5C]-worker)
[    ] o.a.s.c.ZkTestServer start zk server on port:34306
   [junit4]   2> 55017 INFO  (SUITE-MetricsHistoryWithAuthIntegrationTest-seed#[797E8C9A30851C5C]-worker)
[    ] o.a.s.c.ZkTestServer parse host and port list: 127.0.0.1:34306
   [junit4]   2> 55017 INFO  (SUITE-MetricsHistoryWithAuthIntegrationTest-seed#[797E8C9A30851C5C]-worker)
[    ] o.a.s.c.ZkTestServer connecting to 127.0.0.1 34306
   [junit4]   2> 55968 INFO  (zkConnectionManagerCallback-13-thread-1) [    ] o.a.s.c.c.ConnectionManager
zkClient has connected
   [junit4]   2> 56282 INFO  (zkConnectionManagerCallback-15-thread-1) [    ] o.a.s.c.c.ConnectionManager
zkClient has connected
   [junit4]   2> 56302 INFO  (zkConnectionManagerCallback-17-thread-1) [    ] o.a.s.c.c.ConnectionManager
zkClient has connected
   [junit4]   2> 56539 WARN  (jetty-launcher-18-thread-1) [    ] o.e.j.s.AbstractConnector
Ignoring deprecated socket close linger time
   [junit4]   2> 56589 INFO  (jetty-launcher-18-thread-1) [    ] o.a.s.c.s.e.JettySolrRunner
Start Jetty (original configured port=0)
   [junit4]   2> 56590 INFO  (jetty-launcher-18-thread-1) [    ] o.a.s.c.s.e.JettySolrRunner
Trying to start Jetty on port 0 try number 1 ...
   [junit4]   2> 56590 INFO  (jetty-launcher-18-thread-1) [    ] o.e.j.s.Server jetty-9.4.14.v20181114;
built: 2018-11-14T21:20:31.478Z; git: c4550056e785fb5665914545889f21dc136ad9e6; jvm 1.8.0_191-b12
   [junit4]   2> 56637 INFO  (jetty-launcher-18-thread-1) [    ] o.e.j.s.session DefaultSessionIdManager
workerName=node0
   [junit4]   2> 56637 INFO  (jetty-launcher-18-thread-1) [    ] o.e.j.s.session No SessionScavenger
set, using defaults
   [junit4]   2> 56638 INFO  (jetty-launcher-18-thread-1) [    ] o.e.j.s.session node0
Scavenging every 660000ms
   [junit4]   2> 56653 INFO  (jetty-launcher-18-thread-1) [    ] o.e.j.s.h.ContextHandler
Started o.e.j.s.ServletContextHandler@333f94a7{/solr,null,AVAILABLE}
   [junit4]   2> 56664 WARN  (jetty-launcher-18-thread-1) [    ] o.e.j.u.s.S.config No
Client EndPointIdentificationAlgorithm configured for SslContextFactory@2aa6503d[provider=null,keyStore=null,trustStore=null]
   [junit4]   2> 56726 INFO  (jetty-launcher-18-thread-1) [    ] o.e.j.s.AbstractConnector
Started ServerConnector@682f06ac{SSL,[ssl, http/1.1]}{127.0.0.1:45445}
   [junit4]   2> 56726 INFO  (jetty-launcher-18-thread-1) [    ] o.e.j.s.Server Started
@56827ms
   [junit4]   2> 56727 INFO  (jetty-launcher-18-thread-1) [    ] o.a.s.c.s.e.JettySolrRunner
Jetty properties: {hostContext=/solr, hostPort=45445}
   [junit4]   2> 56727 ERROR (jetty-launcher-18-thread-1) [    ] o.a.s.u.StartupLoggingUtils
Missing Java Option solr.log.dir. Logging may be missing or incomplete.
   [junit4]   2> 56727 INFO  (jetty-launcher-18-thread-1) [    ] o.a.s.s.SolrDispatchFilter
Using logger factory org.apache.logging.slf4j.Log4jLoggerFactory
   [junit4]   2> 56727 INFO  (jetty-launcher-18-thread-1) [    ] o.a.s.s.SolrDispatchFilter
 ___      _       Welcome to Apache Solr? version 8.1.1
   [junit4]   2> 56727 INFO  (jetty-launcher-18-thread-1) [    ] o.a.s.s.SolrDispatchFilter
/ __| ___| |_ _   Starting in cloud mode on port null
   [junit4]   2> 56727 INFO  (jetty-launcher-18-thread-1) [    ] o.a.s.s.SolrDispatchFilter
\__ \/ _ \ | '_|  Install dir: null
   [junit4]   2> 56727 INFO  (jetty-launcher-18-thread-1) [    ] o.a.s.s.SolrDispatchFilter
|___/\___/_|_|    Start time: 2019-06-01T19:16:51.179Z
   [junit4]   2> 56727 INFO  (jetty-launcher-18-thread-1) [    ] o.a.s.c.SolrResourceLoader
solr home defaulted to 'solr/' (could not find system property or JNDI)
   [junit4]   2> 56794 INFO  (zkConnectionManagerCallback-20-thread-1) [    ] o.a.s.c.c.ConnectionManager
zkClient has connected
   [junit4]   2> 56817 INFO  (jetty-launcher-18-thread-1) [    ] o.a.s.s.SolrDispatchFilter
solr.xml found in ZooKeeper. Loading...
   [junit4]   2> 57656 INFO  (jetty-launcher-18-thread-1) [    ] o.a.s.h.c.HttpShardHandlerFactory
Host whitelist initialized: WhitelistHostChecker [whitelistHosts=null, whitelistHostCheckingEnabled=true]
   [junit4]   2> 57657 WARN  (jetty-launcher-18-thread-1) [    ] o.a.s.c.s.i.Http2SolrClient
Create Http2SolrClient with HTTP/1.1 transport since Java 8 or lower versions does not support
SSL + HTTP/2
   [junit4]   2> 57857 WARN  (jetty-launcher-18-thread-1) [    ] o.e.j.u.s.S.config No
Client EndPointIdentificationAlgorithm configured for SslContextFactory@475b547d[provider=null,keyStore=null,trustStore=null]
   [junit4]   2> 57910 WARN  (jetty-launcher-18-thread-1) [    ] o.a.s.c.s.i.Http2SolrClient
Create Http2SolrClient with HTTP/1.1 transport since Java 8 or lower versions does not support
SSL + HTTP/2
   [junit4]   2> 58104 WARN  (jetty-launcher-18-thread-1) [    ] o.e.j.u.s.S.config No
Client EndPointIdentificationAlgorithm configured for SslContextFactory@ee3327e[provider=null,keyStore=null,trustStore=null]
   [junit4]   2> 58106 INFO  (jetty-launcher-18-thread-1) [    ] o.a.s.c.ZkContainer Zookeeper
client=127.0.0.1:34306/solr
   [junit4]   2> 58328 INFO  (zkConnectionManagerCallback-27-thread-1) [    ] o.a.s.c.c.ConnectionManager
zkClient has connected
   [junit4]   2> 58460 INFO  (zkConnectionManagerCallback-29-thread-1) [    ] o.a.s.c.c.ConnectionManager
zkClient has connected
   [junit4]   2> 59886 INFO  (jetty-launcher-18-thread-1) [n:127.0.0.1:45445_solr    ]
o.a.s.c.OverseerElectionContext I am going to be the leader 127.0.0.1:45445_solr
   [junit4]   2> 59889 INFO  (jetty-launcher-18-thread-1) [n:127.0.0.1:45445_solr    ]
o.a.s.c.Overseer Overseer (id=74793984869924869-127.0.0.1:45445_solr-n_0000000000) starting
   [junit4]   2> 60414 INFO  (zkConnectionManagerCallback-36-thread-1) [    ] o.a.s.c.c.ConnectionManager
zkClient has connected
   [junit4]   2> 60518 INFO  (jetty-launcher-18-thread-1) [n:127.0.0.1:45445_solr    ]
o.a.s.c.s.i.ZkClientClusterStateProvider Cluster at 127.0.0.1:34306/solr ready
   [junit4]   2> 61055 INFO  (jetty-launcher-18-thread-1) [n:127.0.0.1:45445_solr    ]
o.a.s.c.ZkController Register node as live in ZooKeeper:/live_nodes/127.0.0.1:45445_solr
   [junit4]   2> 61057 INFO  (OverseerStateUpdate-74793984869924869-127.0.0.1:45445_solr-n_0000000000)
[n:127.0.0.1:45445_solr    ] o.a.s.c.Overseer Starting to work on the main queue : 127.0.0.1:45445_solr
   [junit4]   2> 61299 INFO  (jetty-launcher-18-thread-1) [n:127.0.0.1:45445_solr    ]
o.a.s.c.CoreContainer Initializing authorization plugin: solr.RuleBasedAuthorizationPlugin
   [junit4]   2> 61369 INFO  (zkCallback-28-thread-1) [    ] o.a.s.c.c.ZkStateReader Updated
live nodes from ZooKeeper... (0) -> (1)
   [junit4]   2> 61463 INFO  (zkCallback-35-thread-1) [    ] o.a.s.c.c.ZkStateReader Updated
live nodes from ZooKeeper... (0) -> (1)
   [junit4]   2> 61663 INFO  (jetty-launcher-18-thread-1) [n:127.0.0.1:45445_solr    ]
o.a.s.c.CoreContainer Initializing authentication plugin: solr.BasicAuthPlugin
   [junit4]   2> 62118 INFO  (jetty-launcher-18-thread-1) [n:127.0.0.1:45445_solr    ]
o.a.s.h.a.MetricsHistoryHandler No .system collection, keeping metrics history in memory.
   [junit4]   2> 62428 INFO  (jetty-launcher-18-thread-1) [n:127.0.0.1:45445_solr    ]
o.a.s.m.r.SolrJmxReporter JMX monitoring for 'solr_45445.solr.node' (registry 'solr.node')
enabled at server: com.sun.jmx.mbeanserver.JmxMBeanServer@572291d6
   [junit4]   2> 62590 INFO  (jetty-launcher-18-thread-1) [n:127.0.0.1:45445_solr    ]
o.a.s.m.r.SolrJmxReporter JMX monitoring for 'solr_45445.solr.jvm' (registry 'solr.jvm') enabled
at server: com.sun.jmx.mbeanserver.JmxMBeanServer@572291d6
   [junit4]   2> 62590 INFO  (jetty-launcher-18-thread-1) [n:127.0.0.1:45445_solr    ]
o.a.s.m.r.SolrJmxReporter JMX monitoring for 'solr_45445.solr.jetty' (registry 'solr.jetty')
enabled at server: com.sun.jmx.mbeanserver.JmxMBeanServer@572291d6
   [junit4]   2> 62592 INFO  (jetty-launcher-18-thread-1) [n:127.0.0.1:45445_solr    ]
o.a.s.c.CorePropertiesLocator Found 0 core definitions underneath /home/jenkins/jenkins-slave/workspace/Lucene-Solr-Tests-8.1/solr/build/solr-core/test/J0/temp/solr.cloud.MetricsHistoryWithAuthIntegrationTest_797E8C9A30851C5C-001/tempDir-001/node1/.
   [junit4]   2> 63030 INFO  (zkConnectionManagerCallback-42-thread-1) [    ] o.a.s.c.c.ConnectionManager
zkClient has connected
   [junit4]   2> 63102 INFO  (SUITE-MetricsHistoryWithAuthIntegrationTest-seed#[797E8C9A30851C5C]-worker)
[    ] o.a.s.c.c.ZkStateReader Updated live nodes from ZooKeeper... (0) -> (1)
   [junit4]   2> 63196 INFO  (SUITE-MetricsHistoryWithAuthIntegrationTest-seed#[797E8C9A30851C5C]-worker)
[    ] o.a.s.c.s.i.ZkClientClusterStateProvider Cluster at 127.0.0.1:34306/solr ready
   [junit4]   2> 64098 DEBUG (MetricsHistoryHandler-33-thread-1) [    ] o.a.s.h.a.MetricsHistoryHandler
-- collectMetrics
   [junit4]   2> 65911 INFO  (qtp1149657878-85) [n:127.0.0.1:45445_solr    ] o.a.s.s.HttpSolrCall
[admin] webapp=null path=/admin/info/key params={omitHeader=true&wt=json} status=0 QTime=0
   [junit4]   2> 65983 INFO  (qtp1149657878-87) [    ] o.a.s.s.PKIAuthenticationPlugin
New Key obtained from  node: 127.0.0.1:45445_solr / MIIBIjANBgkqhkiG9w0BAQEFAAOCAQ8AMIIBCgKCAQEAoZhPiKKmFwOFyBO2IKdnCgqwLEo/Rs/cUfqHUzPWaZQ4W5coiBkR68gVc1kQD7KT8cqayqFHc/SvBYOoXJiw9ugVMX4uRCasUXrFDR+cnrny4ikLt+lKOOO0QfOsdl/xe5lJ2IY0NLbW/0wDSlJoYiBaQLU/Hl/yC1kuycfyjZKhHKgqYM4sBm/vIKAyQaV+4SAuM21Z3zmr4MVaQ1diOaSjf/QIEYPh7OTLbwg09vGdi8O22HXkCQdx9hW3nf4kwhA/ajJ99i5aSyKfJw3QfUuITqGL676M5eK1nbwXcoLOkms0VW7Xw7cmkBhJSnzzjbTDK9FI+PpCDtt5EQtqOQIDAQAB
   [junit4]   2> 66287 INFO  (qtp1149657878-87) [n:127.0.0.1:45445_solr    ] o.a.s.s.HttpSolrCall
[admin] webapp=null path=/admin/metrics params={wt=javabin&version=2&key=solr.jvm:os.processCpuLoad&key=solr.node:CONTAINER.fs.coreRoot.usableSpace&key=solr.jvm:os.systemLoadAverage&key=solr.jvm:memory.heap.used}
status=0 QTime=123
   [junit4]   2> 66648 INFO  (TEST-MetricsHistoryWithAuthIntegrationTest.testValuesAreCollected-seed#[797E8C9A30851C5C])
[    ] o.a.s.SolrTestCaseJ4 ###Starting testValuesAreCollected
   [junit4]   2> 67158 INFO  (qtp1149657878-84) [n:127.0.0.1:45445_solr    ] o.a.s.s.HttpSolrCall
[admin] webapp=null path=/admin/metrics/history params={name=solr.jvm&action=get&wt=javabin&version=2}
status=0 QTime=182
   [junit4]   2> 67325 INFO  (TEST-MetricsHistoryWithAuthIntegrationTest.testValuesAreCollected-seed#[797E8C9A30851C5C])
[    ] o.a.s.SolrTestCaseJ4 ###Ending testValuesAreCollected
   [junit4]   2> NOTE: reproduce with: ant test  -Dtestcase=MetricsHistoryWithAuthIntegrationTest
-Dtests.method=testValuesAreCollected -Dtests.seed=797E8C9A30851C5C -Dtests.multiplier=2 -Dtests.slow=true
-Dtests.locale=el-GR -Dtests.timezone=Indian/Kerguelen -Dtests.asserts=true -Dtests.file.encoding=US-ASCII
   [junit4] FAILURE 1.00s J0 | MetricsHistoryWithAuthIntegrationTest.testValuesAreCollected
<<<
   [junit4]    > Throwable #1: java.lang.AssertionError: Expected memory.heap.used >
0 in history
   [junit4]    > 	at __randomizedtesting.SeedInfo.seed([797E8C9A30851C5C:5183D1FDE1618319]:0)
   [junit4]    > 	at org.apache.solr.cloud.MetricsHistoryWithAuthIntegrationTest.testValuesAreCollected(MetricsHistoryWithAuthIntegrationTest.java:91)
   [junit4]    > 	at java.lang.Thread.run(Thread.java:748)
   [junit4]   2> 67487 INFO  (jetty-closer-43-thread-1) [    ] o.a.s.c.CoreContainer Shutting
down CoreContainer instance=1986458884
   [junit4]   2> 67487 INFO  (jetty-closer-43-thread-1) [    ] o.a.s.c.ZkController Remove
node as live in ZooKeeper:/live_nodes/127.0.0.1:45445_solr
   [junit4]   2> 67525 INFO  (jetty-closer-43-thread-1) [    ] o.a.s.c.ZkController Publish
this node as DOWN...
   [junit4]   2> 67525 INFO  (jetty-closer-43-thread-1) [    ] o.a.s.c.ZkController Publish
node=127.0.0.1:45445_solr as DOWN
   [junit4]   2> 67633 INFO  (jetty-closer-43-thread-1) [    ] o.a.s.c.TransientSolrCoreCacheDefault
Allocating transient cache for 2147483647 transient cores
   [junit4]   2> 67647 DEBUG (jetty-closer-43-thread-1) [    ] o.a.s.h.a.MetricsHistoryHandler
Closing 2097702941
   [junit4]   2> 67648 INFO  (jetty-closer-43-thread-1) [    ] o.a.s.m.SolrMetricManager
Closing metric reporters for registry=solr.node, tag=null
   [junit4]   2> 67704 INFO  (jetty-closer-43-thread-1) [    ] o.a.s.m.r.SolrJmxReporter
Closing reporter [org.apache.solr.metrics.reporters.SolrJmxReporter@22370cfb: rootName = solr_45445,
domain = solr.node, service url = null, agent id = null] for registry solr.node / com.codahale.metrics.MetricRegistry@123b79fd
   [junit4]   2> 67961 INFO  (jetty-closer-43-thread-1) [    ] o.a.s.m.SolrMetricManager
Closing metric reporters for registry=solr.jvm, tag=null
   [junit4]   2> 67962 INFO  (jetty-closer-43-thread-1) [    ] o.a.s.m.r.SolrJmxReporter
Closing reporter [org.apache.solr.metrics.reporters.SolrJmxReporter@752576e1: rootName = solr_45445,
domain = solr.jvm, service url = null, agent id = null] for registry solr.jvm / com.codahale.metrics.MetricRegistry@3116a63c
   [junit4]   2> 67982 INFO  (jetty-closer-43-thread-1) [    ] o.a.s.m.SolrMetricManager
Closing metric reporters for registry=solr.jetty, tag=null
   [junit4]   2> 67982 INFO  (jetty-closer-43-thread-1) [    ] o.a.s.m.r.SolrJmxReporter
Closing reporter [org.apache.solr.metrics.reporters.SolrJmxReporter@5f3bfe6b: rootName = solr_45445,
domain = solr.jetty, service url = null, agent id = null] for registry solr.jetty / com.codahale.metrics.MetricRegistry@9f75372
   [junit4]   2> 67982 INFO  (jetty-closer-43-thread-1) [    ] o.a.s.m.SolrMetricManager
Closing metric reporters for registry=solr.cluster, tag=null
   [junit4]   2> 68003 INFO  (closeThreadPool-47-thread-2) [    ] o.a.s.c.Overseer Overseer
(id=74793984869924869-127.0.0.1:45445_solr-n_0000000000) closing
   [junit4]   2> 68028 INFO  (OverseerStateUpdate-74793984869924869-127.0.0.1:45445_solr-n_0000000000)
[n:127.0.0.1:45445_solr    ] o.a.s.c.Overseer Overseer Loop exiting : 127.0.0.1:45445_solr
   [junit4]   2> 68045 INFO  (OverseerAutoScalingTriggerThread-74793984869924869-127.0.0.1:45445_solr-n_0000000000)
[    ] o.a.s.c.a.OverseerTriggerThread OverseerTriggerThread woken up but we are closed, exiting.
   [junit4]   2> 68122 INFO  (jetty-closer-43-thread-1) [    ] o.a.s.c.Overseer Overseer
(id=74793984869924869-127.0.0.1:45445_solr-n_0000000000) closing
   [junit4]   2> 68122 INFO  (closeThreadPool-47-thread-1) [    ] o.a.s.c.Overseer Overseer
(id=74793984869924869-127.0.0.1:45445_solr-n_0000000000) closing
   [junit4]   2> 68126 WARN  (NIOServerCxn.Factory:0.0.0.0/0.0.0.0:0) [    ] o.a.z.s.NIOServerCnxn
Unable to read additional data from client sessionid 0x109b8bba3820005, likely client has
closed socket
   [junit4]   2> 68170 INFO  (jetty-closer-43-thread-1) [    ] o.e.j.s.AbstractConnector
Stopped ServerConnector@682f06ac{SSL,[ssl, http/1.1]}{127.0.0.1:0}
   [junit4]   2> 68173 INFO  (jetty-closer-43-thread-1) [    ] o.e.j.s.h.ContextHandler
Stopped o.e.j.s.ServletContextHandler@333f94a7{/solr,null,UNAVAILABLE}
   [junit4]   2> 68173 INFO  (jetty-closer-43-thread-1) [    ] o.e.j.s.session node0 Stopped
scavenging
   [junit4]   2> 68174 INFO  (SUITE-MetricsHistoryWithAuthIntegrationTest-seed#[797E8C9A30851C5C]-worker)
[    ] o.a.s.c.ZkTestServer Shutting down ZkTestServer.
   [junit4]   2> 68230 WARN  (ZkTestServer Run Thread) [    ] o.a.s.c.ZkTestServer Watch
limit violations: 
   [junit4]   2> Maximum concurrent create/delete watches above limit:
   [junit4]   2> 
   [junit4]   2> 	3	/solr/aliases.json
   [junit4]   2> 
   [junit4]   2> Maximum concurrent data watches above limit:
   [junit4]   2> 
   [junit4]   2> 	3	/solr/clusterstate.json
   [junit4]   2> 	3	/solr/clusterprops.json
   [junit4]   2> 
   [junit4]   2> Maximum concurrent children watches above limit:
   [junit4]   2> 
   [junit4]   2> 	3	/solr/live_nodes
   [junit4]   2> 	3	/solr/collections
   [junit4]   2> 
   [junit4]   2> 68335 INFO  (SUITE-MetricsHistoryWithAuthIntegrationTest-seed#[797E8C9A30851C5C]-worker)
[    ] o.a.s.c.ZkTestServer parse host and port list: 127.0.0.1:34306
   [junit4]   2> 68335 INFO  (SUITE-MetricsHistoryWithAuthIntegrationTest-seed#[797E8C9A30851C5C]-worker)
[    ] o.a.s.c.ZkTestServer connecting to 127.0.0.1 34306
   [junit4]   2> NOTE: leaving temporary files on disk at: /home/jenkins/jenkins-slave/workspace/Lucene-Solr-Tests-8.1/solr/build/solr-core/test/J0/temp/solr.cloud.MetricsHistoryWithAuthIntegrationTest_797E8C9A30851C5C-001
   [junit4]   2> Jun 01, 2019 7:17:02 PM com.carrotsearch.randomizedtesting.ThreadLeakControl
checkThreadLeaks
   [junit4]   2> WARNING: Will linger awaiting termination of 1 leaked thread(s).
   [junit4]   2> NOTE: test params are: codec=Asserting(Lucene80): {}, docValues:{}, maxPointsInLeafNode=1085,
maxMBSortInHeap=5.739555204422197, sim=Asserting(org.apache.lucene.search.similarities.AssertingSimilarity@31efb7aa),
locale=el-GR, timezone=Indian/Kerguelen
   [junit4]   2> NOTE: Linux 4.4.0-112-generic amd64/Oracle Corporation 1.8.0_191 (64-bit)/cpus=4,threads=1,free=284984304,total=352845824
   [junit4]   2> NOTE: All tests run in this JVM: [DistributedDebugComponentTest, MetricsHistoryWithAuthIntegrationTest]
   [junit4] Completed [2/855 (1!)] on J0 in 15.65s, 1 test, 1 failure <<< FAILURES!

[...truncated 52847 lines...]
[asciidoctor:convert] asciidoctor: ERROR: about-this-guide.adoc: line 1: invalid part, must
have at least one section (e.g., chapter, appendix, etc.)
[asciidoctor:convert] asciidoctor: ERROR: solr-glossary.adoc: line 1: invalid part, must have
at least one section (e.g., chapter, appendix, etc.)
     [java] Processed 2570 links (2103 relative) to 3374 anchors in 253 files
     [echo] Validated Links & Anchors via: /home/jenkins/jenkins-slave/workspace/Lucene-Solr-Tests-8.1/solr/build/solr-ref-guide/bare-bones-html/

-documentation-lint:
    [jtidy] Checking for broken html (such as invalid tags)...
   [delete] Deleting directory /home/jenkins/jenkins-slave/workspace/Lucene-Solr-Tests-8.1/lucene/build/jtidy_tmp
     [echo] Checking for broken links...
     [exec] 
     [exec] Crawl/parse...
     [exec] 
     [exec] Verify...
     [echo] Checking for malformed docs...

jar-checksums:

resolve:

ivy-availability-check:
[loadresource] Do not set property disallowed.ivy.jars.list as its length is 0.

-ivy-fail-disallowed-ivy-version:

ivy-fail:

ivy-configure:
[ivy:configure] :: loading settings :: file = /home/jenkins/jenkins-slave/workspace/Lucene-Solr-Tests-8.1/lucene/top-level-ivy-settings.xml

resolve:

ivy-availability-check:
[loadresource] Do not set property disallowed.ivy.jars.list as its length is 0.

-ivy-fail-disallowed-ivy-version:

ivy-fail:

ivy-configure:
[ivy:configure] :: loading settings :: file = /home/jenkins/jenkins-slave/workspace/Lucene-Solr-Tests-8.1/lucene/top-level-ivy-settings.xml

resolve:

resolve:

ivy-availability-check:
[loadresource] Do not set property disallowed.ivy.jars.list as its length is 0.

-ivy-fail-disallowed-ivy-version:

ivy-fail:

ivy-configure:
[ivy:configure] :: loading settings :: file = /home/jenkins/jenkins-slave/workspace/Lucene-Solr-Tests-8.1/lucene/top-level-ivy-settings.xml

resolve:

ivy-availability-check:
[loadresource] Do not set property disallowed.ivy.jars.list as its length is 0.

-ivy-fail-disallowed-ivy-version:

ivy-fail:

ivy-configure:
[ivy:configure] :: loading settings :: file = /home/jenkins/jenkins-slave/workspace/Lucene-Solr-Tests-8.1/lucene/top-level-ivy-settings.xml

resolve:

ivy-availability-check:
[loadresource] Do not set property disallowed.ivy.jars.list as its length is 0.

-ivy-fail-disallowed-ivy-version:

ivy-fail:

ivy-configure:
[ivy:configure] :: loading settings :: file = /home/jenkins/jenkins-slave/workspace/Lucene-Solr-Tests-8.1/lucene/top-level-ivy-settings.xml

resolve:

ivy-availability-check:
[loadresource] Do not set property disallowed.ivy.jars.list as its length is 0.

-ivy-fail-disallowed-ivy-version:

ivy-fail:

ivy-configure:
[ivy:configure] :: loading settings :: file = /home/jenkins/jenkins-slave/workspace/Lucene-Solr-Tests-8.1/lucene/top-level-ivy-settings.xml

resolve:

ivy-availability-check:
[loadresource] Do not set property disallowed.ivy.jars.list as its length is 0.

-ivy-fail-disallowed-ivy-version:

ivy-fail:

ivy-configure:
[ivy:configure] :: loading settings :: file = /home/jenkins/jenkins-slave/workspace/Lucene-Solr-Tests-8.1/lucene/top-level-ivy-settings.xml

resolve:

ivy-availability-check:
[loadresource] Do not set property disallowed.ivy.jars.list as its length is 0.

-ivy-fail-disallowed-ivy-version:

ivy-fail:

ivy-configure:
[ivy:configure] :: loading settings :: file = /home/jenkins/jenkins-slave/workspace/Lucene-Solr-Tests-8.1/lucene/top-level-ivy-settings.xml

resolve:

ivy-availability-check:
[loadresource] Do not set property disallowed.ivy.jars.list as its length is 0.

-ivy-fail-disallowed-ivy-version:

ivy-fail:

ivy-configure:
[ivy:configure] :: loading settings :: file = /home/jenkins/jenkins-slave/workspace/Lucene-Solr-Tests-8.1/lucene/top-level-ivy-settings.xml

resolve:

ivy-availability-check:
[loadresource] Do not set property disallowed.ivy.jars.list as its length is 0.

-ivy-fail-disallowed-ivy-version:

ivy-fail:

ivy-configure:
[ivy:configure] :: loading settings :: file = /home/jenkins/jenkins-slave/workspace/Lucene-Solr-Tests-8.1/lucene/top-level-ivy-settings.xml

resolve:

ivy-availability-check:
[loadresource] Do not set property disallowed.ivy.jars.list as its length is 0.

-ivy-fail-disallowed-ivy-version:

ivy-fail:

ivy-configure:
[ivy:configure] :: loading settings :: file = /home/jenkins/jenkins-slave/workspace/Lucene-Solr-Tests-8.1/lucene/top-level-ivy-settings.xml

resolve:

ivy-availability-check:
[loadresource] Do not set property disallowed.ivy.jars.list as its length is 0.

-ivy-fail-disallowed-ivy-version:

ivy-fail:

ivy-configure:
[ivy:configure] :: loading settings :: file = /home/jenkins/jenkins-slave/workspace/Lucene-Solr-Tests-8.1/lucene/top-level-ivy-settings.xml

resolve:

ivy-availability-check:
[loadresource] Do not set property disallowed.ivy.jars.list as its length is 0.

-ivy-fail-disallowed-ivy-version:

ivy-fail:

ivy-configure:
[ivy:configure] :: loading settings :: file = /home/jenkins/jenkins-slave/workspace/Lucene-Solr-Tests-8.1/lucene/top-level-ivy-settings.xml

resolve:

ivy-availability-check:
[loadresource] Do not set property disallowed.ivy.jars.list as its length is 0.

-ivy-fail-disallowed-ivy-version:

ivy-fail:

ivy-configure:
[ivy:configure] :: loading settings :: file = /home/jenkins/jenkins-slave/workspace/Lucene-Solr-Tests-8.1/lucene/top-level-ivy-settings.xml

resolve:

ivy-availability-check:
[loadresource] Do not set property disallowed.ivy.jars.list as its length is 0.

-ivy-fail-disallowed-ivy-version:

ivy-fail:

ivy-configure:
[ivy:configure] :: loading settings :: file = /home/jenkins/jenkins-slave/workspace/Lucene-Solr-Tests-8.1/lucene/top-level-ivy-settings.xml

resolve:

ivy-availability-check:
[loadresource] Do not set property disallowed.ivy.jars.list as its length is 0.

-ivy-fail-disallowed-ivy-version:

ivy-fail:

ivy-configure:
[ivy:configure] :: loading settings :: file = /home/jenkins/jenkins-slave/workspace/Lucene-Solr-Tests-8.1/lucene/top-level-ivy-settings.xml

resolve:

ivy-availability-check:
[loadresource] Do not set property disallowed.ivy.jars.list as its length is 0.

-ivy-fail-disallowed-ivy-version:

ivy-fail:

ivy-configure:
[ivy:configure] :: loading settings :: file = /home/jenkins/jenkins-slave/workspace/Lucene-Solr-Tests-8.1/lucene/top-level-ivy-settings.xml

resolve:

ivy-availability-check:
[loadresource] Do not set property disallowed.ivy.jars.list as its length is 0.

-ivy-fail-disallowed-ivy-version:

ivy-fail:

ivy-configure:
[ivy:configure] :: loading settings :: file = /home/jenkins/jenkins-slave/workspace/Lucene-Solr-Tests-8.1/lucene/top-level-ivy-settings.xml

resolve:

ivy-availability-check:
[loadresource] Do not set property disallowed.ivy.jars.list as its length is 0.

-ivy-fail-disallowed-ivy-version:

ivy-fail:

ivy-configure:
[ivy:configure] :: loading settings :: file = /home/jenkins/jenkins-slave/workspace/Lucene-Solr-Tests-8.1/lucene/top-level-ivy-settings.xml

resolve:

ivy-availability-check:
[loadresource] Do not set property disallowed.ivy.jars.list as its length is 0.

-ivy-fail-disallowed-ivy-version:

ivy-fail:

ivy-configure:
[ivy:configure] :: loading settings :: file = /home/jenkins/jenkins-slave/workspace/Lucene-Solr-Tests-8.1/lucene/top-level-ivy-settings.xml

resolve:

ivy-availability-check:
[loadresource] Do not set property disallowed.ivy.jars.list as its length is 0.

-ivy-fail-disallowed-ivy-version:

ivy-fail:

ivy-configure:
[ivy:configure] :: loading settings :: file = /home/jenkins/jenkins-slave/workspace/Lucene-Solr-Tests-8.1/lucene/top-level-ivy-settings.xml

resolve:

ivy-availability-check:
[loadresource] Do not set property disallowed.ivy.jars.list as its length is 0.

-ivy-fail-disallowed-ivy-version:

ivy-fail:

ivy-configure:
[ivy:configure] :: loading settings :: file = /home/jenkins/jenkins-slave/workspace/Lucene-Solr-Tests-8.1/lucene/top-level-ivy-settings.xml

resolve:

ivy-availability-check:
[loadresource] Do not set property disallowed.ivy.jars.list as its length is 0.

-ivy-fail-disallowed-ivy-version:

ivy-fail:

ivy-configure:
[ivy:configure] :: loading settings :: file = /home/jenkins/jenkins-slave/workspace/Lucene-Solr-Tests-8.1/lucene/top-level-ivy-settings.xml

resolve:

ivy-availability-check:
[loadresource] Do not set property disallowed.ivy.jars.list as its length is 0.

-ivy-fail-disallowed-ivy-version:

ivy-fail:

ivy-configure:
[ivy:configure] :: loading settings :: file = /home/jenkins/jenkins-slave/workspace/Lucene-Solr-Tests-8.1/lucene/top-level-ivy-settings.xml

resolve:

ivy-availability-check:
[loadresource] Do not set property disallowed.ivy.jars.list as its length is 0.

-ivy-fail-disallowed-ivy-version:

ivy-fail:

ivy-configure:
[ivy:configure] :: loading settings :: file = /home/jenkins/jenkins-slave/workspace/Lucene-Solr-Tests-8.1/lucene/top-level-ivy-settings.xml

resolve:

ivy-availability-check:
[loadresource] Do not set property disallowed.ivy.jars.list as its length is 0.

-ivy-fail-disallowed-ivy-version:

ivy-fail:

ivy-configure:
[ivy:configure] :: loading settings :: file = /home/jenkins/jenkins-slave/workspace/Lucene-Solr-Tests-8.1/lucene/top-level-ivy-settings.xml

resolve:

ivy-availability-check:
[loadresource] Do not set property disallowed.ivy.jars.list as its length is 0.

-ivy-fail-disallowed-ivy-version:

ivy-fail:

ivy-configure:
[ivy:configure] :: loading settings :: file = /home/jenkins/jenkins-slave/workspace/Lucene-Solr-Tests-8.1/lucene/top-level-ivy-settings.xml

common.resolve:

resolve:

ivy-availability-check:
[loadresource] Do not set property disallowed.ivy.jars.list as its length is 0.

-ivy-fail-disallowed-ivy-version:

ivy-fail:

ivy-configure:
[ivy:configure] :: loading settings :: file = /home/jenkins/jenkins-slave/workspace/Lucene-Solr-Tests-8.1/lucene/top-level-ivy-settings.xml

resolve:

ivy-availability-check:
[loadresource] Do not set property disallowed.ivy.jars.list as its length is 0.

-ivy-fail-disallowed-ivy-version:

ivy-fail:

ivy-configure:
[ivy:configure] :: loading settings :: file = /home/jenkins/jenkins-slave/workspace/Lucene-Solr-Tests-8.1/lucene/top-level-ivy-settings.xml

resolve:

ivy-availability-check:
[loadresource] Do not set property disallowed.ivy.jars.list as its length is 0.

-ivy-fail-disallowed-ivy-version:

ivy-fail:

ivy-configure:
[ivy:configure] :: loading settings :: file = /home/jenkins/jenkins-slave/workspace/Lucene-Solr-Tests-8.1/lucene/top-level-ivy-settings.xml

resolve:

ivy-availability-check:
[loadresource] Do not set property disallowed.ivy.jars.list as its length is 0.

-ivy-fail-disallowed-ivy-version:

ivy-fail:

ivy-configure:
[ivy:configure] :: loading settings :: file = /home/jenkins/jenkins-slave/workspace/Lucene-Solr-Tests-8.1/lucene/top-level-ivy-settings.xml

resolve:

ivy-availability-check:
[loadresource] Do not set property disallowed.ivy.jars.list as its length is 0.

-ivy-fail-disallowed-ivy-version:

ivy-fail:

ivy-configure:
[ivy:configure] :: loading settings :: file = /home/jenkins/jenkins-slave/workspace/Lucene-Solr-Tests-8.1/lucene/top-level-ivy-settings.xml

resolve:

jar-checksums:
    [mkdir] Created dir: /home/jenkins/jenkins-slave/workspace/Lucene-Solr-Tests-8.1/lucene/null1107244389
     [copy] Copying 38 files to /home/jenkins/jenkins-slave/workspace/Lucene-Solr-Tests-8.1/lucene/null1107244389
   [delete] Deleting directory /home/jenkins/jenkins-slave/workspace/Lucene-Solr-Tests-8.1/lucene/null1107244389

resolve-example:

ivy-availability-check:
[loadresource] Do not set property disallowed.ivy.jars.list as its length is 0.

-ivy-fail-disallowed-ivy-version:

ivy-fail:

ivy-configure:
[ivy:configure] :: loading settings :: file = /home/jenkins/jenkins-slave/workspace/Lucene-Solr-Tests-8.1/lucene/top-level-ivy-settings.xml

resolve:

resolve-server:

ivy-availability-check:
[loadresource] Do not set property disallowed.ivy.jars.list as its length is 0.

-ivy-fail-disallowed-ivy-version:

ivy-fail:

ivy-fail:

ivy-configure:
[ivy:configure] :: loading settings :: file = /home/jenkins/jenkins-slave/workspace/Lucene-Solr-Tests-8.1/lucene/top-level-ivy-settings.xml

resolve:

resolve:

ivy-availability-check:
[loadresource] Do not set property disallowed.ivy.jars.list as its length is 0.

-ivy-fail-disallowed-ivy-version:

ivy-fail:

ivy-fail:

ivy-configure:
[ivy:configure] :: loading settings :: file = /home/jenkins/jenkins-slave/workspace/Lucene-Solr-Tests-8.1/lucene/top-level-ivy-settings.xml

resolve:

ivy-availability-check:
[loadresource] Do not set property disallowed.ivy.jars.list as its length is 0.

-ivy-fail-disallowed-ivy-version:

ivy-fail:

ivy-fail:

ivy-configure:
[ivy:configure] :: loading settings :: file = /home/jenkins/jenkins-slave/workspace/Lucene-Solr-Tests-8.1/lucene/top-level-ivy-settings.xml

resolve:

ivy-availability-check:
[loadresource] Do not set property disallowed.ivy.jars.list as its length is 0.

-ivy-fail-disallowed-ivy-version:

ivy-fail:

ivy-configure:
[ivy:configure] :: loading settings :: file = /home/jenkins/jenkins-slave/workspace/Lucene-Solr-Tests-8.1/lucene/top-level-ivy-settings.xml

resolve:

ivy-availability-check:
[loadresource] Do not set property disallowed.ivy.jars.list as its length is 0.

-ivy-fail-disallowed-ivy-version:

ivy-fail:

ivy-fail:

ivy-configure:
[ivy:configure] :: loading settings :: file = /home/jenkins/jenkins-slave/workspace/Lucene-Solr-Tests-8.1/lucene/top-level-ivy-settings.xml

resolve:

ivy-availability-check:
[loadresource] Do not set property disallowed.ivy.jars.list as its length is 0.

-ivy-fail-disallowed-ivy-version:

ivy-fail:

ivy-configure:
[ivy:configure] :: loading settings :: file = /home/jenkins/jenkins-slave/workspace/Lucene-Solr-Tests-8.1/lucene/top-level-ivy-settings.xml

resolve:

ivy-availability-check:
[loadresource] Do not set property disallowed.ivy.jars.list as its length is 0.

-ivy-fail-disallowed-ivy-version:

ivy-fail:

ivy-fail:

ivy-configure:
[ivy:configure] :: loading settings :: file = /home/jenkins/jenkins-slave/workspace/Lucene-Solr-Tests-8.1/lucene/top-level-ivy-settings.xml

resolve:

ivy-availability-check:
[loadresource] Do not set property disallowed.ivy.jars.list as its length is 0.

-ivy-fail-disallowed-ivy-version:

ivy-fail:

ivy-fail:

ivy-configure:
[ivy:configure] :: loading settings :: file = /home/jenkins/jenkins-slave/workspace/Lucene-Solr-Tests-8.1/lucene/top-level-ivy-settings.xml

resolve:

ivy-availability-check:
[loadresource] Do not set property disallowed.ivy.jars.list as its length is 0.

-ivy-fail-disallowed-ivy-version:

ivy-fail:

ivy-fail:

ivy-configure:
[ivy:configure] :: loading settings :: file = /home/jenkins/jenkins-slave/workspace/Lucene-Solr-Tests-8.1/lucene/top-level-ivy-settings.xml

resolve:

ivy-availability-check:
[loadresource] Do not set property disallowed.ivy.jars.list as its length is 0.

-ivy-fail-disallowed-ivy-version:

ivy-fail:

ivy-fail:

ivy-configure:
[ivy:configure] :: loading settings :: file = /home/jenkins/jenkins-slave/workspace/Lucene-Solr-Tests-8.1/lucene/top-level-ivy-settings.xml

resolve:

ivy-availability-check:
[loadresource] Do not set property disallowed.ivy.jars.list as its length is 0.

-ivy-fail-disallowed-ivy-version:

ivy-fail:

ivy-fail:

ivy-configure:
[ivy:configure] :: loading settings :: file = /home/jenkins/jenkins-slave/workspace/Lucene-Solr-Tests-8.1/lucene/top-level-ivy-settings.xml

resolve:

ivy-availability-check:
[loadresource] Do not set property disallowed.ivy.jars.list as its length is 0.

-ivy-fail-disallowed-ivy-version:

ivy-fail:

ivy-fail:

ivy-configure:
[ivy:configure] :: loading settings :: file = /home/jenkins/jenkins-slave/workspace/Lucene-Solr-Tests-8.1/lucene/top-level-ivy-settings.xml

resolve:

ivy-availability-check:
[loadresource] Do not set property disallowed.ivy.jars.list as its length is 0.

-ivy-fail-disallowed-ivy-version:

ivy-fail:

ivy-fail:

ivy-configure:
[ivy:configure] :: loading settings :: file = /home/jenkins/jenkins-slave/workspace/Lucene-Solr-Tests-8.1/lucene/top-level-ivy-settings.xml

resolve:

ivy-availability-check:
[loadresource] Do not set property disallowed.ivy.jars.list as its length is 0.

-ivy-fail-disallowed-ivy-version:

ivy-fail:

ivy-fail:

ivy-configure:
[ivy:configure] :: loading settings :: file = /home/jenkins/jenkins-slave/workspace/Lucene-Solr-Tests-8.1/lucene/top-level-ivy-settings.xml

resolve:

ivy-availability-check:
[loadresource] Do not set property disallowed.ivy.jars.list as its length is 0.

-ivy-fail-disallowed-ivy-version:

ivy-fail:

ivy-fail:

ivy-configure:
[ivy:configure] :: loading settings :: file = /home/jenkins/jenkins-slave/workspace/Lucene-Solr-Tests-8.1/lucene/top-level-ivy-settings.xml

resolve:

ivy-availability-check:
[loadresource] Do not set property disallowed.ivy.jars.list as its length is 0.

-ivy-fail-disallowed-ivy-version:

ivy-fail:

ivy-fail:

ivy-configure:
[ivy:configure] :: loading settings :: file = /home/jenkins/jenkins-slave/workspace/Lucene-Solr-Tests-8.1/lucene/top-level-ivy-settings.xml

resolve:

jar-checksums:
    [mkdir] Created dir: /home/jenkins/jenkins-slave/workspace/Lucene-Solr-Tests-8.1/solr/null43724423
     [copy] Copying 239 files to /home/jenkins/jenkins-slave/workspace/Lucene-Solr-Tests-8.1/solr/null43724423
   [delete] Deleting directory /home/jenkins/jenkins-slave/workspace/Lucene-Solr-Tests-8.1/solr/null43724423

check-working-copy:
[ivy:cachepath] :: resolving dependencies :: #;working@lucene2-us-west.apache.org
[ivy:cachepath] 	confs: [default]
[ivy:cachepath] 	found org.eclipse.jgit#org.eclipse.jgit;5.3.0.201903130848-r in public
[ivy:cachepath] 	found com.jcraft#jsch;0.1.54 in public
[ivy:cachepath] 	found com.jcraft#jzlib;1.1.1 in public
[ivy:cachepath] 	found com.googlecode.javaewah#JavaEWAH;1.1.6 in public
[ivy:cachepath] 	found org.slf4j#slf4j-api;1.7.2 in public
[ivy:cachepath] 	found org.bouncycastle#bcpg-jdk15on;1.60 in public
[ivy:cachepath] 	found org.bouncycastle#bcprov-jdk15on;1.60 in public
[ivy:cachepath] 	found org.bouncycastle#bcpkix-jdk15on;1.60 in public
[ivy:cachepath] 	found org.slf4j#slf4j-nop;1.7.2 in public
[ivy:cachepath] :: resolution report :: resolve 49ms :: artifacts dl 13ms
	---------------------------------------------------------------------
	|                  |            modules            ||   artifacts   |
	|       conf       | number| search|dwnlded|evicted|| number|dwnlded|
	---------------------------------------------------------------------
	|      default     |   9   |   0   |   0   |   0   ||   9   |   0   |
	---------------------------------------------------------------------
[wc-checker] Initializing working copy...
[wc-checker] Checking working copy status...

-jenkins-base:

BUILD SUCCESSFUL
Total time: 213 minutes 21 seconds
Archiving artifacts
java.lang.InterruptedException: no matches found within 10000
	at hudson.FilePath$ValidateAntFileMask.hasMatch(FilePath.java:2847)
	at hudson.FilePath$ValidateAntFileMask.invoke(FilePath.java:2726)
	at hudson.FilePath$ValidateAntFileMask.invoke(FilePath.java:2707)
	at hudson.FilePath$FileCallableWrapper.call(FilePath.java:3086)
Also:   hudson.remoting.Channel$CallSiteStackTrace: Remote call to lucene2
		at hudson.remoting.Channel.attachCallSiteStackTrace(Channel.java:1741)
		at hudson.remoting.UserRequest$ExceptionResponse.retrieve(UserRequest.java:357)
		at hudson.remoting.Channel.call(Channel.java:955)
		at hudson.FilePath.act(FilePath.java:1072)
		at hudson.FilePath.act(FilePath.java:1061)
		at hudson.FilePath.validateAntFileMask(FilePath.java:2705)
		at hudson.tasks.ArtifactArchiver.perform(ArtifactArchiver.java:243)
		at hudson.tasks.BuildStepCompatibilityLayer.perform(BuildStepCompatibilityLayer.java:81)
		at hudson.tasks.BuildStepMonitor$1.perform(BuildStepMonitor.java:20)
		at hudson.model.AbstractBuild$AbstractBuildExecution.perform(AbstractBuild.java:744)
		at hudson.model.AbstractBuild$AbstractBuildExecution.performAllBuildSteps(AbstractBuild.java:690)
		at hudson.model.Build$BuildExecution.post2(Build.java:186)
		at hudson.model.AbstractBuild$AbstractBuildExecution.post(AbstractBuild.java:635)
		at hudson.model.Run.execute(Run.java:1835)
		at hudson.model.FreeStyleBuild.run(FreeStyleBuild.java:43)
		at hudson.model.ResourceController.execute(ResourceController.java:97)
		at hudson.model.Executor.run(Executor.java:429)
Caused: hudson.FilePath$TunneledInterruptedException
	at hudson.FilePath$FileCallableWrapper.call(FilePath.java:3088)
	at hudson.remoting.UserRequest.perform(UserRequest.java:212)
	at hudson.remoting.UserRequest.perform(UserRequest.java:54)
	at hudson.remoting.Request$2.run(Request.java:369)
	at hudson.remoting.InterceptingExecutorService$1.call(InterceptingExecutorService.java:72)
	at java.util.concurrent.FutureTask.run(FutureTask.java:266)
	at java.util.concurrent.ThreadPoolExecutor.runWorker(ThreadPoolExecutor.java:1142)
	at java.util.concurrent.ThreadPoolExecutor$Worker.run(ThreadPoolExecutor.java:617)
	at java.lang.Thread.run(Thread.java:748)
Caused: java.lang.InterruptedException: java.lang.InterruptedException: no matches found within
10000
	at hudson.FilePath.act(FilePath.java:1074)
	at hudson.FilePath.act(FilePath.java:1061)
	at hudson.FilePath.validateAntFileMask(FilePath.java:2705)
	at hudson.tasks.ArtifactArchiver.perform(ArtifactArchiver.java:243)
	at hudson.tasks.BuildStepCompatibilityLayer.perform(BuildStepCompatibilityLayer.java:81)
	at hudson.tasks.BuildStepMonitor$1.perform(BuildStepMonitor.java:20)
	at hudson.model.AbstractBuild$AbstractBuildExecution.perform(AbstractBuild.java:744)
	at hudson.model.AbstractBuild$AbstractBuildExecution.performAllBuildSteps(AbstractBuild.java:690)
	at hudson.model.Build$BuildExecution.post2(Build.java:186)
	at hudson.model.AbstractBuild$AbstractBuildExecution.post(AbstractBuild.java:635)
	at hudson.model.Run.execute(Run.java:1835)
	at hudson.model.FreeStyleBuild.run(FreeStyleBuild.java:43)
	at hudson.model.ResourceController.execute(ResourceController.java:97)
	at hudson.model.Executor.run(Executor.java:429)
No artifacts found that match the file pattern "**/*.events,heapdumps/**,**/hs_err_pid*".
Configuration error?
Recording test results
Build step 'Publish JUnit test result report' changed build result to UNSTABLE
Email was triggered for: Unstable (Test Failures)
Sending email for trigger: Unstable (Test Failures)

Mime
View raw message