lucene-dev mailing list archives

Site index · List index
Message view « Date » · « Thread »
Top « Date » · « Thread »
From Policeman Jenkins Server <jenk...@thetaphi.de>
Subject [JENKINS] Lucene-Solr-8.x-Windows (64bit/jdk-10.0.1) - Build # 299 - Unstable!
Date Mon, 10 Jun 2019 05:13:57 GMT
Build: https://jenkins.thetaphi.de/job/Lucene-Solr-8.x-Windows/299/
Java: 64bit/jdk-10.0.1 -XX:+UseCompressedOops -XX:+UseG1GC

1 tests failed.
FAILED:  junit.framework.TestSuite.org.apache.solr.handler.component.SuggestComponentContextFilterQueryTest

Error Message:
Could not remove the following files (in the order of attempts):    C:\Users\jenkins\workspace\Lucene-Solr-8.x-Windows\solr\build\solr-core\test\J1\temp\solr.handler.component.SuggestComponentContextFilterQueryTest_2BFA862278639CD7-001\init-core-data-001: java.nio.file.AccessDeniedException: C:\Users\jenkins\workspace\Lucene-Solr-8.x-Windows\solr\build\solr-core\test\J1\temp\solr.handler.component.SuggestComponentContextFilterQueryTest_2BFA862278639CD7-001\init-core-data-001    C:\Users\jenkins\workspace\Lucene-Solr-8.x-Windows\solr\build\solr-core\test\J1\temp\solr.handler.component.SuggestComponentContextFilterQueryTest_2BFA862278639CD7-001: java.nio.file.DirectoryNotEmptyException: C:\Users\jenkins\workspace\Lucene-Solr-8.x-Windows\solr\build\solr-core\test\J1\temp\solr.handler.component.SuggestComponentContextFilterQueryTest_2BFA862278639CD7-001 

Stack Trace:
java.io.IOException: Could not remove the following files (in the order of attempts):
   C:\Users\jenkins\workspace\Lucene-Solr-8.x-Windows\solr\build\solr-core\test\J1\temp\solr.handler.component.SuggestComponentContextFilterQueryTest_2BFA862278639CD7-001\init-core-data-001: java.nio.file.AccessDeniedException: C:\Users\jenkins\workspace\Lucene-Solr-8.x-Windows\solr\build\solr-core\test\J1\temp\solr.handler.component.SuggestComponentContextFilterQueryTest_2BFA862278639CD7-001\init-core-data-001
   C:\Users\jenkins\workspace\Lucene-Solr-8.x-Windows\solr\build\solr-core\test\J1\temp\solr.handler.component.SuggestComponentContextFilterQueryTest_2BFA862278639CD7-001: java.nio.file.DirectoryNotEmptyException: C:\Users\jenkins\workspace\Lucene-Solr-8.x-Windows\solr\build\solr-core\test\J1\temp\solr.handler.component.SuggestComponentContextFilterQueryTest_2BFA862278639CD7-001

	at __randomizedtesting.SeedInfo.seed([2BFA862278639CD7]:0)
	at org.apache.lucene.util.IOUtils.rm(IOUtils.java:318)
	at org.apache.lucene.util.TestRuleTemporaryFilesCleanup.afterAlways(TestRuleTemporaryFilesCleanup.java:216)
	at com.carrotsearch.randomizedtesting.rules.TestRuleAdapter$1.afterAlways(TestRuleAdapter.java:31)
	at com.carrotsearch.randomizedtesting.rules.StatementAdapter.evaluate(StatementAdapter.java:43)
	at com.carrotsearch.randomizedtesting.rules.StatementAdapter.evaluate(StatementAdapter.java:36)
	at org.apache.lucene.util.TestRuleAssertionsRequired$1.evaluate(TestRuleAssertionsRequired.java:53)
	at org.apache.lucene.util.TestRuleMarkFailure$1.evaluate(TestRuleMarkFailure.java:47)
	at org.apache.lucene.util.TestRuleIgnoreAfterMaxFailures$1.evaluate(TestRuleIgnoreAfterMaxFailures.java:64)
	at org.apache.lucene.util.TestRuleIgnoreTestSuites$1.evaluate(TestRuleIgnoreTestSuites.java:54)
	at com.carrotsearch.randomizedtesting.rules.StatementAdapter.evaluate(StatementAdapter.java:36)
	at com.carrotsearch.randomizedtesting.ThreadLeakControl$StatementRunner.run(ThreadLeakControl.java:368)
	at java.base/java.lang.Thread.run(Thread.java:844)




Build Log:
[...truncated 14410 lines...]
   [junit4] Suite: org.apache.solr.handler.component.SuggestComponentContextFilterQueryTest
   [junit4]   2> 2069201 INFO  (SUITE-SuggestComponentContextFilterQueryTest-seed#[2BFA862278639CD7]-worker) [     ] o.a.s.SolrTestCaseJ4 SecureRandom sanity checks: test.solr.allowed.securerandom=null & java.security.egd=file:/dev/./urandom
   [junit4]   2> Creating dataDir: C:\Users\jenkins\workspace\Lucene-Solr-8.x-Windows\solr\build\solr-core\test\J1\temp\solr.handler.component.SuggestComponentContextFilterQueryTest_2BFA862278639CD7-001\init-core-data-001
   [junit4]   2> 2069202 INFO  (SUITE-SuggestComponentContextFilterQueryTest-seed#[2BFA862278639CD7]-worker) [     ] o.a.s.SolrTestCaseJ4 Using TrieFields (NUMERIC_POINTS_SYSPROP=false) w/NUMERIC_DOCVALUES_SYSPROP=true
   [junit4]   2> 2069202 INFO  (SUITE-SuggestComponentContextFilterQueryTest-seed#[2BFA862278639CD7]-worker) [     ] o.a.s.SolrTestCaseJ4 Randomized ssl (false) and clientAuth (false) via: @org.apache.solr.util.RandomizeSSL(reason="", value=0.0/0.0, ssl=0.0/0.0, clientAuth=0.0/0.0)
   [junit4]   2> 2069204 INFO  (SUITE-SuggestComponentContextFilterQueryTest-seed#[2BFA862278639CD7]-worker) [     ] o.a.s.SolrTestCaseJ4 ####initCore
   [junit4]   2> 2069204 INFO  (SUITE-SuggestComponentContextFilterQueryTest-seed#[2BFA862278639CD7]-worker) [     ] o.a.s.c.SolrResourceLoader [null] Added 2 libs to classloader, from paths: [/C:/Users/jenkins/workspace/Lucene-Solr-8.x-Windows/solr/core/src/test-files/solr/collection1/lib, /C:/Users/jenkins/workspace/Lucene-Solr-8.x-Windows/solr/core/src/test-files/solr/collection1/lib/classes]
   [junit4]   2> 2069221 INFO  (SUITE-SuggestComponentContextFilterQueryTest-seed#[2BFA862278639CD7]-worker) [     ] o.a.s.c.SolrConfig Using Lucene MatchVersion: 8.2.0
   [junit4]   2> 2069233 INFO  (SUITE-SuggestComponentContextFilterQueryTest-seed#[2BFA862278639CD7]-worker) [     ] o.a.s.s.IndexSchema [null] Schema name=test
   [junit4]   2> 2069299 INFO  (SUITE-SuggestComponentContextFilterQueryTest-seed#[2BFA862278639CD7]-worker) [     ] o.a.s.s.IndexSchema Loaded schema test/1.0 with uniqueid field id
   [junit4]   2> 2069511 INFO  (SUITE-SuggestComponentContextFilterQueryTest-seed#[2BFA862278639CD7]-worker) [     ] o.a.s.h.c.HttpShardHandlerFactory Host whitelist initialized: WhitelistHostChecker [whitelistHosts=null, whitelistHostCheckingEnabled=true]
   [junit4]   2> 2069513 WARN  (SUITE-SuggestComponentContextFilterQueryTest-seed#[2BFA862278639CD7]-worker) [     ] o.e.j.u.s.S.config No Client EndPointIdentificationAlgorithm configured for SslContextFactory@5e45bd5[provider=null,keyStore=null,trustStore=null]
   [junit4]   2> 2069517 WARN  (SUITE-SuggestComponentContextFilterQueryTest-seed#[2BFA862278639CD7]-worker) [     ] o.e.j.u.s.S.config No Client EndPointIdentificationAlgorithm configured for SslContextFactory@730242c7[provider=null,keyStore=null,trustStore=null]
   [junit4]   2> 2069538 INFO  (SUITE-SuggestComponentContextFilterQueryTest-seed#[2BFA862278639CD7]-worker) [     ] o.a.s.c.TransientSolrCoreCacheDefault Allocating transient cache for 2147483647 transient cores
   [junit4]   2> 2069538 INFO  (SUITE-SuggestComponentContextFilterQueryTest-seed#[2BFA862278639CD7]-worker) [     ] o.a.s.h.a.MetricsHistoryHandler No .system collection, keeping metrics history in memory.
   [junit4]   2> 2069552 INFO  (SUITE-SuggestComponentContextFilterQueryTest-seed#[2BFA862278639CD7]-worker) [     ] o.a.s.m.r.SolrJmxReporter JMX monitoring for 'solr.node' (registry 'solr.node') enabled at server: com.sun.jmx.mbeanserver.JmxMBeanServer@63f3ee54
   [junit4]   2> 2069557 INFO  (SUITE-SuggestComponentContextFilterQueryTest-seed#[2BFA862278639CD7]-worker) [     ] o.a.s.m.r.SolrJmxReporter JMX monitoring for 'solr.jvm' (registry 'solr.jvm') enabled at server: com.sun.jmx.mbeanserver.JmxMBeanServer@63f3ee54
   [junit4]   2> 2069557 INFO  (SUITE-SuggestComponentContextFilterQueryTest-seed#[2BFA862278639CD7]-worker) [     ] o.a.s.m.r.SolrJmxReporter JMX monitoring for 'solr.jetty' (registry 'solr.jetty') enabled at server: com.sun.jmx.mbeanserver.JmxMBeanServer@63f3ee54
   [junit4]   2> 2069557 INFO  (coreLoadExecutor-12563-thread-1) [    x:collection1 ] o.a.s.c.SolrResourceLoader [null] Added 2 libs to classloader, from paths: [/C:/Users/jenkins/workspace/Lucene-Solr-8.x-Windows/solr/core/src/test-files/solr/collection1/lib, /C:/Users/jenkins/workspace/Lucene-Solr-8.x-Windows/solr/core/src/test-files/solr/collection1/lib/classes]
   [junit4]   2> 2069577 INFO  (coreLoadExecutor-12563-thread-1) [    x:collection1 ] o.a.s.c.SolrConfig Using Lucene MatchVersion: 8.2.0
   [junit4]   2> 2069595 INFO  (coreLoadExecutor-12563-thread-1) [    x:collection1 ] o.a.s.s.IndexSchema [collection1] Schema name=test
   [junit4]   2> 2069664 INFO  (coreLoadExecutor-12563-thread-1) [    x:collection1 ] o.a.s.s.IndexSchema Loaded schema test/1.0 with uniqueid field id
   [junit4]   2> 2069672 INFO  (coreLoadExecutor-12563-thread-1) [    x:collection1 ] o.a.s.c.CoreContainer Creating SolrCore 'collection1' using configuration from instancedir C:\Users\jenkins\workspace\Lucene-Solr-8.x-Windows\solr\core\src\test-files\solr\collection1, trusted=true
   [junit4]   2> 2069673 INFO  (coreLoadExecutor-12563-thread-1) [    x:collection1 ] o.a.s.m.r.SolrJmxReporter JMX monitoring for 'solr.core.collection1' (registry 'solr.core.collection1') enabled at server: com.sun.jmx.mbeanserver.JmxMBeanServer@63f3ee54
   [junit4]   2> 2069673 INFO  (coreLoadExecutor-12563-thread-1) [    x:collection1 ] o.a.s.c.SolrCore [[collection1] ] Opening new SolrCore at [C:\Users\jenkins\workspace\Lucene-Solr-8.x-Windows\solr\core\src\test-files\solr\collection1], dataDir=[C:\Users\jenkins\workspace\Lucene-Solr-8.x-Windows\solr\build\solr-core\test\J1\temp\solr.handler.component.SuggestComponentContextFilterQueryTest_2BFA862278639CD7-001\init-core-data-001\]
   [junit4]   2> 2069677 INFO  (coreLoadExecutor-12563-thread-1) [    x:collection1 ] o.a.s.u.RandomMergePolicy RandomMergePolicy wrapping class org.apache.lucene.index.TieredMergePolicy: [TieredMergePolicy: maxMergeAtOnce=28, maxMergeAtOnceExplicit=16, maxMergedSegmentMB=22.169921875, floorSegmentMB=0.2763671875, forceMergeDeletesPctAllowed=26.058374496973066, segmentsPerTier=37.0, maxCFSSegmentSizeMB=8.796093022207999E12, noCFSRatio=1.0, deletesPctAllowed=31.094397647908206
   [junit4]   2> 2069728 INFO  (coreLoadExecutor-12563-thread-1) [    x:collection1 ] o.a.s.u.CommitTracker Hard AutoCommit: disabled
   [junit4]   2> 2069728 INFO  (coreLoadExecutor-12563-thread-1) [    x:collection1 ] o.a.s.u.CommitTracker Soft AutoCommit: disabled
   [junit4]   2> 2069728 INFO  (coreLoadExecutor-12563-thread-1) [    x:collection1 ] o.a.s.u.RandomMergePolicy RandomMergePolicy wrapping class org.apache.lucene.index.TieredMergePolicy: [TieredMergePolicy: maxMergeAtOnce=42, maxMergeAtOnceExplicit=13, maxMergedSegmentMB=54.1572265625, floorSegmentMB=1.16015625, forceMergeDeletesPctAllowed=29.10619682008557, segmentsPerTier=43.0, maxCFSSegmentSizeMB=8.796093022207999E12, noCFSRatio=0.7659550161366787, deletesPctAllowed=46.25792488540982
   [junit4]   2> 2069728 INFO  (coreLoadExecutor-12563-thread-1) [    x:collection1 ] o.a.s.s.SolrIndexSearcher Opening [Searcher@44f43461[collection1] main]
   [junit4]   2> 2069729 WARN  (coreLoadExecutor-12563-thread-1) [    x:collection1 ] o.a.s.r.ManagedResourceStorage Cannot write to config directory C:\Users\jenkins\workspace\Lucene-Solr-8.x-Windows\solr\core\src\test-files\solr\collection1\conf; switching to use InMemory storage instead.
   [junit4]   2> 2069729 INFO  (coreLoadExecutor-12563-thread-1) [    x:collection1 ] o.a.s.h.c.SuggestComponent Initializing SuggestComponent
   [junit4]   2> 2069729 INFO  (coreLoadExecutor-12563-thread-1) [    x:collection1 ] o.a.s.s.s.SolrSuggester init: {name=suggest_blended_infix_suggester,lookupImpl=BlendedInfixLookupFactory,dictionaryImpl=DocumentDictionaryFactory,field=cat,weightField=price,contextField=my_contexts_t,suggestAnalyzerFieldType=text,buildOnCommit=false,buildOnStartup=false,storeDir=suggest_blended_infix_suggester,indexPath=suggest_blended_infix_suggester,highlight=false}
   [junit4]   2> 2069731 INFO  (coreLoadExecutor-12563-thread-1) [    x:collection1 ] o.a.s.s.s.SolrSuggester Dictionary loaded with params: {name=suggest_blended_infix_suggester,lookupImpl=BlendedInfixLookupFactory,dictionaryImpl=DocumentDictionaryFactory,field=cat,weightField=price,contextField=my_contexts_t,suggestAnalyzerFieldType=text,buildOnCommit=false,buildOnStartup=false,storeDir=suggest_blended_infix_suggester,indexPath=suggest_blended_infix_suggester,highlight=false}
   [junit4]   2> 2069731 INFO  (coreLoadExecutor-12563-thread-1) [    x:collection1 ] o.a.s.s.s.SolrSuggester init: {name=suggest_blended_infix_suggester_string,lookupImpl=BlendedInfixLookupFactory,dictionaryImpl=DocumentDictionaryFactory,field=cat,weightField=price,contextField=my_contexts_s,suggestAnalyzerFieldType=text,buildOnCommit=false,buildOnStartup=false,storeDir=suggest_blended_infix_suggester_string,indexPath=suggest_blended_infix_suggester_string,highlight=false}
   [junit4]   2> 2069732 INFO  (coreLoadExecutor-12563-thread-1) [    x:collection1 ] o.a.s.s.s.SolrSuggester Dictionary loaded with params: {name=suggest_blended_infix_suggester_string,lookupImpl=BlendedInfixLookupFactory,dictionaryImpl=DocumentDictionaryFactory,field=cat,weightField=price,contextField=my_contexts_s,suggestAnalyzerFieldType=text,buildOnCommit=false,buildOnStartup=false,storeDir=suggest_blended_infix_suggester_string,indexPath=suggest_blended_infix_suggester_string,highlight=false}
   [junit4]   2> 2069732 INFO  (coreLoadExecutor-12563-thread-1) [    x:collection1 ] o.a.s.s.s.SolrSuggester init: {name=suggest_lookup_has_no_context_implementation,lookupImpl=AnalyzingLookupFactory,dictionaryImpl=DocumentDictionaryFactory,field=cat,weightField=price,suggestAnalyzerFieldType=text,buildOnCommit=false,buildOnStartup=false,storeDir=suggest_lookup_has_no_context_implementation,indexPath=suggest_lookup_has_no_context_implementation,highlight=false}
   [junit4]   2> 2069732 INFO  (coreLoadExecutor-12563-thread-1) [    x:collection1 ] o.a.s.s.s.SolrSuggester Dictionary loaded with params: {name=suggest_lookup_has_no_context_implementation,lookupImpl=AnalyzingLookupFactory,dictionaryImpl=DocumentDictionaryFactory,field=cat,weightField=price,suggestAnalyzerFieldType=text,buildOnCommit=false,buildOnStartup=false,storeDir=suggest_lookup_has_no_context_implementation,indexPath=suggest_lookup_has_no_context_implementation,highlight=false}
   [junit4]   2> 2069732 INFO  (coreLoadExecutor-12563-thread-1) [    x:collection1 ] o.a.s.s.s.SolrSuggester init: {name=suggest_context_filtering_not_implemented,lookupImpl=AnalyzingLookupFactory,dictionaryImpl=DocumentDictionaryFactory,field=cat,weightField=price,suggestAnalyzerFieldType=text,buildOnCommit=false,buildOnStartup=false,contextField=my_contexts_t,storeDir=suggest_context_filtering_not_implemented,indexPath=suggest_context_filtering_not_implemented,highlight=false}
   [junit4]   2> 2069733 INFO  (coreLoadExecutor-12563-thread-1) [    x:collection1 ] o.a.s.s.s.SolrSuggester Dictionary loaded with params: {name=suggest_context_filtering_not_implemented,lookupImpl=AnalyzingLookupFactory,dictionaryImpl=DocumentDictionaryFactory,field=cat,weightField=price,suggestAnalyzerFieldType=text,buildOnCommit=false,buildOnStartup=false,contextField=my_contexts_t,storeDir=suggest_context_filtering_not_implemented,indexPath=suggest_context_filtering_not_implemented,highlight=false}
   [junit4]   2> 2069733 INFO  (coreLoadExecutor-12563-thread-1) [    x:collection1 ] o.a.s.s.s.SolrSuggester init: {name=suggest_context_implemented_but_not_configured,lookupImpl=BlendedInfixLookupFactory,dictionaryImpl=DocumentDictionaryFactory,field=cat,weightField=price,suggestAnalyzerFieldType=text,buildOnCommit=false,buildOnStartup=false,storeDir=suggest_context_implemented_but_not_configured,indexPath=suggest_context_implemented_but_not_configured,highlight=false}
   [junit4]   2> 2069734 INFO  (coreLoadExecutor-12563-thread-1) [    x:collection1 ] o.a.s.s.s.SolrSuggester Dictionary loaded with params: {name=suggest_context_implemented_but_not_configured,lookupImpl=BlendedInfixLookupFactory,dictionaryImpl=DocumentDictionaryFactory,field=cat,weightField=price,suggestAnalyzerFieldType=text,buildOnCommit=false,buildOnStartup=false,storeDir=suggest_context_implemented_but_not_configured,indexPath=suggest_context_implemented_but_not_configured,highlight=false}
   [junit4]   2> 2069734 INFO  (coreLoadExecutor-12563-thread-1) [    x:collection1 ] o.a.s.h.ReplicationHandler Commits will be reserved for 10000ms.
   [junit4]   2> 2069734 INFO  (searcherExecutor-12564-thread-1-processing-x:collection1) [    x:collection1 ] o.a.s.c.SolrCore [collection1] Registered new searcher Searcher@44f43461[collection1] main{ExitableDirectoryReader(UninvertingDirectoryReader())}
   [junit4]   2> 2069735 INFO  (SUITE-SuggestComponentContextFilterQueryTest-seed#[2BFA862278639CD7]-worker) [     ] o.a.s.SolrTestCaseJ4 ####initCore end
   [junit4]   2> 2069739 INFO  (TEST-SuggestComponentContextFilterQueryTest.testContextFilterOK-seed#[2BFA862278639CD7]) [     ] o.a.s.SolrTestCaseJ4 ###Starting testContextFilterOK
   [junit4]   2> 2069739 INFO  (TEST-SuggestComponentContextFilterQueryTest.testContextFilterOK-seed#[2BFA862278639CD7]) [     ] o.a.s.u.DirectUpdateHandler2 [collection1] REMOVING ALL DOCUMENTS FROM INDEX
   [junit4]   2> 2069739 INFO  (TEST-SuggestComponentContextFilterQueryTest.testContextFilterOK-seed#[2BFA862278639CD7]) [     ] o.a.s.u.p.LogUpdateProcessorFactory [collection1]  webapp=null path=null params={}{deleteByQuery=*:*} 0 0
   [junit4]   2> 2069741 INFO  (TEST-SuggestComponentContextFilterQueryTest.testContextFilterOK-seed#[2BFA862278639CD7]) [     ] o.a.s.u.p.LogUpdateProcessorFactory [collection1]  webapp=null path=null params={}{add=[0]} 0 0
   [junit4]   2> 2069742 INFO  (TEST-SuggestComponentContextFilterQueryTest.testContextFilterOK-seed#[2BFA862278639CD7]) [     ] o.a.s.u.p.LogUpdateProcessorFactory [collection1]  webapp=null path=null params={}{add=[1]} 0 0
   [junit4]   2> 2069742 INFO  (TEST-SuggestComponentContextFilterQueryTest.testContextFilterOK-seed#[2BFA862278639CD7]) [     ] o.a.s.u.p.LogUpdateProcessorFactory [collection1]  webapp=null path=null params={}{add=[7]} 0 0
   [junit4]   2> 2069742 INFO  (TEST-SuggestComponentContextFilterQueryTest.testContextFilterOK-seed#[2BFA862278639CD7]) [     ] o.a.s.u.p.LogUpdateProcessorFactory [collection1]  webapp=null path=null params={}{add=[8]} 0 0
   [junit4]   2> 2069742 INFO  (TEST-SuggestComponentContextFilterQueryTest.testContextFilterOK-seed#[2BFA862278639CD7]) [     ] o.a.s.u.p.LogUpdateProcessorFactory [collection1]  webapp=null path=null params={}{add=[9]} 0 0
   [junit4]   2> 2069742 INFO  (TEST-SuggestComponentContextFilterQueryTest.testContextFilterOK-seed#[2BFA862278639CD7]) [     ] o.a.s.u.DirectUpdateHandler2 start commit{,optimize=false,openSearcher=true,waitSearcher=true,expungeDeletes=false,softCommit=false,prepareCommit=false}
   [junit4]   2> 2069742 INFO  (TEST-SuggestComponentContextFilterQueryTest.testContextFilterOK-seed#[2BFA862278639CD7]) [     ] o.a.s.u.SolrIndexWriter Calling setCommitData with IW:org.apache.solr.update.SolrIndexWriter@6bb769e1 commitCommandVersion:0
   [junit4]   2> 2069788 INFO  (TEST-SuggestComponentContextFilterQueryTest.testContextFilterOK-seed#[2BFA862278639CD7]) [     ] o.a.s.s.SolrIndexSearcher Opening [Searcher@d3f69e7[collection1] main]
   [junit4]   2> 2069788 INFO  (TEST-SuggestComponentContextFilterQueryTest.testContextFilterOK-seed#[2BFA862278639CD7]) [     ] o.a.s.u.DirectUpdateHandler2 end_commit_flush
   [junit4]   2> 2069790 INFO  (searcherExecutor-12564-thread-1) [     ] o.a.s.c.SolrCore [collection1] Registered new searcher Searcher@d3f69e7[collection1] main{ExitableDirectoryReader(UninvertingDirectoryReader(Uninverting(_0(8.2.0):C5:[diagnostics={os=Windows 10, java.vendor=Oracle Corporation, java.version=10.0.1, java.vm.version=10.0.1+10, lucene.version=8.2.0, os.arch=amd64, java.runtime.version=10.0.1+10, source=flush, os.version=10.0, timestamp=1560139664337}]:[attributes={Lucene50StoredFieldsFormat.mode=BEST_SPEED}])))}
   [junit4]   2> 2069790 INFO  (TEST-SuggestComponentContextFilterQueryTest.testContextFilterOK-seed#[2BFA862278639CD7]) [     ] o.a.s.u.p.LogUpdateProcessorFactory [collection1]  webapp=null path=null params={}{commit=} 0 47
   [junit4]   2> 2069790 INFO  (TEST-SuggestComponentContextFilterQueryTest.testContextFilterOK-seed#[2BFA862278639CD7]) [     ] o.a.s.h.c.SuggestComponent SuggestComponent prepare with : qt=/suggest&suggest.build=true&indent=off&suggest.q=examp&suggest.count=5&suggest=true&suggest.dictionary=suggest_blended_infix_suggester&wt=xml
   [junit4]   2> 2069791 INFO  (TEST-SuggestComponentContextFilterQueryTest.testContextFilterOK-seed#[2BFA862278639CD7]) [     ] o.a.s.s.s.SolrSuggester SolrSuggester.build(suggest_blended_infix_suggester)
   [junit4]   2> 2069922 ERROR (TEST-SuggestComponentContextFilterQueryTest.testContextFilterOK-seed#[2BFA862278639CD7]) [     ] o.a.s.s.s.SolrSuggester Store Lookup build failed
   [junit4]   2> 2069922 INFO  (TEST-SuggestComponentContextFilterQueryTest.testContextFilterOK-seed#[2BFA862278639CD7]) [     ] o.a.s.h.c.SuggestComponent SuggestComponent process with : qt=/suggest&suggest.build=true&indent=off&suggest.q=examp&suggest.count=5&suggest=true&suggest.dictionary=suggest_blended_infix_suggester&wt=xml
   [junit4]   2> 2069926 INFO  (TEST-SuggestComponentContextFilterQueryTest.testContextFilterOK-seed#[2BFA862278639CD7]) [     ] o.a.s.c.S.Request [collection1]  webapp=null path=null params={qt=/suggest&suggest.build=true&suggest.q=examp&suggest.dictionary=suggest_blended_infix_suggester&wt=xml} status=0 QTime=136
   [junit4]   2> 2069927 INFO  (TEST-SuggestComponentContextFilterQueryTest.testContextFilterOK-seed#[2BFA862278639CD7]) [     ] o.a.s.h.c.SuggestComponent SuggestComponent prepare with : qt=/suggest&suggest.build=true&indent=off&suggest.q=examp&suggest.count=5&suggest=true&suggest.dictionary=suggest_blended_infix_suggester&wt=xml&suggest.cfq=ctx1
   [junit4]   2> 2069927 INFO  (TEST-SuggestComponentContextFilterQueryTest.testContextFilterOK-seed#[2BFA862278639CD7]) [     ] o.a.s.s.s.SolrSuggester SolrSuggester.build(suggest_blended_infix_suggester)
   [junit4]   2> 2069985 ERROR (TEST-SuggestComponentContextFilterQueryTest.testContextFilterOK-seed#[2BFA862278639CD7]) [     ] o.a.s.s.s.SolrSuggester Store Lookup build failed
   [junit4]   2> 2069985 INFO  (TEST-SuggestComponentContextFilterQueryTest.testContextFilterOK-seed#[2BFA862278639CD7]) [     ] o.a.s.h.c.SuggestComponent SuggestComponent process with : qt=/suggest&suggest.build=true&indent=off&suggest.q=examp&suggest.count=5&suggest=true&suggest.dictionary=suggest_blended_infix_suggester&wt=xml&suggest.cfq=ctx1
   [junit4]   2> 2070037 INFO  (TEST-SuggestComponentContextFilterQueryTest.testContextFilterOK-seed#[2BFA862278639CD7]) [     ] o.a.s.c.S.Request [collection1]  webapp=null path=null params={qt=/suggest&suggest.build=true&suggest.q=examp&suggest.dictionary=suggest_blended_infix_suggester&wt=xml&suggest.cfq=ctx1} status=0 QTime=109
   [junit4]   2> 2070037 INFO  (TEST-SuggestComponentContextFilterQueryTest.testContextFilterOK-seed#[2BFA862278639CD7]) [     ] o.a.s.h.c.SuggestComponent SuggestComponent prepare with : qt=/suggest&suggest.build=true&indent=off&suggest.q=examp&suggest.count=5&suggest=true&suggest.dictionary=suggest_blended_infix_suggester&wt=xml&suggest.cfq=ctx1+OR+CTX2
   [junit4]   2> 2070037 INFO  (TEST-SuggestComponentContextFilterQueryTest.testContextFilterOK-seed#[2BFA862278639CD7]) [     ] o.a.s.s.s.SolrSuggester SolrSuggester.build(suggest_blended_infix_suggester)
   [junit4]   2> 2070071 ERROR (TEST-SuggestComponentContextFilterQueryTest.testContextFilterOK-seed#[2BFA862278639CD7]) [     ] o.a.s.s.s.SolrSuggester Store Lookup build failed
   [junit4]   2> 2070072 INFO  (TEST-SuggestComponentContextFilterQueryTest.testContextFilterOK-seed#[2BFA862278639CD7]) [     ] o.a.s.h.c.SuggestComponent SuggestComponent process with : qt=/suggest&suggest.build=true&indent=off&suggest.q=examp&suggest.count=5&suggest=true&suggest.dictionary=suggest_blended_infix_suggester&wt=xml&suggest.cfq=ctx1+OR+CTX2
   [junit4]   2> 2070076 INFO  (TEST-SuggestComponentContextFilterQueryTest.testContextFilterOK-seed#[2BFA862278639CD7]) [     ] o.a.s.c.S.Request [collection1]  webapp=null path=null params={qt=/suggest&suggest.build=true&suggest.q=examp&suggest.dictionary=suggest_blended_infix_suggester&wt=xml&suggest.cfq=ctx1+OR+CTX2} status=0 QTime=38
   [junit4]   2> 2070076 INFO  (TEST-SuggestComponentContextFilterQueryTest.testContextFilterOK-seed#[2BFA862278639CD7]) [     ] o.a.s.h.c.SuggestComponent SuggestComponent prepare with : qt=/suggest&suggest.build=true&indent=off&suggest.q=examp&suggest.count=5&suggest=true&suggest.dictionary=suggest_blended_infix_suggester&wt=xml&suggest.cfq=CTX2+AND+CTX3
   [junit4]   2> 2070076 INFO  (TEST-SuggestComponentContextFilterQueryTest.testContextFilterOK-seed#[2BFA862278639CD7]) [     ] o.a.s.s.s.SolrSuggester SolrSuggester.build(suggest_blended_infix_suggester)
   [junit4]   2> 2070108 ERROR (TEST-SuggestComponentContextFilterQueryTest.testContextFilterOK-seed#[2BFA862278639CD7]) [     ] o.a.s.s.s.SolrSuggester Store Lookup build failed
   [junit4]   2> 2070108 INFO  (TEST-SuggestComponentContextFilterQueryTest.testContextFilterOK-seed#[2BFA862278639CD7]) [     ] o.a.s.h.c.SuggestComponent SuggestComponent process with : qt=/suggest&suggest.build=true&indent=off&suggest.q=examp&suggest.count=5&suggest=true&suggest.dictionary=suggest_blended_infix_suggester&wt=xml&suggest.cfq=CTX2+AND+CTX3
   [junit4]   2> 2070111 INFO  (TEST-SuggestComponentContextFilterQueryTest.testContextFilterOK-seed#[2BFA862278639CD7]) [     ] o.a.s.c.S.Request [collection1]  webapp=null path=null params={qt=/suggest&suggest.build=true&suggest.q=examp&suggest.dictionary=suggest_blended_infix_suggester&wt=xml&suggest.cfq=CTX2+AND+CTX3} status=0 QTime=35
   [junit4]   2> 2070112 INFO  (TEST-SuggestComponentContextFilterQueryTest.testContextFilterOK-seed#[2BFA862278639CD7]) [     ] o.a.s.h.c.SuggestComponent SuggestComponent prepare with : qt=/suggest&suggest.build=true&indent=off&suggest.q=examp&suggest.count=5&suggest=true&suggest.dictionary=suggest_blended_infix_suggester&wt=xml&suggest.cfq=ctx*
   [junit4]   2> 2070112 INFO  (TEST-SuggestComponentContextFilterQueryTest.testContextFilterOK-seed#[2BFA862278639CD7]) [     ] o.a.s.s.s.SolrSuggester SolrSuggester.build(suggest_blended_infix_suggester)
   [junit4]   2> 2070145 ERROR (TEST-SuggestComponentContextFilterQueryTest.testContextFilterOK-seed#[2BFA862278639CD7]) [     ] o.a.s.s.s.SolrSuggester Store Lookup build failed
   [junit4]   2> 2070145 INFO  (TEST-SuggestComponentContextFilterQueryTest.testContextFilterOK-seed#[2BFA862278639CD7]) [     ] o.a.s.h.c.SuggestComponent SuggestComponent process with : qt=/suggest&suggest.build=true&indent=off&suggest.q=examp&suggest.count=5&suggest=true&suggest.dictionary=suggest_blended_infix_suggester&wt=xml&suggest.cfq=ctx*
   [junit4]   2> 2070147 INFO  (TEST-SuggestComponentContextFilterQueryTest.testContextFilterOK-seed#[2BFA862278639CD7]) [     ] o.a.s.c.S.Request [collection1]  webapp=null path=null params={qt=/suggest&suggest.build=true&suggest.q=examp&suggest.dictionary=suggest_blended_infix_suggester&wt=xml&suggest.cfq=ctx*} status=0 QTime=34
   [junit4]   2> 2070148 INFO  (TEST-SuggestComponentContextFilterQueryTest.testContextFilterOK-seed#[2BFA862278639CD7]) [     ] o.a.s.h.c.SuggestComponent SuggestComponent prepare with : qt=/suggest&suggest.build=true&indent=off&suggest.q=examp&suggest.count=5&suggest=true&suggest.dictionary=suggest_blended_infix_suggester&wt=xml&suggest.cfq=[*+TO+*]
   [junit4]   2> 2070148 INFO  (TEST-SuggestComponentContextFilterQueryTest.testContextFilterOK-seed#[2BFA862278639CD7]) [     ] o.a.s.s.s.SolrSuggester SolrSuggester.build(suggest_blended_infix_suggester)
   [junit4]   2> 2070178 ERROR (TEST-SuggestComponentContextFilterQueryTest.testContextFilterOK-seed#[2BFA862278639CD7]) [     ] o.a.s.s.s.SolrSuggester Store Lookup build failed
   [junit4]   2> 2070178 INFO  (TEST-SuggestComponentContextFilterQueryTest.testContextFilterOK-seed#[2BFA862278639CD7]) [     ] o.a.s.h.c.SuggestComponent SuggestComponent process with : qt=/suggest&suggest.build=true&indent=off&suggest.q=examp&suggest.count=5&suggest=true&suggest.dictionary=suggest_blended_infix_suggester&wt=xml&suggest.cfq=[*+TO+*]
   [junit4]   2> 2070180 INFO  (TEST-SuggestComponentContextFilterQueryTest.testContextFilterOK-seed#[2BFA862278639CD7]) [     ] o.a.s.c.S.Request [collection1]  webapp=null path=null params={qt=/suggest&suggest.build=true&suggest.q=examp&suggest.dictionary=suggest_blended_infix_suggester&wt=xml&suggest.cfq=[*+TO+*]} status=0 QTime=33
   [junit4]   2> 2070181 INFO  (TEST-SuggestComponentContextFilterQueryTest.testContextFilterOK-seed#[2BFA862278639CD7]) [     ] o.a.s.h.c.SuggestComponent SuggestComponent prepare with : qt=/suggest&suggest.build=true&indent=off&suggest.q=examp&suggest.count=5&suggest=true&suggest.dictionary=suggest_blended_infix_suggester&wt=xml&suggest.cfq=c*1
   [junit4]   2> 2070181 INFO  (TEST-SuggestComponentContextFilterQueryTest.testContextFilterOK-seed#[2BFA862278639CD7]) [     ] o.a.s.s.s.SolrSuggester SolrSuggester.build(suggest_blended_infix_suggester)
   [junit4]   2> 2070214 ERROR (TEST-SuggestComponentContextFilterQueryTest.testContextFilterOK-seed#[2BFA862278639CD7]) [     ] o.a.s.s.s.SolrSuggester Store Lookup build failed
   [junit4]   2> 2070214 INFO  (TEST-SuggestComponentContextFilterQueryTest.testContextFilterOK-seed#[2BFA862278639CD7]) [     ] o.a.s.h.c.SuggestComponent SuggestComponent process with : qt=/suggest&suggest.build=true&indent=off&suggest.q=examp&suggest.count=5&suggest=true&suggest.dictionary=suggest_blended_infix_suggester&wt=xml&suggest.cfq=c*1
   [junit4]   2> 2070215 INFO  (TEST-SuggestComponentContextFilterQueryTest.testContextFilterOK-seed#[2BFA862278639CD7]) [     ] o.a.s.c.S.Request [collection1]  webapp=null path=null params={qt=/suggest&suggest.build=true&suggest.q=examp&suggest.dictionary=suggest_blended_infix_suggester&wt=xml&suggest.cfq=c*1} status=0 QTime=34
   [junit4]   2> 2070216 INFO  (TEST-SuggestComponentContextFilterQueryTest.testContextFilterOK-seed#[2BFA862278639CD7]) [     ] o.a.s.SolrTestCaseJ4 ###Ending testContextFilterOK
   [junit4]   2> 2070221 INFO  (TEST-SuggestComponentContextFilterQueryTest.testContextFilteringIsIgnoredWhenContextIsImplementedButNotConfigured-seed#[2BFA862278639CD7]) [     ] o.a.s.SolrTestCaseJ4 ###Starting testContextFilteringIsIgnoredWhenContextIsImplementedButNotConfigured
   [junit4]   2> 2070221 INFO  (TEST-SuggestComponentContextFilterQueryTest.testContextFilteringIsIgnoredWhenContextIsImplementedButNotConfigured-seed#[2BFA862278639CD7]) [     ] o.a.s.u.DirectUpdateHandler2 [collection1] REMOVING ALL DOCUMENTS FROM INDEX
   [junit4]   2> 2070221 INFO  (TEST-SuggestComponentContextFilterQueryTest.testContextFilteringIsIgnoredWhenContextIsImplementedButNotConfigured-seed#[2BFA862278639CD7]) [     ] o.a.s.u.p.LogUpdateProcessorFactory [collection1]  webapp=null path=null params={}{deleteByQuery=*:*} 0 0
   [junit4]   2> 2070221 INFO  (TEST-SuggestComponentContextFilterQueryTest.testContextFilteringIsIgnoredWhenContextIsImplementedButNotConfigured-seed#[2BFA862278639CD7]) [     ] o.a.s.u.p.LogUpdateProcessorFactory [collection1]  webapp=null path=null params={}{add=[0]} 0 0
   [junit4]   2> 2070221 INFO  (TEST-SuggestComponentContextFilterQueryTest.testContextFilteringIsIgnoredWhenContextIsImplementedButNotConfigured-seed#[2BFA862278639CD7]) [     ] o.a.s.u.p.LogUpdateProcessorFactory [collection1]  webapp=null path=null params={}{add=[1]} 0 0
   [junit4]   2> 2070222 INFO  (TEST-SuggestComponentContextFilterQueryTest.testContextFilteringIsIgnoredWhenContextIsImplementedButNotConfigured-seed#[2BFA862278639CD7]) [     ] o.a.s.u.p.LogUpdateProcessorFactory [collection1]  webapp=null path=null params={}{add=[7]} 0 0
   [junit4]   2> 2070222 INFO  (TEST-SuggestComponentContextFilterQueryTest.testContextFilteringIsIgnoredWhenContextIsImplementedButNotConfigured-seed#[2BFA862278639CD7]) [     ] o.a.s.u.p.LogUpdateProcessorFactory [collection1]  webapp=null path=null params={}{add=[8]} 0 0
   [junit4]   2> 2070223 INFO  (TEST-SuggestComponentContextFilterQueryTest.testContextFilteringIsIgnoredWhenContextIsImplementedButNotConfigured-seed#[2BFA862278639CD7]) [     ] o.a.s.u.p.LogUpdateProcessorFactory [collection1]  webapp=null path=null params={}{add=[9]} 0 0
   [junit4]   2> 2070223 INFO  (TEST-SuggestComponentContextFilterQueryTest.testContextFilteringIsIgnoredWhenContextIsImplementedButNotConfigured-seed#[2BFA862278639CD7]) [     ] o.a.s.u.DirectUpdateHandler2 start commit{,optimize=false,openSearcher=true,waitSearcher=true,expungeDeletes=false,softCommit=false,prepareCommit=false}
   [junit4]   2> 2070223 INFO  (TEST-SuggestComponentContextFilterQueryTest.testContextFilteringIsIgnoredWhenContextIsImplementedButNotConfigured-seed#[2BFA862278639CD7]) [     ] o.a.s.u.SolrIndexWriter Calling setCommitData with IW:org.apache.solr.update.SolrIndexWriter@6bb769e1 commitCommandVersion:0
   [junit4]   2> 2070255 INFO  (TEST-SuggestComponentContextFilterQueryTest.testContextFilteringIsIgnoredWhenContextIsImplementedButNotConfigured-seed#[2BFA862278639CD7]) [     ] o.a.s.s.SolrIndexSearcher Opening [Searcher@61473e5[collection1] main]
   [junit4]   2> 2070255 INFO  (TEST-SuggestComponentContextFilterQueryTest.testContextFilteringIsIgnoredWhenContextIsImplementedButNotConfigured-seed#[2BFA862278639CD7]) [     ] o.a.s.u.DirectUpdateHandler2 end_commit_flush
   [junit4]   2> 2070256 INFO  (searcherExecutor-12564-thread-1) [     ] o.a.s.c.SolrCore [collection1] Registered new searcher Searcher@61473e5[collection1] main{ExitableDirectoryReader(UninvertingDirectoryReader(Uninverting(_1(8.2.0):C5:[diagnostics={os=Windows 10, java.vendor=Oracle Corporation, java.version=10.0.1, java.vm.version=10.0.1+10, lucene.version=8.2.0, os.arch=amd64, java.runtime.version=10.0.1+10, source=flush, os.version=10.0, timestamp=1560139664807}]:[attributes={Lucene50StoredFieldsFormat.mode=BEST_SPEED}])))}
   [junit4]   2> 2070263 INFO  (TEST-SuggestComponentContextFilterQueryTest.testContextFilteringIsIgnoredWhenContextIsImplementedButNotConfigured-seed#[2BFA862278639CD7]) [     ] o.a.s.u.p.LogUpdateProcessorFactory [collection1]  webapp=null path=null params={}{commit=} 0 40
   [junit4]   2> 2070263 INFO  (TEST-SuggestComponentContextFilterQueryTest.testContextFilteringIsIgnoredWhenContextIsImplementedButNotConfigured-seed#[2BFA862278639CD7]) [     ] o.a.s.h.c.SuggestComponent SuggestComponent prepare with : qt=/suggest&suggest.build=true&indent=off&suggest.q=examp&suggest.count=5&suggest=true&suggest.dictionary=suggest_context_implemented_but_not_configured&wt=xml
   [junit4]   2> 2070264 INFO  (TEST-SuggestComponentContextFilterQueryTest.testContextFilteringIsIgnoredWhenContextIsImplementedButNotConfigured-seed#[2BFA862278639CD7]) [     ] o.a.s.s.s.SolrSuggester SolrSuggester.build(suggest_context_implemented_but_not_configured)
   [junit4]   2> 2070313 ERROR (TEST-SuggestComponentContextFilterQueryTest.testContextFilteringIsIgnoredWhenContextIsImplementedButNotConfigured-seed#[2BFA862278639CD7]) [     ] o.a.s.s.s.SolrSuggester Store Lookup build failed
   [junit4]   2> 2070313 INFO  (TEST-SuggestComponentContextFilterQueryTest.testContextFilteringIsIgnoredWhenContextIsImplementedButNotConfigured-seed#[2BFA862278639CD7]) [     ] o.a.s.h.c.SuggestComponent SuggestComponent process with : qt=/suggest&suggest.build=true&indent=off&suggest.q=examp&suggest.count=5&suggest=true&suggest.dictionary=suggest_context_implemented_but_not_configured&wt=xml
   [junit4]   2> 2070313 INFO  (TEST-SuggestComponentContextFilterQueryTest.testContextFilteringIsIgnoredWhenContextIsImplementedButNotConfigured-seed#[2BFA862278639CD7]) [     ] o.a.s.c.S.Request [collection1]  webapp=null path=null params={qt=/suggest&suggest.build=true&suggest.q=examp&suggest.dictionary=suggest_context_implemented_but_not_configured&wt=xml} status=0 QTime=50
   [junit4]   2> 2070315 INFO  (TEST-SuggestComponentContextFilterQueryTest.testContextFilteringIsIgnoredWhenContextIsImplementedButNotConfigured-seed#[2BFA862278639CD7]) [     ] o.a.s.SolrTestCaseJ4 ###Ending testContextFilteringIsIgnoredWhenContextIsImplementedButNotConfigured
   [junit4]   2> 2070319 INFO  (TEST-SuggestComponentContextFilterQueryTest.testBuildThrowsIllegalArgumentExceptionWhenContextIsConfiguredButNotImplemented-seed#[2BFA862278639CD7]) [     ] o.a.s.SolrTestCaseJ4 ###Starting testBuildThrowsIllegalArgumentExceptionWhenContextIsConfiguredButNotImplemented
   [junit4]   2> 2070319 INFO  (TEST-SuggestComponentContextFilterQueryTest.testBuildThrowsIllegalArgumentExceptionWhenContextIsConfiguredButNotImplemented-seed#[2BFA862278639CD7]) [     ] o.a.s.u.DirectUpdateHandler2 [collection1] REMOVING ALL DOCUMENTS FROM INDEX
   [junit4]   2> 2070319 INFO  (TEST-SuggestComponentContextFilterQueryTest.testBuildThrowsIllegalArgumentExceptionWhenContextIsConfiguredButNotImplemented-seed#[2BFA862278639CD7]) [     ] o.a.s.u.p.LogUpdateProcessorFactory [collection1]  webapp=null path=null params={}{deleteByQuery=*:*} 0 0
   [junit4]   2> 2070320 INFO  (TEST-SuggestComponentContextFilterQueryTest.testBuildThrowsIllegalArgumentExceptionWhenContextIsConfiguredButNotImplemented-seed#[2BFA862278639CD7]) [     ] o.a.s.u.p.LogUpdateProcessorFactory [collection1]  webapp=null path=null params={}{add=[0]} 0 0
   [junit4]   2> 2070320 INFO  (TEST-SuggestComponentContextFilterQueryTest.testBuildThrowsIllegalArgumentExceptionWhenContextIsConfiguredButNotImplemented-seed#[2BFA862278639CD7]) [     ] o.a.s.u.p.LogUpdateProcessorFactory [collection1]  webapp=null path=null params={}{add=[1]} 0 0
   [junit4]   2> 2070321 INFO  (TEST-SuggestComponentContextFilterQueryTest.testBuildThrowsIllegalArgumentExceptionWhenContextIsConfiguredButNotImplemented-seed#[2BFA862278639CD7]) [     ] o.a.s.u.p.LogUpdateProcessorFactory [collection1]  webapp=null path=null params={}{add=[7]} 0 0
   [junit4]   2> 2070321 INFO  (TEST-SuggestComponentContextFilterQueryTest.testBuildThrowsIllegalArgumentExceptionWhenContextIsConfiguredButNotImplemented-seed#[2BFA862278639CD7]) [     ] o.a.s.u.p.LogUpdateProcessorFactory [collection1]  webapp=null path=null params={}{add=[8]} 0 0
   [junit4]   2> 2070322 INFO  (TEST-SuggestComponentContextFilterQueryTest.testBuildThrowsIllegalArgumentExceptionWhenContextIsConfiguredButNotImplemented-seed#[2BFA862278639CD7]) [     ] o.a.s.u.p.LogUpdateProcessorFactory [collection1]  webapp=null path=null params={}{add=[9]} 0 0
   [junit4]   2> 2070322 INFO  (TEST-SuggestComponentContextFilterQueryTest.testBuildThrowsIllegalArgumentExceptionWhenContextIsConfiguredButNotImplemented-seed#[2BFA862278639CD7]) [     ] o.a.s.u.DirectUpdateHandler2 start commit{,optimize=false,openSearcher=true,waitSearcher=true,expungeDeletes=false,softCommit=false,prepareCommit=false}
   [junit4]   2> 2070322 INFO  (TEST-SuggestComponentContextFilterQueryTest.testBuildThrowsIllegalArgumentExceptionWhenContextIsConfiguredButNotImplemented-seed#[2BFA862278639CD7]) [     ] o.a.s.u.SolrIndexWriter Calling setCommitData with IW:org.apache.solr.update.SolrIndexWriter@6bb769e1 commitCommandVersion:0
   [junit4]   2> 2070375 INFO  (TEST-SuggestComponentContextFilterQueryTest.testBuildThrowsIllegalArgumentExceptionWhenContextIsConfiguredButNotImplemented-seed#[2BFA862278639CD7]) [     ] o.a.s.s.SolrIndexSearcher Opening [Searcher@37f8cff2[collection1] main]
   [junit4]   2> 2070375 INFO  (TEST-SuggestComponentContextFilterQueryTest.testBuildThrowsIllegalArgumentExceptionWhenContextIsConfiguredButNotImplemented-seed#[2BFA862278639CD7]) [     ] o.a.s.u.DirectUpdateHandler2 end_commit_flush
   [junit4]   2> 2070376 INFO  (searcherExecutor-12564-thread-1) [     ] o.a.s.c.SolrCore [collection1] Registered new searcher Searcher@37f8cff2[collection1] main{ExitableDirectoryReader(UninvertingDirectoryReader(Uninverting(_2(8.2.0):C5:[diagnostics={os=Windows 10, java.vendor=Oracle Corporation, java.version=10.0.1, java.vm.version=10.0.1+10, lucene.version=8.2.0, os.arch=amd64, java.runtime.version=10.0.1+10, source=flush, os.version=10.0, timestamp=1560139664906}]:[attributes={Lucene50StoredFieldsFormat.mode=BEST_SPEED}])))}
   [junit4]   2> 2070382 INFO  (TEST-SuggestComponentContextFilterQueryTest.testBuildThrowsIllegalArgumentExceptionWhenContextIsConfiguredButNotImplemented-seed#[2BFA862278639CD7]) [     ] o.a.s.u.p.LogUpdateProcessorFactory [collection1]  webapp=null path=null params={}{commit=} 0 59
   [junit4]   2> 2070382 INFO  (TEST-SuggestComponentContextFilterQueryTest.testBuildThrowsIllegalArgumentExceptionWhenContextIsConfiguredButNotImplemented-seed#[2BFA862278639CD7]) [     ] o.a.s.h.c.SuggestComponent SuggestComponent prepare with : qt=/suggest&suggest.build=true&indent=off&suggest.q=examp&suggest.count=5&suggest=true&suggest.dictionary=suggest_context_filtering_not_implemented&wt=xml
   [junit4]   2> 2070382 INFO  (TEST-SuggestComponentContextFilterQueryTest.testBuildThrowsIllegalArgumentExceptionWhenContextIsConfiguredButNotImplemented-seed#[2BFA862278639CD7]) [     ] o.a.s.s.s.SolrSuggester SolrSuggester.build(suggest_context_filtering_not_implemented)
   [junit4]   2> 2070382 ERROR (TEST-SuggestComponentContextFilterQueryTest.testBuildThrowsIllegalArgumentExceptionWhenContextIsConfiguredButNotImplemented-seed#[2BFA862278639CD7]) [     ] o.a.s.h.RequestHandlerBase java.lang.IllegalArgumentException: this suggester doesn't support contexts
   [junit4]   2> 	at org.apache.lucene.search.suggest.analyzing.AnalyzingSuggester.build(AnalyzingSuggester.java:406)
   [junit4]   2> 	at org.apache.lucene.search.suggest.Lookup.build(Lookup.java:190)
   [junit4]   2> 	at org.apache.solr.spelling.suggest.SolrSuggester.build(SolrSuggester.java:181)
   [junit4]   2> 	at org.apache.solr.handler.component.SuggestComponent.prepare(SuggestComponent.java:185)
   [junit4]   2> 	at org.apache.solr.handler.component.SearchHandler.handleRequestBody(SearchHandler.java:272)
   [junit4]   2> 	at org.apache.solr.handler.RequestHandlerBase.handleRequest(RequestHandlerBase.java:199)
   [junit4]   2> 	at org.apache.solr.core.SolrCore.execute(SolrCore.java:2565)
   [junit4]   2> 	at org.apache.solr.util.TestHarness.query(TestHarness.java:338)
   [junit4]   2> 	at org.apache.solr.util.TestHarness.query(TestHarness.java:320)
   [junit4]   2> 	at org.apache.solr.SolrTestCaseJ4.assertQ(SolrTestCaseJ4.java:918)
   [junit4]   2> 	at org.apache.solr.SolrTestCaseJ4.assertQ(SolrTestCaseJ4.java:904)
   [junit4]   2> 	at org.apache.solr.handler.component.SuggestComponentContextFilterQueryTest.testBuildThrowsIllegalArgumentExceptionWhenContextIsConfiguredButNotImplemented(SuggestComponentContextFilterQueryTest.java:82)
   [junit4]   2> 	at java.base/jdk.internal.reflect.NativeMethodAccessorImpl.invoke0(Native Method)
   [junit4]   2> 	at java.base/jdk.internal.reflect.NativeMethodAccessorImpl.invoke(NativeMethodAccessorImpl.java:62)
   [junit4]   2> 	at java.base/jdk.internal.reflect.DelegatingMethodAccessorImpl.invoke(DelegatingMethodAccessorImpl.java:43)
   [junit4]   2> 	at java.base/java.lang.reflect.Method.invoke(Method.java:564)
   [junit4]   2> 	at com.carrotsearch.randomizedtesting.RandomizedRunner.invoke(RandomizedRunner.java:1750)
   [junit4]   2> 	at com.carrotsearch.randomizedtesting.RandomizedRunner$8.evaluate(RandomizedRunner.java:938)
   [junit4]   2> 	at com.carrotsearch.randomizedtesting.RandomizedRunner$9.evaluate(RandomizedRunner.java:974)
   [junit4]   2> 	at com.carrotsearch.randomizedtesting.RandomizedRunner$10.evaluate(RandomizedRunner.java:988)
   [junit4]   2> 	at com.carrotsearch.randomizedtesting.rules.SystemPropertiesRestoreRule$1.evaluate(SystemPropertiesRestoreRule.java:57)
   [junit4]   2> 	at org.apache.lucene.util.TestRuleSetupTeardownChained$1.evaluate(TestRuleSetupTeardownChained.java:49)
   [junit4]   2> 	at org.apache.lucene.util.AbstractBeforeAfterRule$1.evaluate(AbstractBeforeAfterRule.java:45)
   [junit4]   2> 	at org.apache.lucene.util.TestRuleThreadAndTestName$1.evaluate(TestRuleThreadAndTestName.java:48)
   [junit4]   2> 	at org.apache.lucene.util.TestRuleIgnoreAfterMaxFailures$1.evaluate(TestRuleIgnoreAfterMaxFailures.java:64)
   [junit4]   2> 	at org.apache.lucene.util.TestRuleMarkFailure$1.evaluate(TestRuleMarkFailure.java:47)
   [junit4]   2> 	at com.carrotsearch.randomizedtesting.rules.StatementAdapter.evaluate(StatementAdapter.java:36)
   [junit4]   2> 	at com.carrotsearch.randomizedtesting.ThreadLeakControl$StatementRunner.run(ThreadLeakControl.java:368)
   [junit4]   2> 	at com.carrotsearch.randomizedtesting.ThreadLeakControl.forkTimeoutingTask(ThreadLeakControl.java:817)
   [junit4]   2> 	at com.carrotsearch.randomizedtesting.ThreadLeakControl$3.evaluate(ThreadLeakControl.java:468)
   [junit4]   2> 	at com.carrotsearch.randomizedtesting.RandomizedRunner.runSingleTest(RandomizedRunner.java:947)
   [junit4]   2> 	at com.carrotsearch.randomizedtesting.RandomizedRunner$5.evaluate(RandomizedRunner.java:832)
   [junit4]   2> 	at com.carrotsearch.randomizedtesting.RandomizedRunner$6.evaluate(RandomizedRunner.java:883)
   [junit4]   2> 	at com.carrotsearch.randomizedtesting.RandomizedRunner$7.evaluate(RandomizedRunner.java:894)
   [junit4]   2> 	at com.carrotsearch.randomizedtesting.rules.StatementAdapter.evaluate(StatementAdapter.java:36)
   [junit4]   2> 	at com.carrotsearch.randomizedtesting.rules.SystemPropertiesRestoreRule$1.evaluate(SystemPropertiesRestoreRule.java:57)
   [junit4]   2> 	at org.apache.lucene.util.AbstractBeforeAfterRule$1.evaluate(AbstractBeforeAfterRule.java:45)
   [junit4]   2> 	at com.carrotsearch.randomizedtesting.rules.StatementAdapter.evaluate(StatementAdapter.java:36)
   [junit4]   2> 	at org.apache.lucene.util.TestRuleStoreClassName$1.evaluate(TestRuleStoreClassName.java:41)
   [junit4]   2> 	at com.carrotsearch.randomizedtesting.rules.NoShadowingOrOverridesOnMethodsRule$1.evaluate(NoShadowingOrOverridesOnMethodsRule.java:40)
   [junit4]   2> 	at com.carrotsearch.randomizedtesting.rules.NoShadowingOrOverridesOnMethodsRule$1.evaluate(NoShadowingOrOverridesOnMethodsRule.java:40)
   [junit4]   2> 	at com.carrotsearch.randomizedtesting.rules.StatementAdapter.evaluate(StatementAdapter.java:36)
   [junit4]   2> 	at com.carrotsearch.randomizedtesting.rules.StatementAdapter.evaluate(StatementAdapter.java:36)
   [junit4]   2> 	at org.apache.lucene.util.TestRuleAssertionsRequired$1.evaluate(TestRuleAssertionsRequired.java:53)
   [junit4]   2> 	at org.apache.lucene.util.TestRuleMarkFailure$1.evaluate(TestRuleMarkFailure.java:47)
   [junit4]   2> 	at org.apache.lucene.util.TestRuleIgnoreAfterMaxFailures$1.evaluate(TestRuleIgnoreAfterMaxFailures.java:64)
   [junit4]   2> 	at org.apache.lucene.util.TestRuleIgnoreTestSuites$1.evaluate(TestRuleIgnoreTestSuites.java:54)
   [junit4]   2> 	at com.carrotsearch.randomizedtesting.rules.StatementAdapter.evaluate(StatementAdapter.java:36)
   [junit4]   2> 	at com.carrotsearch.randomizedtesting.ThreadLeakControl$StatementRunner.run(ThreadLeakControl.java:368)
   [junit4]   2> 	at java.base/java.lang.Thread.run(Thread.java:844)
   [junit4]   2> 
   [junit4]   2> 2070382 INFO  (TEST-SuggestComponentContextFilterQueryTest.testBuildThrowsIllegalArgumentExceptionWhenContextIsConfiguredButNotImplemented-seed#[2BFA862278639CD7]) [     ] o.a.s.c.S.Request [collection1]  webapp=null path=null params={qt=/suggest&suggest.build=true&suggest.q=examp&suggest.dictionary=suggest_context_filtering_not_implemented&wt=xml} status=500 QTime=0
   [junit4]   2> 2070382 ERROR (TEST-SuggestComponentContextFilterQueryTest.testBuildThrowsIllegalArgumentExceptionWhenContextIsConfiguredButNotImplemented-seed#[2BFA862278639CD7]) [     ] o.a.s.SolrTestCaseJ4 REQUEST FAILED: qt=/suggest&suggest.build=true&suggest.q=examp&suggest.dictionary=suggest_context_filtering_not_implemented&wt=xml:java.lang.IllegalArgumentException: this suggester doesn't support contexts
   [junit4]   2> 	at org.apache.lucene.search.suggest.analyzing.AnalyzingSuggester.build(AnalyzingSuggester.java:406)
   [junit4]   2> 	at org.apache.lucene.search.suggest.Lookup.build(Lookup.java:190)
   [junit4]   2> 	at org.apache.solr.spelling.suggest.SolrSuggester.build(SolrSuggester.java:181)
   [junit4]   2> 	at org.apache.solr.handler.component.SuggestComponent.prepare(SuggestComponent.java:185)
   [junit4]   2> 	at org.apache.solr.handler.component.SearchHandler.handleRequestBody(SearchHandler.java:272)
   [junit4]   2> 	at org.apache.solr.handler.RequestHandlerBase.handleRequest(RequestHandlerBase.java:199)
   [junit4]   2> 	at org.apache.solr.core.SolrCore.execute(SolrCore.java:2565)
   [junit4]   2> 	at org.apache.solr.util.TestHarness.query(TestHarness.java:338)
   [junit4]   2> 	at org.apache.solr.util.TestHarness.query(TestHarness.java:320)
   [junit4]   2> 	at org.apache.solr.SolrTestCaseJ4.assertQ(SolrTestCaseJ4.java:918)
   [junit4]   2> 	at org.apache.solr.SolrTestCaseJ4.assertQ(SolrTestCaseJ4.java:904)
   [junit4]   2> 	at org.apache.solr.handler.component.SuggestComponentContextFilterQueryTest.testBuildThrowsIllegalArgumentExceptionWhenContextIsConfiguredButNotImplemented(SuggestComponentContextFilterQueryTest.java:82)
   [junit4]   2> 	at java.base/jdk.internal.reflect.NativeMethodAccessorImpl.invoke0(Native Method)
   [junit4]   2> 	at java.base/jdk.internal.reflect.NativeMethodAccessorImpl.invoke(NativeMethodAccessorImpl.java:62)
   [junit4]   2> 	at java.base/jdk.internal.reflect.DelegatingMethodAccessorImpl.invoke(DelegatingMethodAccessorImpl.java:43)
   [junit4]   2> 	at java.base/java.lang.reflect.Method.invoke(Method.java:564)
   [junit4]   2> 	at com.carrotsearch.randomizedtesting.RandomizedRunner.invoke(RandomizedRunner.java:1750)
   [junit4]   2> 	at com.carrotsearch.randomizedtesting.RandomizedRunner$8.evaluate(RandomizedRunner.java:938)
   [junit4]   2> 	at com.carrotsearch.randomizedtesting.RandomizedRunner$9.evaluate(RandomizedRunner.java:974)
   [junit4]   2> 	at com.carrotsearch.randomizedtesting.RandomizedRunner$10.evaluate(RandomizedRunner.java:988)
   [junit4]   2> 	at com.carrotsearch.randomizedtesting.rules.SystemPropertiesRestoreRule$1.evaluate(SystemPropertiesRestoreRule.java:57)
   [junit4]   2> 	at org.apache.lucene.util.TestRuleSetupTeardownChained$1.evaluate(TestRuleSetupTeardownChained.java:49)
   [junit4]   2> 	at org.apache.lucene.util.AbstractBeforeAfterRule$1.evaluate(AbstractBeforeAfterRule.java:45)
   [junit4]   2> 	at org.apache.lucene.util.TestRuleThreadAndTestName$1.evaluate(TestRuleThreadAndTestName.java:48)
   [junit4]   2> 	at org.apache.lucene.util.TestRuleIgnoreAfterMaxFailures$1.evaluate(TestRuleIgnoreAfterMaxFailures.java:64)
   [junit4]   2> 	at org.apache.lucene.util.TestRuleMarkFailure$1.evaluate(TestRuleMarkFailure.java:47)
   [junit4]   2> 	at com.carrotsearch.randomizedtesting.rules.StatementAdapter.evaluate(StatementAdapter.java:36)
   [junit4]   2> 	at com.carrotsearch.randomizedtesting.ThreadLeakControl$StatementRunner.run(ThreadLeakControl.java:368)
   [junit4]   2> 	at com.carrotsearch.randomizedtesting.ThreadLeakControl.forkTimeoutingTask(ThreadLeakControl.java:817)
   [junit4]   2> 	at com.carrotsearch.randomizedtesting.ThreadLeakControl$3.evaluate(ThreadLeakControl.java:468)
   [junit4]   2> 	at com.carrotsearch.randomizedtesting.RandomizedRunner.runSingleTest(RandomizedRunner.java:947)
   [junit4]   2> 	at com.carrotsearch.randomizedtesting.RandomizedRunner$5.evaluate(RandomizedRunner.java:832)
   [junit4]   2> 	at com.carrotsearch.randomizedtesting.RandomizedRunner$6.evaluate(RandomizedRunner.java:883)
   [junit4]   2> 	at com.carrotsearch.randomizedtesting.RandomizedRunner$7.evaluate(RandomizedRunner.java:894)
   [junit4]   2> 	at com.carrotsearch.randomizedtesting.rules.StatementAdapter.evaluate(StatementAdapter.java:36)
   [junit4]   2> 	at com.carrotsearch.randomizedtesting.rules.SystemPropertiesRestoreRule$1.evaluate(SystemPropertiesRestoreRule.java:57)
   [junit4]   2> 	at org.apache.lucene.util.AbstractBeforeAfterRule$1.evaluate(AbstractBeforeAfterRule.java:45)
   [junit4]   2> 	at com.carrotsearch.randomizedtesting.rules.StatementAdapter.evaluate(StatementAdapter.java:36)
   [junit4]   2> 	at org.apache.lucene.util.TestRuleStoreClassName$1.evaluate(TestRuleStoreClassName.java:41)
   [junit4]   2> 	at com.carrotsearch.randomizedtesting.rules.NoShadowingOrOverridesOnMethodsRule$1.evaluate(NoShadowingOrOverridesOnMethodsRule.java:40)
   [junit4]   2> 	at com.carrotsearch.randomizedtesting.rules.NoShadowingOrOverridesOnMethodsRule$1.evaluate(NoShadowingOrOverridesOnMethodsRule.java:40)
   [junit4]   2> 	at com.carrotsearch.randomizedtesting.rules.StatementAdapter.evaluate(StatementAdapter.java:36)
   [junit4]   2> 	at com.carrotsearch.randomizedtesting.rules.StatementAdapter.evaluate(StatementAdapter.java:36)
   [junit4]   2> 	at org.apache.lucene.util.TestRuleAssertionsRequired$1.evaluate(TestRuleAssertionsRequired.java:53)
   [junit4]   2> 	at org.apache.lucene.util.TestRuleMarkFailure$1.evaluate(TestRuleMarkFailure.java:47)
   [junit4]   2> 	at org.apache.lucene.util.TestRuleIgnoreAfterMaxFailures$1.evaluate(TestRuleIgnoreAfterMaxFailures.java:64)
   [junit4]   2> 	at org.apache.lucene.util.TestRuleIgnoreTestSuites$1.evaluate(TestRuleIgnoreTestSuites.java:54)
   [junit4]   2> 	at com.carrotsearch.randomizedtesting.rules.StatementAdapter.evaluate(StatementAdapter.java:36)
   [junit4]   2> 	at com.carrotsearch.randomizedtesting.ThreadLeakControl$StatementRunner.run(ThreadLeakControl.java:368)
   [junit4]   2> 	at java.base/java.lang.Thread.run(Thread.java:844)
   [junit4]   2> 
   [junit4]   2> 2070382 INFO  (TEST-SuggestComponentContextFilterQueryTest.testBuildThrowsIllegalArgumentExceptionWhenContextIsConfiguredButNotImplemented-seed#[2BFA862278639CD7]) [     ] o.a.s.h.c.SuggestComponent SuggestComponent prepare with : qt=/suggest&suggest.build=false&indent=off&suggest.q=examp&suggest.count=5&suggest=true&suggest.dictionary=suggest_context_filtering_not_implemented&wt=xml
   [junit4]   2> 2070382 INFO  (TEST-SuggestComponentContextFilterQueryTest.testBuildThrowsIllegalArgumentExceptionWhenContextIsConfiguredButNotImplemented-seed#[2BFA862278639CD7]) [     ] o.a.s.h.c.SuggestComponent SuggestComponent process with : qt=/suggest&suggest.build=false&indent=off&suggest.q=examp&suggest.count=5&suggest=true&suggest.dictionary=suggest_context_filtering_not_implemented&wt=xml
   [junit4]   2> 2070382 INFO  (TEST-SuggestComponentContextFilterQueryTest.testBuildThrowsIllegalArgumentExceptionWhenContextIsConfiguredButNotImplemented-seed#[2BFA862278639CD7]) [     ] o.a.s.c.S.Request [collection1]  webapp=null path=null params={qt=/suggest&suggest.build=false&suggest.q=examp&suggest.dictionary=suggest_context_filtering_not_implemented&wt=xml} status=0 QTime=0
   [junit4]   2> 2070384 INFO  (TEST-SuggestComponentContextFilterQueryTest.testBuildThrowsIllegalArgumentExceptionWhenContextIsConfiguredButNotImplemented-seed#[2BFA862278639CD7]) [     ] o.a.s.SolrTestCaseJ4 ###Ending testBuildThrowsIllegalArgumentExceptionWhenContextIsConfiguredButNotImplemented
   [junit4]   2> 2070387 INFO  (TEST-SuggestComponentContextFilterQueryTest.testContextFilterIsTrimmed-seed#[2BFA862278639CD7]) [     ] o.a.s.SolrTestCaseJ4 ###Starting testContextFilterIsTrimmed
   [junit4]   2> 2070387 INFO  (TEST-SuggestComponentContextFilterQueryTest.testContextFilterIsTrimmed-seed#[2BFA862278639CD7]) [     ] o.a.s.u.DirectUpdateHandler2 [collection1] REMOVING ALL DOCUMENTS FROM INDEX
   [junit4]   2> 2070387 INFO  (TEST-SuggestComponentContextFilterQueryTest.testContextFilterIsTrimmed-seed#[2BFA862278639CD7]) [     ] o.a.s.u.p.LogUpdateProcessorFactory [collection1]  webapp=null path=null params={}{deleteByQuery=*:*} 0 0
   [junit4]   2> 2070388 INFO  (TEST-SuggestComponentContextFilterQueryTest.testContextFilterIsTrimmed-seed#[2BFA862278639CD7]) [     ] o.a.s.u.p.LogUpdateProcessorFactory [collection1]  webapp=null path=null params={}{add=[0]} 0 0
   [junit4]   2> 2070388 INFO  (TEST-SuggestComponentContextFilterQueryTest.testContextFilterIsTrimmed-seed#[2BFA862278639CD7]) [     ] o.a.s.u.p.LogUpdateProcessorFactory [collection1]  webapp=null path=null params={}{add=[1]} 0 0
   [junit4]   2> 2070389 INFO  (TEST-SuggestComponentContextFilterQueryTest.testContextFilterIsTrimmed-seed#[2BFA862278639CD7]) [     ] o.a.s.u.p.LogUpdateProcessorFactory [collection1]  webapp=null path=null params={}{add=[7]} 0 0
   [junit4]   2> 2070389 INFO  (TEST-SuggestComponentContextFilterQueryTest.testContextFilterIsTrimmed-seed#[2BFA862278639CD7]) [     ] o.a.s.u.p.LogUpdateProcessorFactory [collection1]  webapp=null path=null params={}{add=[8]} 0 0
   [junit4]   2> 2070389 INFO  (TEST-SuggestComponentContextFilterQueryTest.testContextFilterIsTrimmed-seed#[2BFA862278639CD7]) [     ] o.a.s.u.p.LogUpdateProcessorFactory [collection1]  webapp=null path=null params={}{add=[9]} 0 0
   [junit4]   2> 2070389 INFO  (TEST-SuggestComponentContextFilterQueryTest.testContextFilterIsTrimmed-seed#[2BFA862278639CD7]) [     ] o.a.s.u.DirectUpdateHandler2 start commit{,optimize=false,openSearcher=true,waitSearcher=true,expungeDeletes=false,softCommit=false,prepareCommit=false}
   [junit4]   2> 2070389 INFO  (TEST-SuggestComponentContextFilterQueryTest.testContextFilterIsTrimmed-seed#[2BFA862278639CD7]) [     ] o.a.s.u.SolrIndexWriter Calling setCommitData with IW:org.apache.solr.update.SolrIndexWriter@6bb769e1 commitCommandVersion:0
   [junit4]   2> 2070439 INFO  (TEST-SuggestComponentContextFilterQueryTest.testContextFilterIsTrimmed-seed#[2BFA862278639CD7]) [     ] o.a.s.s.SolrIndexSearcher Opening [Searcher@473754e8[collection1] main]
   [junit4]   2> 2070439 INFO  (TEST-SuggestComponentContextFilterQueryTest.testContextFilterIsTrimmed-seed#[2BFA862278639CD7]) [     ] o.a.s.u.DirectUpdateHandler2 end_commit_flush
   [junit4]   2> 2070441 INFO  (searcherExecutor-12564-thread-1) [     ] o.a.s.c.SolrCore [collection1] Registered new searcher Searcher@473754e8[collection1] main{ExitableDirectoryReader(UninvertingDirectoryReader(Uninverting(_3(8.2.0):C5:[diagnostics={os=Windows 10, java.vendor=Oracle Corporation, java.version=10.0.1, java.vm.version=10.0.1+10, lucene.version=8.2.0, os.arch=amd64, java.runtime.version=10.0.1+10, source=flush, os.version=10.0, timestamp=1560139664971}]:[attributes={Lucene50StoredFieldsFormat.mode=BEST_SPEED}])))}
   [junit4]   2> 2070448 INFO  (TEST-SuggestComponentContextFilterQueryTest.testContextFilterIsTrimmed-seed#[2BFA862278639CD7]) [     ] o.a.s.u.p.LogUpdateProcessorFactory [collection1]  webapp=null path=null params={}{commit=} 0 59
   [junit4]   2> 2070449 INFO  (TEST-SuggestComponentContextFilterQueryTest.testContextFilterIsTrimmed-seed#[2BFA862278639CD7]) [     ] o.a.s.h.c.SuggestComponent SuggestComponent prepare with : qt=/suggest&suggest.build=true&indent=off&suggest.q=examp&suggest.count=5&suggest=true&suggest.dictionary=suggest_blended_infix_suggester&wt=xml&suggest.cfq=+++++
   [junit4]   2> 2070449 INFO  (TEST-SuggestComponentContextFilterQueryTest.testContextFilterIsTrimmed-seed#[2BFA862278639CD7]) [     ] o.a.s.s.s.SolrSuggester SolrSuggester.build(suggest_blended_infix_suggester)
   [junit4]   2> 2070494 ERROR (TEST-SuggestComponentContextFilterQueryTest.testContextFilterIsTrimmed-seed#[2BFA862278639CD7]) [     ] o.a.s.s.s.SolrSuggester Store Lookup build failed
   [junit4]   2> 2070494 INFO  (TEST-SuggestComponentContextFilterQueryTest.testContextFilterIsTrimmed-seed#[2BFA862278639CD7]) [     ] o.a.s.h.c.SuggestComponent SuggestComponent process with : qt=/suggest&suggest.build=true&indent=off&suggest.q=examp&suggest.count=5&suggest=true&suggest.dictionary=suggest_blended_infix_suggester&wt=xml&suggest.cfq=+++++
   [junit4]   2> 2070495 INFO  (TEST-SuggestComponentContextFilterQueryTest.testContextFilterIsTrimmed-seed#[2BFA862278639CD7]) [     ] o.a.s.c.S.Request [collection1]  webapp=null path=null params={qt=/suggest&suggest.build=true&suggest.q=examp&suggest.dictionary=suggest_blended_infix_suggester&wt=xml&suggest.cfq=+++++} status=0 QTime=46
   [junit4]   2> 2070496 INFO  (TEST-SuggestComponentContextFilterQueryTest.testContextFilterIsTrimmed-seed#[2BFA862278639CD7]) [     ] o.a.s.SolrTestCaseJ4 ###Ending testContextFilterIsTrimmed
   [junit4]   2> 2070499 INFO  (TEST-SuggestComponentContextFilterQueryTest.testExplicitFieldedQuery-seed#[2BFA862278639CD7]) [     ] o.a.s.SolrTestCaseJ4 ###Starting testExplicitFieldedQuery
   [junit4]   2> 2070499 INFO  (TEST-SuggestComponentContextFilterQueryTest.testExplicitFieldedQuery-seed#[2BFA862278639CD7]) [     ] o.a.s.u.DirectUpdateHandler2 [collection1] REMOVING ALL DOCUMENTS FROM INDEX
   [junit4]   2> 2070499 INFO  (TEST-SuggestComponentContextFilterQueryTest.testExplicitFieldedQuery-seed#[2BFA862278639CD7]) [     ] o.a.s.u.p.LogUpdateProcessorFactory [collection1]  webapp=null path=null params={}{deleteByQuery=*:*} 0 0
   [junit4]   2> 2070500 INFO  (TEST-SuggestComponentContextFilterQueryTest.testExplicitFieldedQuery-seed#[2BFA862278639CD7]) [     ] o.a.s.u.p.LogUpdateProcessorFactory [collection1]  webapp=null path=null params={}{add=[0]} 0 0
   [junit4]   2> 2070500 INFO  (TEST-SuggestComponentContextFilterQueryTest.testExplicitFieldedQuery-seed#[2BFA862278639CD7]) [     ] o.a.s.u.p.LogUpdateProcessorFactory [collection1]  webapp=null path=null params={}{add=[1]} 0 0
   [junit4]   2> 2070500 INFO  (TEST-SuggestComponentContextFilterQueryTest.testExplicitFieldedQuery-seed#[2BFA862278639CD7]) [     ] o.a.s.u.p.LogUpdateProcessorFactory [collection1]  webapp=null path=null params={}{add=[7]} 0 0
   [junit4]   2> 2070501 INFO  (TEST-SuggestComponentContextFilterQueryTest.testExplicitFieldedQuery-seed#[2BFA862278639CD7]) [     ] o.a.s.u.p.LogUpdateProcessorFactory [collection1]  webapp=null path=null params={}{add=[8]} 0 0
   [junit4]   2> 2070501 INFO  (TEST-SuggestComponentContextFilterQueryTest.testExplicitFieldedQuery-seed#[2BFA862278639CD7]) [     ] o.a.s.u.p.LogUpdateProcessorFactory [collection1]  webapp=null path=null params={}{add=[9]} 0 0
   [junit4]   2> 2070501 INFO  (TEST-SuggestComponentContextFilterQueryTest.testExplicitFieldedQuery-seed#[2BFA862278639CD7]) [     ] o.a.s.u.DirectUpdateHandler2 start commit{,optimize=false,openSearcher=true,waitSearcher=true,expungeDeletes=false,softCommit=false,prepareCommit=false}
   [junit4]   2> 2070501 INFO  (TEST-SuggestComponentContextFilterQueryTest.testExplicitFieldedQuery-seed#[2BFA862278639CD7]) [     ] o.a.s.u.SolrIndexWriter Calling setCommitData with IW:org.apache.solr.update.SolrIndexWriter@6bb769e1 commitCommandVersion:0
   [junit4]   2> 2070538 INFO  (TEST-SuggestComponentContextFilterQueryTest.testExplicitFieldedQuery-seed#[2BFA862278639CD7]) [     ] o.a.s.s.SolrIndexSearcher Opening [Searcher@7e0fea5e[collection1] main]
   [junit4]   2> 2070539 INFO  (TEST-SuggestComponentContextFilterQueryTest.testExplicitFieldedQuery-seed#[2BFA862278639CD7]) [     ] o.a.s.u.DirectUpdateHandler2 end_commit_flush
   [junit4]   2> 2070540 INFO  (searcherExecutor-12564-thread-1) [     ] o.a.s.c.SolrCore [collection1] Registered new searcher Searcher@7e0fea5e[collection1] main{ExitableDirectoryReader(UninvertingDirectoryReader(Uninverting(_4(8.2.0):C5:[diagnostics={os=Windows 10, java.vendor=Oracle Corporation, java.version=10.0.1, java.vm.version=10.0.1+10, lucene.version=8.2.0, os.arch=amd64, java.runtime.version=10.0.1+10, source=flush, os.version=10.0, timestamp=1560139665085}]:[attributes={Lucene50StoredFieldsFormat.mode=BEST_SPEED}])))}
   [junit4]   2> 2070545 INFO  (TEST-SuggestComponentContextFilterQueryTest.testExplicitFieldedQuery-seed#[2BFA862278639CD7]) [     ] o.a.s.u.p.LogUpdateProcessorFactory [collection1]  webapp=null path=null params={}{commit=} 0 43
   [junit4]   2> 2070545 INFO  (TEST-SuggestComponentContextFilterQueryTest.testExplicitFieldedQuery-seed#[2BFA862278639CD7]) [     ] o.a.s.h.c.SuggestComponent SuggestComponent prepare with : qt=/suggest&suggest.build=true&indent=off&suggest.q=examp&suggest.count=5&suggest=true&suggest.dictionary=suggest_blended_infix_suggester&wt=xml&suggest.cfq=contexts:ctx1
   [junit4]   2> 2070545 INFO  (TEST-SuggestComponentContextFilterQueryTest.testExplicitFieldedQuery-seed#[2BFA862278639CD7]) [     ] o.a.s.s.s.SolrSuggester SolrSuggester.build(suggest_blended_infix_suggester)
   [junit4]   2> 2070580 ERROR (TEST-SuggestComponentContextFilterQueryTest.testExplicitFieldedQuery-seed#[2BFA862278639CD7]) [     ] o.a.s.s.s.SolrSuggester Store Lookup build failed
   [junit4]   2> 2070580 INFO  (TEST-SuggestComponentContextFilterQueryTest.testExplicitFieldedQuery-seed#[2BFA862278639CD7]) [     ] o.a.s.h.c.SuggestComponent SuggestComponent process with : qt=/suggest&suggest.build=true&indent=off&suggest.q=examp&suggest.count=5&suggest=true&suggest.dictionary=suggest_blended_infix_suggester&wt=xml&suggest.cfq=contexts:ctx1
   [junit4]   2> 2070582 INFO  (TEST-SuggestComponentContextFilterQueryTest.testExplicitFieldedQuery-seed#[2BFA862278639CD7]) [     ] o.a.s.c.S.Request [collection1]  webapp=null path=null params={qt=/suggest&suggest.build=true&suggest.q=examp&suggest.dictionary=suggest_blended_infix_suggester&wt=xml&suggest.cfq=contexts:ctx1} status=0 QTime=36
   [junit4]   2> 2070582 INFO  (TEST-SuggestComponentContextFilterQueryTest.testExplicitFieldedQuery-seed#[2BFA862278639CD7]) [     ] o.a.s.SolrTestCaseJ4 ###Ending testExplicitFieldedQuery
   [junit4]   2> 2070585 INFO  (TEST-SuggestComponentContextFilterQueryTest.testContextFilterOnInvalidFieldGivesNoSuggestions-seed#[2BFA862278639CD7]) [     ] o.a.s.SolrTestCaseJ4 ###Starting testContextFilterOnInvalidFieldGivesNoSuggestions
   [junit4]   2> 2070586 INFO  (TEST-SuggestComponentContextFilterQueryTest.testContextFilterOnInvalidFieldGivesNoSuggestions-seed#[2BFA862278639CD7]) [     ] o.a.s.u.DirectUpdateHandler2 [collection1] REMOVING ALL DOCUMENTS FROM INDEX
   [junit4]   2> 2070586 INFO  (TEST-SuggestComponentContextFilterQueryTest.testContextFilterOnInvalidFieldGivesNoSuggestions-seed#[2BFA862278639CD7]) [     ] o.a.s.u.p.LogUpdateProcessorFactory [collection1]  webapp=null path=null params={}{deleteByQuery=*:*} 0 0
   [junit4]   2> 2070586 INFO  (TEST-SuggestComponentContextFilterQueryTest.testContextFilterOnInvalidFieldGivesNoSuggestions-seed#[2BFA862278639CD7]) [     ] o.a.s.u.p.LogUpdateProcessorFactory [collection1]  webapp=null path=null params={}{add=[0]} 0 0
   [junit4]   2> 2070587 INFO  (TEST-SuggestComponentContextFilterQueryTest.testContextFilterOnInvalidFieldGivesNoSuggestions-seed#[2BFA862278639CD7]) [     ] o.a.s.u.p.LogUpdateProcessorFactory [collection1]  webapp=null path=null params={}{add=[1]} 0 0
   [junit4]   2> 2070587 INFO  (TEST-SuggestComponentContextFilterQueryTest.testContextFilterOnInvalidFieldGivesNoSuggestions-seed#[2BFA862278639CD7]) [     ] o.a.s.u.p.LogUpdateProcessorFactory [collection1]  webapp=null path=null params={}{add=[7]} 0 0
   [junit4]   2> 2070587 INFO  (TEST-SuggestComponentContextFilterQueryTest.testContextFilterOnInvalidFieldGivesNoSuggestions-seed#[2BFA862278639CD7]) [     ] o.a.s.u.p.LogUpdateProcessorFactory [collection1]  webapp=null path=null params={}{add=[8]} 0 0
   [junit4]   2> 2070587 INFO  (TEST-SuggestComponentContextFilterQueryTest.testContextFilterOnInvalidFieldGivesNoSuggestions-seed#[2BFA862278639CD7]) [     ] o.a.s.u.p.LogUpdateProcessorFactory [collection1]  webapp=null path=null params={}{add=[9]} 0 0
   [junit4]   2> 2070587 INFO  (TEST-SuggestComponentContextFilterQueryTest.testContextFilterOnInvalidFieldGivesNoSuggestions-seed#[2BFA862278639CD7]) [     ] o.a.s.u.DirectUpdateHandler2 start commit{,optimize=false,openSearcher=true,waitSearcher=true,expungeDeletes=false,softCommit=false,prepareCommit=false}
   [junit4]   2> 2070587 INFO  (TEST-SuggestComponentContextFilterQueryTest.testContextFilterOnInvalidFieldGivesNoSuggestions-seed#[2BFA862278639CD7]) [     ] o.a.s.u.SolrIndexWriter Calling setCommitData with IW:org.apache.solr.update.SolrIndexWriter@6bb769e1 commitCommandVersion:0
   [junit4]   2> 2070619 INFO  (TEST-SuggestComponentContextFilterQueryTest.testContextFilterOnInvalidFieldGivesNoSuggestions-seed#[2BFA862278639CD7]) [     ] o.a.s.s.SolrIndexSearcher Opening [Searcher@71cf0fed[collection1] main]
   [junit4]   2> 2070619 INFO  (TEST-SuggestComponentContextFilterQueryTest.testContextFilterOnInvalidFieldGivesNoSuggestions-seed#[2BFA862278639CD7]) [     ] o.a.s.u.DirectUpdateHandler2 end_commit_flush
   [junit4]   2> 2070621 INFO  (searcherExecutor-12564-thread-1) [     ] o.a.s.c.SolrCore [collection1] Registered new searcher Searcher@71cf0fed[collection1] main{ExitableDirectoryReader(UninvertingDirectoryReader(Uninverting(_5(8.2.0):C5:[diagnostics={os=Windows 10, java.vendor=Oracle Corporation, java.version=10.0.1, java.vm.version=10.0.1+10, lucene.version=8.2.0, os.arch=amd64, java.runtime.version=10.0.1+10, source=flush, os.version=10.0, timestamp=1560139665170}]:[attributes={Lucene50StoredFieldsFormat.mode=BEST_SPEED}])))}
   [junit4]   2> 2070626 INFO  (TEST-SuggestComponentContextFilterQueryTest.testContextFilterOnInvalidFieldGivesNoSuggestions-seed#[2BFA862278639CD7]) [     ] o.a.s.u.p.LogUpdateProcessorFactory [collection1]  webapp=null path=null params={}{commit=} 0 39
   [junit4]   2> 2070626 INFO  (TEST-SuggestComponentContextFilterQueryTest.testContextFilterOnInvalidFieldGivesNoSuggestions-seed#[2BFA862278639CD7]) [     ] o.a.s.h.c.SuggestComponent SuggestComponent prepare with : qt=/suggest&suggest.build=true&indent=off&suggest.q=examp&suggest.count=5&suggest=true&suggest.dictionary=suggest_blended_infix_suggester&wt=xml&suggest.cfq=some_invalid_context_field:some_invalid_value
   [junit4]   2> 2070626 INFO  (TEST-SuggestComponentContextFilterQueryTest.testContextFilterOnInvalidFieldGivesNoSuggestions-seed#[2BFA862278639CD7]) [     ] o.a.s.s.s.SolrSuggester SolrSuggester.build(suggest_blended_infix_suggester)
   [junit4]   2> 2070662 ERROR (TEST-SuggestComponentContextFilterQueryTest.testContextFilterOnInvalidFieldGivesNoSuggestions-seed#[2BFA862278639CD7]) [     ] o.a.s.s.s.SolrSuggester Store Lookup build failed
   [junit4]   2> 2070662 INFO  (TEST-SuggestComponentContextFilterQueryTest.testContextFilterOnInvalidFieldGivesNoSuggestions-seed#[2BFA862278639CD7]) [     ] o.a.s.h.c.SuggestComponent SuggestComponent process with : qt=/suggest&suggest.build=true&indent=off&suggest.q=examp&suggest.count=5&suggest=true&suggest.dictionary=suggest_blended_infix_suggester&wt=xml&suggest.cfq=some_invalid_context_field:some_invalid_value
   [junit4]   2> 2070663 INFO  (TEST-SuggestComponentContextFilterQueryTest.testContextFilterOnInvalidFieldGivesNoSuggestions-seed#[2BFA862278639CD7]) [     ] o.a.s.c.S.Request [collection1]  webapp=null path=null params={qt=/suggest&suggest.build=true&suggest.q=examp&suggest.dictionary=suggest_blended_infix_suggester&wt=xml&suggest.cfq=some_invalid_context_field:some_invalid_value} status=0 QTime=36
   [junit4]   2> 2070664 INFO  (TEST-SuggestComponentContextFilterQueryTest.testContextFilterOnInvalidFieldGivesNoSuggestions-seed#[2BFA862278639CD7]) [     ] o.a.s.SolrTestCaseJ4 ###Ending testContextFilterOnInvalidFieldGivesNoSuggestions
   [junit4]   2> 2070668 INFO  (TEST-SuggestComponentContextFilterQueryTest.testContextFilterParamIsIgnoredWhenContextIsNotImplemented-seed#[2BFA862278639CD7]) [     ] o.a.s.SolrTestCaseJ4 ###Starting testContextFilterParamIsIgnoredWhenContextIsNotImplemented
   [junit4]   2> 2070668 INFO  (TEST-SuggestComponentContextFilterQueryTest.testContextFilterParamIsIgnoredWhenContextIsNotImplemented-seed#[2BFA862278639CD7]) [     ] o.a.s.u.DirectUpdateHandler2 [collection1] REMOVING ALL DOCUMENTS FROM INDEX
   [junit4]   2> 2070668 INFO  (TEST-SuggestComponentContextFilterQueryTest.testContextFilterParamIsIgnoredWhenContextIsNotImplemented-seed#[2BFA862278639CD7]) [     ] o.a.s.u.p.LogUpdateProcessorFactory [collection1]  webapp=null path=null params={}{deleteByQuery=*:*} 0 0
   [junit4]   2> 2070668 INFO  (TEST-SuggestComponentContextFilterQueryTest.testContextFilterParamIsIgnoredWhenContextIsNotImplemented-seed#[2BFA862278639CD7]) [     ] o.a.s.u.p.LogUpdateProcessorFactory [collection1]  webapp=null path=null params={}{add=[0]} 0 0
   [junit4]   2> 2070668 INFO  (TEST-SuggestComponentContextFilterQueryTest.testContextFilterParamIsIgnoredWhenContextIsNotImplemented-seed#[2BFA862278639CD7]) [     ] o.a.s.u.p.LogUpdateProcessorFactory [collection1]  webapp=null path=null params={}{add=[1]} 0 0
   [junit4]   2> 2070668 INFO  (TEST-SuggestComponentContextFilterQueryTest.testContextFilterParamIsIgnoredWhenContextIsNotImplemented-seed#[2BFA862278639CD7]) [     ] o.a.s.u.p.LogUpdateProcessorFactory [collection1]  webapp=null path=null params={}{add=[7]} 0 0
   [junit4]   2> 2070668 INFO  (TEST-SuggestComponentContextFilterQueryTest.testContextFilterParamIsIgnoredWhenContextIsNotImplemented-seed#[2BFA862278639CD7]) [     ] o.a.s.u.p.LogUpdateProcessorFactory [collection1]  webapp=null path=null params={}{add=[8]} 0 0
   [junit4]   2> 2070669 INFO  (TEST-SuggestComponentContextFilterQueryTest.testContextFilterParamIsIgnoredWhenContextIsNotImplemented-seed#[2BFA862278639CD7]) [     ] o.a.s.u.p.LogUpdateProcessorFactory [collection1]  webapp=null path=null params={}{add=[9]} 0 0
   [junit4]   2> 2070669 INFO  (TEST-SuggestComponentContextFilterQueryTest.testContextFilterParamIsIgnoredWhenContextIsNotImplemented-seed#[2BFA862278639CD7]) [     ] o.a.s.u.DirectUpdateHandler2 start commit{,optimize=false,openSearcher=true,waitSearcher=true,expungeDeletes=false,softCommit=false,prepareCommit=false}
   [junit4]   2> 2070669 INFO  (TEST-SuggestComponentContextFilterQueryTest.testContextFilterParamIsIgnoredWhenContextIsNotImplemented-seed#[2BFA862278639CD7]) [     ] o.a.s.u.SolrIndexWriter Calling setCommitData with IW:org.apache.solr.update.SolrIndexWriter@6bb769e1 commitCommandVersion:0
   [junit4]   2> 2070705 INFO  (TEST-SuggestComponentContextFilterQueryTest.testContextFilterParamIsIgnoredWhenContextIsNotImplemented-seed#[2BFA862278639CD7]) [     ] o.a.s.s.SolrIndexSearcher Opening [Searcher@130e14e1[collection1] main]
   [junit4]   2> 2070706 INFO  (TEST-SuggestComponentContextFilterQueryTest.testContextFilterParamIsIgnoredWhenContextIsNotImplemented-seed#[2BFA862278639CD7]) [     ] o.a.s.u.DirectUpdateHandler2 end_commit_flush
   [junit4]   2> 2070706 INFO  (searcherExecutor-12564-thread-1) [     ] o.a.s.c.SolrCore [collection1] Registered new searcher Searcher@130e14e1[collection1] main{ExitableDirectoryReader(UninvertingDirectoryReader(Uninverting(_6(8.2.0):C5:[diagnostics={os=Windows 10, java.vendor=Oracle Corporation, java.version=10.0.1, java.vm.version=10.0.1+10, lucene.version=8.2.0, os.arch=amd64, java.runtime.version=10.0.1+10, source=flush, os.version=10.0, timestamp=1560139665251}]:[attributes={Lucene50StoredFieldsFormat.mode=BEST_SPEED}])))}
   [junit4]   2> 2070711 INFO  (TEST-SuggestComponentContextFilterQueryTest.testContextFilterParamIsIgnoredWhenContextIsNotImplemented-seed#[2BFA862278639CD7]) [     ] o.a.s.u.p.LogUpdateProcessorFactory [collection1]  webapp=null path=null params={}{commit=} 0 42
   [junit4]   2> 2070713 INFO  (TEST-SuggestComponentContextFilterQueryTest.testContextFilterParamIsIgnoredWhenContextIsNotImplemented-seed#[2BFA862278639CD7]) [     ] o.a.s.h.c.SuggestComponent SuggestComponent prepare with : qt=/suggest&suggest.build=true&indent=off&suggest.q=examp&suggest.count=5&suggest=true&suggest.dictionary=suggest_lookup_has_no_context_implementation&wt=xml&suggest.cfq=ctx1
   [junit4]   2> 2070713 INFO  (TEST-SuggestComponentContextFilterQueryTest.testContextFilterParamIsIgnoredWhenContextIsNotImplemented-seed#[2BFA862278639CD7]) [     ] o.a.s.s.s.SolrSuggester SolrSuggester.build(suggest_lookup_has_no_context_implementation)
   [junit4]   2> 2070716 INFO  (TEST-SuggestComponentContextFilterQueryTest.testContextFilterParamIsIgnoredWhenContextIsNotImplemented-seed#[2BFA862278639CD7]) [     ] o.a.s.s.s.SolrSuggester Stored suggest data to: C:\Users\jenkins\workspace\Lucene-Solr-8.x-Windows\solr\build\solr-core\test\J1\temp\solr.handler.component.SuggestComponentContextFilterQueryTest_2BFA862278639CD7-001\init-core-data-001\suggest_lookup_has_no_context_implementation\wfsta.bin
   [junit4]   2> 2070716 INFO  (TEST-SuggestComponentContextFilterQueryTest.testContextFilterParamIsIgnoredWhenContextIsNotImplemented-seed#[2BFA862278639CD7]) [     ] o.a.s.h.c.SuggestComponent SuggestComponent process with : qt=/suggest&suggest.build=true&indent=off&suggest.q=examp&suggest.count=5&suggest=true&suggest.dictionary=suggest_lookup_has_no_context_implementation&wt=xml&suggest.cfq=ctx1
   [junit4]   2> 2070716 INFO  (TEST-SuggestComponentContextFilterQueryTest.testContextFilterParamIsIgnoredWhenContextIsNotImplemented-seed#[2BFA862278639CD7]) [     ] o.a.s.c.S.Request [collection1]  webapp=null path=null params={qt=/suggest&suggest.build=true&suggest.q=examp&suggest.dictionary=suggest_lookup_has_no_context_implementation&wt=xml&suggest.cfq=ctx1} status=0 QTime=4
   [junit4]   2> 2070717 INFO  (TEST-SuggestComponentContextFilterQueryTest.testContextFilterParamIsIgnoredWhenContextIsNotImplemented-seed#[2BFA862278639CD7]) [     ] o.a.s.SolrTestCaseJ4 ###Ending testContextFilterParamIsIgnoredWhenContextIsNotImplemented
   [junit4]   2> 2070722 INFO  (TEST-SuggestComponentContextFilterQueryTest.testContextFilterUsesAnalyzer-seed#[2BFA862278639CD7]) [     ] o.a.s.SolrTestCaseJ4 ###Starting testContextFilterUsesAnalyzer
   [junit4]   2> 2070722 INFO  (TEST-SuggestComponentContextFilterQueryTest.testContextFilterUsesAnalyzer-seed#[2BFA862278639CD7]) [     ] o.a.s.u.DirectUpdateHandler2 [collection1] REMOVING ALL DOCUMENTS FROM INDEX
   [junit4]   2> 2070722 INFO  (TEST-SuggestComponentContextFilterQueryTest.testContextFilterUsesAnalyzer-seed#[2BFA862278639CD7]) [     ] o.a.s.u.p.LogUpdateProcessorFactory [collection1]  webapp=null path=null params={}{deleteByQuery=*:*} 0 0
   [junit4]   2> 2070723 INFO  (TEST-SuggestComponentContextFilterQueryTest.testContextFilterUsesAnalyzer-seed#[2BFA862278639CD7]) [     ] o.a.s.u.p.LogUpdateProcessorFactory [collection1]  webapp=null path=null params={}{add=[0]} 0 0
   [junit4]   2> 2070724 INFO  (TEST-SuggestComponentContextFilterQueryTest.testContextFilterUsesAnalyzer-seed#[2BFA862278639CD7]) [     ] o.a.s.u.p.LogUpdateProcessorFactory [collection1]  webapp=null path=null params={}{add=[1]} 0 0
   [junit4]   2> 2070724 INFO  (TEST-SuggestComponentContextFilterQueryTest.testContextFilterUsesAnalyzer-seed#[2BFA862278639CD7]) [     ] o.a.s.u.p.LogUpdateProcessorFactory [collection1]  webapp=null path=null params={}{add=[7]} 0 0
   [junit4]   2> 2070724 INFO  (TEST-SuggestComponentContextFilterQueryTest.testContextFilterUsesAnalyzer-seed#[2BFA862278639CD7]) [     ] o.a.s.u.p.LogUpdateProcessorFactory [collection1]  webapp=null path=null params={}{add=[8]} 0 0
   [junit4]   2> 2070724 INFO  (TEST-SuggestComponentContextFilterQueryTest.testContextFilterUsesAnalyzer-seed#[2BFA862278639CD7]) [     ] o.a.s.u.p.LogUpdateProcessorFactory [collection1]  webapp=null path=null params={}{add=[9]} 0 0
   [junit4]   2> 2070724 INFO  (TEST-SuggestComponentContextFilterQueryTest.testContextFilterUsesAnalyzer-seed#[2BFA862278639CD7]) [     ] o.a.s.u.DirectUpdateHandler2 start commit{,optimize=false,openSearcher=true,waitSearcher=true,expungeDeletes=false,softCommit=false,prepareCommit=false}
   [junit4]   2> 2070724 INFO  (TEST-SuggestComponentContextFilterQueryTest.testContextFilterUsesAnalyzer-seed#[2BFA862278639CD7]) [     ] o.a.s.u.SolrIndexWriter Calling setCommitData with IW:org.apache.solr.update.SolrIndexWriter@6bb769e1 commitCommandVersion:0
   [junit4]   2> 2070763 INFO  (TEST-SuggestComponentContextFilterQueryTest.testContextFilterUsesAnalyzer-seed#[2BFA862278639CD7]) [     ] o.a.s.s.SolrIndexSearcher Opening [Searcher@28bc543a[collection1] main]
   [junit4]   2> 2070763 INFO  (TEST-SuggestComponentContextFilterQueryTest.testContextFilterUsesAnalyzer-seed#[2BFA862278639CD7]) [     ] o.a.s.u.DirectUpdateHandler2 end_commit_flush
   [junit4]   2> 2070763 INFO  (searcherExecutor-12564-thread-1) [     ] o.a.s.c.SolrCore [collection1] Registered new searcher Searcher@28bc543a[collection1] main{ExitableDirectoryReader(UninvertingDirectoryReader(Uninverting(_7(8.2.0):C5:[diagnostics={os=Windows 10, java.vendor=Oracle Corporation, java.version=10.0.1, java.vm.version=10.0.1+10, lucene.version=8.2.0, os.arch=amd64, java.runtime.version=10.0.1+10, source=flush, os.version=10.0, timestamp=1560139665309}]:[attributes={Lucene50StoredFieldsFormat.mode=BEST_SPEED}])))}
   [junit4]   2> 2070772 INFO  (TEST-SuggestComponentContextFilterQueryTest.testContextFilterUsesAnalyzer-seed#[2BFA862278639CD7]) [     ] o.a.s.u.p.LogUpdateProcessorFactory [collection1]  webapp=null path=null params={}{commit=} 0 47
   [junit4]   2> 2070772 INFO  (TEST-SuggestComponentContextFilterQueryTest.testContextFilterUsesAnalyzer-seed#[2BFA862278639CD7]) [     ] o.a.s.h.c.SuggestComponent SuggestComponent prepare with : qt=/suggest&suggest.build=true&indent=off&suggest.q=examp&suggest.count=5&suggest=true&suggest.dictionary=suggest_blended_infix_suggester&wt=xml&suggest.cfq=CTx1
   [junit4]   2> 2070772 INFO  (TEST-SuggestComponentContextFilterQueryTest.testContextFilterUsesAnalyzer-seed#[2BFA862278639CD7]) [     ] o.a.s.s.s.SolrSuggester SolrSuggester.build(suggest_blended_infix_suggester)
   [junit4]   2> 2070825 ERROR (TEST-SuggestComponentContextFilterQueryTest.testContextFilterUsesAnalyzer-seed#[2BFA862278639CD7]) [     ] o.a.s.s.s.SolrSuggester Store Lookup build failed
   [junit4]   2> 2070825 INFO  (TEST-SuggestComponentContextFilterQueryTest.testContextFilterUsesAnalyzer-seed#[2BFA862278639CD7]) [     ] o.a.s.h.c.SuggestComponent SuggestComponent process with : qt=/suggest&suggest.build=true&indent=off&suggest.q=examp&suggest.count=5&suggest=true&suggest.dictionary=suggest_blended_infix_suggester&wt=xml&suggest.cfq=CTx1
   [junit4]   2> 2070826 INFO  (TEST-SuggestComponentContextFilterQueryTest.testContextFilterUsesAnalyzer-seed#[2BFA862278639CD7]) [     ] o.a.s.c.S.Request [collection1]  webapp=null path=null params={qt=/suggest&suggest.build=true&suggest.q=examp&suggest.dictionary=suggest_blended_infix_suggester&wt=xml&suggest.cfq=CTx1} status=0 QTime=53
   [junit4]   2> 2070827 INFO  (TEST-SuggestComponentContextFilterQueryTest.testContextFilterUsesAnalyzer-seed#[2BFA862278639CD7]) [     ] o.a.s.SolrTestCaseJ4 ###Ending testContextFilterUsesAnalyzer
   [junit4]   2> 2070832 INFO  (TEST-SuggestComponentContextFilterQueryTest.testStringContext-seed#[2BFA862278639CD7]) [     ] o.a.s.SolrTestCaseJ4 ###Starting testStringContext
   [junit4]   2> 2070832 INFO  (TEST-SuggestComponentContextFilterQueryTest.testStringContext-seed#[2BFA862278639CD7]) [     ] o.a.s.u.DirectUpdateHandler2 [collection1] REMOVING ALL DOCUMENTS FROM INDEX
   [junit4]   2> 2070832 INFO  (TEST-SuggestComponentContextFilterQueryTest.testStringContext-seed#[2BFA862278639CD7]) [     ] o.a.s.u.p.LogUpdateProcessorFactory [collection1]  webapp=null path=null params={}{deleteByQuery=*:*} 0 0
   [junit4]   2> 2070833 INFO  (TEST-SuggestComponentContextFilterQueryTest.testStringContext-seed#[2BFA862278639CD7]) [     ] o.a.s.u.p.LogUpdateProcessorFactory [collection1]  webapp=null path=null params={}{add=[0]} 0 0
   [junit4]   2> 2070833 INFO  (TEST-SuggestComponentContextFilterQueryTest.testStringContext-seed#[2BFA862278639CD7]) [     ] o.a.s.u.p.LogUpdateProcessorFactory [collection1]  webapp=null path=null params={}{add=[1]} 0 0
   [junit4]   2> 2070833 INFO  (TEST-SuggestComponentContextFilterQueryTest.testStringContext-seed#[2BFA862278639CD7]) [     ] o.a.s.u.p.LogUpdateProcessorFactory [collection1]  webapp=null path=null params={}{add=[7]} 0 0
   [junit4]   2> 2070833 INFO  (TEST-SuggestComponentContextFilterQueryTest.testStringContext-seed#[2BFA862278639CD7]) [     ] o.a.s.u.p.LogUpdateProcessorFactory [collection1]  webapp=null path=null params={}{add=[8]} 0 0
   [junit4]   2> 2070834 INFO  (TEST-SuggestComponentContextFilterQueryTest.testStringContext-seed#[2BFA862278639CD7]) [     ] o.a.s.u.p.LogUpdateProcessorFactory [collection1]  webapp=null path=null params={}{add=[9]} 0 0
   [junit4]   2> 2070834 INFO  (TEST-SuggestComponentContextFilterQueryTest.testStringContext-seed#[2BFA862278639CD7]) [     ] o.a.s.u.DirectUpdateHandler2 start commit{,optimize=false,openSearcher=true,waitSearcher=true,expungeDeletes=false,softCommit=false,prepareCommit=false}
   [junit4]   2> 2070834 INFO  (TEST-SuggestComponentContextFilterQueryTest.testStringContext-seed#[2BFA862278639CD7]) [     ] o.a.s.u.SolrIndexWriter Calling setCommitData with IW:org.apache.solr.update.SolrIndexWriter@6bb769e1 commitCommandVersion:0
   [junit4]   2> 2070872 INFO  (TEST-SuggestComponentContextFilterQueryTest.testStringContext-seed#[2BFA862278639CD7]) [     ] o.a.s.s.SolrIndexSearcher Opening [Searcher@1fabb305[collection1] main]
   [junit4]   2> 2070872 INFO  (TEST-SuggestComponentContextFilterQueryTest.testStringContext-seed#[2BFA862278639CD7]) [     ] o.a.s.u.DirectUpdateHandler2 end_commit_flush
   [junit4]   2> 2070873 INFO  (searcherExecutor-12564-thread-1) [     ] o.a.s.c.SolrCore [collection1] Registered new searcher Searcher@1fabb305[collection1] main{ExitableDirectoryReader(UninvertingDirectoryReader(Uninverting(_8(8.2.0):C5:[diagnostics={os=Windows 10, java.vendor=Oracle Corporation, java.version=10.0.1, java.vm.version=10.0.1+10, lucene.version=8.2.0, os.arch=amd64, java.runtime.version=10.0.1+10, source=flush, os.version=10.0, timestamp=1560139665418}]:[attributes={Lucene50StoredFieldsFormat.mode=BEST_SPEED}])))}
   [junit4]   2> 2070880 INFO  (TEST-SuggestComponentContextFilterQueryTest.testStringContext-seed#[2BFA862278639CD7]) [     ] o.a.s.u.p.LogUpdateProcessorFactory [collection1]  webapp=null path=null params={}{commit=} 0 45
   [junit4]   2> 2070881 INFO  (TEST-SuggestComponentContextFilterQueryTest.testStringContext-seed#[2BFA862278639CD7]) [     ] o.a.s.h.c.SuggestComponent SuggestComponent prepare with : qt=/suggest&suggest.build=true&indent=off&suggest.q=examp&suggest.count=5&suggest=true&suggest.dictionary=suggest_blended_infix_suggester_string&wt=xml&suggest.cfq=Ctx4
   [junit4]   2> 2070881 INFO  (TEST-SuggestComponentContextFilterQueryTest.testStringContext-seed#[2BFA862278639CD7]) [     ] o.a.s.s.s.SolrSuggester SolrSuggester.build(suggest_blended_infix_suggester_string)
   [junit4]   2> 2070920 ERROR (TEST-SuggestComponentContextFilterQueryTest.testStringContext-seed#[2BFA862278639CD7]) [     ] o.a.s.s.s.SolrSuggester Store Lookup build failed
   [junit4]   2> 2070920 INFO  (TEST-SuggestComponentContextFilterQueryTest.testStringContext-seed#[2BFA862278639CD7]) [     ] o.a.s.h.c.SuggestComponent SuggestComponent process with : qt=/suggest&suggest.build=true&indent=off&suggest.q=examp&suggest.count=5&suggest=true&suggest.dictionary=suggest_blended_infix_suggester_string&wt=xml&suggest.cfq=Ctx4
   [junit4]   2> 2070920 INFO  (TEST-SuggestComponentContextFilterQueryTest.testStringContext-seed#[2BFA862278639CD7]) [     ] o.a.s.c.S.Request [collection1]  webapp=null path=null params={qt=/suggest&suggest.build=true&suggest.q=examp&suggest.dictionary=suggest_blended_infix_suggester_string&wt=xml&suggest.cfq=Ctx4} status=0 QTime=41
   [junit4]   2> 2070920 INFO  (TEST-SuggestComponentContextFilterQueryTest.testStringContext-seed#[2BFA862278639CD7]) [     ] o.a.s.h.c.SuggestComponent SuggestComponent prepare with : qt=/suggest&suggest.build=true&indent=off&suggest.q=examp&suggest.count=5&suggest=true&suggest.dictionary=suggest_blended_infix_suggester_string&wt=xml&suggest.cfq=ctx4
   [junit4]   2> 2070920 INFO  (TEST-SuggestComponentContextFilterQueryTest.testStringContext-seed#[2BFA862278639CD7]) [     ] o.a.s.s.s.SolrSuggester SolrSuggester.build(suggest_blended_infix_suggester_string)
   [junit4]   2> 2071021 ERROR (TEST-SuggestComponentContextFilterQueryTest.testStringContext-seed#[2BFA862278639CD7]) [     ] o.a.s.s.s.SolrSuggester Store Lookup build failed
   [junit4]   2> 2071021 INFO  (TEST-SuggestComponentContextFilterQueryTest.testStringContext-seed#[2BFA862278639CD7]) [     ] o.a.s.h.c.SuggestComponent SuggestComponent process with : qt=/suggest&suggest.build=true&indent=off&suggest.q=examp&suggest.count=5&suggest=true&suggest.dictionary=suggest_blended_infix_suggester_string&wt=xml&suggest.cfq=ctx4
   [junit4]   2> 2071022 INFO  (TEST-SuggestComponentContextFilterQueryTest.testStringContext-seed#[2BFA862278639CD7]) [     ] o.a.s.c.S.Request [collection1]  webapp=null path=null params={qt=/suggest&suggest.build=true&suggest.q=examp&suggest.dictionary=suggest_blended_infix_suggester_string&wt=xml&suggest.cfq=ctx4} status=0 QTime=99
   [junit4]   2> 2071022 INFO  (TEST-SuggestComponentContextFilterQueryTest.testStringContext-seed#[2BFA862278639CD7]) [     ] o.a.s.SolrTestCaseJ4 ###Ending testStringContext
   [junit4]   2> 2071022 INFO  (SUITE-SuggestComponentContextFilterQueryTest-seed#[2BFA862278639CD7]-worker) [     ] o.a.s.SolrTestCaseJ4 ###deleteCore
   [junit4]   2> 2071022 INFO  (SUITE-SuggestComponentContextFilterQueryTest-seed#[2BFA862278639CD7]-worker) [     ] o.a.s.c.CoreContainer Shutting down CoreContainer instance=109230241
   [junit4]   2> 2071022 INFO  (coreCloseExecutor-12568-thread-1) [    x:collection1 ] o.a.s.c.SolrCore [collection1]  CLOSING SolrCore org.apache.solr.core.SolrCore@885c3d8
   [junit4]   2> 2071022 INFO  (coreCloseExecutor-12568-thread-1) [    x:collection1 ] o.a.s.m.SolrMetricManager Closing metric reporters for registry=solr.core.collection1, tag=885c3d8
   [junit4]   2> 2071022 INFO  (coreCloseExecutor-12568-thread-1) [    x:collection1 ] o.a.s.m.r.SolrJmxReporter Closing reporter [org.apache.solr.me

[...truncated too long message...]

olr.jetty, tag=null
   [junit4]   2> 2071041 INFO  (SUITE-SuggestComponentContextFilterQueryTest-seed#[2BFA862278639CD7]-worker) [     ] o.a.s.m.r.SolrJmxReporter Closing reporter [org.apache.solr.metrics.reporters.SolrJmxReporter@5a4aad55: rootName = null, domain = solr.jetty, service url = null, agent id = null] for registry solr.jetty / com.codahale.metrics.MetricRegistry@7ab0fdc7
   [junit4]   2> 2071044 INFO  (SUITE-SuggestComponentContextFilterQueryTest-seed#[2BFA862278639CD7]-worker) [     ] o.a.s.SolrTestCaseJ4 ------------------------------------------------------- Done waiting for tracked resources to be released
   [junit4]   2> NOTE: test params are: codec=Asserting(Lucene80): {range_facet_l_dv=PostingsFormat(name=LuceneVarGapFixedInterval), multiDefault=FST50, _root_=BlockTreeOrds(blocksize=128), intDefault=BlockTreeOrds(blocksize=128), weight=FST50, contexts=FST50, range_facet_l=BlockTreeOrds(blocksize=128), price=PostingsFormat(name=MockRandom), cat=BlockTreeOrds(blocksize=128), textgrams=PostingsFormat(name=MockRandom), id_i1=FST50, my_contexts_s=PostingsFormat(name=MockRandom), id=PostingsFormat(name=LuceneVarGapFixedInterval), range_facet_i_dv=BlockTreeOrds(blocksize=128), text=PostingsFormat(name=MockRandom), my_contexts_t=FST50, exacttext=FST50, timestamp=BlockTreeOrds(blocksize=128)}, docValues:{range_facet_l_dv=DocValuesFormat(name=Lucene80), price=DocValuesFormat(name=Direct), intDefault=DocValuesFormat(name=Asserting), weight=DocValuesFormat(name=Lucene80), id_i1=DocValuesFormat(name=Lucene80), range_facet_i_dv=DocValuesFormat(name=Asserting), contexts=DocValuesFormat(name=Lucene80), text=DocValuesFormat(name=Direct), intDvoDefault=DocValuesFormat(name=Direct), timestamp=DocValuesFormat(name=Asserting), range_facet_l=DocValuesFormat(name=Asserting)}, maxPointsInLeafNode=468, maxMBSortInHeap=5.385412449188692, sim=Asserting(org.apache.lucene.search.similarities.AssertingSimilarity@26dfe378), locale=en-US-POSIX, timezone=Pacific/Marquesas
   [junit4]   2> NOTE: Windows 10 10.0 amd64/Oracle Corporation 10.0.1 (64-bit)/cpus=3,threads=1,free=255475384,total=536870912
   [junit4]   2> NOTE: All tests run in this JVM: [TestCloudJSONFacetSKG, TestOnReconnectListenerSupport, ZkNodePropsTest, TestTolerantSearch, ResponseLogComponentTest, OutOfBoxZkACLAndCredentialsProvidersTest, TestSchemaManager, TestCustomDocTransformer, TestShortCircuitedRequests, ZkSolrClientTest, TestInPlaceUpdatesStandalone, CSVRequestHandlerTest, TestHalfAndHalfDocValues, TestCursorMarkWithoutUniqueKey, NumberUtilsTest, TestRandomFlRTGCloud, TestLogWatcher, TestZkAclsWithHadoopAuth, LargeFieldTest, TestSerializedLuceneMatchVersion, DocValuesMultiTest, HdfsBasicDistributedZkTest, SearchHandlerTest, RootFieldTest, TestSimNodeLostTrigger, NodeLostTriggerIntegrationTest, BasicAuthOnSingleNodeTest, TestConfig, EnumFieldTest, TestSortableTextField, TestMaxTokenLenTokenizer, TestJsonRequest, ScheduledTriggerTest, LeaderElectionIntegrationTest, TestHdfsUpdateLog, TestUseDocValuesAsStored2, CategoryRoutedAliasUpdateProcessorTest, TestSolrXml, PeerSyncReplicationTest, RulesTest, TestStressLucene, HdfsThreadLeakTest, SuggesterWFSTTest, TestReload, TestPolicyCloud, DirectSolrSpellCheckerTest, TestSolrDeletionPolicy2, TestExactSharedStatsCache, PeerSyncWithBufferUpdatesTest, AdminHandlersProxyTest, V2ApiIntegrationTest, DistributedFacetPivotLargeTest, StressHdfsTest, TestInPlaceUpdatesDistrib, MoveReplicaHDFSTest, TestCoreBackup, CdcrUpdateLogTest, HLLSerializationTest, FastVectorHighlighterTest, TestAnalyzedSuggestions, BasicDistributedZk2Test, TestCloudManagedSchema, SubstringBytesRefFilterTest, SliceStateTest, EmbeddedSolrNoSerializeTest, TestHighlightDedupGrouping, TestStressLiveNodes, TestScoreJoinQPNoScore, TestConfigSetsAPIZkFailure, TestShardHandlerFactory, IndexSchemaRuntimeFieldTest, AutoAddReplicasIntegrationTest, MetricsConfigTest, SignificantTermsQParserPluginTest, JSONWriterTest, SolrIndexMetricsTest, TestNestedUpdateProcessor, TestTolerantUpdateProcessorCloud, DirectUpdateHandlerTest, DebugComponentTest, TestFieldCacheSort, SchemaVersionSpecificBehaviorTest, TestWordDelimiterFilterFactory, TestExpandComponent, CollectionsAPIDistributedZkTest, DirectoryFactoryTest, TestSkipOverseerOperations, TestRandomCollapseQParserPlugin, TestPhraseSuggestions, TestExportWriter, CursorPagingTest, TestPKIAuthenticationPlugin, TestHashQParserPlugin, TestPostingsSolrHighlighter, OverseerRolesTest, MoreLikeThisHandlerTest, RegexBytesRefFilterTest, TermsComponentTest, BaseCdcrDistributedZkTest, TestBulkSchemaAPI, TriggerSetPropertiesIntegrationTest, TestElisionMultitermQuery, AuthToolTest, AuditLoggerPluginTest, TestReplicationHandler, TermVectorComponentDistributedTest, QueryResultKeyTest, TestFieldCollectionResource, WrapperMergePolicyFactoryTest, TestFastLRUCache, HttpTriggerListenerTest, HdfsRecoverLeaseTest, TestDocumentBuilder, ClusterStateTest, BadIndexSchemaTest, TestDefaultStatsCache, TestNamedUpdateProcessors, TestCharFilters, AliasIntegrationTest, TestStressReorder, TestLazyCores, TestOmitPositions, ClassificationUpdateProcessorIntegrationTest, SegmentsInfoRequestHandlerTest, CollectionsAPISolrJTest, TestConfigSetImmutable, TestSolrCoreParser, TestFieldCacheVsDocValues, CurrencyRangeFacetCloudTest, MinimalSchemaTest, TestHdfsCloudBackupRestore, TestReplicationHandlerDiskOverFlow, TestCloudPivotFacet, RecoveryZkTest, OverseerCollectionConfigSetProcessorTest, TestLRUCache, TestSimLargeCluster, MetricsHandlerTest, CoreAdminOperationTest, HDFSCollectionsAPITest, BlockJoinFacetDistribTest, TestRandomDVFaceting, TestSolrConfigHandlerConcurrent, TransactionLogTest, TestFoldingMultitermQuery, DistributedQueryElevationComponentTest, LeaderFailoverAfterPartitionTest, TriLevelCompositeIdRoutingTest, TestConfigSets, SolrSlf4jReporterTest, TestJettySolrRunner, TestPerFieldSimilarity, FullSolrCloudDistribCmdsTest, MissingSegmentRecoveryTest, ShardsWhitelistTest, TestOrdValues, TestRawResponseWriter, AsyncCallRequestStatusResponseTest, NoCacheHeaderTest, WordBreakSolrSpellCheckerTest, TestCollapseQParserPlugin, TestCollectionAPI, DistanceUnitsTest, PeerSyncWithLeaderAndIndexFingerprintCachingTest, SpellCheckCollatorWithCollapseTest, TestLegacyBM25SimilarityFactory, ScriptEngineTest, TestApiFramework, TestSchemaNameResource, TestDFRSimilarityFactory, RemoteQueryErrorTest, TestNoOpRegenerator, SpatialFilterTest, TestFuzzyAnalyzedSuggestions, UpdateParamsTest, TestDistributedMissingSort, ReplaceNodeTest, DistributedQueryComponentCustomSortTest, TimeRoutedAliasUpdateProcessorTest, DistribJoinFromCollectionTest, RestartWhileUpdatingTest, HttpPartitionOnCommitTest, SolrTestCaseJ4Test, TestUtilizeNode, CleanupOldIndexTest, RequiredFieldsTest, HdfsUnloadDistributedZkTest, TestPullReplica, TestLRUStatsCache, ChangedSchemaMergeTest, TestRecovery, CoreAdminCreateDiscoverTest, CustomHighlightComponentTest, TestLegacyFieldCache, TestManagedResourceStorage, BasicFunctionalityTest, DistribCursorPagingTest, PreAnalyzedFieldTest, TestSha256AuthenticationProvider, TestFilteredDocIdSet, DistributedSuggestComponentTest, TestMacroExpander, TestTrieFacet, LukeRequestHandlerTest, TestMultiValuedNumericRangeQuery, TestStressCloudBlindAtomicUpdates, ChaosMonkeySafeLeaderWithPullReplicasTest, ImplicitSnitchTest, TestSimTriggerIntegration, SuggestComponentContextFilterQueryTest]
   [junit4]   2> NOTE: reproduce with: ant test  -Dtestcase=SuggestComponentContextFilterQueryTest -Dtests.seed=2BFA862278639CD7 -Dtests.slow=true -Dtests.locale=en-US-POSIX -Dtests.timezone=Pacific/Marquesas -Dtests.asserts=true -Dtests.file.encoding=Cp1252
   [junit4] ERROR   0.00s J1 | SuggestComponentContextFilterQueryTest (suite) <<<
   [junit4]    > Throwable #1: java.io.IOException: Could not remove the following files (in the order of attempts):
   [junit4]    >    C:\Users\jenkins\workspace\Lucene-Solr-8.x-Windows\solr\build\solr-core\test\J1\temp\solr.handler.component.SuggestComponentContextFilterQueryTest_2BFA862278639CD7-001\init-core-data-001: java.nio.file.AccessDeniedException: C:\Users\jenkins\workspace\Lucene-Solr-8.x-Windows\solr\build\solr-core\test\J1\temp\solr.handler.component.SuggestComponentContextFilterQueryTest_2BFA862278639CD7-001\init-core-data-001
   [junit4]    >    C:\Users\jenkins\workspace\Lucene-Solr-8.x-Windows\solr\build\solr-core\test\J1\temp\solr.handler.component.SuggestComponentContextFilterQueryTest_2BFA862278639CD7-001: java.nio.file.DirectoryNotEmptyException: C:\Users\jenkins\workspace\Lucene-Solr-8.x-Windows\solr\build\solr-core\test\J1\temp\solr.handler.component.SuggestComponentContextFilterQueryTest_2BFA862278639CD7-001
   [junit4]    > 	at __randomizedtesting.SeedInfo.seed([2BFA862278639CD7]:0)
   [junit4]    > 	at org.apache.lucene.util.IOUtils.rm(IOUtils.java:318)
   [junit4]    > 	at java.base/java.lang.Thread.run(Thread.java:844)
   [junit4] Completed [447/861 (1!)] on J1 in 2.05s, 10 tests, 1 error, 1 skipped <<< FAILURES!

[...truncated 46125 lines...]
[repro] Jenkins log URL: https://jenkins.thetaphi.de/job/Lucene-Solr-8.x-Windows/299/consoleText

[repro] Revision: 619e47b791a3cea475923a61113adf0fe39404c6

[repro] Ant options: "-Dargs=-XX:+UseCompressedOops -XX:+UseG1GC"

[repro] ant clean

[...truncated 6 lines...]
[repro] Test suites by module:
[repro]    solr\core
[repro]       SuggestComponentContextFilterQueryTest
[repro] ant compile-test

[...truncated 3605 lines...]
[repro] ant test-nocompile -Dtests.dups=5 -Dtests.maxfailures=5 -Dtests.class="*.SuggestComponentContextFilterQueryTest" -Dtests.showOutput=onerror "-Dargs=-XX:+UseCompressedOops -XX:+UseG1GC" -Dtests.seed=2BFA862278639CD7 -Dtests.slow=true -Dtests.locale=en-US-POSIX -Dtests.timezone=Pacific/Marquesas -Dtests.asserts=true -Dtests.file.encoding=Cp1252

[...truncated 113 lines...]
[repro] Failures:
[repro]   0/5 failed: org.apache.solr.handler.component.SuggestComponentContextFilterQueryTest
[repro] Exiting with code 0

[...truncated 78 lines...]

Mime
View raw message