lucene-dev mailing list archives

Site index · List index
Message view « Date » · « Thread »
Top « Date » · « Thread »
From Policeman Jenkins Server <jenk...@thetaphi.de>
Subject [JENKINS] Lucene-Solr-8.x-Linux (64bit/jdk1.8.0_201) - Build # 700 - Unstable!
Date Thu, 13 Jun 2019 04:54:04 GMT
Build: https://jenkins.thetaphi.de/job/Lucene-Solr-8.x-Linux/700/
Java: 64bit/jdk1.8.0_201 -XX:+UseCompressedOops -XX:+UseSerialGC

1 tests failed.
FAILED:  org.apache.solr.cloud.AliasIntegrationTest.testClusterStateProviderAPI

Error Message:
{} expected:<2> but was:<0>

Stack Trace:
java.lang.AssertionError: {} expected:<2> but was:<0>
	at __randomizedtesting.SeedInfo.seed([ADEA51C03CB0FEAC:B23DCDEC4FBB07E7]:0)
	at org.junit.Assert.fail(Assert.java:88)
	at org.junit.Assert.failNotEquals(Assert.java:834)
	at org.junit.Assert.assertEquals(Assert.java:645)
	at org.apache.solr.cloud.AliasIntegrationTest.testClusterStateProviderAPI(AliasIntegrationTest.java:303)
	at sun.reflect.NativeMethodAccessorImpl.invoke0(Native Method)
	at sun.reflect.NativeMethodAccessorImpl.invoke(NativeMethodAccessorImpl.java:62)
	at sun.reflect.DelegatingMethodAccessorImpl.invoke(DelegatingMethodAccessorImpl.java:43)
	at java.lang.reflect.Method.invoke(Method.java:498)
	at com.carrotsearch.randomizedtesting.RandomizedRunner.invoke(RandomizedRunner.java:1750)
	at com.carrotsearch.randomizedtesting.RandomizedRunner$8.evaluate(RandomizedRunner.java:938)
	at com.carrotsearch.randomizedtesting.RandomizedRunner$9.evaluate(RandomizedRunner.java:974)
	at com.carrotsearch.randomizedtesting.RandomizedRunner$10.evaluate(RandomizedRunner.java:988)
	at com.carrotsearch.randomizedtesting.rules.SystemPropertiesRestoreRule$1.evaluate(SystemPropertiesRestoreRule.java:57)
	at org.apache.lucene.util.TestRuleSetupTeardownChained$1.evaluate(TestRuleSetupTeardownChained.java:49)
	at org.apache.lucene.util.AbstractBeforeAfterRule$1.evaluate(AbstractBeforeAfterRule.java:45)
	at org.apache.lucene.util.TestRuleThreadAndTestName$1.evaluate(TestRuleThreadAndTestName.java:48)
	at org.apache.lucene.util.TestRuleIgnoreAfterMaxFailures$1.evaluate(TestRuleIgnoreAfterMaxFailures.java:64)
	at org.apache.lucene.util.TestRuleMarkFailure$1.evaluate(TestRuleMarkFailure.java:47)
	at com.carrotsearch.randomizedtesting.rules.StatementAdapter.evaluate(StatementAdapter.java:36)
	at com.carrotsearch.randomizedtesting.ThreadLeakControl$StatementRunner.run(ThreadLeakControl.java:368)
	at com.carrotsearch.randomizedtesting.ThreadLeakControl.forkTimeoutingTask(ThreadLeakControl.java:817)
	at com.carrotsearch.randomizedtesting.ThreadLeakControl$3.evaluate(ThreadLeakControl.java:468)
	at com.carrotsearch.randomizedtesting.RandomizedRunner.runSingleTest(RandomizedRunner.java:947)
	at com.carrotsearch.randomizedtesting.RandomizedRunner$5.evaluate(RandomizedRunner.java:832)
	at com.carrotsearch.randomizedtesting.RandomizedRunner$6.evaluate(RandomizedRunner.java:883)
	at com.carrotsearch.randomizedtesting.RandomizedRunner$7.evaluate(RandomizedRunner.java:894)
	at com.carrotsearch.randomizedtesting.rules.StatementAdapter.evaluate(StatementAdapter.java:36)
	at com.carrotsearch.randomizedtesting.rules.SystemPropertiesRestoreRule$1.evaluate(SystemPropertiesRestoreRule.java:57)
	at org.apache.lucene.util.AbstractBeforeAfterRule$1.evaluate(AbstractBeforeAfterRule.java:45)
	at com.carrotsearch.randomizedtesting.rules.StatementAdapter.evaluate(StatementAdapter.java:36)
	at org.apache.lucene.util.TestRuleStoreClassName$1.evaluate(TestRuleStoreClassName.java:41)
	at com.carrotsearch.randomizedtesting.rules.NoShadowingOrOverridesOnMethodsRule$1.evaluate(NoShadowingOrOverridesOnMethodsRule.java:40)
	at com.carrotsearch.randomizedtesting.rules.NoShadowingOrOverridesOnMethodsRule$1.evaluate(NoShadowingOrOverridesOnMethodsRule.java:40)
	at com.carrotsearch.randomizedtesting.rules.StatementAdapter.evaluate(StatementAdapter.java:36)
	at com.carrotsearch.randomizedtesting.rules.StatementAdapter.evaluate(StatementAdapter.java:36)
	at com.carrotsearch.randomizedtesting.rules.StatementAdapter.evaluate(StatementAdapter.java:36)
	at org.apache.lucene.util.TestRuleAssertionsRequired$1.evaluate(TestRuleAssertionsRequired.java:53)
	at org.apache.lucene.util.TestRuleMarkFailure$1.evaluate(TestRuleMarkFailure.java:47)
	at org.apache.lucene.util.TestRuleIgnoreAfterMaxFailures$1.evaluate(TestRuleIgnoreAfterMaxFailures.java:64)
	at org.apache.lucene.util.TestRuleIgnoreTestSuites$1.evaluate(TestRuleIgnoreTestSuites.java:54)
	at com.carrotsearch.randomizedtesting.rules.StatementAdapter.evaluate(StatementAdapter.java:36)
	at com.carrotsearch.randomizedtesting.ThreadLeakControl$StatementRunner.run(ThreadLeakControl.java:368)
	at java.lang.Thread.run(Thread.java:748)




Build Log:
[...truncated 13158 lines...]
   [junit4] Suite: org.apache.solr.cloud.AliasIntegrationTest
   [junit4]   2> Creating dataDir: /home/jenkins/workspace/Lucene-Solr-8.x-Linux/solr/build/solr-core/test/J1/temp/solr.cloud.AliasIntegrationTest_ADEA51C03CB0FEAC-001/init-core-data-001
   [junit4]   2> 223985 WARN  (SUITE-AliasIntegrationTest-seed#[ADEA51C03CB0FEAC]-worker) [     ] o.a.s.SolrTestCaseJ4 startTrackingSearchers: numOpens=1 numCloses=1
   [junit4]   2> 223985 INFO  (SUITE-AliasIntegrationTest-seed#[ADEA51C03CB0FEAC]-worker) [     ] o.a.s.SolrTestCaseJ4 Using TrieFields (NUMERIC_POINTS_SYSPROP=false) w/NUMERIC_DOCVALUES_SYSPROP=true
   [junit4]   2> 223986 INFO  (SUITE-AliasIntegrationTest-seed#[ADEA51C03CB0FEAC]-worker) [     ] o.a.s.SolrTestCaseJ4 Randomized ssl (true) and clientAuth (true) via: @org.apache.solr.util.RandomizeSSL(reason=, ssl=NaN, value=NaN, clientAuth=NaN)
   [junit4]   2> 223987 INFO  (SUITE-AliasIntegrationTest-seed#[ADEA51C03CB0FEAC]-worker) [     ] o.a.s.SolrTestCaseJ4 SecureRandom sanity checks: test.solr.allowed.securerandom=null & java.security.egd=file:/dev/./urandom
   [junit4]   2> 223987 INFO  (SUITE-AliasIntegrationTest-seed#[ADEA51C03CB0FEAC]-worker) [     ] o.a.s.c.MiniSolrCloudCluster Starting cluster of 2 servers in /home/jenkins/workspace/Lucene-Solr-8.x-Linux/solr/build/solr-core/test/J1/temp/solr.cloud.AliasIntegrationTest_ADEA51C03CB0FEAC-001/tempDir-001
   [junit4]   2> 223987 INFO  (SUITE-AliasIntegrationTest-seed#[ADEA51C03CB0FEAC]-worker) [     ] o.a.s.c.ZkTestServer STARTING ZK TEST SERVER
   [junit4]   2> 223987 INFO  (ZkTestServer Run Thread) [     ] o.a.s.c.ZkTestServer client port:0.0.0.0/0.0.0.0:0
   [junit4]   2> 223988 INFO  (ZkTestServer Run Thread) [     ] o.a.s.c.ZkTestServer Starting server
   [junit4]   2> 224088 INFO  (SUITE-AliasIntegrationTest-seed#[ADEA51C03CB0FEAC]-worker) [     ] o.a.s.c.ZkTestServer start zk server on port:40173
   [junit4]   2> 224088 INFO  (SUITE-AliasIntegrationTest-seed#[ADEA51C03CB0FEAC]-worker) [     ] o.a.s.c.ZkTestServer parse host and port list: 127.0.0.1:40173
   [junit4]   2> 224088 INFO  (SUITE-AliasIntegrationTest-seed#[ADEA51C03CB0FEAC]-worker) [     ] o.a.s.c.ZkTestServer connecting to 127.0.0.1 40173
   [junit4]   2> 224090 INFO  (SUITE-AliasIntegrationTest-seed#[ADEA51C03CB0FEAC]-worker) [     ] o.a.s.c.c.ConnectionManager Waiting for client to connect to ZooKeeper
   [junit4]   2> 224109 INFO  (zkConnectionManagerCallback-700-thread-1) [     ] o.a.s.c.c.ConnectionManager zkClient has connected
   [junit4]   2> 224109 INFO  (SUITE-AliasIntegrationTest-seed#[ADEA51C03CB0FEAC]-worker) [     ] o.a.s.c.c.ConnectionManager Client is connected to ZooKeeper
   [junit4]   2> 224112 INFO  (SUITE-AliasIntegrationTest-seed#[ADEA51C03CB0FEAC]-worker) [     ] o.a.s.c.c.ConnectionManager Waiting for client to connect to ZooKeeper
   [junit4]   2> 224117 INFO  (zkConnectionManagerCallback-702-thread-1) [     ] o.a.s.c.c.ConnectionManager zkClient has connected
   [junit4]   2> 224117 INFO  (SUITE-AliasIntegrationTest-seed#[ADEA51C03CB0FEAC]-worker) [     ] o.a.s.c.c.ConnectionManager Client is connected to ZooKeeper
   [junit4]   2> 224123 INFO  (SUITE-AliasIntegrationTest-seed#[ADEA51C03CB0FEAC]-worker) [     ] o.a.s.c.c.ConnectionManager Waiting for client to connect to ZooKeeper
   [junit4]   2> 224127 INFO  (zkConnectionManagerCallback-704-thread-1) [     ] o.a.s.c.c.ConnectionManager zkClient has connected
   [junit4]   2> 224127 INFO  (SUITE-AliasIntegrationTest-seed#[ADEA51C03CB0FEAC]-worker) [     ] o.a.s.c.c.ConnectionManager Client is connected to ZooKeeper
   [junit4]   2> 224234 WARN  (jetty-launcher-705-thread-1) [     ] o.e.j.s.AbstractConnector Ignoring deprecated socket close linger time
   [junit4]   2> 224234 INFO  (jetty-launcher-705-thread-1) [     ] o.a.s.c.s.e.JettySolrRunner Start Jetty (original configured port=0)
   [junit4]   2> 224234 INFO  (jetty-launcher-705-thread-1) [     ] o.a.s.c.s.e.JettySolrRunner Trying to start Jetty on port 0 try number 1 ...
   [junit4]   2> 224235 INFO  (jetty-launcher-705-thread-1) [     ] o.e.j.s.Server jetty-9.4.14.v20181114; built: 2018-11-14T21:20:31.478Z; git: c4550056e785fb5665914545889f21dc136ad9e6; jvm 1.8.0_201-b09
   [junit4]   2> 224236 WARN  (jetty-launcher-705-thread-2) [     ] o.e.j.s.AbstractConnector Ignoring deprecated socket close linger time
   [junit4]   2> 224236 INFO  (jetty-launcher-705-thread-2) [     ] o.a.s.c.s.e.JettySolrRunner Start Jetty (original configured port=0)
   [junit4]   2> 224236 INFO  (jetty-launcher-705-thread-2) [     ] o.a.s.c.s.e.JettySolrRunner Trying to start Jetty on port 0 try number 1 ...
   [junit4]   2> 224236 INFO  (jetty-launcher-705-thread-2) [     ] o.e.j.s.Server jetty-9.4.14.v20181114; built: 2018-11-14T21:20:31.478Z; git: c4550056e785fb5665914545889f21dc136ad9e6; jvm 1.8.0_201-b09
   [junit4]   2> 224241 INFO  (jetty-launcher-705-thread-1) [     ] o.e.j.s.session DefaultSessionIdManager workerName=node0
   [junit4]   2> 224241 INFO  (jetty-launcher-705-thread-1) [     ] o.e.j.s.session No SessionScavenger set, using defaults
   [junit4]   2> 224241 INFO  (jetty-launcher-705-thread-2) [     ] o.e.j.s.session DefaultSessionIdManager workerName=node0
   [junit4]   2> 224241 INFO  (jetty-launcher-705-thread-2) [     ] o.e.j.s.session No SessionScavenger set, using defaults
   [junit4]   2> 224241 INFO  (jetty-launcher-705-thread-1) [     ] o.e.j.s.session node0 Scavenging every 600000ms
   [junit4]   2> 224241 INFO  (jetty-launcher-705-thread-2) [     ] o.e.j.s.session node0 Scavenging every 600000ms
   [junit4]   2> 224241 INFO  (jetty-launcher-705-thread-1) [     ] o.e.j.s.h.ContextHandler Started o.e.j.s.ServletContextHandler@27d2e1c9{/solr,null,AVAILABLE}
   [junit4]   2> 224241 INFO  (jetty-launcher-705-thread-2) [     ] o.e.j.s.h.ContextHandler Started o.e.j.s.ServletContextHandler@682b336b{/solr,null,AVAILABLE}
   [junit4]   2> 224242 WARN  (jetty-launcher-705-thread-2) [     ] o.e.j.u.s.S.config No Client EndPointIdentificationAlgorithm configured for SslContextFactory@878ca24[provider=null,keyStore=null,trustStore=null]
   [junit4]   2> 224242 WARN  (jetty-launcher-705-thread-1) [     ] o.e.j.u.s.S.config No Client EndPointIdentificationAlgorithm configured for SslContextFactory@5c726367[provider=null,keyStore=null,trustStore=null]
   [junit4]   2> 224243 INFO  (jetty-launcher-705-thread-1) [     ] o.e.j.s.AbstractConnector Started ServerConnector@1e43b49{SSL,[ssl, http/1.1]}{127.0.0.1:40885}
   [junit4]   2> 224243 INFO  (jetty-launcher-705-thread-1) [     ] o.e.j.s.Server Started @224285ms
   [junit4]   2> 224243 INFO  (jetty-launcher-705-thread-1) [     ] o.a.s.c.s.e.JettySolrRunner Jetty properties: {hostContext=/solr, hostPort=40885}
   [junit4]   2> 224243 ERROR (jetty-launcher-705-thread-1) [     ] o.a.s.u.StartupLoggingUtils Missing Java Option solr.log.dir. Logging may be missing or incomplete.
   [junit4]   2> 224243 INFO  (jetty-launcher-705-thread-1) [     ] o.a.s.s.SolrDispatchFilter Using logger factory org.apache.logging.slf4j.Log4jLoggerFactory
   [junit4]   2> 224243 INFO  (jetty-launcher-705-thread-1) [     ] o.a.s.s.SolrDispatchFilter  ___      _       Welcome to Apache Solr™ version 8.2.0
   [junit4]   2> 224243 INFO  (jetty-launcher-705-thread-1) [     ] o.a.s.s.SolrDispatchFilter / __| ___| |_ _   Starting in cloud mode on port null
   [junit4]   2> 224243 INFO  (jetty-launcher-705-thread-1) [     ] o.a.s.s.SolrDispatchFilter \__ \/ _ \ | '_|  Install dir: null
   [junit4]   2> 224243 INFO  (jetty-launcher-705-thread-1) [     ] o.a.s.s.SolrDispatchFilter |___/\___/_|_|    Start time: 2019-06-13T03:51:10.925Z
   [junit4]   2> 224253 INFO  (jetty-launcher-705-thread-1) [     ] o.a.s.c.c.ConnectionManager Waiting for client to connect to ZooKeeper
   [junit4]   2> 224254 INFO  (jetty-launcher-705-thread-2) [     ] o.e.j.s.AbstractConnector Started ServerConnector@3a5b8b2{SSL,[ssl, http/1.1]}{127.0.0.1:33583}
   [junit4]   2> 224254 INFO  (jetty-launcher-705-thread-2) [     ] o.e.j.s.Server Started @224296ms
   [junit4]   2> 224254 INFO  (jetty-launcher-705-thread-2) [     ] o.a.s.c.s.e.JettySolrRunner Jetty properties: {hostContext=/solr, hostPort=33583}
   [junit4]   2> 224254 ERROR (jetty-launcher-705-thread-2) [     ] o.a.s.u.StartupLoggingUtils Missing Java Option solr.log.dir. Logging may be missing or incomplete.
   [junit4]   2> 224254 INFO  (jetty-launcher-705-thread-2) [     ] o.a.s.s.SolrDispatchFilter Using logger factory org.apache.logging.slf4j.Log4jLoggerFactory
   [junit4]   2> 224254 INFO  (jetty-launcher-705-thread-2) [     ] o.a.s.s.SolrDispatchFilter  ___      _       Welcome to Apache Solr™ version 8.2.0
   [junit4]   2> 224254 INFO  (jetty-launcher-705-thread-2) [     ] o.a.s.s.SolrDispatchFilter / __| ___| |_ _   Starting in cloud mode on port null
   [junit4]   2> 224254 INFO  (jetty-launcher-705-thread-2) [     ] o.a.s.s.SolrDispatchFilter \__ \/ _ \ | '_|  Install dir: null
   [junit4]   2> 224254 INFO  (jetty-launcher-705-thread-2) [     ] o.a.s.s.SolrDispatchFilter |___/\___/_|_|    Start time: 2019-06-13T03:51:10.936Z
   [junit4]   2> 224260 INFO  (zkConnectionManagerCallback-707-thread-1) [     ] o.a.s.c.c.ConnectionManager zkClient has connected
   [junit4]   2> 224260 INFO  (jetty-launcher-705-thread-1) [     ] o.a.s.c.c.ConnectionManager Client is connected to ZooKeeper
   [junit4]   2> 224261 INFO  (jetty-launcher-705-thread-2) [     ] o.a.s.c.c.ConnectionManager Waiting for client to connect to ZooKeeper
   [junit4]   2> 224261 INFO  (jetty-launcher-705-thread-1) [     ] o.a.s.s.SolrDispatchFilter solr.xml found in ZooKeeper. Loading...
   [junit4]   2> 224263 INFO  (zkConnectionManagerCallback-709-thread-1) [     ] o.a.s.c.c.ConnectionManager zkClient has connected
   [junit4]   2> 224264 INFO  (jetty-launcher-705-thread-2) [     ] o.a.s.c.c.ConnectionManager Client is connected to ZooKeeper
   [junit4]   2> 224265 INFO  (jetty-launcher-705-thread-2) [     ] o.a.s.s.SolrDispatchFilter solr.xml found in ZooKeeper. Loading...
   [junit4]   2> 224427 INFO  (jetty-launcher-705-thread-1) [     ] o.a.s.h.c.HttpShardHandlerFactory Host whitelist initialized: WhitelistHostChecker [whitelistHosts=null, whitelistHostCheckingEnabled=true]
   [junit4]   2> 224427 WARN  (jetty-launcher-705-thread-1) [     ] o.a.s.c.s.i.Http2SolrClient Create Http2SolrClient with HTTP/1.1 transport since Java 8 or lower versions does not support SSL + HTTP/2
   [junit4]   2> 224428 WARN  (jetty-launcher-705-thread-1) [     ] o.e.j.u.s.S.config No Client EndPointIdentificationAlgorithm configured for SslContextFactory@43e11153[provider=null,keyStore=null,trustStore=null]
   [junit4]   2> 224446 WARN  (jetty-launcher-705-thread-1) [     ] o.a.s.c.s.i.Http2SolrClient Create Http2SolrClient with HTTP/1.1 transport since Java 8 or lower versions does not support SSL + HTTP/2
   [junit4]   2> 224448 WARN  (jetty-launcher-705-thread-1) [     ] o.e.j.u.s.S.config No Client EndPointIdentificationAlgorithm configured for SslContextFactory@318dd7bd[provider=null,keyStore=null,trustStore=null]
   [junit4]   2> 224449 INFO  (jetty-launcher-705-thread-1) [     ] o.a.s.c.ZkContainer Zookeeper client=127.0.0.1:40173/solr
   [junit4]   2> 224453 INFO  (jetty-launcher-705-thread-1) [     ] o.a.s.c.c.ConnectionManager Waiting for client to connect to ZooKeeper
   [junit4]   2> 224454 INFO  (zkConnectionManagerCallback-716-thread-1) [     ] o.a.s.c.c.ConnectionManager zkClient has connected
   [junit4]   2> 224454 INFO  (jetty-launcher-705-thread-1) [     ] o.a.s.c.c.ConnectionManager Client is connected to ZooKeeper
   [junit4]   2> 224572 INFO  (jetty-launcher-705-thread-1) [n:127.0.0.1:40885_solr     ] o.a.s.c.c.ConnectionManager Waiting for client to connect to ZooKeeper
   [junit4]   2> 224573 INFO  (jetty-launcher-705-thread-2) [     ] o.a.s.h.c.HttpShardHandlerFactory Host whitelist initialized: WhitelistHostChecker [whitelistHosts=null, whitelistHostCheckingEnabled=true]
   [junit4]   2> 224574 WARN  (jetty-launcher-705-thread-2) [     ] o.a.s.c.s.i.Http2SolrClient Create Http2SolrClient with HTTP/1.1 transport since Java 8 or lower versions does not support SSL + HTTP/2
   [junit4]   2> 224574 INFO  (zkConnectionManagerCallback-719-thread-1) [     ] o.a.s.c.c.ConnectionManager zkClient has connected
   [junit4]   2> 224574 INFO  (jetty-launcher-705-thread-1) [n:127.0.0.1:40885_solr     ] o.a.s.c.c.ConnectionManager Client is connected to ZooKeeper
   [junit4]   2> 224576 WARN  (jetty-launcher-705-thread-2) [     ] o.e.j.u.s.S.config No Client EndPointIdentificationAlgorithm configured for SslContextFactory@440099a6[provider=null,keyStore=null,trustStore=null]
   [junit4]   2> 224579 WARN  (jetty-launcher-705-thread-2) [     ] o.a.s.c.s.i.Http2SolrClient Create Http2SolrClient with HTTP/1.1 transport since Java 8 or lower versions does not support SSL + HTTP/2
   [junit4]   2> 224582 WARN  (jetty-launcher-705-thread-2) [     ] o.e.j.u.s.S.config No Client EndPointIdentificationAlgorithm configured for SslContextFactory@268ede54[provider=null,keyStore=null,trustStore=null]
   [junit4]   2> 224583 INFO  (jetty-launcher-705-thread-2) [     ] o.a.s.c.ZkContainer Zookeeper client=127.0.0.1:40173/solr
   [junit4]   2> 224584 INFO  (jetty-launcher-705-thread-2) [     ] o.a.s.c.c.ConnectionManager Waiting for client to connect to ZooKeeper
   [junit4]   2> 224585 INFO  (zkConnectionManagerCallback-727-thread-1) [     ] o.a.s.c.c.ConnectionManager zkClient has connected
   [junit4]   2> 224585 INFO  (jetty-launcher-705-thread-2) [     ] o.a.s.c.c.ConnectionManager Client is connected to ZooKeeper
   [junit4]   2> 224693 INFO  (jetty-launcher-705-thread-2) [n:127.0.0.1:33583_solr     ] o.a.s.c.c.ConnectionManager Waiting for client to connect to ZooKeeper
   [junit4]   2> 224732 INFO  (zkConnectionManagerCallback-729-thread-1) [     ] o.a.s.c.c.ConnectionManager zkClient has connected
   [junit4]   2> 224733 INFO  (jetty-launcher-705-thread-2) [n:127.0.0.1:33583_solr     ] o.a.s.c.c.ConnectionManager Client is connected to ZooKeeper
   [junit4]   2> 224757 INFO  (jetty-launcher-705-thread-2) [n:127.0.0.1:33583_solr     ] o.a.s.c.OverseerElectionContext I am going to be the leader 127.0.0.1:33583_solr
   [junit4]   2> 224758 INFO  (jetty-launcher-705-thread-2) [n:127.0.0.1:33583_solr     ] o.a.s.c.Overseer Overseer (id=72417596788834312-127.0.0.1:33583_solr-n_0000000000) starting
   [junit4]   2> 224783 INFO  (jetty-launcher-705-thread-1) [n:127.0.0.1:40885_solr     ] o.a.s.c.ZkController Register node as live in ZooKeeper:/live_nodes/127.0.0.1:40885_solr
   [junit4]   2> 224784 INFO  (jetty-launcher-705-thread-2) [n:127.0.0.1:33583_solr     ] o.a.s.c.c.ConnectionManager Waiting for client to connect to ZooKeeper
   [junit4]   2> 224808 INFO  (zkCallback-718-thread-1) [     ] o.a.s.c.c.ZkStateReader Updated live nodes from ZooKeeper... (0) -> (1)
   [junit4]   2> 224809 INFO  (jetty-launcher-705-thread-1) [n:127.0.0.1:40885_solr     ] o.a.s.c.c.ConnectionManager Waiting for client to connect to ZooKeeper
   [junit4]   2> 224814 INFO  (zkCallback-728-thread-1) [     ] o.a.s.c.c.ZkStateReader Updated live nodes from ZooKeeper... (0) -> (1)
   [junit4]   2> 224817 INFO  (zkConnectionManagerCallback-736-thread-1) [     ] o.a.s.c.c.ConnectionManager zkClient has connected
   [junit4]   2> 224817 INFO  (jetty-launcher-705-thread-2) [n:127.0.0.1:33583_solr     ] o.a.s.c.c.ConnectionManager Client is connected to ZooKeeper
   [junit4]   2> 224838 INFO  (zkConnectionManagerCallback-741-thread-1) [     ] o.a.s.c.c.ConnectionManager zkClient has connected
   [junit4]   2> 224838 INFO  (jetty-launcher-705-thread-1) [n:127.0.0.1:40885_solr     ] o.a.s.c.c.ConnectionManager Client is connected to ZooKeeper
   [junit4]   2> 224839 INFO  (jetty-launcher-705-thread-2) [n:127.0.0.1:33583_solr     ] o.a.s.c.c.ZkStateReader Updated live nodes from ZooKeeper... (0) -> (1)
   [junit4]   2> 224839 INFO  (jetty-launcher-705-thread-1) [n:127.0.0.1:40885_solr     ] o.a.s.c.c.ZkStateReader Updated live nodes from ZooKeeper... (0) -> (1)
   [junit4]   2> 224840 INFO  (jetty-launcher-705-thread-2) [n:127.0.0.1:33583_solr     ] o.a.s.c.s.i.ZkClientClusterStateProvider Cluster at 127.0.0.1:40173/solr ready
   [junit4]   2> 224840 INFO  (jetty-launcher-705-thread-1) [n:127.0.0.1:40885_solr     ] o.a.s.c.s.i.ZkClientClusterStateProvider Cluster at 127.0.0.1:40173/solr ready
   [junit4]   2> 224847 INFO  (OverseerStateUpdate-72417596788834312-127.0.0.1:33583_solr-n_0000000000) [n:127.0.0.1:33583_solr     ] o.a.s.c.Overseer Starting to work on the main queue : 127.0.0.1:33583_solr
   [junit4]   2> 224858 INFO  (jetty-launcher-705-thread-2) [n:127.0.0.1:33583_solr     ] o.a.s.c.ZkController Publish node=127.0.0.1:33583_solr as DOWN
   [junit4]   2> 224859 INFO  (jetty-launcher-705-thread-2) [n:127.0.0.1:33583_solr     ] o.a.s.c.TransientSolrCoreCacheDefault Allocating transient cache for 2147483647 transient cores
   [junit4]   2> 224859 INFO  (jetty-launcher-705-thread-2) [n:127.0.0.1:33583_solr     ] o.a.s.c.ZkController Register node as live in ZooKeeper:/live_nodes/127.0.0.1:33583_solr
   [junit4]   2> 224860 INFO  (zkCallback-728-thread-1) [     ] o.a.s.c.c.ZkStateReader Updated live nodes from ZooKeeper... (1) -> (2)
   [junit4]   2> 224868 INFO  (zkCallback-718-thread-1) [     ] o.a.s.c.c.ZkStateReader Updated live nodes from ZooKeeper... (1) -> (2)
   [junit4]   2> 224881 INFO  (zkCallback-735-thread-1) [     ] o.a.s.c.c.ZkStateReader Updated live nodes from ZooKeeper... (1) -> (2)
   [junit4]   2> 224888 INFO  (zkCallback-740-thread-1) [     ] o.a.s.c.c.ZkStateReader Updated live nodes from ZooKeeper... (1) -> (2)
   [junit4]   2> 224917 INFO  (jetty-launcher-705-thread-1) [n:127.0.0.1:40885_solr     ] o.a.s.h.a.MetricsHistoryHandler No .system collection, keeping metrics history in memory.
   [junit4]   2> 224945 INFO  (jetty-launcher-705-thread-2) [n:127.0.0.1:33583_solr     ] o.a.s.h.a.MetricsHistoryHandler No .system collection, keeping metrics history in memory.
   [junit4]   2> 224948 INFO  (jetty-launcher-705-thread-1) [n:127.0.0.1:40885_solr     ] o.a.s.m.r.SolrJmxReporter JMX monitoring for 'solr_40885.solr.node' (registry 'solr.node') enabled at server: com.sun.jmx.mbeanserver.JmxMBeanServer@31362085
   [junit4]   2> 224956 INFO  (jetty-launcher-705-thread-1) [n:127.0.0.1:40885_solr     ] o.a.s.m.r.SolrJmxReporter JMX monitoring for 'solr_40885.solr.jvm' (registry 'solr.jvm') enabled at server: com.sun.jmx.mbeanserver.JmxMBeanServer@31362085
   [junit4]   2> 224956 INFO  (jetty-launcher-705-thread-1) [n:127.0.0.1:40885_solr     ] o.a.s.m.r.SolrJmxReporter JMX monitoring for 'solr_40885.solr.jetty' (registry 'solr.jetty') enabled at server: com.sun.jmx.mbeanserver.JmxMBeanServer@31362085
   [junit4]   2> 224957 INFO  (jetty-launcher-705-thread-1) [n:127.0.0.1:40885_solr     ] o.a.s.c.CorePropertiesLocator Found 0 core definitions underneath /home/jenkins/workspace/Lucene-Solr-8.x-Linux/solr/build/solr-core/test/J1/temp/solr.cloud.AliasIntegrationTest_ADEA51C03CB0FEAC-001/tempDir-001/node1/.
   [junit4]   2> 224986 INFO  (jetty-launcher-705-thread-2) [n:127.0.0.1:33583_solr     ] o.a.s.m.r.SolrJmxReporter JMX monitoring for 'solr_33583.solr.node' (registry 'solr.node') enabled at server: com.sun.jmx.mbeanserver.JmxMBeanServer@31362085
   [junit4]   2> 225015 INFO  (jetty-launcher-705-thread-2) [n:127.0.0.1:33583_solr     ] o.a.s.m.r.SolrJmxReporter JMX monitoring for 'solr_33583.solr.jvm' (registry 'solr.jvm') enabled at server: com.sun.jmx.mbeanserver.JmxMBeanServer@31362085
   [junit4]   2> 225015 INFO  (jetty-launcher-705-thread-2) [n:127.0.0.1:33583_solr     ] o.a.s.m.r.SolrJmxReporter JMX monitoring for 'solr_33583.solr.jetty' (registry 'solr.jetty') enabled at server: com.sun.jmx.mbeanserver.JmxMBeanServer@31362085
   [junit4]   2> 225016 INFO  (jetty-launcher-705-thread-2) [n:127.0.0.1:33583_solr     ] o.a.s.c.CorePropertiesLocator Found 0 core definitions underneath /home/jenkins/workspace/Lucene-Solr-8.x-Linux/solr/build/solr-core/test/J1/temp/solr.cloud.AliasIntegrationTest_ADEA51C03CB0FEAC-001/tempDir-001/node2/.
   [junit4]   2> 225053 INFO  (SUITE-AliasIntegrationTest-seed#[ADEA51C03CB0FEAC]-worker) [     ] o.a.s.c.c.ConnectionManager Waiting for client to connect to ZooKeeper
   [junit4]   2> 225077 INFO  (zkConnectionManagerCallback-748-thread-1) [     ] o.a.s.c.c.ConnectionManager zkClient has connected
   [junit4]   2> 225077 INFO  (SUITE-AliasIntegrationTest-seed#[ADEA51C03CB0FEAC]-worker) [     ] o.a.s.c.c.ConnectionManager Client is connected to ZooKeeper
   [junit4]   2> 225083 INFO  (SUITE-AliasIntegrationTest-seed#[ADEA51C03CB0FEAC]-worker) [     ] o.a.s.c.c.ZkStateReader Updated live nodes from ZooKeeper... (0) -> (2)
   [junit4]   2> 225086 INFO  (SUITE-AliasIntegrationTest-seed#[ADEA51C03CB0FEAC]-worker) [     ] o.a.s.c.s.i.ZkClientClusterStateProvider Cluster at 127.0.0.1:40173/solr ready
   [junit4]   2> 225109 INFO  (TEST-AliasIntegrationTest.testModifyPropertiesCAR-seed#[ADEA51C03CB0FEAC]) [     ] o.a.s.SolrTestCaseJ4 ###Starting testModifyPropertiesCAR
   [junit4]   2> 225153 INFO  (qtp720046542-2480) [n:127.0.0.1:40885_solr     ] o.a.s.h.a.CollectionsHandler Invoked Collection Action :clusterstatus with params action=CLUSTERSTATUS&wt=javabin&version=2 and sendToOCPQueue=true
   [junit4]   2> 225153 INFO  (qtp720046542-2480) [n:127.0.0.1:40885_solr     ] o.a.s.s.HttpSolrCall [admin] webapp=null path=/admin/collections params={action=CLUSTERSTATUS&wt=javabin&version=2} status=0 QTime=0
   [junit4]   2> 225178 INFO  (qtp736560341-2477) [n:127.0.0.1:33583_solr     ] o.a.s.h.a.CollectionsHandler Invoked Collection Action :create with params collection.configName=conf&name=collection1meta&nrtReplicas=1&action=CREATE&numShards=2&wt=javabin&version=2 and sendToOCPQueue=true
   [junit4]   2> 225181 INFO  (OverseerThreadFactory-821-thread-1-processing-n:127.0.0.1:33583_solr) [n:127.0.0.1:33583_solr     ] o.a.s.c.a.c.CreateCollectionCmd Create collection collection1meta
   [junit4]   2> 225286 INFO  (OverseerStateUpdate-72417596788834312-127.0.0.1:33583_solr-n_0000000000) [n:127.0.0.1:33583_solr     ] o.a.s.c.o.SliceMutator createReplica() {
   [junit4]   2>   "operation":"ADDREPLICA",
   [junit4]   2>   "collection":"collection1meta",
   [junit4]   2>   "shard":"shard1",
   [junit4]   2>   "core":"collection1meta_shard1_replica_n1",
   [junit4]   2>   "state":"down",
   [junit4]   2>   "base_url":"https://127.0.0.1:33583/solr",
   [junit4]   2>   "type":"NRT",
   [junit4]   2>   "waitForFinalState":"false"} 
   [junit4]   2> 225288 INFO  (OverseerStateUpdate-72417596788834312-127.0.0.1:33583_solr-n_0000000000) [n:127.0.0.1:33583_solr     ] o.a.s.c.o.SliceMutator createReplica() {
   [junit4]   2>   "operation":"ADDREPLICA",
   [junit4]   2>   "collection":"collection1meta",
   [junit4]   2>   "shard":"shard2",
   [junit4]   2>   "core":"collection1meta_shard2_replica_n2",
   [junit4]   2>   "state":"down",
   [junit4]   2>   "base_url":"https://127.0.0.1:40885/solr",
   [junit4]   2>   "type":"NRT",
   [junit4]   2>   "waitForFinalState":"false"} 
   [junit4]   2> 225505 INFO  (qtp720046542-2480) [n:127.0.0.1:40885_solr    x:collection1meta_shard2_replica_n2 ] o.a.s.h.a.CoreAdminOperation core create command qt=/admin/cores&coreNodeName=core_node4&collection.configName=conf&newCollection=true&name=collection1meta_shard2_replica_n2&action=CREATE&numShards=2&collection=collection1meta&shard=shard2&wt=javabin&version=2&replicaType=NRT
   [junit4]   2> 225507 INFO  (qtp736560341-2479) [n:127.0.0.1:33583_solr    x:collection1meta_shard1_replica_n1 ] o.a.s.h.a.CoreAdminOperation core create command qt=/admin/cores&coreNodeName=core_node3&collection.configName=conf&newCollection=true&name=collection1meta_shard1_replica_n1&action=CREATE&numShards=2&collection=collection1meta&shard=shard1&wt=javabin&version=2&replicaType=NRT
   [junit4]   2> 225508 INFO  (qtp720046542-2480) [n:127.0.0.1:40885_solr    x:collection1meta_shard2_replica_n2 ] o.a.s.c.TransientSolrCoreCacheDefault Allocating transient cache for 2147483647 transient cores
   [junit4]   2> 226537 INFO  (qtp736560341-2479) [n:127.0.0.1:33583_solr c:collection1meta s:shard1 r:core_node3 x:collection1meta_shard1_replica_n1 ] o.a.s.c.SolrConfig Using Lucene MatchVersion: 8.2.0
   [junit4]   2> 226544 INFO  (qtp736560341-2479) [n:127.0.0.1:33583_solr c:collection1meta s:shard1 r:core_node3 x:collection1meta_shard1_replica_n1 ] o.a.s.s.IndexSchema [collection1meta_shard1_replica_n1] Schema name=minimal
   [junit4]   2> 226545 INFO  (qtp736560341-2479) [n:127.0.0.1:33583_solr c:collection1meta s:shard1 r:core_node3 x:collection1meta_shard1_replica_n1 ] o.a.s.s.IndexSchema Loaded schema minimal/1.1 with uniqueid field id
   [junit4]   2> 226546 INFO  (qtp736560341-2479) [n:127.0.0.1:33583_solr c:collection1meta s:shard1 r:core_node3 x:collection1meta_shard1_replica_n1 ] o.a.s.c.CoreContainer Creating SolrCore 'collection1meta_shard1_replica_n1' using configuration from collection collection1meta, trusted=true
   [junit4]   2> 226547 INFO  (qtp736560341-2479) [n:127.0.0.1:33583_solr c:collection1meta s:shard1 r:core_node3 x:collection1meta_shard1_replica_n1 ] o.a.s.m.r.SolrJmxReporter JMX monitoring for 'solr_33583.solr.core.collection1meta.shard1.replica_n1' (registry 'solr.core.collection1meta.shard1.replica_n1') enabled at server: com.sun.jmx.mbeanserver.JmxMBeanServer@31362085
   [junit4]   2> 226547 INFO  (qtp736560341-2479) [n:127.0.0.1:33583_solr c:collection1meta s:shard1 r:core_node3 x:collection1meta_shard1_replica_n1 ] o.a.s.c.SolrCore [[collection1meta_shard1_replica_n1] ] Opening new SolrCore at [/home/jenkins/workspace/Lucene-Solr-8.x-Linux/solr/build/solr-core/test/J1/temp/solr.cloud.AliasIntegrationTest_ADEA51C03CB0FEAC-001/tempDir-001/node2/collection1meta_shard1_replica_n1], dataDir=[/home/jenkins/workspace/Lucene-Solr-8.x-Linux/solr/build/solr-core/test/J1/temp/solr.cloud.AliasIntegrationTest_ADEA51C03CB0FEAC-001/tempDir-001/node2/./collection1meta_shard1_replica_n1/data/]
   [junit4]   2> 226563 INFO  (qtp720046542-2480) [n:127.0.0.1:40885_solr c:collection1meta s:shard2 r:core_node4 x:collection1meta_shard2_replica_n2 ] o.a.s.c.SolrConfig Using Lucene MatchVersion: 8.2.0
   [junit4]   2> 226570 INFO  (qtp720046542-2480) [n:127.0.0.1:40885_solr c:collection1meta s:shard2 r:core_node4 x:collection1meta_shard2_replica_n2 ] o.a.s.s.IndexSchema [collection1meta_shard2_replica_n2] Schema name=minimal
   [junit4]   2> 226571 INFO  (qtp720046542-2480) [n:127.0.0.1:40885_solr c:collection1meta s:shard2 r:core_node4 x:collection1meta_shard2_replica_n2 ] o.a.s.s.IndexSchema Loaded schema minimal/1.1 with uniqueid field id
   [junit4]   2> 226571 INFO  (qtp720046542-2480) [n:127.0.0.1:40885_solr c:collection1meta s:shard2 r:core_node4 x:collection1meta_shard2_replica_n2 ] o.a.s.c.CoreContainer Creating SolrCore 'collection1meta_shard2_replica_n2' using configuration from collection collection1meta, trusted=true
   [junit4]   2> 226572 INFO  (qtp720046542-2480) [n:127.0.0.1:40885_solr c:collection1meta s:shard2 r:core_node4 x:collection1meta_shard2_replica_n2 ] o.a.s.m.r.SolrJmxReporter JMX monitoring for 'solr_40885.solr.core.collection1meta.shard2.replica_n2' (registry 'solr.core.collection1meta.shard2.replica_n2') enabled at server: com.sun.jmx.mbeanserver.JmxMBeanServer@31362085
   [junit4]   2> 226572 INFO  (qtp720046542-2480) [n:127.0.0.1:40885_solr c:collection1meta s:shard2 r:core_node4 x:collection1meta_shard2_replica_n2 ] o.a.s.c.SolrCore [[collection1meta_shard2_replica_n2] ] Opening new SolrCore at [/home/jenkins/workspace/Lucene-Solr-8.x-Linux/solr/build/solr-core/test/J1/temp/solr.cloud.AliasIntegrationTest_ADEA51C03CB0FEAC-001/tempDir-001/node1/collection1meta_shard2_replica_n2], dataDir=[/home/jenkins/workspace/Lucene-Solr-8.x-Linux/solr/build/solr-core/test/J1/temp/solr.cloud.AliasIntegrationTest_ADEA51C03CB0FEAC-001/tempDir-001/node1/./collection1meta_shard2_replica_n2/data/]
   [junit4]   2> 226583 INFO  (qtp736560341-2479) [n:127.0.0.1:33583_solr c:collection1meta s:shard1 r:core_node3 x:collection1meta_shard1_replica_n1 ] o.a.s.u.UpdateHandler Using UpdateLog implementation: org.apache.solr.update.UpdateLog
   [junit4]   2> 226583 INFO  (qtp736560341-2479) [n:127.0.0.1:33583_solr c:collection1meta s:shard1 r:core_node3 x:collection1meta_shard1_replica_n1 ] o.a.s.u.UpdateLog Initializing UpdateLog: dataDir=null defaultSyncLevel=FLUSH numRecordsToKeep=100 maxNumLogsToKeep=10 numVersionBuckets=65536
   [junit4]   2> 226584 INFO  (qtp736560341-2479) [n:127.0.0.1:33583_solr c:collection1meta s:shard1 r:core_node3 x:collection1meta_shard1_replica_n1 ] o.a.s.u.CommitTracker Hard AutoCommit: disabled
   [junit4]   2> 226584 INFO  (qtp736560341-2479) [n:127.0.0.1:33583_solr c:collection1meta s:shard1 r:core_node3 x:collection1meta_shard1_replica_n1 ] o.a.s.u.CommitTracker Soft AutoCommit: disabled
   [junit4]   2> 226585 INFO  (qtp736560341-2479) [n:127.0.0.1:33583_solr c:collection1meta s:shard1 r:core_node3 x:collection1meta_shard1_replica_n1 ] o.a.s.s.SolrIndexSearcher Opening [Searcher@6963f35d[collection1meta_shard1_replica_n1] main]
   [junit4]   2> 226586 INFO  (qtp736560341-2479) [n:127.0.0.1:33583_solr c:collection1meta s:shard1 r:core_node3 x:collection1meta_shard1_replica_n1 ] o.a.s.r.ManagedResourceStorage Configured ZooKeeperStorageIO with znodeBase: /configs/conf
   [junit4]   2> 226586 INFO  (qtp736560341-2479) [n:127.0.0.1:33583_solr c:collection1meta s:shard1 r:core_node3 x:collection1meta_shard1_replica_n1 ] o.a.s.r.ManagedResourceStorage Loaded null at path _rest_managed.json using ZooKeeperStorageIO:path=/configs/conf
   [junit4]   2> 226586 INFO  (qtp736560341-2479) [n:127.0.0.1:33583_solr c:collection1meta s:shard1 r:core_node3 x:collection1meta_shard1_replica_n1 ] o.a.s.h.ReplicationHandler Commits will be reserved for 10000ms.
   [junit4]   2> 226586 INFO  (qtp736560341-2479) [n:127.0.0.1:33583_solr c:collection1meta s:shard1 r:core_node3 x:collection1meta_shard1_replica_n1 ] o.a.s.u.UpdateLog Could not find max version in index or recent updates, using new clock 1636195760359866368
   [junit4]   2> 226589 INFO  (searcherExecutor-829-thread-1-processing-n:127.0.0.1:33583_solr x:collection1meta_shard1_replica_n1 c:collection1meta s:shard1 r:core_node3) [n:127.0.0.1:33583_solr c:collection1meta s:shard1 r:core_node3 x:collection1meta_shard1_replica_n1 ] o.a.s.c.SolrCore [collection1meta_shard1_replica_n1] Registered new searcher Searcher@6963f35d[collection1meta_shard1_replica_n1] main{ExitableDirectoryReader(UninvertingDirectoryReader())}
   [junit4]   2> 226591 INFO  (qtp736560341-2479) [n:127.0.0.1:33583_solr c:collection1meta s:shard1 r:core_node3 x:collection1meta_shard1_replica_n1 ] o.a.s.c.ZkShardTerms Successful update of terms at /collections/collection1meta/terms/shard1 to Terms{values={core_node3=0}, version=0}
   [junit4]   2> 226591 INFO  (qtp736560341-2479) [n:127.0.0.1:33583_solr c:collection1meta s:shard1 r:core_node3 x:collection1meta_shard1_replica_n1 ] o.a.s.c.ShardLeaderElectionContextBase make sure parent is created /collections/collection1meta/leaders/shard1
   [junit4]   2> 226593 INFO  (qtp736560341-2479) [n:127.0.0.1:33583_solr c:collection1meta s:shard1 r:core_node3 x:collection1meta_shard1_replica_n1 ] o.a.s.c.ShardLeaderElectionContext Enough replicas found to continue.
   [junit4]   2> 226593 INFO  (qtp736560341-2479) [n:127.0.0.1:33583_solr c:collection1meta s:shard1 r:core_node3 x:collection1meta_shard1_replica_n1 ] o.a.s.c.ShardLeaderElectionContext I may be the new leader - try and sync
   [junit4]   2> 226593 INFO  (qtp736560341-2479) [n:127.0.0.1:33583_solr c:collection1meta s:shard1 r:core_node3 x:collection1meta_shard1_replica_n1 ] o.a.s.c.SyncStrategy Sync replicas to https://127.0.0.1:33583/solr/collection1meta_shard1_replica_n1/
   [junit4]   2> 226593 INFO  (qtp736560341-2479) [n:127.0.0.1:33583_solr c:collection1meta s:shard1 r:core_node3 x:collection1meta_shard1_replica_n1 ] o.a.s.c.SyncStrategy Sync Success - now sync replicas to me
   [junit4]   2> 226593 INFO  (qtp736560341-2479) [n:127.0.0.1:33583_solr c:collection1meta s:shard1 r:core_node3 x:collection1meta_shard1_replica_n1 ] o.a.s.c.SyncStrategy https://127.0.0.1:33583/solr/collection1meta_shard1_replica_n1/ has no replicas
   [junit4]   2> 226593 INFO  (qtp736560341-2479) [n:127.0.0.1:33583_solr c:collection1meta s:shard1 r:core_node3 x:collection1meta_shard1_replica_n1 ] o.a.s.c.ShardLeaderElectionContextBase Creating leader registration node /collections/collection1meta/leaders/shard1/leader after winning as /collections/collection1meta/leader_elect/shard1/election/72417596788834312-core_node3-n_0000000000
   [junit4]   2> 226594 INFO  (qtp736560341-2479) [n:127.0.0.1:33583_solr c:collection1meta s:shard1 r:core_node3 x:collection1meta_shard1_replica_n1 ] o.a.s.c.ShardLeaderElectionContext I am the new leader: https://127.0.0.1:33583/solr/collection1meta_shard1_replica_n1/ shard1
   [junit4]   2> 226604 INFO  (qtp720046542-2480) [n:127.0.0.1:40885_solr c:collection1meta s:shard2 r:core_node4 x:collection1meta_shard2_replica_n2 ] o.a.s.u.UpdateHandler Using UpdateLog implementation: org.apache.solr.update.UpdateLog
   [junit4]   2> 226604 INFO  (qtp720046542-2480) [n:127.0.0.1:40885_solr c:collection1meta s:shard2 r:core_node4 x:collection1meta_shard2_replica_n2 ] o.a.s.u.UpdateLog Initializing UpdateLog: dataDir=null defaultSyncLevel=FLUSH numRecordsToKeep=100 maxNumLogsToKeep=10 numVersionBuckets=65536
   [junit4]   2> 226627 INFO  (qtp720046542-2480) [n:127.0.0.1:40885_solr c:collection1meta s:shard2 r:core_node4 x:collection1meta_shard2_replica_n2 ] o.a.s.u.CommitTracker Hard AutoCommit: disabled
   [junit4]   2> 226627 INFO  (qtp720046542-2480) [n:127.0.0.1:40885_solr c:collection1meta s:shard2 r:core_node4 x:collection1meta_shard2_replica_n2 ] o.a.s.u.CommitTracker Soft AutoCommit: disabled
   [junit4]   2> 226628 INFO  (qtp720046542-2480) [n:127.0.0.1:40885_solr c:collection1meta s:shard2 r:core_node4 x:collection1meta_shard2_replica_n2 ] o.a.s.s.SolrIndexSearcher Opening [Searcher@b03af64[collection1meta_shard2_replica_n2] main]
   [junit4]   2> 226628 INFO  (qtp720046542-2480) [n:127.0.0.1:40885_solr c:collection1meta s:shard2 r:core_node4 x:collection1meta_shard2_replica_n2 ] o.a.s.r.ManagedResourceStorage Configured ZooKeeperStorageIO with znodeBase: /configs/conf
   [junit4]   2> 226628 INFO  (qtp720046542-2480) [n:127.0.0.1:40885_solr c:collection1meta s:shard2 r:core_node4 x:collection1meta_shard2_replica_n2 ] o.a.s.r.ManagedResourceStorage Loaded null at path _rest_managed.json using ZooKeeperStorageIO:path=/configs/conf
   [junit4]   2> 226629 INFO  (qtp720046542-2480) [n:127.0.0.1:40885_solr c:collection1meta s:shard2 r:core_node4 x:collection1meta_shard2_replica_n2 ] o.a.s.h.ReplicationHandler Commits will be reserved for 10000ms.
   [junit4]   2> 226629 INFO  (qtp720046542-2480) [n:127.0.0.1:40885_solr c:collection1meta s:shard2 r:core_node4 x:collection1meta_shard2_replica_n2 ] o.a.s.u.UpdateLog Could not find max version in index or recent updates, using new clock 1636195760404955136
   [junit4]   2> 226632 INFO  (searcherExecutor-830-thread-1-processing-n:127.0.0.1:40885_solr x:collection1meta_shard2_replica_n2 c:collection1meta s:shard2 r:core_node4) [n:127.0.0.1:40885_solr c:collection1meta s:shard2 r:core_node4 x:collection1meta_shard2_replica_n2 ] o.a.s.c.SolrCore [collection1meta_shard2_replica_n2] Registered new searcher Searcher@b03af64[collection1meta_shard2_replica_n2] main{ExitableDirectoryReader(UninvertingDirectoryReader())}
   [junit4]   2> 226633 INFO  (qtp720046542-2480) [n:127.0.0.1:40885_solr c:collection1meta s:shard2 r:core_node4 x:collection1meta_shard2_replica_n2 ] o.a.s.c.ZkShardTerms Successful update of terms at /collections/collection1meta/terms/shard2 to Terms{values={core_node4=0}, version=0}
   [junit4]   2> 226634 INFO  (qtp720046542-2480) [n:127.0.0.1:40885_solr c:collection1meta s:shard2 r:core_node4 x:collection1meta_shard2_replica_n2 ] o.a.s.c.ShardLeaderElectionContextBase make sure parent is created /collections/collection1meta/leaders/shard2
   [junit4]   2> 226635 INFO  (qtp720046542-2480) [n:127.0.0.1:40885_solr c:collection1meta s:shard2 r:core_node4 x:collection1meta_shard2_replica_n2 ] o.a.s.c.ShardLeaderElectionContext Enough replicas found to continue.
   [junit4]   2> 226635 INFO  (qtp720046542-2480) [n:127.0.0.1:40885_solr c:collection1meta s:shard2 r:core_node4 x:collection1meta_shard2_replica_n2 ] o.a.s.c.ShardLeaderElectionContext I may be the new leader - try and sync
   [junit4]   2> 226635 INFO  (qtp720046542-2480) [n:127.0.0.1:40885_solr c:collection1meta s:shard2 r:core_node4 x:collection1meta_shard2_replica_n2 ] o.a.s.c.SyncStrategy Sync replicas to https://127.0.0.1:40885/solr/collection1meta_shard2_replica_n2/
   [junit4]   2> 226635 INFO  (qtp720046542-2480) [n:127.0.0.1:40885_solr c:collection1meta s:shard2 r:core_node4 x:collection1meta_shard2_replica_n2 ] o.a.s.c.SyncStrategy Sync Success - now sync replicas to me
   [junit4]   2> 226636 INFO  (qtp720046542-2480) [n:127.0.0.1:40885_solr c:collection1meta s:shard2 r:core_node4 x:collection1meta_shard2_replica_n2 ] o.a.s.c.SyncStrategy https://127.0.0.1:40885/solr/collection1meta_shard2_replica_n2/ has no replicas
   [junit4]   2> 226636 INFO  (qtp720046542-2480) [n:127.0.0.1:40885_solr c:collection1meta s:shard2 r:core_node4 x:collection1meta_shard2_replica_n2 ] o.a.s.c.ShardLeaderElectionContextBase Creating leader registration node /collections/collection1meta/leaders/shard2/leader after winning as /collections/collection1meta/leader_elect/shard2/election/72417596788834310-core_node4-n_0000000000
   [junit4]   2> 226637 INFO  (qtp720046542-2480) [n:127.0.0.1:40885_solr c:collection1meta s:shard2 r:core_node4 x:collection1meta_shard2_replica_n2 ] o.a.s.c.ShardLeaderElectionContext I am the new leader: https://127.0.0.1:40885/solr/collection1meta_shard2_replica_n2/ shard2
   [junit4]   2> 226738 INFO  (zkCallback-718-thread-1) [     ] o.a.s.c.c.ZkStateReader A cluster state change: [WatchedEvent state:SyncConnected type:NodeDataChanged path:/collections/collection1meta/state.json] for collection [collection1meta] has occurred - updating... (live nodes size: [2])
   [junit4]   2> 226738 INFO  (zkCallback-728-thread-1) [     ] o.a.s.c.c.ZkStateReader A cluster state change: [WatchedEvent state:SyncConnected type:NodeDataChanged path:/collections/collection1meta/state.json] for collection [collection1meta] has occurred - updating... (live nodes size: [2])
   [junit4]   2> 226738 INFO  (zkCallback-718-thread-2) [     ] o.a.s.c.c.ZkStateReader A cluster state change: [WatchedEvent state:SyncConnected type:NodeDataChanged path:/collections/collection1meta/state.json] for collection [collection1meta] has occurred - updating... (live nodes size: [2])
   [junit4]   2> 226738 INFO  (zkCallback-728-thread-2) [     ] o.a.s.c.c.ZkStateReader A cluster state change: [WatchedEvent state:SyncConnected type:NodeDataChanged path:/collections/collection1meta/state.json] for collection [collection1meta] has occurred - updating... (live nodes size: [2])
   [junit4]   2> 226739 INFO  (qtp720046542-2480) [n:127.0.0.1:40885_solr c:collection1meta s:shard2 r:core_node4 x:collection1meta_shard2_replica_n2 ] o.a.s.c.ZkController I am the leader, no recovery necessary
   [junit4]   2> 226739 INFO  (qtp736560341-2479) [n:127.0.0.1:33583_solr c:collection1meta s:shard1 r:core_node3 x:collection1meta_shard1_replica_n1 ] o.a.s.c.ZkController I am the leader, no recovery necessary
   [junit4]   2> 226741 INFO  (qtp736560341-2479) [n:127.0.0.1:33583_solr c:collection1meta s:shard1 r:core_node3 x:collection1meta_shard1_replica_n1 ] o.a.s.s.HttpSolrCall [admin] webapp=null path=/admin/cores params={qt=/admin/cores&coreNodeName=core_node3&collection.configName=conf&newCollection=true&name=collection1meta_shard1_replica_n1&action=CREATE&numShards=2&collection=collection1meta&shard=shard1&wt=javabin&version=2&replicaType=NRT} status=0 QTime=1234
   [junit4]   2> 226741 INFO  (qtp720046542-2480) [n:127.0.0.1:40885_solr c:collection1meta s:shard2 r:core_node4 x:collection1meta_shard2_replica_n2 ] o.a.s.s.HttpSolrCall [admin] webapp=null path=/admin/cores params={qt=/admin/cores&coreNodeName=core_node4&collection.configName=conf&newCollection=true&name=collection1meta_shard2_replica_n2&action=CREATE&numShards=2&collection=collection1meta&shard=shard2&wt=javabin&version=2&replicaType=NRT} status=0 QTime=1235
   [junit4]   2> 226744 INFO  (qtp736560341-2477) [n:127.0.0.1:33583_solr     ] o.a.s.h.a.CollectionsHandler Wait for new collection to be active for at most 45 seconds. Check all shard replicas
   [junit4]   2> 226841 INFO  (zkCallback-718-thread-1) [     ] o.a.s.c.c.ZkStateReader A cluster state change: [WatchedEvent state:SyncConnected type:NodeDataChanged path:/collections/collection1meta/state.json] for collection [collection1meta] has occurred - updating... (live nodes size: [2])
   [junit4]   2> 226841 INFO  (zkCallback-718-thread-2) [     ] o.a.s.c.c.ZkStateReader A cluster state change: [WatchedEvent state:SyncConnected type:NodeDataChanged path:/collections/collection1meta/state.json] for collection [collection1meta] has occurred - updating... (live nodes size: [2])
   [junit4]   2> 226841 INFO  (zkCallback-728-thread-2) [     ] o.a.s.c.c.ZkStateReader A cluster state change: [WatchedEvent state:SyncConnected type:NodeDataChanged path:/collections/collection1meta/state.json] for collection [collection1meta] has occurred - updating... (live nodes size: [2])
   [junit4]   2> 226841 INFO  (zkCallback-728-thread-1) [     ] o.a.s.c.c.ZkStateReader A cluster state change: [WatchedEvent state:SyncConnected type:NodeDataChanged path:/collections/collection1meta/state.json] for collection [collection1meta] has occurred - updating... (live nodes size: [2])
   [junit4]   2> 226841 INFO  (zkCallback-718-thread-3) [     ] o.a.s.c.c.ZkStateReader A cluster state change: [WatchedEvent state:SyncConnected type:NodeDataChanged path:/collections/collection1meta/state.json] for collection [collection1meta] has occurred - updating... (live nodes size: [2])
   [junit4]   2> 226842 INFO  (zkCallback-728-thread-3) [     ] o.a.s.c.c.ZkStateReader A cluster state change: [WatchedEvent state:SyncConnected type:NodeDataChanged path:/collections/collection1meta/state.json] for collection [collection1meta] has occurred - updating... (live nodes size: [2])
   [junit4]   2> 226842 INFO  (qtp736560341-2477) [n:127.0.0.1:33583_solr     ] o.a.s.s.HttpSolrCall [admin] webapp=null path=/admin/collections params={collection.configName=conf&name=collection1meta&nrtReplicas=1&action=CREATE&numShards=2&wt=javabin&version=2} status=0 QTime=1663
   [junit4]   2> 226843 INFO  (qtp736560341-2481) [n:127.0.0.1:33583_solr     ] o.a.s.h.a.CollectionsHandler Invoked Collection Action :create with params collection.configName=conf&name=collection2meta&nrtReplicas=1&action=CREATE&numShards=1&wt=javabin&version=2 and sendToOCPQueue=true
   [junit4]   2> 226844 INFO  (OverseerThreadFactory-821-thread-2-processing-n:127.0.0.1:33583_solr) [n:127.0.0.1:33583_solr     ] o.a.s.c.a.c.CreateCollectionCmd Create collection collection2meta
   [junit4]   2> 226844 INFO  (OverseerCollectionConfigSetProcessor-72417596788834312-127.0.0.1:33583_solr-n_0000000000) [n:127.0.0.1:33583_solr     ] o.a.s.c.OverseerTaskQueue Response ZK path: /overseer/collection-queue-work/qnr-0000000000 doesn't exist.  Requestor may have disconnected from ZooKeeper
   [junit4]   2> 227049 INFO  (OverseerStateUpdate-72417596788834312-127.0.0.1:33583_solr-n_0000000000) [n:127.0.0.1:33583_solr     ] o.a.s.c.o.SliceMutator createReplica() {
   [junit4]   2>   "operation":"ADDREPLICA",
   [junit4]   2>   "collection":"collection2meta",
   [junit4]   2>   "shard":"shard1",
   [junit4]   2>   "core":"collection2meta_shard1_replica_n1",
   [junit4]   2>   "state":"down",
   [junit4]   2>   "base_url":"https://127.0.0.1:40885/solr",
   [junit4]   2>   "type":"NRT",
   [junit4]   2>   "waitForFinalState":"false"} 
   [junit4]   2> 227252 INFO  (qtp720046542-2476) [n:127.0.0.1:40885_solr    x:collection2meta_shard1_replica_n1 ] o.a.s.h.a.CoreAdminOperation core create command qt=/admin/cores&coreNodeName=core_node2&collection.configName=conf&newCollection=true&name=collection2meta_shard1_replica_n1&action=CREATE&numShards=1&collection=collection2meta&shard=shard1&wt=javabin&version=2&replicaType=NRT
   [junit4]   2> 228259 INFO  (qtp720046542-2476) [n:127.0.0.1:40885_solr c:collection2meta s:shard1 r:core_node2 x:collection2meta_shard1_replica_n1 ] o.a.s.c.SolrConfig Using Lucene MatchVersion: 8.2.0
   [junit4]   2> 228264 INFO  (qtp720046542-2476) [n:127.0.0.1:40885_solr c:collection2meta s:shard1 r:core_node2 x:collection2meta_shard1_replica_n1 ] o.a.s.s.IndexSchema [collection2meta_shard1_replica_n1] Schema name=minimal
   [junit4]   2> 228265 INFO  (qtp720046542-2476) [n:127.0.0.1:40885_solr c:collection2meta s:shard1 r:core_node2 x:collection2meta_shard1_replica_n1 ] o.a.s.s.IndexSchema Loaded schema minimal/1.1 with uniqueid field id
   [junit4]   2> 228265 INFO  (qtp720046542-2476) [n:127.0.0.1:40885_solr c:collection2meta s:shard1 r:core_node2 x:collection2meta_shard1_replica_n1 ] o.a.s.c.CoreContainer Creating SolrCore 'collection2meta_shard1_replica_n1' using configuration from collection collection2meta, trusted=true
   [junit4]   2> 228266 INFO  (qtp720046542-2476) [n:127.0.0.1:40885_solr c:collection2meta s:shard1 r:core_node2 x:collection2meta_shard1_replica_n1 ] o.a.s.m.r.SolrJmxReporter JMX monitoring for 'solr_40885.solr.core.collection2meta.shard1.replica_n1' (registry 'solr.core.collection2meta.shard1.replica_n1') enabled at server: com.sun.jmx.mbeanserver.JmxMBeanServer@31362085
   [junit4]   2> 228266 INFO  (qtp720046542-2476) [n:127.0.0.1:40885_solr c:collection2meta s:shard1 r:core_node2 x:collection2meta_shard1_replica_n1 ] o.a.s.c.SolrCore [[collection2meta_shard1_replica_n1] ] Opening new SolrCore at [/home/jenkins/workspace/Lucene-Solr-8.x-Linux/solr/build/solr-core/test/J1/temp/solr.cloud.AliasIntegrationTest_ADEA51C03CB0FEAC-001/tempDir-001/node1/collection2meta_shard1_replica_n1], dataDir=[/home/jenkins/workspace/Lucene-Solr-8.x-Linux/solr/build/solr-core/test/J1/temp/solr.cloud.AliasIntegrationTest_ADEA51C03CB0FEAC-001/tempDir-001/node1/./collection2meta_shard1_replica_n1/data/]
   [junit4]   2> 228296 INFO  (qtp720046542-2476) [n:127.0.0.1:40885_solr c:collection2meta s:shard1 r:core_node2 x:collection2meta_shard1_replica_n1 ] o.a.s.u.UpdateHandler Using UpdateLog implementation: org.apache.solr.update.UpdateLog
   [junit4]   2> 228296 INFO  (qtp720046542-2476) [n:127.0.0.1:40885_solr c:collection2meta s:shard1 r:core_node2 x:collection2meta_shard1_replica_n1 ] o.a.s.u.UpdateLog Initializing UpdateLog: dataDir=null defaultSyncLevel=FLUSH numRecordsToKeep=100 maxNumLogsToKeep=10 numVersionBuckets=65536
   [junit4]   2> 228297 INFO  (qtp720046542-2476) [n:127.0.0.1:40885_solr c:collection2meta s:shard1 r:core_node2 x:collection2meta_shard1_replica_n1 ] o.a.s.u.CommitTracker Hard AutoCommit: disabled
   [junit4]   2> 228297 INFO  (qtp720046542-2476) [n:127.0.0.1:40885_solr c:collection2meta s:shard1 r:core_node2 x:collection2meta_shard1_replica_n1 ] o.a.s.u.CommitTracker Soft AutoCommit: disabled
   [junit4]   2> 228298 INFO  (qtp720046542-2476) [n:127.0.0.1:40885_solr c:collection2meta s:shard1 r:core_node2 x:collection2meta_shard1_replica_n1 ] o.a.s.s.SolrIndexSearcher Opening [Searcher@5c5a902d[collection2meta_shard1_replica_n1] main]
   [junit4]   2> 228299 INFO  (qtp720046542-2476) [n:127.0.0.1:40885_solr c:collection2meta s:shard1 r:core_node2 x:collection2meta_shard1_replica_n1 ] o.a.s.r.ManagedResourceStorage Configured ZooKeeperStorageIO with znodeBase: /configs/conf
   [junit4]   2> 228299 INFO  (qtp720046542-2476) [n:127.0.0.1:40885_solr c:collection2meta s:shard1 r:core_node2 x:collection2meta_shard1_replica_n1 ] o.a.s.r.ManagedResourceStorage Loaded null at path _rest_managed.json using ZooKeeperStorageIO:path=/configs/conf
   [junit4]   2> 228299 INFO  (qtp720046542-2476) [n:127.0.0.1:40885_solr c:collection2meta s:shard1 r:core_node2 x:collection2meta_shard1_replica_n1 ] o.a.s.h.ReplicationHandler Commits will be reserved for 10000ms.
   [junit4]   2> 228299 INFO  (qtp720046542-2476) [n:127.0.0.1:40885_solr c:collection2meta s:shard1 r:core_node2 x:collection2meta_shard1_replica_n1 ] o.a.s.u.UpdateLog Could not find max version in index or recent updates, using new clock 1636195762156077056
   [junit4]   2> 228302 INFO  (searcherExecutor-839-thread-1-processing-n:127.0.0.1:40885_solr x:collection2meta_shard1_replica_n1 c:collection2meta s:shard1 r:core_node2) [n:127.0.0.1:40885_solr c:collection2meta s:shard1 r:core_node2 x:collection2meta_shard1_replica_n1 ] o.a.s.c.SolrCore [collection2meta_shard1_replica_n1] Registered new searcher Searcher@5c5a902d[collection2meta_shard1_replica_n1] main{ExitableDirectoryReader(UninvertingDirectoryReader())}
   [junit4]   2> 228303 INFO  (qtp720046542-2476) [n:127.0.0.1:40885_solr c:collection2meta s:shard1 r:core_node2 x:collection2meta_shard1_replica_n1 ] o.a.s.c.ZkShardTerms Successful update of terms at /collections/collection2meta/terms/shard1 to Terms{values={core_node2=0}, version=0}
   [junit4]   2> 228304 INFO  (qtp720046542-2476) [n:127.0.0.1:40885_solr c:collection2meta s:shard1 r:core_node2 x:collection2meta_shard1_replica_n1 ] o.a.s.c.ShardLeaderElectionContextBase make sure parent is created /collections/collection2meta/leaders/shard1
   [junit4]   2> 228306 INFO  (qtp720046542-2476) [n:127.0.0.1:40885_solr c:collection2meta s:shard1 r:core_node2 x:collection2meta_shard1_replica_n1 ] o.a.s.c.ShardLeaderElectionContext Enough replicas found to continue.
   [junit4]   2> 228306 INFO  (qtp720046542-2476) [n:127.0.0.1:40885_solr c:collection2meta s:shard1 r:core_node2 x:collection2meta_shard1_replica_n1 ] o.a.s.c.ShardLeaderElectionContext I may be the new leader - try and sync
   [junit4]   2> 228306 INFO  (qtp720046542-2476) [n:127.0.0.1:40885_solr c:collection2meta s:shard1 r:core_node2 x:collection2meta_shard1_replica_n1 ] o.a.s.c.SyncStrategy Sync replicas to https://127.0.0.1:40885/solr/collection2meta_shard1_replica_n1/
   [junit4]   2> 228306 INFO  (qtp720046542-2476) [n:127.0.0.1:40885_solr c:collection2meta s:shard1 r:core_node2 x:collection2meta_shard1_replica_n1 ] o.a.s.c.SyncStrategy Sync Success - now sync replicas to me
   [junit4]   2> 228306 INFO  (qtp720046542-2476) [n:127.0.0.1:40885_solr c:collection2meta s:shard1 r:core_node2 x:collection2meta_shard1_replica_n1 ] o.a.s.c.SyncStrategy https://127.0.0.1:40885/solr/collection2meta_shard1_replica_n1/ has no replicas
   [junit4]   2> 228306 INFO  (qtp720046542-2476) [n:127.0.0.1:40885_solr c:collection2meta s:shard1 r:core_node2 x:collection2meta_shard1_replica_n1 ] o.a.s.c.ShardLeaderElectionContextBase Creating leader registration node /collections/collection2meta/leaders/shard1/leader after winning as /collections/collection2meta/leader_elect/shard1/election/72417596788834310-core_node2-n_0000000000
   [junit4]   2> 228307 INFO  (qtp720046542-2476) [n:127.0.0.1:40885_solr c:collection2meta s:shard1 r:core_node2 x:collection2meta_shard1_replica_n1 ] o.a.s.c.ShardLeaderElectionContext I am the new leader: https://127.0.0.1:40885/solr/collection2meta_shard1_replica_n1/ shard1
   [junit4]   2> 228408 INFO  (zkCallback-718-thread-3) [     ] o.a.s.c.c.ZkStateReader A cluster state change: [WatchedEvent state:SyncConnected type:NodeDataChanged path:/collections/collection2meta/state.json] for collection [collection2meta] has occurred - updating... (live nodes size: [2])
   [junit4]   2> 228408 INFO  (zkCallback-718-thread-1) [     ] o.a.s.c.c.ZkStateReader A cluster state change: [WatchedEvent state:SyncConnected type:NodeDataChanged path:/collections/collection2meta/state.json] for collection [collection2meta] has occurred - updating... (live nodes size: [2])
   [junit4]   2> 228409 INFO  (qtp720046542-2476) [n:127.0.0.1:40885_solr c:collection2meta s:shard1 r:core_node2 x:collection2meta_shard1_replica_n1 ] o.a.s.c.ZkController I am the leader, no recovery necessary
   [junit4]   2> 228464 INFO  (qtp720046542-2476) [n:127.0.0.1:40885_solr c:collection2meta s:shard1 r:core_node2 x:collection2meta_shard1_replica_n1 ] o.a.s.s.HttpSolrCall [admin] webapp=null path=/admin/cores params={qt=/admin/cores&coreNodeName=core_node2&collection.configName=conf&newCollection=true&name=collection2meta_shard1_replica_n1&action=CREATE&numShards=1&collection=collection2meta&shard=shard1&wt=javabin&version=2&replicaType=NRT} status=0 QTime=1212
   [junit4]   2> 228478 INFO  (qtp736560341-2481) [n:127.0.0.1:33583_solr     ] o.a.s.h.a.CollectionsHandler Wait for new collection to be active for at most 45 seconds. Check all shard replicas
   [junit4]   2> 228510 INFO  (zkCallback-728-thread-3) [     ] o.a.s.c.c.ZkStateReader A cluster state change: [WatchedEvent state:SyncConnected type:NodeDataChanged path:/collections/collection2meta/state.json] for collection [collection2meta] has occurred - updating... (live nodes size: [2])
   [junit4]   2> 228510 INFO  (zkCallback-718-thread-1) [     ] o.a.s.c.c.ZkStateReader A cluster state change: [WatchedEvent state:SyncConnected type:NodeDataChanged path:/collections/collection2meta/state.json] for collection [collection2meta] has occurred - updating... (live nodes size: [2])
   [junit4]   2> 228510 INFO  (zkCallback-718-thread-2) [     ] o.a.s.c.c.ZkStateReader A cluster state change: [WatchedEvent state:SyncConnected type:NodeDataChanged path:/collections/collection2meta/state.json] for collection [collection2meta] has occurred - updating... (live nodes size: [2])
   [junit4]   2> 228510 INFO  (zkCallback-718-thread-3) [     ] o.a.s.c.c.ZkStateReader A cluster state change: [WatchedEvent state:SyncConnected type:NodeDataChanged path:/collections/collection2meta/state.json] for collection [collection2meta] has occurred - updating... (live nodes size: [2])
   [junit4]   2> 228511 INFO  (qtp736560341-2481) [n:127.0.0.1:33583_solr     ] o.a.s.s.HttpSolrCall [admin] webapp=null path=/admin/collections params={collection.configName=conf&name=collection2meta&nrtReplicas=1&action=CREATE&numShards=1&wt=javabin&version=2} status=0 QTime=1668
   [junit4]   2> 228518 INFO  (TEST-AliasIntegrationTest.testModifyPropertiesCAR-seed#[ADEA51C03CB0FEAC]) [     ] o.a.s.c.SolrCloudTestCase active replica count: 2 expected replica count: 2
   [junit4]   2> 228518 INFO  (watches-745-thread-1) [     ] o.a.s.c.SolrCloudTestCase active replica count: 2 expected replica count: 2
   [junit4]   2> 228518 INFO  (TEST-AliasIntegrationTest.testModifyPropertiesCAR-seed#[ADEA51C03CB0FEAC]) [     ] o.a.s.c.SolrCloudTestCase active replica count: 1 expected replica count: 1
   [junit4]   2> 228518 INFO  (watches-745-thread-1) [     ] o.a.s.c.SolrCloudTestCase active replica count: 1 expected replica count: 1
   [junit4]   2> 228523 INFO  (qtp736560341-2479) [n:127.0.0.1:33583_solr     ] o.a.s.h.a.CollectionsHandler Invoked Collection Action :aliasprop with params name=testModifyPropertiesCAR&action=ALIASPROP&property.foo=baz&property.bar=bam&wt=javabin&version=2 and sendToOCPQueue=true
   [junit4]   2> 228534 INFO  (OverseerCollectionConfigSetProcessor-72417596788834312-127.0.0.1:33583_solr-n_0000000000) [n:127.0.0.1:33583_solr     ] o.a.s.c.OverseerTaskQueue Response ZK path: /overseer/collection-queue-work/qnr-0000000002 doesn't exist.  Requestor may have disconnected from ZooKeeper
   [junit4]   2> 228536 INFO  (qtp736560341-2479) [n:127.0.0.1:33583_solr     ] o.a.s.s.HttpSolrCall [admin] webapp=null path=/admin/collections params={name=testModifyPropertiesCAR&action=ALIASPROP&property.foo=baz&property.bar=bam&wt=javabin&version=2} status=0 QTime=13
   [junit4]   2> 228537 INFO  (qtp736560341-2477) [n:127.0.0.1:33583_solr     ] o.a.s.h.a.CollectionsHandler Invoked Collection Action :aliasprop with params name=testModifyPropertiesCAR&action=ALIASPROP&property.foo=&wt=javabin&version=2 and sendToOCPQueue=true
   [junit4]   2> 228539 INFO  (OverseerCollectionConfigSetProcessor-72417596788834312-127.0.0.1:33583_solr-n_0000000000) [n:127.0.0.1:33583_solr     ] o.a.s.c.OverseerTaskQueue Response ZK path: /overseer/collection-queue-work/qnr-0000000004 doesn't exist.  Requestor may have disconnected from ZooKeeper
   [junit4]   2> 228541 INFO  (qtp736560341-2477) [n:127.0.0.1:33583_solr     ] o.a.s.s.HttpSolrCall [admin] webapp=null path=/admin/collections params={name=testModifyPropertiesCAR&action=ALIASPROP&property.foo=&wt=javabin&version=2} status=0 QTime=3
   [junit4]   2> 228542 INFO  (qtp736560341-2481) [n:127.0.0.1:33583_solr     ] o.a.s.h.a.CollectionsHandler Invoked Collection Action :aliasprop with params name=testModifyPropertiesCAR&action=ALIASPROP&wt=javabin&version=2 and sendToOCPQueue=true
   [junit4]   2> 228553 INFO  (OverseerCollectionConfigSetProcessor-72417596788834312-127.0.0.1:33583_solr-n_0000000000) [n:127.0.0.1:33583_solr     ] o.a.s.c.OverseerTaskQueue Response ZK path: /overseer/collection-queue-work/qnr-0000000006 doesn't exist.  Requestor may have disconnected from ZooKeeper
   [junit4]   2> 228555 INFO  (qtp736560341-2481) [n:127.0.0.1:33583_solr     ] o.a.s.s.HttpSolrCall [admin] webapp=null path=/admin/collections params={name=testModifyPropertiesCAR&action=ALIASPROP&wt=javabin&version=2} status=0 QTime=13
   [junit4]   2> 228557 INFO  (qtp736560341-2479) [n:127.0.0.1:33583_solr     ] o.a.s.h.a.CollectionsHandler Invoked Collection Action :aliasprop with params name=testModifyPropertiesCAR&action=ALIASPROP&property.foo=+&wt=javabin&version=2 and sendToOCPQueue=true
   [junit4]   2> 228559 INFO  (OverseerCollectionConfigSetProcessor-72417596788834312-127.0.0.1:33583_solr-n_0000000000) [n:127.0.0.1:33583_solr     ] o.a.s.c.OverseerTaskQueue Response ZK path: /overseer/collection-queue-work/qnr-0000000008 doesn't exist.  Requestor may have disconnected from ZooKeeper
   [junit4]   2> 228562 INFO  (qtp736560341-2479) [n:127.0.0.1:33583_solr     ] o.a.s.s.HttpSolrCall [admin] webapp=null path=/admin/collections params={name=testModifyPropertiesCAR&action=ALIASPROP&property.foo=+&wt=javabin&version=2} status=0 QTime=4
   [junit4]   2> 228562 INFO  (TEST-AliasIntegrationTest.testModifyPropertiesCAR-seed#[ADEA51C03CB0FEAC]) [     ] o.a.s.SolrTestCaseJ4 ###Ending testModifyPropertiesCAR
   [junit4]   2> 228564 INFO  (TEST-AliasIntegrationTest.testModifyPropertiesCAR-seed#[ADEA51C03CB0FEAC]) [     ] o.a.s.c.c.ZkStateReader Updated live nodes from ZooKeeper... (0) -> (2)
   [junit4]   2> 228567 INFO  (qtp736560341-2477) [n:127.0.0.1:33583_solr     ] o.a.s.h.a.CollectionsHandler Invoked Collection Action :delete with params name=collection2meta&action=DELETE&wt=javabin&version=2 and sendToOCPQueue=true
   [junit4]   2> 228568 INFO  (OverseerCollectionConfigSetProcessor-72417596788834312-127.0.0.1:33583_solr-n_0000000000) [n:127.0.0.1:33583_solr     ] o.a.s.c.OverseerTaskQueue Response ZK path: /overseer/collection-queue-work/qnr-0000000010 doesn't exist.  Requestor may have disconnected from ZooKeeper
   [junit4]   2> 228569 INFO  (OverseerThreadFactory-821-thread-5-processing-n:127.0.0.1:33583_solr) [n:127.0.0.1:33583_solr     ] o.a.s.c.a.c.OverseerCollectionMessageHandler Executing Collection Cmd=action=UNLOAD&deleteInstanceDir=true&deleteDataDir=true&deleteMetricsHistory=true, asyncId=null
   [junit4]   2> 228571 INFO  (qtp720046542-2476) [n:127.0.0.1:40885_solr    x:collection2meta_shard1_replica_n1 ] o.a.s.m.SolrMetricManager Closing metric reporters for registry=solr.core.collection2meta.shard1.replica_n1, tag=null
   [junit4]   2> 228571 INFO  (qtp720046542-2476) [n:127.0.0.1:40885_solr    x:collection2meta_shard1_replica_n1 ] o.a.s.m.r.SolrJmxReporter Closing reporter [org.apache.solr.metrics.reporters.SolrJmxReporter@4663b0c9: rootName = solr_40885, domain = solr.core.collection2meta.shard1.replica_n1, service url = null, agent id = null] for registry solr.core.collection2meta.shard1.replica_n1 / com.codahale.metrics.MetricRegistry@35343ce5
   [junit4]   2> 228590 INFO  (qtp720046542-2476) [n:127.0.0.1:40885_solr    x:collection2meta_shard1_replica_n1 ] o.a.s.c.SolrCore [collection2meta_shard1_replica_n1]  CLOSING SolrCore org.apache.solr.core.SolrCore@62abbb18
   [junit4]   2> 228590 INFO  (qtp720046542-2476) [n:127.0.0.1:40885_solr    x:collection2meta_shard1_replica_n1 ] o.a.s.m.SolrMetricManager Closing metric reporters for registry=solr.core.collection2meta.shard1.replica_n1, tag=62abbb18
   [junit4]   2> 228590 INFO  (qtp720046542-2476) [n:127.0.0.1:40885_solr    x:collection2meta_shard1_replica_n1 ] o.a.s.m.SolrMetricManager Closing metric reporters for registry=solr.collection.collection2meta.shard1.leader, tag=62abbb18
   [junit4]   2> 228598 INFO  (qtp720046542-2476) [n:127.0.0.1:40885_solr    x:collection2meta_shard1_replica_n1 ] o.a.s.c.ZkShardTerms Successful update of terms at /collections/collection2meta/terms/shard1 to Terms{values={}, version=1}
   [junit4]   2> 228599 INFO  (qtp720046542-2476) [n:127.0.0.1:40885_solr    x:collection2meta_shard1_replica_n1 ] o.a.s.s.HttpSolrCall [admin] webapp=null path=/admin/cores params={deleteInstanceDir=true&deleteMetricsHistory=true&core=collection2meta_shard1_replica_n1&qt=/admin/cores&deleteDataDir=true&action=UNLOAD&wt=javabin&version=2} status=0 QTime=28
   [junit4]   2> 228710 INFO  (zkCallback-728-thread-3) [     ] o.a.s.c.c.ZkStateReader A cluster state change: [WatchedEvent state:SyncConnected type:NodeDeleted path:/collections/collection2meta/state.json] for collection [collection2meta] has occurred - updating... (live nodes size: [2])
   [junit4]   2> 228710 INFO  (zkCallback-728-thread-2) [     ] o.a.s.c.c.ZkStateReader A cluster state change: [WatchedEvent state:SyncConnected type:NodeDeleted path:/collections/collection2meta/state.json] for collection [collection2meta] has occurred - updating... (live nodes size: [2])
   [junit4]   2> 228710 INFO  (zkCallback-718-thread-2) [     ] o.a.s.c.c.ZkStateReader A cluster state change: [WatchedEvent state:SyncConnected type:NodeDeleted path:/collections/collection2meta/state.json] for collection [collection2meta] has occurred - updating... (live nodes size: [2])
   [junit4]   2> 228710 INFO  (zkCallback-718-thread-3) [     ] o.a.s.c.c.ZkStateReader A cluster state change: [WatchedEvent state:SyncConnected type:NodeDeleted path:/collections/collection2meta/state.json] for collection [collection2meta] has occurred - updating... (live nodes size: [2])
   [junit4]   2> 228717 INFO  (qtp736560341-2477) [n:127.0.0.1:33583_solr     ] o.a.s.s.HttpSolrCall [admin] webapp=null path=/admin/collections params={name=collection2meta&action=DELETE&wt=javabin&version=2} status=0 QTime=150
   [junit4]   2> 228718 INFO  (qtp736560341-2481) [n:127.0.0.1:33583_solr     ] o.a.s.h.a.CollectionsHandler Invoked Collection Action :delete with params name=collection1meta&action=DELETE&wt=javabin&version=2 and sendToOCPQueue=true
   [junit4]   2> 228722 INFO  (OverseerThreadFactory-821-thread-5-processing-n:127.0.0.1:33583_solr) [n:127.0.0.1:33583_solr     ] o.a.s.c.a.c.OverseerCollectionMessageHandler Executing Collection Cmd=action=UNLOAD&deleteInstanceDir=true&deleteDataDir=true&deleteMetricsHistory=true, asyncId=null
   [junit4]   2> 228724 INFO  (qtp736560341-2479) [n:127.0.0.1:33583_solr    x:collection1meta_shard1_replica_n1 ] o.a.s.m.SolrMetricManager Closing metric reporters for registry=solr.core.collection1meta.shard1.replica_n1, tag=null
   [junit4]   2> 228724 INFO  (qtp720046542-2480) [n:127.0.0.1:40885_solr    x:collection1meta_shard2_replica_n2 ] o.a.s.m.SolrMetricManager Closing metric reporters for registry=solr.core.collection1meta.shard2.replica_n2, tag=null
   [junit4]   2> 228724 INFO  (qtp736560341-2479) [n:127.0.0.1:33583_solr    x:collection1meta_shard1_replica_n1 ] o.a.s.m.r.SolrJmxReporter Closing reporter [org.apache.solr.metrics.reporters.SolrJmxReporter@683d1e52: rootName = solr_33583, domain = solr.core.collection1meta.shard1.replica_n1, service url = null, agent id = null] for registry solr.core.collection1meta.shard1.replica_n1 / com.codahale.metrics.MetricRegistry@26880f1f
   [junit4]   2> 228724 INFO  (OverseerCollectionConfigSetProcessor-72417596788834312-127.0.0.1:33583_solr-n_0000000000) [n:127.0.0.1:33583_solr     ] o.a.s.c.OverseerTaskQueue Response ZK path: /overseer/collection-queue-work/qnr-0000000012 doesn't exist.  Requestor may have disconnected from ZooKeeper
   [junit4]   2> 228733 INFO  (qtp720046542-2480) [n:127.0.0.1:40885_solr    x:collection1meta_shard2_replica_n2 ] o.a.s.m.r.SolrJmxReporter Closing reporter [org.apache.solr.metrics.reporters.SolrJmxReporter@4a18189: rootName = solr_40885, domain = solr.core.collection1meta.shard2.replica_n2, service url = null, agent id = null] for registry solr.core.collection1meta.shard2.replica_n2 / com.codahale.metrics.MetricRegistry@47154cbc
   [junit4]   2> 228752 INFO  (qtp720046542-2480) [n:127.0.0.1:40885_solr    x:collection1meta_shard2_replica_n2 ] o.a.s.c.SolrCore [collection1meta_shard2_replica_n2]  CLOSING SolrCore org.apache.solr.core.SolrCore@6b13ea2b
   [junit4]   2> 228754 INFO  (qtp736560341-2479) [n:127.0.0.1:33583_solr    x:collection1meta_shard1_replica_n1 ] o.a.s.c.SolrCore [collection1meta_shard1_replica_n1]  CLOSING SolrCore org.apache.solr.core.SolrCore@6ec326d9
   [junit4]   2> 228754 INFO  (qtp736560341-2479) [n:127.0.0.1:33583_solr    x:collection1meta_shard1_replica_n1 ] o.a.s.m.SolrMetricManager Closing metric reporters for registry=solr.core.collection1meta.shard1.replica_n1, tag=6ec326d9
   [junit4]   2> 228754 INFO  (qtp720046542-2480) [n:127.0.0.1:40885_solr    x:collection1meta_shard2_replica_n2 ] o.a.s.m.SolrMetricManager Closing metric reporters for registry=solr.core.collection1meta.shard2.replica_n2, tag=6b13ea2b
   [junit4]   2> 228754 INFO  (qtp720046542-2480) [n:127.0.0.1:40885_solr    x:collection1meta_shard2_replica_n2 ] o.a.s.m.SolrMetricManager Closing metric reporters for registry=solr.collection.collection1meta.shard2.leader, tag=6b13ea2b
   [junit4]   2> 228758 INFO  (qtp736560341-2479) [n:127.0.0.1:33583_solr    x:collection1meta_shard1_replica_n1 ] o.a.s.m.SolrMetricManager Closing metric reporters for registry=solr.collection.collection1meta.shard1.leader, tag=6ec326d9
   [junit4]   2> 228761 INFO  (qtp720046542-2480) [n:127.0.0.1:40885_solr    x:collection1meta_shard2_replica_n2 ] o.a.s.c.ZkShardTerms Successful update of terms at /collections/collection1meta/terms/shard2 to Terms{values={}, version=1}
   [junit4]   2> 228762 INFO  (qtp720046542-2480) [n:127.0.0.1:40885_solr    x:collection1meta_shard2_replica_n2 ] o.a.s.s.HttpSolrCall [admin] webapp=null path=/admin/cores params={deleteInstanceDir=true&deleteMetricsHistory=true&core=collection1meta_shard2_replica_n2&qt=/admin/cores&deleteDataDir=true&action=UNLOAD&wt=javabin&version=2} status=0 QTime=39
   [junit4]   2> 228766 INFO  (qtp736560341-2479) [n:127.0.0.1:33583_solr    x:collection1meta_shard1_replica_n1 ] o.a.s.c.ZkShardTerms Successful update of terms at /collections/collection1meta/terms/shard1 to Terms{values={}, version=1}
   [junit4]   2> 228768 INFO  (qtp736560341-2479) [n:127.0.0.1:33583_solr    x:collection1meta_shard1_replica_n1 ] o.a.s.s.HttpSolrCall [admin] webapp=null path=/admin/cores params={deleteInstanceDir=true&deleteMetricsHistory=true&core=collection1meta_shard1_replica_n1&qt=/admin/cores&deleteDataDir=true&action=UNLOAD&wt=javabin&version=2} status=0 QTime=44
   [junit4]   2> 228870 INFO  (zkCallback-728-thread-3) [     ] o.a.s.c.c.ZkStateReader A cluster state change: [WatchedEvent state:SyncConnected type:NodeDeleted path:/collections/collection1meta/state.json] for collection [collection1meta] has occurred - updating... (live nodes size: [2])
   [junit4]   2> 228870 INFO  (zkCallback-728-thread-1) [     ] o.a.s.c.c.ZkStateReader A cluster state change: [WatchedEvent state:SyncConnected type:NodeDeleted path:/collections/collection1meta/state.json] for collection [collection1meta] has occurred - updating... (live nodes size: [2])
   [junit4]   2> 228870 INFO  (zkCallback-728-thread-2) [     ] o.a.s.c.c.ZkStateReader A cluster state change: [WatchedEvent state:SyncConnected type:NodeDeleted path:/collections/collection1meta/state.json] for collection [collection1meta] has occurred - updating... (live nodes size: [2])
   [junit4]   2> 228873 INFO  (zkCallback-718-thread-3) [     ] o.a.s.c.c.ZkStateReader A cluster state change: [WatchedEvent state:SyncConnected type:NodeDeleted path:/collections/collection1meta/state.json] for collection [collection1meta] has occurred - updating... (live nodes size: [2])
   [junit4]   2> 228873 INFO  (zkCallback-718-thread-1) [     ] o.a.s.c.c.ZkStateReader A cluster state change: [WatchedEvent state:SyncConnected type:NodeDeleted path:/collections/collection1meta/state.json] for collection [collection1meta] has occurred - updating... (live nodes size: [2])
   [junit4]   2> 228873 INFO  (zkCallback-718-thread-2) [     ] o.a.s.c.c.ZkStateReader A cluster state change: [WatchedEvent state:SyncConnected type:NodeDeleted path:/collections/collection1meta/state.json] for collection [collection1meta] has occurred - updating... (live nodes size: [2])
   [junit4]   2> 228882 INFO  (qtp736560341-2481) [n:127.0.0.1:33583_solr     ] o.a.s.s.HttpSolrCall [admin] webapp=null path=/admin/collections params={name=collection1meta&action=DELETE&wt=javabin&version=2} status=0 QTime=163
   [junit4]   2> 228915 INFO  (TEST-AliasIntegrationTest.testProperties-seed#[ADEA51C03CB0FEAC]) [     ] o.a.s.SolrTestCaseJ4 ###Starting testProperties
   [junit4]   2> 228924 INFO  (qtp736560341-2477) [n:127.0.0.1:33583_solr     ] o.a.s.h.a.CollectionsHandler Invoked Collection Action :create with params collection.configName=conf&name=collection1meta&nrtReplicas=1&action=CREATE&numShards=2&wt=javabin&version=2 and sendToOCPQueue=true
   [junit4]   2> 228927 INFO  (OverseerThreadFactory-821-thread-5-processing-n:127.0.0.1:33583_solr) [n:127.0.0.1:33583_solr     ] o.a.s.c.a.c.CreateCollectionCmd Create collection collection1meta
   [junit4]   2> 228929 INFO  (OverseerCollectionConfigSetProcessor-72417596788834312-127.0.0.1:33583_solr-n_0000000000) [n:127.0.0.1:33583_solr     ] o.a.s.c.OverseerTaskQueue Response ZK path: /overseer/collection-queue-work/qnr-0000000014 doesn't exist.  Requestor may have disconnected from ZooKeeper
   [junit4]   2> 229133 INFO  (OverseerStateUpdate-72417596788834312-127.0.0.1:33583_solr-n_0000000000) [n:127.0.0.1:33583_solr     ] o.a.s.c.o.SliceMutator createReplica() {
   [junit4]   2>   "operation":"ADDREPLICA",
   [junit4]   2>   "collection":"collection1meta",
   [junit4]   2>   "shard":"shard1",
   [junit4]   2>   "core":"collection1meta_shard1_replica_n1",
   [junit4]   2>   "state":"down",
   [junit4]   2>   "base_url":"https://127.0.0.1:40885/solr",
   [junit4]   2>   "type":"NRT",
   [junit4]   2>   "waitForFinalState":"false"} 
   [junit4]   2> 229135 INFO  (OverseerStateUpdate-72417596788834312-127.0.0.1:33583_solr-n_0000000000) [n:127.0.0.1:33583_solr     ] o.a.s.c.o.SliceMutator createReplica() {
   [junit4]   2>   "operation":"ADDREPLICA",
   [junit4]   2>   "collection":"collection1meta",
   [junit4]   2>   "shard":"shard2",
   [junit4]   2>   "core":"collection1meta_shard2_replica_n2",
   [junit4]   2>   "state":"down",
   [junit4]   2>   "base_url":"https://127.0.0.1:33583/solr",
   [junit4]   2>   "type":"NRT",
   [junit4]   2>   "waitForFinalState":"false"} 
   [junit4]   2> 229339 INFO  (qtp736560341-2479) [n:127.0.0.1:33583_solr    x:collection1meta_shard2_replica_n2 ] o.a.s.h.a.CoreAdminOperation core create command qt=/admin/cores&coreNodeName=core_node4&collection.configName=conf&newCollection=true&name=collection1meta_shard2_replica_n2&action=CREATE&numShards=2&collection=collection1meta&shard=shard2&wt=javabin&version=2&replicaType=NRT
   [junit4]   2> 229339 INFO  (qtp720046542-2478) [n:127.0.0.1:40885_solr    x:collection1meta_shard1_replica_n1 ] o.a.s.h.a.CoreAdminOperation core create command qt=/admin/cores&coreNodeName=core_node3&collection.configName=conf&newCollection=true&name=collection1meta_shard1_replica_n1&action=CREATE&numShards=2&collection=collection1meta&shard=shard1&wt=javabin&version=2&replicaType=NRT
   [junit4]   2> 230349 INFO  (qtp736560341-2479) [n:127.0.0.1:33583_solr c:collection1meta s:shard2 r:core_node4 x:collection1meta_shard2_replica_n2 ] o.a.s.c.SolrConfig Using Lucene MatchVersion: 8.2.0
   [junit4]   2> 230349 INFO  (qtp720046542-2478) [n:127.0.0.1:40885_solr c:collection1meta s:shard1 r:core_node3 x:collection1meta_shard1_replica_n1 ] o.a.s.c.SolrConfig Using Lucene MatchVersion: 8.2.0
   [junit4]   2> 230373 INFO  (qtp720046542-2478) [n:127.0.0.1:40885_solr c:collection1meta s:shard1 r:core_node3 x:collection1meta_shard1_replica_n1 ] o.a.s.s.IndexSchema [collection1meta_shard1_replica_n1] Schema name=minimal
   [junit4]   2> 230373 INFO  (qtp736560341-2479) [n:127.0.0.1:33583_solr c:collection1meta s:shard2 r:core_node4 x:collection1meta_shard2_replica_n2 ] o.a.s.s.IndexSchema [collection1meta_shard2_replica_n2] Schema name=minimal
   [junit4]   2> 230374 INFO  (qtp720046542-2478) [n:127.0.0.1:40885_solr c:collection1meta s:shard1 r:core_node3 x:collection1meta_shard1_replica_n1 ] o.a.s.s.IndexSchema Loaded schema minimal/1.1 with uniqueid field id
   [junit4]   2> 230375 INFO  (qtp720046542-2478) [n:127.0.0.1:40885_solr c:collection1meta s:shard1 r:core_node3 x:collection1meta_shard1_replica_n1 ] o.a.s.c.CoreContainer Creating SolrCore 'collection1meta_shard1_replica_n1' using configuration from collection collection1meta, trusted=true
   [junit4]   2> 230375 INFO  (qtp736560341-2479) [n:127.0.0.1:33583_solr c:collection1meta s:shard2 r:core_node4 x:collection1meta_shard2_replica_n2 ] o.a.s.s.IndexSchema Loaded schema minimal/1.1 with uniqueid field id
   [junit4]   2> 230375 INFO  (qtp736560341-2479) [n:127.0.0.1:33583_solr c:collection1meta s:shard2 r:core_node4 x:collection1meta_shard2_replica_n2 ] o.a.s.c.CoreContainer Creating SolrCore 'collection1meta_shard2_replica_n2' using configuration from collection collection1meta, trusted=true
   [junit4]   2> 230375 INFO  (qtp736560341-2479) [n:127.0.0.1:33583_solr c:collection1meta s:shard2 r:core_node4 x:collection1meta_shard2_replica_n2 ] o.a.s.m.r.SolrJmxReporter JMX monitoring for 'solr_33583.solr.core.collection1meta.shard2.replica_n2' (registry 'solr.core.collection1meta.shard2.replica_n2') enabled at server: com.sun.jmx.mbeanserver.JmxMBeanServer@31362085
   [junit4]   2> 230375 INFO  (qtp720046542-2478) [n:127.0.0.1:40885_solr c:collection1meta s:shard1 r:core_node3 x:collection1meta_shard1_replica_n1 ] o.a.s.m.r.SolrJmxReporter JMX monitoring for 'solr_40885.solr.core.collection1meta.shard1.replica_n1' (registry 'solr.core.collection1meta.shard1.replica_n1') enabled at server: com.sun.jmx.mbeanserver.JmxMBeanServer@31362085
   [junit4]   2> 230375 INFO  (qtp736560341-2479) [n:127.0.0.1:33583_solr c:collection1meta s:shard2 r:core_node4 x:collection1meta_shard2_replica_n2 ] o.a.s.c.SolrCore [[collection1meta_shard2_replica_n2] ] Opening new SolrCore at [/home/jenkins/workspace/Lucene-Solr-8.x-Linux/solr/build/solr-core/test/J1/temp/solr.cloud.AliasIntegrationTest_ADEA51C03CB0FEAC-001/tempDir-001/node2/collection1meta_shard2_replica_n2], dataDir=[/home/jenkins/workspace/Lucene-Solr-8.x-Linux/solr/build/solr-core/test/J1/temp/solr.cloud.AliasIntegrationTest_ADEA51C03CB0FEAC-001/tempDir-001/node2/./collection1meta_shard2_replica_n2/data/]
   [junit4]   2> 230375 INFO  (qtp720046542-2478) [n:127.0.0.1:40885_solr c:collection1meta s:shard1 r:core_node3 x:collection1meta_shard1_replica_n1 ] o.a.s.c.SolrCore [[collection1meta_shard1_replica_n1] ] Opening new SolrCore at [/home/jenkins/workspace/Lucene-Solr-8.x-Linux/solr/build/solr-core/test/J1/temp/solr.cloud.AliasIntegrationTest_ADEA51C03CB0FEAC-001/tempDir-001/node1/collection1meta_shard1_replica_n1], dataDir=[/home/jenkins/workspace/Lucene-Solr-8.x-Linux/solr/build/solr-core/test/J1/temp/solr.cloud.AliasIntegrationTest_ADEA51C03CB0FEAC-001/tempDir-001/node1/./collection1meta_shard1_replica_n1/data/]
   [junit4]   2> 230404 INFO  (qtp736560341-2479) [n:127.0.0.1:33583_solr c:collection1meta s:shard2 r:core_node4 x:collection1meta_shard2_replica_n2 ] o.a.s.u.UpdateHandler Using UpdateLog implementation: org.apache.solr.update.UpdateLog
   [junit4]   2> 230404 INFO  (qtp736560341-2479) [n:127.0.0.1:33583_solr c:collection1meta s:shard2 r:core_node4 x:collection1meta_shard2_replica_n2 ] o.a.s.u.UpdateLog Initializing UpdateLog: dataDir=null defaultSyncLevel=FLUSH numRecordsToKeep=100 maxNumLogsToKeep=10 numVersionBuckets=65536
   [junit4]   2> 230405 INFO  (qtp720046542-2478) [n:127.0.0.1:40885_solr c:collection1meta s:shard1 r:core_node3 x:collection1meta_shard1_replica_n1 ] o.a.s.u.UpdateHandler Using UpdateLog implementation: org.apache.solr.update.UpdateLog
   [junit4]   2> 230405 INFO  (qtp720046542-2478) [n:127.0.0.1:40885_solr c:collection1meta s:shard1 r:core_node3 x:collection1meta_shard1_replica_n1 ] o.a.s.u.UpdateLog Initializing UpdateLog: dataDir=null defaultSyncLevel=FLUSH numRecordsToKeep=100 maxNumLogsToKeep=10 numVersionBuckets=65536
   [junit4]   2> 230405 INFO  (qtp736560341-2479) [n:127.0.0.1:33583_solr c:collection1meta s:shard2 r:core_node4 x:collection1meta_shard2_replica_n2 ] o.a.s.u.CommitTracker Hard AutoCommit: disabled
   [junit4]   2> 230406 INFO  (qtp736560341-2479) [n:127.0.0.1:33583_solr c:collection1meta s:shard2 r:core_node4 x:collection1meta_shard2_replica_n2 ] o.a.s.u.CommitTracker Soft AutoCommit: disabled
   [junit4]   2> 230406 INFO  (qtp720046542-2478) [n:127.0.0.1:40885_solr c:collection1meta s:shard1 r:core_node3 x:collection1meta_shard1_replica_n1 ] o.a.s.u.CommitTracker Hard AutoCommit: disabled
   [junit4]   2> 230406 INFO  (qtp720046542-2478) [n:127.0.0.1:40885_solr c:collection1meta s:shard1 r:core_node3 x:collection1meta_shard1_replica_n1 ] o.a.s.u.CommitTracker Soft AutoCommit: disabled
   [junit4]   2> 230406 INFO  (qtp736560341-2479) [n:127.0.0.1:33583_solr c:collection1meta s:shard2 r:core_node4 x:collection1meta_shard2_replica_n2 ] o.a.s.s.SolrIndexSearcher Opening [Searcher@b81839e[collection1meta_shard2_replica_n2] main]
   [junit4]   2> 230407 INFO  (qtp720046542-2478) [n:127.0.0.1:40885_solr c:collection1meta s:shard1 r:core_node3 x:collection1meta_shard1_replica_n1 ] o.a.s.s.SolrIndexSearcher Opening [Searcher@75e148a6[collection1meta_shard1_replica_n1] main]
   [junit4]   2> 230407 INFO  (qtp736560341-2479) [n:127.0.0.1:33583_solr c:collection1meta s:shard2 r:core_node4 x:collection1meta_shard2_replica_n2 ] o.a.s.r.ManagedResourceStorage Configured ZooKeeperStorageIO with znodeBase: /configs/conf
   [junit4]   2> 230407 INFO  (qtp736560341-2479) [n:127.0.0.1:33583_solr c:collection1meta s:shard2 r:core_node4 x:collection1meta_shard2_replica_n2 ] o.a.s.r.ManagedResourceStorage Loaded null at path _rest_managed.json using ZooKeeperStorageIO:path=/configs/conf
   [junit4]   2> 230407 INFO  (qtp720046542-2478) [n:127.0.0.1:40885_solr c:collection1meta s:shard1 r:core_node3 x:collection1meta_shard1_replica_n1 ] o.a.s.r.ManagedResourceStorage Configured ZooKeeperStorageIO with znodeBase: /configs/conf
   [junit4]   2> 230408 INFO  (qtp720046542-2478) [n:127.0.0.1:40885_solr c:collection1meta s:shard1 r:core_node3 x:collection1meta_shard1_replica_n1 ] o.a.s.r.ManagedResourceStorage Loaded null at path _rest_managed.json using ZooKeeperStorageIO:path=/configs/conf
   [junit4]   2> 230408 INFO  (qtp736560341-2479) [n:127.0.0.1:33583_solr c:collection1meta s:shard2 r:core_node4 x:collection1meta_shard2_replica_n2 ] o.a.s.h.ReplicationHandler Commits will be reserved for 10000ms.
   [junit4]   2> 230408 INFO  (qtp736560341-2479) [n:127.0.0.1:33583_solr c:collection1meta s:shard2 r:core_node4 x:collection1meta_shard2_replica_n2 ] o.a.s.u.UpdateLog Could not find max version in index or recent updates, using new clock 1636195764367523840
   [junit4]   2> 230408 INFO  (qtp720046542-2478) [n:127.0.0.1:40885_solr c:collection1meta s:shard1 r:core_node3 x:collection1meta_shard1_replica_n1 ] o.a.s.h.ReplicationHandler Commits will be reserved for 10000ms.
   [junit4]   2> 230408 INFO  (qtp720046542-2478) [n:127.0.0.1:40885_solr c:collection1meta s:shard1 r:core_node3 x:collection1meta_shard1_replica_n1 ] o.a.s.u.UpdateLog Could not find max version in index or recent updates, using new clock 1636195764367523840
   [junit4]   2> 230410 INFO  (searcherExecutor-844-thread-1-processing-n:127.0.0.1:40885_solr x:collection1meta_shard1_replica_n1 c:collection1meta s:shard1 r:core_node3) [n:127.0.0.1:40885_solr c:collection1meta s:shard1 r:core_node3 x:collection1meta_shard1_replica_n1 ] o.a.s.c.SolrCore [collection1meta_shard1_replica_n1] Registered new searcher Searcher@75e148a6[collection1meta_shard1_replica_n1] main{ExitableDirectoryReader(UninvertingDirectoryReader())}
   [junit4]   2> 230410 INFO  (searcherExecutor-845-thread-1-processing-n:127.0.0.1:33583_solr x:collection1meta_shard2_replica_n2 c:collection1meta s:shard2 r:core_node4) [n:127.0.0.1:33583_solr c:collection1meta s:shard2 r:core_node4 x:collection1meta_shard2_replica_n2 ] o.a.s.c.SolrCore [collection1meta_shard2_replica_n2] Registered new searcher Searcher@b81839e[collection1meta_shard2_replica_n2] main{ExitableDirectoryReader(UninvertingDirectoryReader())}
   [junit4]   2> 230412 INFO  (qtp720046542-2478) [n:127.0.0.1:40885_solr c:collection1meta s:shard1 r:core_node3 x:collection1meta_shard1_replica_n1 ] o.a.s.c.ZkShardTerms Successful update of terms at /collections/collection1meta/terms/shard1 to Terms{values={core_node3=0}, version=0}
   [junit4]   2> 230412 INFO  (qtp736560341-2479) [n:127.0.0.1:33583_solr c:collection1meta s:shard2 r:core_node4 x:collection1meta_shard2_replica_n2 ] o.a.s.c.ZkShardTerms Successful update of terms at /collections/collection1meta/terms/shard2 to Terms{values={core_node4=0}, version=0}
   [junit4]   2> 230412 INFO  (qtp736560341-2479) [n:127.0.0.1:33583_solr c:collection1meta s:shard2 r:core_node4 x:collection1meta_shard2_replica_n2 ] o.a.s.c.ShardLeaderElectionContextBase make sure parent is created /collections/collection1meta/leaders/shard2
   [junit4]   2> 230412 INFO  (qtp720046542-2478) [n:127.0.0.1:40885_solr c:collection1meta s:shard1 r:core_node3 x:collection1meta_shard1_replica_n1 ] o.a.s.c.ShardLeaderElectionContextBase make sure parent is created /collections/collection1meta/leaders/shard1
   [junit4]   2> 230415 INFO  (qtp736560341-2479) [n:127.0.0.1:33583_solr c:collection1meta s:shard2 r:core_node4 x:collection1meta_shard2_replica_n2 ] o.a.s.c.ShardLeaderElectionContext Enough replicas found to continue.
   [junit4]   2> 230415 INFO  (qtp736560341-2479) [n:127.0.0.1:33583_solr c:collection1meta s:shard2 r:core_node4 x:collection1meta_shard2_replica_n2 ] o.a.s.c.ShardLeaderElectionContext I may be the new leader - try and sync
   [junit4]   2> 230415 INFO  (qtp736560341-2479) [n:127.0.0.1:33583_solr c:collection1meta s:shard2 r:core_node4 x:collection1meta_shard2_replica_n2 ] o.a.s.c.SyncStrategy Sync replicas to https://127.0.0.1:33583/solr/collection1meta_shard2_replica_n2/
   [junit4]   2> 230415 INFO  (qtp720046542-2478) [n:127.0.0.1:40885_solr c:collection1meta s:shard1 r:core_node3 x:collection1meta_shard1_replica_n1 ] o.a.s.c.ShardLeaderElectionContext Enough replicas found to continue.
   [junit4]   2> 230415 INFO  (qtp720046542-2478) [n:127.0.0.1:40885_solr c:collection1meta s:shard1 r:core_node3 x:collection1meta_shard1_replica_n1 ] o.a.s.c.ShardLeaderElectionContext I may be the new leader - try and sync
   [junit4]   2> 230415 INFO  (qtp720046542-2478) [n:127.0.0.1:40885_solr c:collection1meta s:shard1 r:core_node3 x:collection1meta_shard1_replica_n1 ] o.a.s.c.SyncStrategy Sync replicas to https://127.0.0.1:40885/solr/collection1meta_shard1_replica_n1/
   [junit4]   2> 230415 INFO  (qtp736560341-2479) [n:127.0.0.1:33583_solr c:collection1meta s:shard2 r:core_node4 x:collection1meta_shard2_replica_n2 ] o.a.s.c.SyncStrategy Sync Success - now sync replicas to me
   [junit4]   2> 230415 INFO  (qtp720046542-2478) [n:127.0.0.1:40885_solr c:collection1meta s:shard1 r:core_node3 x:collection1meta_shard1_replica_n1 ] o.a.s.c.SyncStrategy Sync Success - now sync replicas to me
   [junit4]   2> 230415 INFO  (qtp736560341-2479) [n:127.0.0.1:33583_solr c:collection1meta s:shard2 r:core_node4 x:collection1meta_shard2_replica_n2 ] o.a.s.c.SyncStrategy https://127.0.0.1:33583/solr/collection1meta_shard2_replica_n2/ has no replicas
   [junit4]   2> 230415 INFO  (qtp736560341-2479) [n:127.0.0.1:33583_solr c:collection1meta s:shard2 r:core_node4 x:collection1meta_shard2_replica_n2 ] o.a.s.c.ShardLeaderElectionContextBase Creating leader registration node /collections/collection1meta/leaders/shard2/leader after winning as /collections/collection1meta/leader_elect/shard2/election/72417596788834312-core_node4-n_0000000000
   [junit4]   2> 230415 INFO  (qtp720046542-2478) [n:127.0.0.1:40885_solr c:collection1meta s:shard1 r:core_node3 x:collection1meta_shard1_replica_n1 ] o.

[...truncated too long message...]

sallowed.ivy.jars.list as its length is 0.

-ivy-fail-disallowed-ivy-version:

ivy-fail:

resolve-groovy:
[ivy:cachepath] :: resolving dependencies :: org.codehaus.groovy#groovy-all-caller;working
[ivy:cachepath] 	confs: [default]
[ivy:cachepath] 	found org.codehaus.groovy#groovy-all;2.4.16 in public
[ivy:cachepath] :: resolution report :: resolve 20ms :: artifacts dl 0ms
	---------------------------------------------------------------------
	|                  |            modules            ||   artifacts   |
	|       conf       | number| search|dwnlded|evicted|| number|dwnlded|
	---------------------------------------------------------------------
	|      default     |   1   |   0   |   0   |   0   ||   1   |   0   |
	---------------------------------------------------------------------

-init-totals:

-test:
    [mkdir] Created dir: /home/jenkins/workspace/Lucene-Solr-8.x-Linux/solr/build/solr-core/test
[junit4:pickseed] Seed property 'tests.seed' already defined: ADEA51C03CB0FEAC
    [mkdir] Created dir: /home/jenkins/workspace/Lucene-Solr-8.x-Linux/solr/build/solr-core/test/temp
   [junit4] <JUnit4> says olá! Master seed: ADEA51C03CB0FEAC
   [junit4] Executing 5 suites with 3 JVMs.
   [junit4] 
   [junit4] Started J2 PID(11996@serv1.sd-datasolutions.de).
   [junit4] Started J1 PID(12000@serv1.sd-datasolutions.de).
   [junit4] Started J0 PID(11997@serv1.sd-datasolutions.de).
   [junit4] Suite: org.apache.solr.cloud.AliasIntegrationTest
   [junit4] OK      6.46s J1 | AliasIntegrationTest.testModifyPropertiesCAR
   [junit4] OK      4.02s J1 | AliasIntegrationTest.testProperties
   [junit4] OK      3.82s J1 | AliasIntegrationTest.testModifyPropertiesV1
   [junit4] OK      10.8s J1 | AliasIntegrationTest.testDeleteOneOfTwoCollectionsAliased
   [junit4] OK      2.26s J1 | AliasIntegrationTest.testErrorChecks
   [junit4] OK      3.78s J1 | AliasIntegrationTest.testClusterStateProviderAPI
   [junit4] OK      11.0s J1 | AliasIntegrationTest.testDeleteAliasWithExistingCollectionName
   [junit4] OK      3.73s J1 | AliasIntegrationTest.testModifyPropertiesV2
   [junit4] OK      5.76s J1 | AliasIntegrationTest.test
   [junit4] Completed [1/5] on J1 in 59.10s, 9 tests
   [junit4] 
   [junit4] Suite: org.apache.solr.cloud.AliasIntegrationTest
   [junit4] OK      6.46s J2 | AliasIntegrationTest.testModifyPropertiesCAR
   [junit4] OK      3.98s J2 | AliasIntegrationTest.testProperties
   [junit4] OK      3.84s J2 | AliasIntegrationTest.testModifyPropertiesV1
   [junit4] OK      10.7s J2 | AliasIntegrationTest.testDeleteOneOfTwoCollectionsAliased
   [junit4] OK      2.20s J2 | AliasIntegrationTest.testErrorChecks
   [junit4] OK      3.79s J2 | AliasIntegrationTest.testClusterStateProviderAPI
   [junit4] OK      11.1s J2 | AliasIntegrationTest.testDeleteAliasWithExistingCollectionName
   [junit4] OK      3.75s J2 | AliasIntegrationTest.testModifyPropertiesV2
   [junit4] OK      5.74s J2 | AliasIntegrationTest.test
   [junit4] Completed [2/5] on J2 in 59.12s, 9 tests
   [junit4] 
   [junit4] Suite: org.apache.solr.cloud.AliasIntegrationTest
   [junit4] OK      6.26s J0 | AliasIntegrationTest.testModifyPropertiesCAR
   [junit4] OK      4.06s J0 | AliasIntegrationTest.testProperties
   [junit4] OK      3.92s J0 | AliasIntegrationTest.testModifyPropertiesV1
   [junit4] OK      10.8s J0 | AliasIntegrationTest.testDeleteOneOfTwoCollectionsAliased
   [junit4] OK      2.09s J0 | AliasIntegrationTest.testErrorChecks
   [junit4] OK      3.75s J0 | AliasIntegrationTest.testClusterStateProviderAPI
   [junit4] OK      10.9s J0 | AliasIntegrationTest.testDeleteAliasWithExistingCollectionName
   [junit4] OK      3.88s J0 | AliasIntegrationTest.testModifyPropertiesV2
   [junit4] OK      5.61s J0 | AliasIntegrationTest.test
   [junit4] Completed [3/5] on J0 in 59.15s, 9 tests
   [junit4] 
   [junit4] Suite: org.apache.solr.cloud.AliasIntegrationTest
   [junit4] OK      3.66s J1 | AliasIntegrationTest.testModifyPropertiesCAR
   [junit4] OK      3.98s J1 | AliasIntegrationTest.testProperties
   [junit4] OK      4.12s J1 | AliasIntegrationTest.testModifyPropertiesV1
   [junit4] OK      9.02s J1 | AliasIntegrationTest.testDeleteOneOfTwoCollectionsAliased
   [junit4] OK      2.16s J1 | AliasIntegrationTest.testErrorChecks
   [junit4] OK      3.79s J1 | AliasIntegrationTest.testClusterStateProviderAPI
   [junit4] OK      10.8s J1 | AliasIntegrationTest.testDeleteAliasWithExistingCollectionName
   [junit4] OK      3.87s J1 | AliasIntegrationTest.testModifyPropertiesV2
   [junit4] OK      5.33s J1 | AliasIntegrationTest.test
   [junit4] Completed [4/5] on J1 in 48.83s, 9 tests
   [junit4] 
   [junit4] Suite: org.apache.solr.cloud.AliasIntegrationTest
   [junit4] OK      3.63s J0 | AliasIntegrationTest.testModifyPropertiesCAR
   [junit4] OK      3.95s J0 | AliasIntegrationTest.testProperties
   [junit4] OK      4.09s J0 | AliasIntegrationTest.testModifyPropertiesV1
   [junit4] OK      10.0s J0 | AliasIntegrationTest.testDeleteOneOfTwoCollectionsAliased
   [junit4] OK      2.15s J0 | AliasIntegrationTest.testErrorChecks
   [junit4] OK      3.97s J0 | AliasIntegrationTest.testClusterStateProviderAPI
   [junit4] OK      10.9s J0 | AliasIntegrationTest.testDeleteAliasWithExistingCollectionName
   [junit4] OK      3.90s J0 | AliasIntegrationTest.testModifyPropertiesV2
   [junit4] OK      5.46s J0 | AliasIntegrationTest.test
   [junit4] Completed [5/5] on J0 in 49.80s, 9 tests
   [junit4] 
   [junit4] JVM J0:     0.78 ..   110.81 =   110.03s
   [junit4] JVM J1:     0.75 ..   109.80 =   109.05s
   [junit4] JVM J2:     0.75 ..    60.77 =    60.01s
   [junit4] Execution time total: 1 minute 50 seconds
   [junit4] Tests summary: 5 suites, 45 tests
   [junit4] Could not remove temporary path: /home/jenkins/workspace/Lucene-Solr-8.x-Linux/solr/build/solr-core/test/J2 (java.nio.file.DirectoryNotEmptyException: Remaining files: [/home/jenkins/workspace/Lucene-Solr-8.x-Linux/solr/build/solr-core/test/J2/temp])
   [junit4] Could not remove temporary path: /home/jenkins/workspace/Lucene-Solr-8.x-Linux/solr/build/solr-core/test/J1 (java.nio.file.DirectoryNotEmptyException: Remaining files: [/home/jenkins/workspace/Lucene-Solr-8.x-Linux/solr/build/solr-core/test/J1/temp])
   [junit4] Could not remove temporary path: /home/jenkins/workspace/Lucene-Solr-8.x-Linux/solr/build/solr-core/test/J0 (java.nio.file.DirectoryNotEmptyException: Remaining files: [/home/jenkins/workspace/Lucene-Solr-8.x-Linux/solr/build/solr-core/test/J0/temp])
     [echo] 5 slowest tests:
[junit4:tophints] 258.09s | org.apache.solr.cloud.autoscaling.IndexSizeTriggerTest
[junit4:tophints] 246.38s | org.apache.solr.cloud.TestStressLiveNodes
[junit4:tophints] 181.76s | org.apache.solr.cloud.api.collections.ShardSplitTest
[junit4:tophints] 128.41s | org.apache.solr.index.hdfs.CheckHdfsIndexTest
[junit4:tophints] 117.18s | org.apache.solr.update.SoftAutoCommitTest

-check-totals:

test-nocompile:

BUILD SUCCESSFUL
Total time: 1 minute 53 seconds
[repro] Failures:
[repro]   0/5 failed: org.apache.solr.cloud.AliasIntegrationTest
[repro] Exiting with code 0
+ mv lucene/build lucene/build.repro
+ mv solr/build solr/build.repro
+ mv lucene/build.orig lucene/build
+ mv solr/build.orig solr/build
Archiving artifacts
Setting ANT_1_8_2_HOME=/home/jenkins/tools/hudson.tasks.Ant_AntInstallation/ANT_1.8.2
java.lang.InterruptedException: no matches found within 10000
	at hudson.FilePath$ValidateAntFileMask.hasMatch(FilePath.java:2805)
	at hudson.FilePath$ValidateAntFileMask.invoke(FilePath.java:2684)
	at hudson.FilePath$ValidateAntFileMask.invoke(FilePath.java:2665)
	at hudson.FilePath.act(FilePath.java:1078)
	at hudson.FilePath.act(FilePath.java:1061)
	at hudson.FilePath.validateAntFileMask(FilePath.java:2663)
	at hudson.tasks.ArtifactArchiver.perform(ArtifactArchiver.java:248)
	at hudson.tasks.BuildStepCompatibilityLayer.perform(BuildStepCompatibilityLayer.java:79)
	at hudson.tasks.BuildStepMonitor$1.perform(BuildStepMonitor.java:20)
	at hudson.model.AbstractBuild$AbstractBuildExecution.perform(AbstractBuild.java:741)
	at hudson.model.AbstractBuild$AbstractBuildExecution.performAllBuildSteps(AbstractBuild.java:690)
	at hudson.model.Build$BuildExecution.post2(Build.java:186)
	at hudson.model.AbstractBuild$AbstractBuildExecution.post(AbstractBuild.java:635)
	at hudson.model.Run.execute(Run.java:1843)
	at hudson.model.FreeStyleBuild.run(FreeStyleBuild.java:43)
	at hudson.model.ResourceController.execute(ResourceController.java:97)
	at hudson.model.Executor.run(Executor.java:429)
No artifacts found that match the file pattern "**/*.events,heapdumps/**,**/*_pid*.log". Configuration error?
[WARNINGS] Parsing warnings in console log with parser Java Compiler (javac)
Setting ANT_1_8_2_HOME=/home/jenkins/tools/hudson.tasks.Ant_AntInstallation/ANT_1.8.2
No credentials specified
Setting ANT_1_8_2_HOME=/home/jenkins/tools/hudson.tasks.Ant_AntInstallation/ANT_1.8.2
<Git Blamer> Using GitBlamer to create author and commit information for all warnings.
<Git Blamer> GIT_COMMIT=e139c86769b34c5e6658900e951c4b41117c3cbd, workspace=/home/jenkins/workspace/Lucene-Solr-8.x-Linux
[WARNINGS] Computing warning deltas based on reference build #699
Recording test results
Setting ANT_1_8_2_HOME=/home/jenkins/tools/hudson.tasks.Ant_AntInstallation/ANT_1.8.2
Build step 'Publish JUnit test result report' changed build result to UNSTABLE
Email was triggered for: Unstable (Test Failures)
Sending email for trigger: Unstable (Test Failures)
Setting ANT_1_8_2_HOME=/home/jenkins/tools/hudson.tasks.Ant_AntInstallation/ANT_1.8.2
Setting ANT_1_8_2_HOME=/home/jenkins/tools/hudson.tasks.Ant_AntInstallation/ANT_1.8.2
Setting ANT_1_8_2_HOME=/home/jenkins/tools/hudson.tasks.Ant_AntInstallation/ANT_1.8.2
Setting ANT_1_8_2_HOME=/home/jenkins/tools/hudson.tasks.Ant_AntInstallation/ANT_1.8.2
Setting ANT_1_8_2_HOME=/home/jenkins/tools/hudson.tasks.Ant_AntInstallation/ANT_1.8.2
Setting ANT_1_8_2_HOME=/home/jenkins/tools/hudson.tasks.Ant_AntInstallation/ANT_1.8.2

Mime
View raw message