lucene-dev mailing list archives

Site index · List index
Message view « Date » · « Thread »
Top « Date » · « Thread »
From Policeman Jenkins Server <jenk...@thetaphi.de>
Subject [JENKINS] Lucene-Solr-8.1-Windows (64bit/jdk-12) - Build # 124 - Unstable!
Date Sun, 02 Jun 2019 01:34:08 GMT
Build: https://jenkins.thetaphi.de/job/Lucene-Solr-8.1-Windows/124/
Java: 64bit/jdk-12 -XX:-UseCompressedOops -XX:+UseParallelGC

1 tests failed.
FAILED:  org.apache.solr.cloud.MissingSegmentRecoveryTest.testLeaderRecovery

Error Message:
Expected a collection with one shard and two replicas Timeout waiting to see state for collection=MissingSegmentRecoveryTest :DocCollection(MissingSegmentRecoveryTest//collections/MissingSegmentRecoveryTest/state.json/7)={   "pullReplicas":"0",   "replicationFactor":"2",   "shards":{"shard1":{       "range":"80000000-7fffffff",       "state":"active",       "replicas":{         "core_node3":{           "core":"MissingSegmentRecoveryTest_shard1_replica_n1",           "base_url":"http://127.0.0.1:61236/solr",           "node_name":"127.0.0.1:61236_solr",           "state":"down",           "type":"NRT",           "force_set_state":"false"},         "core_node4":{           "core":"MissingSegmentRecoveryTest_shard1_replica_n2",           "base_url":"http://127.0.0.1:61237/solr",           "node_name":"127.0.0.1:61237_solr",           "state":"active",           "type":"NRT",           "force_set_state":"false",           "leader":"true"}}}},   "router":{"name":"compositeId"},   "maxShardsPerNode":"1",   "autoAddReplicas":"false",   "nrtReplicas":"2",   "tlogReplicas":"0"} Live Nodes: [127.0.0.1:61236_solr, 127.0.0.1:61237_solr] Last available state: DocCollection(MissingSegmentRecoveryTest//collections/MissingSegmentRecoveryTest/state.json/7)={   "pullReplicas":"0",   "replicationFactor":"2",   "shards":{"shard1":{       "range":"80000000-7fffffff",       "state":"active",       "replicas":{         "core_node3":{           "core":"MissingSegmentRecoveryTest_shard1_replica_n1",           "base_url":"http://127.0.0.1:61236/solr",           "node_name":"127.0.0.1:61236_solr",           "state":"down",           "type":"NRT",           "force_set_state":"false"},         "core_node4":{           "core":"MissingSegmentRecoveryTest_shard1_replica_n2",           "base_url":"http://127.0.0.1:61237/solr",           "node_name":"127.0.0.1:61237_solr",           "state":"active",           "type":"NRT",           "force_set_state":"false",           "leader":"true"}}}},   "router":{"name":"compositeId"},   "maxShardsPerNode":"1",   "autoAddReplicas":"false",   "nrtReplicas":"2",   "tlogReplicas":"0"}

Stack Trace:
java.lang.AssertionError: Expected a collection with one shard and two replicas
Timeout waiting to see state for collection=MissingSegmentRecoveryTest :DocCollection(MissingSegmentRecoveryTest//collections/MissingSegmentRecoveryTest/state.json/7)={
  "pullReplicas":"0",
  "replicationFactor":"2",
  "shards":{"shard1":{
      "range":"80000000-7fffffff",
      "state":"active",
      "replicas":{
        "core_node3":{
          "core":"MissingSegmentRecoveryTest_shard1_replica_n1",
          "base_url":"http://127.0.0.1:61236/solr",
          "node_name":"127.0.0.1:61236_solr",
          "state":"down",
          "type":"NRT",
          "force_set_state":"false"},
        "core_node4":{
          "core":"MissingSegmentRecoveryTest_shard1_replica_n2",
          "base_url":"http://127.0.0.1:61237/solr",
          "node_name":"127.0.0.1:61237_solr",
          "state":"active",
          "type":"NRT",
          "force_set_state":"false",
          "leader":"true"}}}},
  "router":{"name":"compositeId"},
  "maxShardsPerNode":"1",
  "autoAddReplicas":"false",
  "nrtReplicas":"2",
  "tlogReplicas":"0"}
Live Nodes: [127.0.0.1:61236_solr, 127.0.0.1:61237_solr]
Last available state: DocCollection(MissingSegmentRecoveryTest//collections/MissingSegmentRecoveryTest/state.json/7)={
  "pullReplicas":"0",
  "replicationFactor":"2",
  "shards":{"shard1":{
      "range":"80000000-7fffffff",
      "state":"active",
      "replicas":{
        "core_node3":{
          "core":"MissingSegmentRecoveryTest_shard1_replica_n1",
          "base_url":"http://127.0.0.1:61236/solr",
          "node_name":"127.0.0.1:61236_solr",
          "state":"down",
          "type":"NRT",
          "force_set_state":"false"},
        "core_node4":{
          "core":"MissingSegmentRecoveryTest_shard1_replica_n2",
          "base_url":"http://127.0.0.1:61237/solr",
          "node_name":"127.0.0.1:61237_solr",
          "state":"active",
          "type":"NRT",
          "force_set_state":"false",
          "leader":"true"}}}},
  "router":{"name":"compositeId"},
  "maxShardsPerNode":"1",
  "autoAddReplicas":"false",
  "nrtReplicas":"2",
  "tlogReplicas":"0"}
	at __randomizedtesting.SeedInfo.seed([E077A03BBA687400:B0223838E349C21D]:0)
	at org.junit.Assert.fail(Assert.java:88)
	at org.apache.solr.cloud.SolrCloudTestCase.waitForState(SolrCloudTestCase.java:310)
	at org.apache.solr.cloud.SolrCloudTestCase.waitForState(SolrCloudTestCase.java:288)
	at org.apache.solr.cloud.MissingSegmentRecoveryTest.testLeaderRecovery(MissingSegmentRecoveryTest.java:106)
	at java.base/jdk.internal.reflect.NativeMethodAccessorImpl.invoke0(Native Method)
	at java.base/jdk.internal.reflect.NativeMethodAccessorImpl.invoke(NativeMethodAccessorImpl.java:62)
	at java.base/jdk.internal.reflect.DelegatingMethodAccessorImpl.invoke(DelegatingMethodAccessorImpl.java:43)
	at java.base/java.lang.reflect.Method.invoke(Method.java:567)
	at com.carrotsearch.randomizedtesting.RandomizedRunner.invoke(RandomizedRunner.java:1750)
	at com.carrotsearch.randomizedtesting.RandomizedRunner$8.evaluate(RandomizedRunner.java:938)
	at com.carrotsearch.randomizedtesting.RandomizedRunner$9.evaluate(RandomizedRunner.java:974)
	at com.carrotsearch.randomizedtesting.RandomizedRunner$10.evaluate(RandomizedRunner.java:988)
	at com.carrotsearch.randomizedtesting.rules.SystemPropertiesRestoreRule$1.evaluate(SystemPropertiesRestoreRule.java:57)
	at org.apache.lucene.util.TestRuleSetupTeardownChained$1.evaluate(TestRuleSetupTeardownChained.java:49)
	at org.apache.lucene.util.AbstractBeforeAfterRule$1.evaluate(AbstractBeforeAfterRule.java:45)
	at org.apache.lucene.util.TestRuleThreadAndTestName$1.evaluate(TestRuleThreadAndTestName.java:48)
	at org.apache.lucene.util.TestRuleIgnoreAfterMaxFailures$1.evaluate(TestRuleIgnoreAfterMaxFailures.java:64)
	at org.apache.lucene.util.TestRuleMarkFailure$1.evaluate(TestRuleMarkFailure.java:47)
	at com.carrotsearch.randomizedtesting.rules.StatementAdapter.evaluate(StatementAdapter.java:36)
	at com.carrotsearch.randomizedtesting.ThreadLeakControl$StatementRunner.run(ThreadLeakControl.java:368)
	at com.carrotsearch.randomizedtesting.ThreadLeakControl.forkTimeoutingTask(ThreadLeakControl.java:817)
	at com.carrotsearch.randomizedtesting.ThreadLeakControl$3.evaluate(ThreadLeakControl.java:468)
	at com.carrotsearch.randomizedtesting.RandomizedRunner.runSingleTest(RandomizedRunner.java:947)
	at com.carrotsearch.randomizedtesting.RandomizedRunner$5.evaluate(RandomizedRunner.java:832)
	at com.carrotsearch.randomizedtesting.RandomizedRunner$6.evaluate(RandomizedRunner.java:883)
	at com.carrotsearch.randomizedtesting.RandomizedRunner$7.evaluate(RandomizedRunner.java:894)
	at com.carrotsearch.randomizedtesting.rules.StatementAdapter.evaluate(StatementAdapter.java:36)
	at com.carrotsearch.randomizedtesting.rules.SystemPropertiesRestoreRule$1.evaluate(SystemPropertiesRestoreRule.java:57)
	at org.apache.lucene.util.AbstractBeforeAfterRule$1.evaluate(AbstractBeforeAfterRule.java:45)
	at com.carrotsearch.randomizedtesting.rules.StatementAdapter.evaluate(StatementAdapter.java:36)
	at org.apache.lucene.util.TestRuleStoreClassName$1.evaluate(TestRuleStoreClassName.java:41)
	at com.carrotsearch.randomizedtesting.rules.NoShadowingOrOverridesOnMethodsRule$1.evaluate(NoShadowingOrOverridesOnMethodsRule.java:40)
	at com.carrotsearch.randomizedtesting.rules.NoShadowingOrOverridesOnMethodsRule$1.evaluate(NoShadowingOrOverridesOnMethodsRule.java:40)
	at com.carrotsearch.randomizedtesting.rules.StatementAdapter.evaluate(StatementAdapter.java:36)
	at com.carrotsearch.randomizedtesting.rules.StatementAdapter.evaluate(StatementAdapter.java:36)
	at org.apache.lucene.util.TestRuleAssertionsRequired$1.evaluate(TestRuleAssertionsRequired.java:53)
	at org.apache.lucene.util.TestRuleMarkFailure$1.evaluate(TestRuleMarkFailure.java:47)
	at org.apache.lucene.util.TestRuleIgnoreAfterMaxFailures$1.evaluate(TestRuleIgnoreAfterMaxFailures.java:64)
	at org.apache.lucene.util.TestRuleIgnoreTestSuites$1.evaluate(TestRuleIgnoreTestSuites.java:54)
	at com.carrotsearch.randomizedtesting.rules.StatementAdapter.evaluate(StatementAdapter.java:36)
	at com.carrotsearch.randomizedtesting.ThreadLeakControl$StatementRunner.run(ThreadLeakControl.java:368)
	at java.base/java.lang.Thread.run(Thread.java:835)




Build Log:
[...truncated 13366 lines...]
   [junit4] Suite: org.apache.solr.cloud.MissingSegmentRecoveryTest
   [junit4]   2> Creating dataDir: C:\Users\jenkins\workspace\Lucene-Solr-8.1-Windows\solr\build\solr-core\test\J1\temp\solr.cloud.MissingSegmentRecoveryTest_E077A03BBA687400-001\init-core-data-001
   [junit4]   2> 522857 WARN  (SUITE-MissingSegmentRecoveryTest-seed#[E077A03BBA687400]-worker) [    ] o.a.s.SolrTestCaseJ4 startTrackingSearchers: numOpens=19 numCloses=19
   [junit4]   2> 522860 INFO  (SUITE-MissingSegmentRecoveryTest-seed#[E077A03BBA687400]-worker) [    ] o.a.s.SolrTestCaseJ4 Using PointFields (NUMERIC_POINTS_SYSPROP=true) w/NUMERIC_DOCVALUES_SYSPROP=true
   [junit4]   2> 522863 INFO  (SUITE-MissingSegmentRecoveryTest-seed#[E077A03BBA687400]-worker) [    ] o.a.s.SolrTestCaseJ4 Randomized ssl (false) and clientAuth (false) via: @org.apache.solr.util.RandomizeSSL(reason="", ssl=0.0/0.0, value=0.0/0.0, clientAuth=0.0/0.0)
   [junit4]   2> 522863 INFO  (SUITE-MissingSegmentRecoveryTest-seed#[E077A03BBA687400]-worker) [    ] o.a.s.SolrTestCaseJ4 SecureRandom sanity checks: test.solr.allowed.securerandom=null & java.security.egd=file:/dev/./urandom
   [junit4]   2> 522863 INFO  (SUITE-MissingSegmentRecoveryTest-seed#[E077A03BBA687400]-worker) [    ] o.a.s.c.MiniSolrCloudCluster Starting cluster of 2 servers in C:\Users\jenkins\workspace\Lucene-Solr-8.1-Windows\solr\build\solr-core\test\J1\temp\solr.cloud.MissingSegmentRecoveryTest_E077A03BBA687400-001\tempDir-001
   [junit4]   2> 522864 INFO  (SUITE-MissingSegmentRecoveryTest-seed#[E077A03BBA687400]-worker) [    ] o.a.s.c.ZkTestServer STARTING ZK TEST SERVER
   [junit4]   2> 522864 INFO  (ZkTestServer Run Thread) [    ] o.a.s.c.ZkTestServer client port:0.0.0.0/0.0.0.0:0
   [junit4]   2> 522864 INFO  (ZkTestServer Run Thread) [    ] o.a.s.c.ZkTestServer Starting server
   [junit4]   2> 522965 INFO  (SUITE-MissingSegmentRecoveryTest-seed#[E077A03BBA687400]-worker) [    ] o.a.s.c.ZkTestServer start zk server on port:61225
   [junit4]   2> 522965 INFO  (SUITE-MissingSegmentRecoveryTest-seed#[E077A03BBA687400]-worker) [    ] o.a.s.c.ZkTestServer parse host and port list: 127.0.0.1:61225
   [junit4]   2> 522965 INFO  (SUITE-MissingSegmentRecoveryTest-seed#[E077A03BBA687400]-worker) [    ] o.a.s.c.ZkTestServer connecting to 127.0.0.1 61225
   [junit4]   2> 522971 INFO  (zkConnectionManagerCallback-1462-thread-1) [    ] o.a.s.c.c.ConnectionManager zkClient has connected
   [junit4]   2> 522977 INFO  (zkConnectionManagerCallback-1464-thread-1) [    ] o.a.s.c.c.ConnectionManager zkClient has connected
   [junit4]   2> 522980 INFO  (zkConnectionManagerCallback-1466-thread-1) [    ] o.a.s.c.c.ConnectionManager zkClient has connected
   [junit4]   2> 522982 WARN  (NIOServerCxn.Factory:0.0.0.0/0.0.0.0:0) [    ] o.a.z.s.NIOServerCnxn Unable to read additional data from client sessionid 0x1005cc0090b0002, likely client has closed socket
   [junit4]   2> 522984 WARN  (jetty-launcher-1467-thread-1) [    ] o.e.j.s.AbstractConnector Ignoring deprecated socket close linger time
   [junit4]   2> 522984 WARN  (jetty-launcher-1467-thread-2) [    ] o.e.j.s.AbstractConnector Ignoring deprecated socket close linger time
   [junit4]   2> 522984 INFO  (jetty-launcher-1467-thread-1) [    ] o.a.s.c.s.e.JettySolrRunner Start Jetty (original configured port=0)
   [junit4]   2> 522984 INFO  (jetty-launcher-1467-thread-1) [    ] o.a.s.c.s.e.JettySolrRunner Trying to start Jetty on port 0 try number 1 ...
   [junit4]   2> 522984 INFO  (jetty-launcher-1467-thread-1) [    ] o.e.j.s.Server jetty-9.4.14.v20181114; built: 2018-11-14T21:20:31.478Z; git: c4550056e785fb5665914545889f21dc136ad9e6; jvm 12+33
   [junit4]   2> 522984 INFO  (jetty-launcher-1467-thread-2) [    ] o.a.s.c.s.e.JettySolrRunner Start Jetty (original configured port=0)
   [junit4]   2> 522984 INFO  (jetty-launcher-1467-thread-2) [    ] o.a.s.c.s.e.JettySolrRunner Trying to start Jetty on port 0 try number 1 ...
   [junit4]   2> 522984 INFO  (jetty-launcher-1467-thread-2) [    ] o.e.j.s.Server jetty-9.4.14.v20181114; built: 2018-11-14T21:20:31.478Z; git: c4550056e785fb5665914545889f21dc136ad9e6; jvm 12+33
   [junit4]   2> 522985 INFO  (jetty-launcher-1467-thread-2) [    ] o.e.j.s.session DefaultSessionIdManager workerName=node0
   [junit4]   2> 522985 INFO  (jetty-launcher-1467-thread-2) [    ] o.e.j.s.session No SessionScavenger set, using defaults
   [junit4]   2> 522985 INFO  (jetty-launcher-1467-thread-2) [    ] o.e.j.s.session node0 Scavenging every 600000ms
   [junit4]   2> 522985 INFO  (jetty-launcher-1467-thread-1) [    ] o.e.j.s.session DefaultSessionIdManager workerName=node0
   [junit4]   2> 522985 INFO  (jetty-launcher-1467-thread-1) [    ] o.e.j.s.session No SessionScavenger set, using defaults
   [junit4]   2> 522985 INFO  (jetty-launcher-1467-thread-1) [    ] o.e.j.s.session node0 Scavenging every 600000ms
   [junit4]   2> 522985 INFO  (jetty-launcher-1467-thread-2) [    ] o.e.j.s.h.ContextHandler Started o.e.j.s.ServletContextHandler@3cb9c57d{/solr,null,AVAILABLE}
   [junit4]   2> 522985 INFO  (jetty-launcher-1467-thread-1) [    ] o.e.j.s.h.ContextHandler Started o.e.j.s.ServletContextHandler@2a66cb16{/solr,null,AVAILABLE}
   [junit4]   2> 522986 INFO  (jetty-launcher-1467-thread-2) [    ] o.e.j.s.AbstractConnector Started ServerConnector@656a93ab{HTTP/1.1,[http/1.1, h2c]}{127.0.0.1:61236}
   [junit4]   2> 522986 INFO  (jetty-launcher-1467-thread-1) [    ] o.e.j.s.AbstractConnector Started ServerConnector@18a6bbe7{HTTP/1.1,[http/1.1, h2c]}{127.0.0.1:61237}
   [junit4]   2> 522986 INFO  (jetty-launcher-1467-thread-2) [    ] o.e.j.s.Server Started @523051ms
   [junit4]   2> 522986 INFO  (jetty-launcher-1467-thread-1) [    ] o.e.j.s.Server Started @523051ms
   [junit4]   2> 522986 INFO  (jetty-launcher-1467-thread-2) [    ] o.a.s.c.s.e.JettySolrRunner Jetty properties: {hostContext=/solr, hostPort=61236}
   [junit4]   2> 522986 INFO  (jetty-launcher-1467-thread-1) [    ] o.a.s.c.s.e.JettySolrRunner Jetty properties: {hostContext=/solr, hostPort=61237}
   [junit4]   2> 522987 ERROR (jetty-launcher-1467-thread-2) [    ] o.a.s.u.StartupLoggingUtils Missing Java Option solr.log.dir. Logging may be missing or incomplete.
   [junit4]   2> 522987 INFO  (jetty-launcher-1467-thread-2) [    ] o.a.s.s.SolrDispatchFilter Using logger factory org.apache.logging.slf4j.Log4jLoggerFactory
   [junit4]   2> 522987 INFO  (jetty-launcher-1467-thread-2) [    ] o.a.s.s.SolrDispatchFilter  ___      _       Welcome to Apache Solr? version 8.1.1
   [junit4]   2> 522987 INFO  (jetty-launcher-1467-thread-2) [    ] o.a.s.s.SolrDispatchFilter / __| ___| |_ _   Starting in cloud mode on port null
   [junit4]   2> 522987 INFO  (jetty-launcher-1467-thread-2) [    ] o.a.s.s.SolrDispatchFilter \__ \/ _ \ | '_|  Install dir: null
   [junit4]   2> 522987 INFO  (jetty-launcher-1467-thread-2) [    ] o.a.s.s.SolrDispatchFilter |___/\___/_|_|    Start time: 2019-06-02T00:13:59.115972300Z
   [junit4]   2> 522989 ERROR (jetty-launcher-1467-thread-1) [    ] o.a.s.u.StartupLoggingUtils Missing Java Option solr.log.dir. Logging may be missing or incomplete.
   [junit4]   2> 522989 INFO  (jetty-launcher-1467-thread-1) [    ] o.a.s.s.SolrDispatchFilter Using logger factory org.apache.logging.slf4j.Log4jLoggerFactory
   [junit4]   2> 522989 INFO  (jetty-launcher-1467-thread-1) [    ] o.a.s.s.SolrDispatchFilter  ___      _       Welcome to Apache Solr? version 8.1.1
   [junit4]   2> 522989 INFO  (jetty-launcher-1467-thread-1) [    ] o.a.s.s.SolrDispatchFilter / __| ___| |_ _   Starting in cloud mode on port null
   [junit4]   2> 522989 INFO  (jetty-launcher-1467-thread-1) [    ] o.a.s.s.SolrDispatchFilter \__ \/ _ \ | '_|  Install dir: null
   [junit4]   2> 522989 INFO  (jetty-launcher-1467-thread-1) [    ] o.a.s.s.SolrDispatchFilter |___/\___/_|_|    Start time: 2019-06-02T00:13:59.117570700Z
   [junit4]   2> 522994 INFO  (zkConnectionManagerCallback-1471-thread-1) [    ] o.a.s.c.c.ConnectionManager zkClient has connected
   [junit4]   2> 522995 INFO  (zkConnectionManagerCallback-1469-thread-1) [    ] o.a.s.c.c.ConnectionManager zkClient has connected
   [junit4]   2> 522995 INFO  (jetty-launcher-1467-thread-1) [    ] o.a.s.s.SolrDispatchFilter solr.xml found in ZooKeeper. Loading...
   [junit4]   2> 522995 INFO  (jetty-launcher-1467-thread-2) [    ] o.a.s.s.SolrDispatchFilter solr.xml found in ZooKeeper. Loading...
   [junit4]   2> 523149 INFO  (jetty-launcher-1467-thread-2) [    ] o.a.s.h.c.HttpShardHandlerFactory Host whitelist initialized: WhitelistHostChecker [whitelistHosts=null, whitelistHostCheckingEnabled=true]
   [junit4]   2> 523151 WARN  (jetty-launcher-1467-thread-2) [    ] o.e.j.u.s.S.config No Client EndPointIdentificationAlgorithm configured for SslContextFactory@a3a7ada[provider=null,keyStore=null,trustStore=null]
   [junit4]   2> 523160 WARN  (jetty-launcher-1467-thread-2) [    ] o.e.j.u.s.S.config No Client EndPointIdentificationAlgorithm configured for SslContextFactory@7e7d28fe[provider=null,keyStore=null,trustStore=null]
   [junit4]   2> 523160 INFO  (jetty-launcher-1467-thread-2) [    ] o.a.s.c.ZkContainer Zookeeper client=127.0.0.1:61225/solr
   [junit4]   2> 523168 INFO  (zkConnectionManagerCallback-1479-thread-1) [    ] o.a.s.c.c.ConnectionManager zkClient has connected
   [junit4]   2> 523174 INFO  (zkConnectionManagerCallback-1481-thread-1) [    ] o.a.s.c.c.ConnectionManager zkClient has connected
   [junit4]   2> 523289 INFO  (jetty-launcher-1467-thread-2) [n:127.0.0.1:61236_solr    ] o.a.s.c.OverseerElectionContext I am going to be the leader 127.0.0.1:61236_solr
   [junit4]   2> 523291 INFO  (jetty-launcher-1467-thread-2) [n:127.0.0.1:61236_solr    ] o.a.s.c.Overseer Overseer (id=72159573893120006-127.0.0.1:61236_solr-n_0000000000) starting
   [junit4]   2> 523300 INFO  (zkConnectionManagerCallback-1488-thread-1) [    ] o.a.s.c.c.ConnectionManager zkClient has connected
   [junit4]   2> 523301 INFO  (jetty-launcher-1467-thread-1) [    ] o.a.s.h.c.HttpShardHandlerFactory Host whitelist initialized: WhitelistHostChecker [whitelistHosts=null, whitelistHostCheckingEnabled=true]
   [junit4]   2> 523304 INFO  (jetty-launcher-1467-thread-2) [n:127.0.0.1:61236_solr    ] o.a.s.c.s.i.ZkClientClusterStateProvider Cluster at 127.0.0.1:61225/solr ready
   [junit4]   2> 523305 INFO  (jetty-launcher-1467-thread-2) [n:127.0.0.1:61236_solr    ] o.a.s.c.ZkController Register node as live in ZooKeeper:/live_nodes/127.0.0.1:61236_solr
   [junit4]   2> 523316 WARN  (jetty-launcher-1467-thread-1) [    ] o.e.j.u.s.S.config No Client EndPointIdentificationAlgorithm configured for SslContextFactory@4298e7e1[provider=null,keyStore=null,trustStore=null]
   [junit4]   2> 523324 INFO  (OverseerStateUpdate-72159573893120006-127.0.0.1:61236_solr-n_0000000000) [n:127.0.0.1:61236_solr    ] o.a.s.c.Overseer Starting to work on the main queue : 127.0.0.1:61236_solr
   [junit4]   2> 523325 INFO  (OverseerStateUpdate-72159573893120006-127.0.0.1:61236_solr-n_0000000000) [n:127.0.0.1:61236_solr    ] o.a.s.c.c.ZkStateReader Updated live nodes from ZooKeeper... (0) -> (1)
   [junit4]   2> 523325 INFO  (zkCallback-1487-thread-1) [    ] o.a.s.c.c.ZkStateReader Updated live nodes from ZooKeeper... (0) -> (1)
   [junit4]   2> 523334 WARN  (jetty-launcher-1467-thread-1) [    ] o.e.j.u.s.S.config No Client EndPointIdentificationAlgorithm configured for SslContextFactory@661cedb4[provider=null,keyStore=null,trustStore=null]
   [junit4]   2> 523334 INFO  (jetty-launcher-1467-thread-1) [    ] o.a.s.c.ZkContainer Zookeeper client=127.0.0.1:61225/solr
   [junit4]   2> 523339 INFO  (zkConnectionManagerCallback-1494-thread-1) [    ] o.a.s.c.c.ConnectionManager zkClient has connected
   [junit4]   2> 523345 INFO  (zkConnectionManagerCallback-1496-thread-1) [    ] o.a.s.c.c.ConnectionManager zkClient has connected
   [junit4]   2> 523355 INFO  (jetty-launcher-1467-thread-1) [n:127.0.0.1:61237_solr    ] o.a.s.c.c.ZkStateReader Updated live nodes from ZooKeeper... (0) -> (1)
   [junit4]   2> 523362 INFO  (jetty-launcher-1467-thread-1) [n:127.0.0.1:61237_solr    ] o.a.s.c.ZkController Publish node=127.0.0.1:61237_solr as DOWN
   [junit4]   2> 523363 INFO  (jetty-launcher-1467-thread-1) [n:127.0.0.1:61237_solr    ] o.a.s.c.TransientSolrCoreCacheDefault Allocating transient cache for 2147483647 transient cores
   [junit4]   2> 523363 INFO  (jetty-launcher-1467-thread-1) [n:127.0.0.1:61237_solr    ] o.a.s.c.ZkController Register node as live in ZooKeeper:/live_nodes/127.0.0.1:61237_solr
   [junit4]   2> 523364 INFO  (jetty-launcher-1467-thread-2) [n:127.0.0.1:61236_solr    ] o.a.s.h.a.MetricsHistoryHandler No .system collection, keeping metrics history in memory.
   [junit4]   2> 523364 INFO  (zkCallback-1487-thread-1) [    ] o.a.s.c.c.ZkStateReader Updated live nodes from ZooKeeper... (1) -> (2)
   [junit4]   2> 523364 INFO  (zkCallback-1480-thread-1) [    ] o.a.s.c.c.ZkStateReader Updated live nodes from ZooKeeper... (1) -> (2)
   [junit4]   2> 523405 INFO  (jetty-launcher-1467-thread-2) [n:127.0.0.1:61236_solr    ] o.a.s.m.r.SolrJmxReporter JMX monitoring for 'solr_61236.solr.node' (registry 'solr.node') enabled at server: com.sun.jmx.mbeanserver.JmxMBeanServer@6a85b2c6
   [junit4]   2> 523410 INFO  (zkCallback-1495-thread-1) [    ] o.a.s.c.c.ZkStateReader Updated live nodes from ZooKeeper... (1) -> (2)
   [junit4]   2> 523415 INFO  (jetty-launcher-1467-thread-2) [n:127.0.0.1:61236_solr    ] o.a.s.m.r.SolrJmxReporter JMX monitoring for 'solr_61236.solr.jvm' (registry 'solr.jvm') enabled at server: com.sun.jmx.mbeanserver.JmxMBeanServer@6a85b2c6
   [junit4]   2> 523415 INFO  (jetty-launcher-1467-thread-2) [n:127.0.0.1:61236_solr    ] o.a.s.m.r.SolrJmxReporter JMX monitoring for 'solr_61236.solr.jetty' (registry 'solr.jetty') enabled at server: com.sun.jmx.mbeanserver.JmxMBeanServer@6a85b2c6
   [junit4]   2> 523415 INFO  (jetty-launcher-1467-thread-2) [n:127.0.0.1:61236_solr    ] o.a.s.c.CorePropertiesLocator Found 0 core definitions underneath C:\Users\jenkins\workspace\Lucene-Solr-8.1-Windows\solr\build\solr-core\test\J1\temp\solr.cloud.MissingSegmentRecoveryTest_E077A03BBA687400-001\tempDir-001\node2\.
   [junit4]   2> 523419 INFO  (zkConnectionManagerCallback-1504-thread-1) [    ] o.a.s.c.c.ConnectionManager zkClient has connected
   [junit4]   2> 523422 INFO  (jetty-launcher-1467-thread-1) [n:127.0.0.1:61237_solr    ] o.a.s.c.c.ZkStateReader Updated live nodes from ZooKeeper... (0) -> (2)
   [junit4]   2> 523423 INFO  (jetty-launcher-1467-thread-1) [n:127.0.0.1:61237_solr    ] o.a.s.c.s.i.ZkClientClusterStateProvider Cluster at 127.0.0.1:61225/solr ready
   [junit4]   2> 523424 INFO  (jetty-launcher-1467-thread-1) [n:127.0.0.1:61237_solr    ] o.a.s.h.a.MetricsHistoryHandler No .system collection, keeping metrics history in memory.
   [junit4]   2> 523454 INFO  (jetty-launcher-1467-thread-1) [n:127.0.0.1:61237_solr    ] o.a.s.m.r.SolrJmxReporter JMX monitoring for 'solr_61237.solr.node' (registry 'solr.node') enabled at server: com.sun.jmx.mbeanserver.JmxMBeanServer@6a85b2c6
   [junit4]   2> 523466 INFO  (jetty-launcher-1467-thread-1) [n:127.0.0.1:61237_solr    ] o.a.s.m.r.SolrJmxReporter JMX monitoring for 'solr_61237.solr.jvm' (registry 'solr.jvm') enabled at server: com.sun.jmx.mbeanserver.JmxMBeanServer@6a85b2c6
   [junit4]   2> 523466 INFO  (jetty-launcher-1467-thread-1) [n:127.0.0.1:61237_solr    ] o.a.s.m.r.SolrJmxReporter JMX monitoring for 'solr_61237.solr.jetty' (registry 'solr.jetty') enabled at server: com.sun.jmx.mbeanserver.JmxMBeanServer@6a85b2c6
   [junit4]   2> 523466 INFO  (jetty-launcher-1467-thread-1) [n:127.0.0.1:61237_solr    ] o.a.s.c.CorePropertiesLocator Found 0 core definitions underneath C:\Users\jenkins\workspace\Lucene-Solr-8.1-Windows\solr\build\solr-core\test\J1\temp\solr.cloud.MissingSegmentRecoveryTest_E077A03BBA687400-001\tempDir-001\node1\.
   [junit4]   2> 523506 INFO  (zkConnectionManagerCallback-1510-thread-1) [    ] o.a.s.c.c.ConnectionManager zkClient has connected
   [junit4]   2> 523508 INFO  (SUITE-MissingSegmentRecoveryTest-seed#[E077A03BBA687400]-worker) [    ] o.a.s.c.c.ZkStateReader Updated live nodes from ZooKeeper... (0) -> (2)
   [junit4]   2> 523511 INFO  (SUITE-MissingSegmentRecoveryTest-seed#[E077A03BBA687400]-worker) [    ] o.a.s.c.s.i.ZkClientClusterStateProvider Cluster at 127.0.0.1:61225/solr ready
   [junit4]   2> 523534 INFO  (TEST-MissingSegmentRecoveryTest.testLeaderRecovery-seed#[E077A03BBA687400]) [    ] o.a.s.SolrTestCaseJ4 ###Starting testLeaderRecovery
   [junit4]   2> 523538 INFO  (qtp214325874-4162) [n:127.0.0.1:61236_solr    ] o.a.s.h.a.CollectionsHandler Invoked Collection Action :create with params collection.configName=conf&maxShardsPerNode=1&name=MissingSegmentRecoveryTest&nrtReplicas=2&action=CREATE&numShards=1&wt=javabin&version=2 and sendToOCPQueue=true
   [junit4]   2> 523541 INFO  (OverseerThreadFactory-1247-thread-1-processing-n:127.0.0.1:61236_solr) [n:127.0.0.1:61236_solr    ] o.a.s.c.a.c.CreateCollectionCmd Create collection MissingSegmentRecoveryTest
   [junit4]   2> 523654 INFO  (OverseerStateUpdate-72159573893120006-127.0.0.1:61236_solr-n_0000000000) [n:127.0.0.1:61236_solr    ] o.a.s.c.o.SliceMutator createReplica() {
   [junit4]   2>   "operation":"ADDREPLICA",
   [junit4]   2>   "collection":"MissingSegmentRecoveryTest",
   [junit4]   2>   "shard":"shard1",
   [junit4]   2>   "core":"MissingSegmentRecoveryTest_shard1_replica_n1",
   [junit4]   2>   "state":"down",
   [junit4]   2>   "base_url":"http://127.0.0.1:61236/solr",
   [junit4]   2>   "type":"NRT",
   [junit4]   2>   "waitForFinalState":"false"} 
   [junit4]   2> 523659 INFO  (OverseerStateUpdate-72159573893120006-127.0.0.1:61236_solr-n_0000000000) [n:127.0.0.1:61236_solr    ] o.a.s.c.o.SliceMutator createReplica() {
   [junit4]   2>   "operation":"ADDREPLICA",
   [junit4]   2>   "collection":"MissingSegmentRecoveryTest",
   [junit4]   2>   "shard":"shard1",
   [junit4]   2>   "core":"MissingSegmentRecoveryTest_shard1_replica_n2",
   [junit4]   2>   "state":"down",
   [junit4]   2>   "base_url":"http://127.0.0.1:61237/solr",
   [junit4]   2>   "type":"NRT",
   [junit4]   2>   "waitForFinalState":"false"} 
   [junit4]   2> 523862 INFO  (qtp2016407112-4161) [n:127.0.0.1:61237_solr    x:MissingSegmentRecoveryTest_shard1_replica_n2] o.a.s.h.a.CoreAdminOperation core create command qt=/admin/cores&coreNodeName=core_node4&collection.configName=conf&newCollection=true&name=MissingSegmentRecoveryTest_shard1_replica_n2&action=CREATE&numShards=1&collection=MissingSegmentRecoveryTest&shard=shard1&wt=javabin&version=2&replicaType=NRT
   [junit4]   2> 523862 INFO  (qtp214325874-4164) [n:127.0.0.1:61236_solr    x:MissingSegmentRecoveryTest_shard1_replica_n1] o.a.s.h.a.CoreAdminOperation core create command qt=/admin/cores&coreNodeName=core_node3&collection.configName=conf&newCollection=true&name=MissingSegmentRecoveryTest_shard1_replica_n1&action=CREATE&numShards=1&collection=MissingSegmentRecoveryTest&shard=shard1&wt=javabin&version=2&replicaType=NRT
   [junit4]   2> 523862 INFO  (qtp214325874-4164) [n:127.0.0.1:61236_solr    x:MissingSegmentRecoveryTest_shard1_replica_n1] o.a.s.c.TransientSolrCoreCacheDefault Allocating transient cache for 2147483647 transient cores
   [junit4]   2> 524893 INFO  (qtp2016407112-4161) [n:127.0.0.1:61237_solr c:MissingSegmentRecoveryTest s:shard1 r:core_node4 x:MissingSegmentRecoveryTest_shard1_replica_n2] o.a.s.c.SolrConfig Using Lucene MatchVersion: 8.1.1
   [junit4]   2> 524893 INFO  (qtp214325874-4164) [n:127.0.0.1:61236_solr c:MissingSegmentRecoveryTest s:shard1 r:core_node3 x:MissingSegmentRecoveryTest_shard1_replica_n1] o.a.s.c.SolrConfig Using Lucene MatchVersion: 8.1.1
   [junit4]   2> 524913 INFO  (qtp2016407112-4161) [n:127.0.0.1:61237_solr c:MissingSegmentRecoveryTest s:shard1 r:core_node4 x:MissingSegmentRecoveryTest_shard1_replica_n2] o.a.s.s.IndexSchema [MissingSegmentRecoveryTest_shard1_replica_n2] Schema name=minimal
   [junit4]   2> 524914 INFO  (qtp214325874-4164) [n:127.0.0.1:61236_solr c:MissingSegmentRecoveryTest s:shard1 r:core_node3 x:MissingSegmentRecoveryTest_shard1_replica_n1] o.a.s.s.IndexSchema [MissingSegmentRecoveryTest_shard1_replica_n1] Schema name=minimal
   [junit4]   2> 524915 INFO  (qtp2016407112-4161) [n:127.0.0.1:61237_solr c:MissingSegmentRecoveryTest s:shard1 r:core_node4 x:MissingSegmentRecoveryTest_shard1_replica_n2] o.a.s.s.IndexSchema Loaded schema minimal/1.1 with uniqueid field id
   [junit4]   2> 524915 INFO  (qtp2016407112-4161) [n:127.0.0.1:61237_solr c:MissingSegmentRecoveryTest s:shard1 r:core_node4 x:MissingSegmentRecoveryTest_shard1_replica_n2] o.a.s.c.CoreContainer Creating SolrCore 'MissingSegmentRecoveryTest_shard1_replica_n2' using configuration from collection MissingSegmentRecoveryTest, trusted=true
   [junit4]   2> 524916 INFO  (qtp2016407112-4161) [n:127.0.0.1:61237_solr c:MissingSegmentRecoveryTest s:shard1 r:core_node4 x:MissingSegmentRecoveryTest_shard1_replica_n2] o.a.s.m.r.SolrJmxReporter JMX monitoring for 'solr_61237.solr.core.MissingSegmentRecoveryTest.shard1.replica_n2' (registry 'solr.core.MissingSegmentRecoveryTest.shard1.replica_n2') enabled at server: com.sun.jmx.mbeanserver.JmxMBeanServer@6a85b2c6
   [junit4]   2> 524916 INFO  (qtp214325874-4164) [n:127.0.0.1:61236_solr c:MissingSegmentRecoveryTest s:shard1 r:core_node3 x:MissingSegmentRecoveryTest_shard1_replica_n1] o.a.s.s.IndexSchema Loaded schema minimal/1.1 with uniqueid field id
   [junit4]   2> 524916 INFO  (qtp214325874-4164) [n:127.0.0.1:61236_solr c:MissingSegmentRecoveryTest s:shard1 r:core_node3 x:MissingSegmentRecoveryTest_shard1_replica_n1] o.a.s.c.CoreContainer Creating SolrCore 'MissingSegmentRecoveryTest_shard1_replica_n1' using configuration from collection MissingSegmentRecoveryTest, trusted=true
   [junit4]   2> 524916 INFO  (qtp2016407112-4161) [n:127.0.0.1:61237_solr c:MissingSegmentRecoveryTest s:shard1 r:core_node4 x:MissingSegmentRecoveryTest_shard1_replica_n2] o.a.s.c.SolrCore [[MissingSegmentRecoveryTest_shard1_replica_n2] ] Opening new SolrCore at [C:\Users\jenkins\workspace\Lucene-Solr-8.1-Windows\solr\build\solr-core\test\J1\temp\solr.cloud.MissingSegmentRecoveryTest_E077A03BBA687400-001\tempDir-001\node1\MissingSegmentRecoveryTest_shard1_replica_n2], dataDir=[C:\Users\jenkins\workspace\Lucene-Solr-8.1-Windows\solr\build\solr-core\test\J1\temp\solr.cloud.MissingSegmentRecoveryTest_E077A03BBA687400-001\tempDir-001\node1\.\MissingSegmentRecoveryTest_shard1_replica_n2\data\]
   [junit4]   2> 524916 INFO  (qtp214325874-4164) [n:127.0.0.1:61236_solr c:MissingSegmentRecoveryTest s:shard1 r:core_node3 x:MissingSegmentRecoveryTest_shard1_replica_n1] o.a.s.m.r.SolrJmxReporter JMX monitoring for 'solr_61236.solr.core.MissingSegmentRecoveryTest.shard1.replica_n1' (registry 'solr.core.MissingSegmentRecoveryTest.shard1.replica_n1') enabled at server: com.sun.jmx.mbeanserver.JmxMBeanServer@6a85b2c6
   [junit4]   2> 524916 INFO  (qtp214325874-4164) [n:127.0.0.1:61236_solr c:MissingSegmentRecoveryTest s:shard1 r:core_node3 x:MissingSegmentRecoveryTest_shard1_replica_n1] o.a.s.c.SolrCore [[MissingSegmentRecoveryTest_shard1_replica_n1] ] Opening new SolrCore at [C:\Users\jenkins\workspace\Lucene-Solr-8.1-Windows\solr\build\solr-core\test\J1\temp\solr.cloud.MissingSegmentRecoveryTest_E077A03BBA687400-001\tempDir-001\node2\MissingSegmentRecoveryTest_shard1_replica_n1], dataDir=[C:\Users\jenkins\workspace\Lucene-Solr-8.1-Windows\solr\build\solr-core\test\J1\temp\solr.cloud.MissingSegmentRecoveryTest_E077A03BBA687400-001\tempDir-001\node2\.\MissingSegmentRecoveryTest_shard1_replica_n1\data\]
   [junit4]   2> 525050 INFO  (qtp2016407112-4161) [n:127.0.0.1:61237_solr c:MissingSegmentRecoveryTest s:shard1 r:core_node4 x:MissingSegmentRecoveryTest_shard1_replica_n2] o.a.s.u.UpdateHandler Using UpdateLog implementation: org.apache.solr.update.UpdateLog
   [junit4]   2> 525050 INFO  (qtp2016407112-4161) [n:127.0.0.1:61237_solr c:MissingSegmentRecoveryTest s:shard1 r:core_node4 x:MissingSegmentRecoveryTest_shard1_replica_n2] o.a.s.u.UpdateLog Initializing UpdateLog: dataDir=null defaultSyncLevel=FLUSH numRecordsToKeep=100 maxNumLogsToKeep=10 numVersionBuckets=65536
   [junit4]   2> 525055 INFO  (qtp2016407112-4161) [n:127.0.0.1:61237_solr c:MissingSegmentRecoveryTest s:shard1 r:core_node4 x:MissingSegmentRecoveryTest_shard1_replica_n2] o.a.s.u.CommitTracker Hard AutoCommit: disabled
   [junit4]   2> 525055 INFO  (qtp2016407112-4161) [n:127.0.0.1:61237_solr c:MissingSegmentRecoveryTest s:shard1 r:core_node4 x:MissingSegmentRecoveryTest_shard1_replica_n2] o.a.s.u.CommitTracker Soft AutoCommit: disabled
   [junit4]   2> 525058 INFO  (qtp214325874-4164) [n:127.0.0.1:61236_solr c:MissingSegmentRecoveryTest s:shard1 r:core_node3 x:MissingSegmentRecoveryTest_shard1_replica_n1] o.a.s.u.UpdateHandler Using UpdateLog implementation: org.apache.solr.update.UpdateLog
   [junit4]   2> 525058 INFO  (qtp214325874-4164) [n:127.0.0.1:61236_solr c:MissingSegmentRecoveryTest s:shard1 r:core_node3 x:MissingSegmentRecoveryTest_shard1_replica_n1] o.a.s.u.UpdateLog Initializing UpdateLog: dataDir=null defaultSyncLevel=FLUSH numRecordsToKeep=100 maxNumLogsToKeep=10 numVersionBuckets=65536
   [junit4]   2> 525060 INFO  (qtp214325874-4164) [n:127.0.0.1:61236_solr c:MissingSegmentRecoveryTest s:shard1 r:core_node3 x:MissingSegmentRecoveryTest_shard1_replica_n1] o.a.s.u.CommitTracker Hard AutoCommit: disabled
   [junit4]   2> 525060 INFO  (qtp214325874-4164) [n:127.0.0.1:61236_solr c:MissingSegmentRecoveryTest s:shard1 r:core_node3 x:MissingSegmentRecoveryTest_shard1_replica_n1] o.a.s.u.CommitTracker Soft AutoCommit: disabled
   [junit4]   2> 525061 INFO  (qtp2016407112-4161) [n:127.0.0.1:61237_solr c:MissingSegmentRecoveryTest s:shard1 r:core_node4 x:MissingSegmentRecoveryTest_shard1_replica_n2] o.a.s.s.SolrIndexSearcher Opening [Searcher@228713d6[MissingSegmentRecoveryTest_shard1_replica_n2] main]
   [junit4]   2> 525063 INFO  (qtp2016407112-4161) [n:127.0.0.1:61237_solr c:MissingSegmentRecoveryTest s:shard1 r:core_node4 x:MissingSegmentRecoveryTest_shard1_replica_n2] o.a.s.r.ManagedResourceStorage Configured ZooKeeperStorageIO with znodeBase: /configs/conf
   [junit4]   2> 525064 INFO  (qtp2016407112-4161) [n:127.0.0.1:61237_solr c:MissingSegmentRecoveryTest s:shard1 r:core_node4 x:MissingSegmentRecoveryTest_shard1_replica_n2] o.a.s.r.ManagedResourceStorage Loaded null at path _rest_managed.json using ZooKeeperStorageIO:path=/configs/conf
   [junit4]   2> 525064 INFO  (qtp2016407112-4161) [n:127.0.0.1:61237_solr c:MissingSegmentRecoveryTest s:shard1 r:core_node4 x:MissingSegmentRecoveryTest_shard1_replica_n2] o.a.s.h.ReplicationHandler Commits will be reserved for 10000ms.
   [junit4]   2> 525064 INFO  (qtp2016407112-4161) [n:127.0.0.1:61237_solr c:MissingSegmentRecoveryTest s:shard1 r:core_node4 x:MissingSegmentRecoveryTest_shard1_replica_n2] o.a.s.u.UpdateLog Could not find max version in index or recent updates, using new clock 1635185528607342592
   [junit4]   2> 525066 INFO  (qtp214325874-4164) [n:127.0.0.1:61236_solr c:MissingSegmentRecoveryTest s:shard1 r:core_node3 x:MissingSegmentRecoveryTest_shard1_replica_n1] o.a.s.s.SolrIndexSearcher Opening [Searcher@2eaba818[MissingSegmentRecoveryTest_shard1_replica_n1] main]
   [junit4]   2> 525067 INFO  (searcherExecutor-1256-thread-1-processing-n:127.0.0.1:61237_solr x:MissingSegmentRecoveryTest_shard1_replica_n2 c:MissingSegmentRecoveryTest s:shard1 r:core_node4) [n:127.0.0.1:61237_solr c:MissingSegmentRecoveryTest s:shard1 r:core_node4 x:MissingSegmentRecoveryTest_shard1_replica_n2] o.a.s.c.SolrCore [MissingSegmentRecoveryTest_shard1_replica_n2] Registered new searcher Searcher@228713d6[MissingSegmentRecoveryTest_shard1_replica_n2] main{ExitableDirectoryReader(UninvertingDirectoryReader())}
   [junit4]   2> 525067 INFO  (qtp214325874-4164) [n:127.0.0.1:61236_solr c:MissingSegmentRecoveryTest s:shard1 r:core_node3 x:MissingSegmentRecoveryTest_shard1_replica_n1] o.a.s.r.ManagedResourceStorage Configured ZooKeeperStorageIO with znodeBase: /configs/conf
   [junit4]   2> 525068 INFO  (qtp214325874-4164) [n:127.0.0.1:61236_solr c:MissingSegmentRecoveryTest s:shard1 r:core_node3 x:MissingSegmentRecoveryTest_shard1_replica_n1] o.a.s.r.ManagedResourceStorage Loaded null at path _rest_managed.json using ZooKeeperStorageIO:path=/configs/conf
   [junit4]   2> 525069 INFO  (qtp214325874-4164) [n:127.0.0.1:61236_solr c:MissingSegmentRecoveryTest s:shard1 r:core_node3 x:MissingSegmentRecoveryTest_shard1_replica_n1] o.a.s.h.ReplicationHandler Commits will be reserved for 10000ms.
   [junit4]   2> 525069 INFO  (qtp214325874-4164) [n:127.0.0.1:61236_solr c:MissingSegmentRecoveryTest s:shard1 r:core_node3 x:MissingSegmentRecoveryTest_shard1_replica_n1] o.a.s.u.UpdateLog Could not find max version in index or recent updates, using new clock 1635185528612585472
   [junit4]   2> 525071 INFO  (qtp2016407112-4161) [n:127.0.0.1:61237_solr c:MissingSegmentRecoveryTest s:shard1 r:core_node4 x:MissingSegmentRecoveryTest_shard1_replica_n2] o.a.s.c.ZkShardTerms Successful update of terms at /collections/MissingSegmentRecoveryTest/terms/shard1 to Terms{values={core_node4=0}, version=0}
   [junit4]   2> 525071 INFO  (qtp2016407112-4161) [n:127.0.0.1:61237_solr c:MissingSegmentRecoveryTest s:shard1 r:core_node4 x:MissingSegmentRecoveryTest_shard1_replica_n2] o.a.s.c.ShardLeaderElectionContextBase make sure parent is created /collections/MissingSegmentRecoveryTest/leaders/shard1
   [junit4]   2> 525071 INFO  (searcherExecutor-1257-thread-1-processing-n:127.0.0.1:61236_solr x:MissingSegmentRecoveryTest_shard1_replica_n1 c:MissingSegmentRecoveryTest s:shard1 r:core_node3) [n:127.0.0.1:61236_solr c:MissingSegmentRecoveryTest s:shard1 r:core_node3 x:MissingSegmentRecoveryTest_shard1_replica_n1] o.a.s.c.SolrCore [MissingSegmentRecoveryTest_shard1_replica_n1] Registered new searcher Searcher@2eaba818[MissingSegmentRecoveryTest_shard1_replica_n1] main{ExitableDirectoryReader(UninvertingDirectoryReader())}
   [junit4]   2> 525077 INFO  (qtp214325874-4164) [n:127.0.0.1:61236_solr c:MissingSegmentRecoveryTest s:shard1 r:core_node3 x:MissingSegmentRecoveryTest_shard1_replica_n1] o.a.s.c.ZkShardTerms Successful update of terms at /collections/MissingSegmentRecoveryTest/terms/shard1 to Terms{values={core_node3=0, core_node4=0}, version=1}
   [junit4]   2> 525077 INFO  (qtp214325874-4164) [n:127.0.0.1:61236_solr c:MissingSegmentRecoveryTest s:shard1 r:core_node3 x:MissingSegmentRecoveryTest_shard1_replica_n1] o.a.s.c.ShardLeaderElectionContextBase make sure parent is created /collections/MissingSegmentRecoveryTest/leaders/shard1
   [junit4]   2> 525079 INFO  (qtp2016407112-4161) [n:127.0.0.1:61237_solr c:MissingSegmentRecoveryTest s:shard1 r:core_node4 x:MissingSegmentRecoveryTest_shard1_replica_n2] o.a.s.c.ShardLeaderElectionContext Enough replicas found to continue.
   [junit4]   2> 525079 INFO  (qtp2016407112-4161) [n:127.0.0.1:61237_solr c:MissingSegmentRecoveryTest s:shard1 r:core_node4 x:MissingSegmentRecoveryTest_shard1_replica_n2] o.a.s.c.ShardLeaderElectionContext I may be the new leader - try and sync
   [junit4]   2> 525079 INFO  (qtp2016407112-4161) [n:127.0.0.1:61237_solr c:MissingSegmentRecoveryTest s:shard1 r:core_node4 x:MissingSegmentRecoveryTest_shard1_replica_n2] o.a.s.c.SyncStrategy Sync replicas to http://127.0.0.1:61237/solr/MissingSegmentRecoveryTest_shard1_replica_n2/
   [junit4]   2> 525080 INFO  (qtp2016407112-4161) [n:127.0.0.1:61237_solr c:MissingSegmentRecoveryTest s:shard1 r:core_node4 x:MissingSegmentRecoveryTest_shard1_replica_n2] o.a.s.u.PeerSync PeerSync: core=MissingSegmentRecoveryTest_shard1_replica_n2 url=http://127.0.0.1:61237/solr START replicas=[http://127.0.0.1:61236/solr/MissingSegmentRecoveryTest_shard1_replica_n1/] nUpdates=100
   [junit4]   2> 525080 INFO  (qtp2016407112-4161) [n:127.0.0.1:61237_solr c:MissingSegmentRecoveryTest s:shard1 r:core_node4 x:MissingSegmentRecoveryTest_shard1_replica_n2] o.a.s.u.PeerSync PeerSync: core=MissingSegmentRecoveryTest_shard1_replica_n2 url=http://127.0.0.1:61237/solr DONE.  We have no versions.  sync failed.
   [junit4]   2> 525084 INFO  (qtp214325874-4166) [n:127.0.0.1:61236_solr c:MissingSegmentRecoveryTest s:shard1 r:core_node3 x:MissingSegmentRecoveryTest_shard1_replica_n1] o.a.s.c.S.Request [MissingSegmentRecoveryTest_shard1_replica_n1]  webapp=/solr path=/get params={distrib=false&qt=/get&fingerprint=false&getVersions=100&wt=javabin&version=2} status=0 QTime=1
   [junit4]   2> 525084 INFO  (qtp2016407112-4161) [n:127.0.0.1:61237_solr c:MissingSegmentRecoveryTest s:shard1 r:core_node4 x:MissingSegmentRecoveryTest_shard1_replica_n2] o.a.s.c.SyncStrategy Leader's attempt to sync with shard failed, moving to the next candidate
   [junit4]   2> 525084 INFO  (qtp2016407112-4161) [n:127.0.0.1:61237_solr c:MissingSegmentRecoveryTest s:shard1 r:core_node4 x:MissingSegmentRecoveryTest_shard1_replica_n2] o.a.s.c.ShardLeaderElectionContext We failed sync, but we have no versions - we can't sync in that case - we were active before, so become leader anyway
   [junit4]   2> 525084 INFO  (qtp2016407112-4161) [n:127.0.0.1:61237_solr c:MissingSegmentRecoveryTest s:shard1 r:core_node4 x:MissingSegmentRecoveryTest_shard1_replica_n2] o.a.s.c.ShardLeaderElectionContextBase Creating leader registration node /collections/MissingSegmentRecoveryTest/leaders/shard1/leader after winning as /collections/MissingSegmentRecoveryTest/leader_elect/shard1/election/72159573893120009-core_node4-n_0000000000
   [junit4]   2> 525087 INFO  (qtp2016407112-4161) [n:127.0.0.1:61237_solr c:MissingSegmentRecoveryTest s:shard1 r:core_node4 x:MissingSegmentRecoveryTest_shard1_replica_n2] o.a.s.c.ShardLeaderElectionContext I am the new leader: http://127.0.0.1:61237/solr/MissingSegmentRecoveryTest_shard1_replica_n2/ shard1
   [junit4]   2> 525189 INFO  (zkCallback-1495-thread-1) [    ] o.a.s.c.c.ZkStateReader A cluster state change: [WatchedEvent state:SyncConnected type:NodeDataChanged path:/collections/MissingSegmentRecoveryTest/state.json] for collection [MissingSegmentRecoveryTest] has occurred - updating... (live nodes size: [2])
   [junit4]   2> 525189 INFO  (zkCallback-1495-thread-2) [    ] o.a.s.c.c.ZkStateReader A cluster state change: [WatchedEvent state:SyncConnected type:NodeDataChanged path:/collections/MissingSegmentRecoveryTest/state.json] for collection [MissingSegmentRecoveryTest] has occurred - updating... (live nodes size: [2])
   [junit4]   2> 525190 INFO  (qtp2016407112-4161) [n:127.0.0.1:61237_solr c:MissingSegmentRecoveryTest s:shard1 r:core_node4 x:MissingSegmentRecoveryTest_shard1_replica_n2] o.a.s.c.ZkController I am the leader, no recovery necessary
   [junit4]   2> 525194 INFO  (qtp2016407112-4161) [n:127.0.0.1:61237_solr c:MissingSegmentRecoveryTest s:shard1 r:core_node4 x:MissingSegmentRecoveryTest_shard1_replica_n2] o.a.s.s.HttpSolrCall [admin] webapp=null path=/admin/cores params={qt=/admin/cores&coreNodeName=core_node4&collection.configName=conf&newCollection=true&name=MissingSegmentRecoveryTest_shard1_replica_n2&action=CREATE&numShards=1&collection=MissingSegmentRecoveryTest&shard=shard1&wt=javabin&version=2&replicaType=NRT} status=0 QTime=1331
   [junit4]   2> 525294 INFO  (zkCallback-1495-thread-2) [    ] o.a.s.c.c.ZkStateReader A cluster state change: [WatchedEvent state:SyncConnected type:NodeDataChanged path:/collections/MissingSegmentRecoveryTest/state.json] for collection [MissingSegmentRecoveryTest] has occurred - updating... (live nodes size: [2])
   [junit4]   2> 525294 INFO  (zkCallback-1495-thread-1) [    ] o.a.s.c.c.ZkStateReader A cluster state change: [WatchedEvent state:SyncConnected type:NodeDataChanged path:/collections/MissingSegmentRecoveryTest/state.json] for collection [MissingSegmentRecoveryTest] has occurred - updating... (live nodes size: [2])
   [junit4]   2> 525295 INFO  (zkCallback-1495-thread-3) [    ] o.a.s.c.c.ZkStateReader A cluster state change: [WatchedEvent state:SyncConnected type:NodeDataChanged path:/collections/MissingSegmentRecoveryTest/state.json] for collection [MissingSegmentRecoveryTest] has occurred - updating... (live nodes size: [2])
   [junit4]   2> 526082 INFO  (qtp214325874-4164) [n:127.0.0.1:61236_solr c:MissingSegmentRecoveryTest s:shard1 r:core_node3 x:MissingSegmentRecoveryTest_shard1_replica_n1] o.a.s.s.HttpSolrCall [admin] webapp=null path=/admin/cores params={qt=/admin/cores&coreNodeName=core_node3&collection.configName=conf&newCollection=true&name=MissingSegmentRecoveryTest_shard1_replica_n1&action=CREATE&numShards=1&collection=MissingSegmentRecoveryTest&shard=shard1&wt=javabin&version=2&replicaType=NRT} status=0 QTime=2221
   [junit4]   2> 526087 INFO  (qtp214325874-4162) [n:127.0.0.1:61236_solr    ] o.a.s.h.a.CollectionsHandler Wait for new collection to be active for at most 45 seconds. Check all shard replicas
   [junit4]   2> 526185 INFO  (zkCallback-1480-thread-1) [    ] o.a.s.c.c.ZkStateReader A cluster state change: [WatchedEvent state:SyncConnected type:NodeDataChanged path:/collections/MissingSegmentRecoveryTest/state.json] for collection [MissingSegmentRecoveryTest] has occurred - updating... (live nodes size: [2])
   [junit4]   2> 526185 INFO  (zkCallback-1495-thread-3) [    ] o.a.s.c.c.ZkStateReader A cluster state change: [WatchedEvent state:SyncConnected type:NodeDataChanged path:/collections/MissingSegmentRecoveryTest/state.json] for collection [MissingSegmentRecoveryTest] has occurred - updating... (live nodes size: [2])
   [junit4]   2> 526185 INFO  (zkCallback-1495-thread-1) [    ] o.a.s.c.c.ZkStateReader A cluster state change: [WatchedEvent state:SyncConnected type:NodeDataChanged path:/collections/MissingSegmentRecoveryTest/state.json] for collection [MissingSegmentRecoveryTest] has occurred - updating... (live nodes size: [2])
   [junit4]   2> 526185 INFO  (zkCallback-1495-thread-2) [    ] o.a.s.c.c.ZkStateReader A cluster state change: [WatchedEvent state:SyncConnected type:NodeDataChanged path:/collections/MissingSegmentRecoveryTest/state.json] for collection [MissingSegmentRecoveryTest] has occurred - updating... (live nodes size: [2])
   [junit4]   2> 526185 INFO  (qtp214325874-4162) [n:127.0.0.1:61236_solr    ] o.a.s.s.HttpSolrCall [admin] webapp=null path=/admin/collections params={collection.configName=conf&maxShardsPerNode=1&name=MissingSegmentRecoveryTest&nrtReplicas=2&action=CREATE&numShards=1&wt=javabin&version=2} status=0 QTime=2647
   [junit4]   2> 526187 INFO  (TEST-MissingSegmentRecoveryTest.testLeaderRecovery-seed#[E077A03BBA687400]) [    ] o.a.s.c.SolrCloudTestCase active replica count: 2 expected replica count: 2
   [junit4]   2> 526188 INFO  (zkCallback-1480-thread-2) [    ] o.a.s.c.c.ZkStateReader A cluster state change: [WatchedEvent state:SyncConnected type:NodeDataChanged path:/collections/MissingSegmentRecoveryTest/state.json] for collection [MissingSegmentRecoveryTest] has occurred - updating... (live nodes size: [2])
   [junit4]   2> 526196 INFO  (qtp2016407112-4169) [n:127.0.0.1:61237_solr c:MissingSegmentRecoveryTest s:shard1 r:core_node4 x:MissingSegmentRecoveryTest_shard1_replica_n2] o.a.s.c.ZkShardTerms Successful update of terms at /collections/MissingSegmentRecoveryTest/terms/shard1 to Terms{values={core_node3=1, core_node4=1}, version=2}
   [junit4]   2> 526203 INFO  (qtp214325874-4163) [n:127.0.0.1:61236_solr c:MissingSegmentRecoveryTest s:shard1 r:core_node3 x:MissingSegmentRecoveryTest_shard1_replica_n1] o.a.s.u.p.LogUpdateProcessorFactory [MissingSegmentRecoveryTest_shard1_replica_n1]  webapp=/solr path=/update params={update.distrib=FROMLEADER&distrib.from=http://127.0.0.1:61237/solr/MissingSegmentRecoveryTest_shard1_replica_n2/&wt=javabin&version=2}{add=[0 (1635185529789087744), 1 (1635185529793282048), 2 (1635185529793282049), 3 (1635185529793282050), 4 (1635185529793282051), 5 (1635185529793282052), 6 (1635185529793282053), 7 (1635185529794330624), 8 (1635185529794330625), 9 (1635185529794330626)]} 0 3
   [junit4]   2> 526205 INFO  (qtp2016407112-4169) [n:127.0.0.1:61237_solr c:MissingSegmentRecoveryTest s:shard1 r:core_node4 x:MissingSegmentRecoveryTest_shard1_replica_n2] o.a.s.u.p.LogUpdateProcessorFactory [MissingSegmentRecoveryTest_shard1_replica_n2]  webapp=/solr path=/update params={wt=javabin&version=2}{add=[0 (1635185529789087744), 1 (1635185529793282048), 2 (1635185529793282049), 3 (1635185529793282050), 4 (1635185529793282051), 5 (1635185529793282052), 6 (1635185529793282053), 7 (1635185529794330624), 8 (1635185529794330625), 9 (1635185529794330626)]} 0 14
   [junit4]   2> 526205 INFO  (qtp2016407112-4170) [n:127.0.0.1:61237_solr c:MissingSegmentRecoveryTest s:shard1 r:core_node4 x:MissingSegmentRecoveryTest_shard1_replica_n2] o.a.s.u.DirectUpdateHandler2 start commit{_version_=1635185529803767808,optimize=false,openSearcher=true,waitSearcher=true,expungeDeletes=false,softCommit=false,prepareCommit=false}
   [junit4]   2> 526206 INFO  (qtp2016407112-4170) [n:127.0.0.1:61237_solr c:MissingSegmentRecoveryTest s:shard1 r:core_node4 x:MissingSegmentRecoveryTest_shard1_replica_n2] o.a.s.u.SolrIndexWriter Calling setCommitData with IW:org.apache.solr.update.SolrIndexWriter@5540ccf4 commitCommandVersion:1635185529803767808
   [junit4]   2> 526208 INFO  (qtp214325874-4165) [n:127.0.0.1:61236_solr c:MissingSegmentRecoveryTest s:shard1 r:core_node3 x:MissingSegmentRecoveryTest_shard1_replica_n1] o.a.s.u.DirectUpdateHandler2 start commit{_version_=1635185529806913536,optimize=false,openSearcher=true,waitSearcher=true,expungeDeletes=false,softCommit=false,prepareCommit=false}
   [junit4]   2> 526208 INFO  (qtp214325874-4165) [n:127.0.0.1:61236_solr c:MissingSegmentRecoveryTest s:shard1 r:core_node3 x:MissingSegmentRecoveryTest_shard1_replica_n1] o.a.s.u.SolrIndexWriter Calling setCommitData with IW:org.apache.solr.update.SolrIndexWriter@4a9f95da commitCommandVersion:1635185529806913536
   [junit4]   2> 526238 INFO  (qtp214325874-4165) [n:127.0.0.1:61236_solr c:MissingSegmentRecoveryTest s:shard1 r:core_node3 x:MissingSegmentRecoveryTest_shard1_replica_n1] o.a.s.s.SolrIndexSearcher Opening [Searcher@44f8c52c[MissingSegmentRecoveryTest_shard1_replica_n1] main]
   [junit4]   2> 526238 INFO  (qtp2016407112-4170) [n:127.0.0.1:61237_solr c:MissingSegmentRecoveryTest s:shard1 r:core_node4 x:MissingSegmentRecoveryTest_shard1_replica_n2] o.a.s.s.SolrIndexSearcher Opening [Searcher@6a838b33[MissingSegmentRecoveryTest_shard1_replica_n2] main]
   [junit4]   2> 526238 INFO  (qtp214325874-4165) [n:127.0.0.1:61236_solr c:MissingSegmentRecoveryTest s:shard1 r:core_node3 x:MissingSegmentRecoveryTest_shard1_replica_n1] o.a.s.u.DirectUpdateHandler2 end_commit_flush
   [junit4]   2> 526239 INFO  (qtp2016407112-4170) [n:127.0.0.1:61237_solr c:MissingSegmentRecoveryTest s:shard1 r:core_node4 x:MissingSegmentRecoveryTest_shard1_replica_n2] o.a.s.u.DirectUpdateHandler2 end_commit_flush
   [junit4]   2> 526239 INFO  (searcherExecutor-1257-thread-1-processing-n:127.0.0.1:61236_solr x:MissingSegmentRecoveryTest_shard1_replica_n1 c:MissingSegmentRecoveryTest s:shard1 r:core_node3) [n:127.0.0.1:61236_solr c:MissingSegmentRecoveryTest s:shard1 r:core_node3 x:MissingSegmentRecoveryTest_shard1_replica_n1] o.a.s.c.SolrCore [MissingSegmentRecoveryTest_shard1_replica_n1] Registered new searcher Searcher@44f8c52c[MissingSegmentRecoveryTest_shard1_replica_n1] main{ExitableDirectoryReader(UninvertingDirectoryReader(Uninverting(_0(8.1.1):C10:[diagnostics={os=Windows 10, java.vendor=Oracle Corporation, java.version=12, java.vm.version=12+33, lucene.version=8.1.1, os.arch=amd64, java.runtime.version=12+33, source=flush, os.version=10.0, timestamp=1559434442344}]:[attributes={Lucene50StoredFieldsFormat.mode=BEST_SPEED}])))}
   [junit4]   2> 526239 INFO  (qtp214325874-4165) [n:127.0.0.1:61236_solr c:MissingSegmentRecoveryTest s:shard1 r:core_node3 x:MissingSegmentRecoveryTest_shard1_replica_n1] o.a.s.u.p.LogUpdateProcessorFactory [MissingSegmentRecoveryTest_shard1_replica_n1]  webapp=/solr path=/update params={update.distrib=FROMLEADER&waitSearcher=true&openSearcher=true&commit=true&softCommit=false&distrib.from=http://127.0.0.1:61237/solr/MissingSegmentRecoveryTest_shard1_replica_n2/&commit_end_point=replicas&wt=javabin&version=2&expungeDeletes=false}{commit=} 0 32
   [junit4]   2> 526240 INFO  (searcherExecutor-1256-thread-1-processing-n:127.0.0.1:61237_solr x:MissingSegmentRecoveryTest_shard1_replica_n2 c:MissingSegmentRecoveryTest s:shard1 r:core_node4) [n:127.0.0.1:61237_solr c:MissingSegmentRecoveryTest s:shard1 r:core_node4 x:MissingSegmentRecoveryTest_shard1_replica_n2] o.a.s.c.SolrCore [MissingSegmentRecoveryTest_shard1_replica_n2] Registered new searcher Searcher@6a838b33[MissingSegmentRecoveryTest_shard1_replica_n2] main{ExitableDirectoryReader(UninvertingDirectoryReader(Uninverting(_0(8.1.1):C10:[diagnostics={os=Windows 10, java.vendor=Oracle Corporation, java.version=12, java.vm.version=12+33, lucene.version=8.1.1, os.arch=amd64, java.runtime.version=12+33, source=flush, os.version=10.0, timestamp=1559434442344}]:[attributes={Lucene50StoredFieldsFormat.mode=BEST_SPEED}])))}
   [junit4]   2> 526240 INFO  (qtp2016407112-4170) [n:127.0.0.1:61237_solr c:MissingSegmentRecoveryTest s:shard1 r:core_node4 x:MissingSegmentRecoveryTest_shard1_replica_n2] o.a.s.u.p.LogUpdateProcessorFactory [MissingSegmentRecoveryTest_shard1_replica_n2]  webapp=/solr path=/update params={_stateVer_=MissingSegmentRecoveryTest:5&waitSearcher=true&commit=true&softCommit=false&wt=javabin&version=2}{commit=} 0 35
   [junit4]   2> 526242 INFO  (TEST-MissingSegmentRecoveryTest.testLeaderRecovery-seed#[E077A03BBA687400]) [    ] o.a.s.c.CoreContainer Shutting down CoreContainer instance=1597935732
   [junit4]   2> 526243 INFO  (TEST-MissingSegmentRecoveryTest.testLeaderRecovery-seed#[E077A03BBA687400]) [    ] o.a.s.c.ZkController Remove node as live in ZooKeeper:/live_nodes/127.0.0.1:61236_solr
   [junit4]   2> 526243 INFO  (TEST-MissingSegmentRecoveryTest.testLeaderRecovery-seed#[E077A03BBA687400]) [    ] o.a.s.c.ZkController Publish this node as DOWN...
   [junit4]   2> 526243 INFO  (TEST-MissingSegmentRecoveryTest.testLeaderRecovery-seed#[E077A03BBA687400]) [    ] o.a.s.c.ZkController Publish node=127.0.0.1:61236_solr as DOWN
   [junit4]   2> 526247 INFO  (coreCloseExecutor-1266-thread-1) [n:127.0.0.1:61236_solr c:MissingSegmentRecoveryTest s:shard1 r:core_node3 x:MissingSegmentRecoveryTest_shard1_replica_n1] o.a.s.c.SolrCore [MissingSegmentRecoveryTest_shard1_replica_n1]  CLOSING SolrCore org.apache.solr.core.SolrCore@3c128d2b
   [junit4]   2> 526247 INFO  (coreCloseExecutor-1266-thread-1) [n:127.0.0.1:61236_solr c:MissingSegmentRecoveryTest s:shard1 r:core_node3 x:MissingSegmentRecoveryTest_shard1_replica_n1] o.a.s.m.SolrMetricManager Closing metric reporters for registry=solr.core.MissingSegmentRecoveryTest.shard1.replica_n1, tag=3c128d2b
   [junit4]   2> 526247 INFO  (coreCloseExecutor-1266-thread-1) [n:127.0.0.1:61236_solr c:MissingSegmentRecoveryTest s:shard1 r:core_node3 x:MissingSegmentRecoveryTest_shard1_replica_n1] o.a.s.m.r.SolrJmxReporter Closing reporter [org.apache.solr.metrics.reporters.SolrJmxReporter@4a3b7867: rootName = solr_61236, domain = solr.core.MissingSegmentRecoveryTest.shard1.replica_n1, service url = null, agent id = null] for registry solr.core.MissingSegmentRecoveryTest.shard1.replica_n1 / com.codahale.metrics.MetricRegistry@3fb0ead7
   [junit4]   2> 526256 INFO  (coreCloseExecutor-1266-thread-1) [n:127.0.0.1:61236_solr c:MissingSegmentRecoveryTest s:shard1 r:core_node3 x:MissingSegmentRecoveryTest_shard1_replica_n1] o.a.s.m.SolrMetricManager Closing metric reporters for registry=solr.collection.MissingSegmentRecoveryTest.shard1.leader, tag=3c128d2b
   [junit4]   2> 526262 INFO  (TEST-MissingSegmentRecoveryTest.testLeaderRecovery-seed#[E077A03BBA687400]) [    ] o.a.s.m.SolrMetricManager Closing metric reporters for registry=solr.node, tag=null
   [junit4]   2> 526263 INFO  (TEST-MissingSegmentRecoveryTest.testLeaderRecovery-seed#[E077A03BBA687400]) [    ] o.a.s.m.r.SolrJmxReporter Closing reporter [org.apache.solr.metrics.reporters.SolrJmxReporter@26b7478: rootName = solr_61236, domain = solr.node, service url = null, agent id = null] for registry solr.node / com.codahale.metrics.MetricRegistry@6ceab122
   [junit4]   2> 526270 INFO  (TEST-MissingSegmentRecoveryTest.testLeaderRecovery-seed#[E077A03BBA687400]) [    ] o.a.s.m.SolrMetricManager Closing metric reporters for registry=solr.jvm, tag=null
   [junit4]   2> 526270 INFO  (TEST-MissingSegmentRecoveryTest.testLeaderRecovery-seed#[E077A03BBA687400]) [    ] o.a.s.m.r.SolrJmxReporter Closing reporter [org.apache.solr.metrics.reporters.SolrJmxReporter@5800f292: rootName = solr_61236, domain = solr.jvm, service url = null, agent id = null] for registry solr.jvm / com.codahale.metrics.MetricRegistry@228d1c2a
   [junit4]   2> 526274 INFO  (TEST-MissingSegmentRecoveryTest.testLeaderRecovery-seed#[E077A03BBA687400]) [    ] o.a.s.m.SolrMetricManager Closing metric reporters for registry=solr.jetty, tag=null
   [junit4]   2> 526274 INFO  (TEST-MissingSegmentRecoveryTest.testLeaderRecovery-seed#[E077A03BBA687400]) [    ] o.a.s.m.r.SolrJmxReporter Closing reporter [org.apache.solr.metrics.reporters.SolrJmxReporter@1fd21dbe: rootName = solr_61236, domain = solr.jetty, service url = null, agent id = null] for registry solr.jetty / com.codahale.metrics.MetricRegistry@bb95bc0
   [junit4]   2> 526275 INFO  (TEST-MissingSegmentRecoveryTest.testLeaderRecovery-seed#[E077A03BBA687400]) [    ] o.a.s.m.SolrMetricManager Closing metric reporters for registry=solr.cluster, tag=null
   [junit4]   2> 526277 INFO  (TEST-MissingSegmentRecoveryTest.testLeaderRecovery-seed#[E077A03BBA687400]) [    ] o.a.s.c.Overseer Overseer (id=72159573893120006-127.0.0.1:61236_solr-n_0000000000) closing
   [junit4]   2> 526277 WARN  (NIOServerCxn.Factory:0.0.0.0/0.0.0.0:0) [    ] o.a.z.s.NIOServerCnxn Unable to read additional data from client sessionid 0x1005cc0090b0006, likely client has closed socket
   [junit4]   2> 526277 INFO  (OverseerStateUpdate-72159573893120006-127.0.0.1:61236_solr-n_0000000000) [n:127.0.0.1:61236_solr    ] o.a.s.c.Overseer Overseer Loop exiting : 127.0.0.1:61236_solr
   [junit4]   2> 526281 INFO  (OverseerAutoScalingTriggerThread-72159573893120006-127.0.0.1:61236_solr-n_0000000000) [    ] o.a.s.c.a.OverseerTriggerThread OverseerTriggerThread woken up but we are closed, exiting.
   [junit4]   2> 526281 INFO  (closeThreadPool-1516-thread-2) [    ] o.a.s.c.Overseer Overseer (id=72159573893120006-127.0.0.1:61236_solr-n_0000000000) closing
   [junit4]   2> 526281 INFO  (zkCallback-1509-thread-1) [    ] o.a.s.c.c.ZkStateReader Updated live nodes from ZooKeeper... (2) -> (1)
   [junit4]   2> 526281 INFO  (zkCallback-1503-thread-1) [    ] o.a.s.c.c.ZkStateReader Updated live nodes from ZooKeeper... (2) -> (1)
   [junit4]   2> 526281 INFO  (zkCallback-1487-thread-1) [    ] o.a.s.c.c.ZkStateReader Updated live nodes from ZooKeeper... (2) -> (1)
   [junit4]   2> 526281 INFO  (zkCallback-1495-thread-1) [    ] o.a.s.c.c.ZkStateReader Updated live nodes from ZooKeeper... (2) -> (1)
   [junit4]   2> 526283 INFO  (zkCallback-1495-thread-2) [    ] o.a.s.c.OverseerElectionContext I am going to be the leader 127.0.0.1:61237_solr
   [junit4]   2> 526283 INFO  (closeThreadPool-1516-thread-1) [    ] o.a.s.c.Overseer Overseer (id=72159573893120006-127.0.0.1:61236_solr-n_0000000000) closing
   [junit4]   2> 526284 INFO  (zkCallback-1495-thread-2) [n:127.0.0.1:61237_solr    ] o.a.s.c.Overseer Overseer (id=72159573893120009-127.0.0.1:61237_solr-n_0000000001) starting
   [junit4]   2> 526285 WARN  (NIOServerCxn.Factory:0.0.0.0/0.0.0.0:0) [    ] o.a.z.s.NIOServerCnxn Unable to read additional data from client sessionid 0x1005cc0090b0007, likely client has closed socket
   [junit4]   2> 526287 INFO  (TEST-MissingSegmentRecoveryTest.testLeaderRecovery-seed#[E077A03BBA687400]) [    ] o.e.j.s.AbstractConnector Stopped ServerConnector@656a93ab{HTTP/1.1,[http/1.1, h2c]}{127.0.0.1:0}
   [junit4]   2> 526295 INFO  (TEST-MissingSegmentRecoveryTest.testLeaderRecovery-seed#[E077A03BBA687400]) [    ] o.e.j.s.h.ContextHandler Stopped o.e.j.s.ServletContextHandler@3cb9c57d{/solr,null,UNAVAILABLE}
   [junit4]   2> 526295 INFO  (TEST-MissingSegmentRecoveryTest.testLeaderRecovery-seed#[E077A03BBA687400]) [    ] o.e.j.s.session node0 Stopped scavenging
   [junit4]   2> 526299 INFO  (OverseerStateUpdate-72159573893120009-127.0.0.1:61237_solr-n_0000000001) [n:127.0.0.1:61237_solr    ] o.a.s.c.Overseer Starting to work on the main queue : 127.0.0.1:61237_solr
   [junit4]   2> 526302 INFO  (TEST-MissingSegmentRecoveryTest.testLeaderRecovery-seed#[E077A03BBA687400]) [    ] o.a.s.c.s.e.JettySolrRunner Start Jetty (original configured port=0)
   [junit4]   2> 526302 WARN  (TEST-MissingSegmentRecoveryTest.testLeaderRecovery-seed#[E077A03BBA687400]) [    ] o.e.j.s.AbstractConnector Ignoring deprecated socket close linger time
   [junit4]   2> 526303 INFO  (TEST-MissingSegmentRecoveryTest.testLeaderRecovery-seed#[E077A03BBA687400]) [    ] o.a.s.c.s.e.JettySolrRunner Trying to start Jetty on port 61236 try number 1 ...
   [junit4]   2> 526303 INFO  (TEST-MissingSegmentRecoveryTest.testLeaderRecovery-seed#[E077A03BBA687400]) [    ] o.e.j.s.Server jetty-9.4.14.v20181114; built: 2018-11-14T21:20:31.478Z; git: c4550056e785fb5665914545889f21dc136ad9e6; jvm 12+33
   [junit4]   2> 526304 INFO  (TEST-MissingSegmentRecoveryTest.testLeaderRecovery-seed#[E077A03BBA687400]) [    ] o.e.j.s.session DefaultSessionIdManager workerName=node0
   [junit4]   2> 526304 INFO  (TEST-MissingSegmentRecoveryTest.testLeaderRecovery-seed#[E077A03BBA687400]) [    ] o.e.j.s.session No SessionScavenger set, using defaults
   [junit4]   2> 526304 INFO  (TEST-MissingSegmentRecoveryTest.testLeaderRecovery-seed#[E077A03BBA687400]) [    ] o.e.j.s.session node0 Scavenging every 660000ms
   [junit4]   2> 526304 INFO  (TEST-MissingSegmentRecoveryTest.testLeaderRecovery-seed#[E077A03BBA687400]) [    ] o.e.j.s.h.ContextHandler Started o.e.j.s.ServletContextHandler@6c248d57{/solr,null,AVAILABLE}
   [junit4]   2> 526306 INFO  (zkCallback-1495-thread-2) [    ] o.a.s.c.c.ZkStateReader A cluster state change: [WatchedEvent state:SyncConnected type:NodeDataChanged path:/collections/MissingSegmentRecoveryTest/state.json] for collection [MissingSegmentRecoveryTest] has occurred - updating... (live nodes size: [1])
   [junit4]   2> 526306 INFO  (zkCallback-1495-thread-1) [    ] o.a.s.c.c.ZkStateReader A cluster state change: [WatchedEvent state:SyncConnected type:NodeDataChanged path:/collections/MissingSegmentRecoveryTest/state.json] for collection [MissingSegmentRecoveryTest] has occurred - updating... (live nodes size: [1])
   [junit4]   2> 526306 INFO  (zkCallback-1495-thread-3) [    ] o.a.s.c.c.ZkStateReader A cluster state change: [WatchedEvent state:SyncConnected type:NodeDataChanged path:/collections/MissingSegmentRecoveryTest/state.json] for collection [MissingSegmentRecoveryTest] has occurred - updating... (live nodes size: [1])
   [junit4]   2> 526310 INFO  (TEST-MissingSegmentRecoveryTest.testLeaderRecovery-seed#[E077A03BBA687400]) [    ] o.e.j.s.AbstractConnector Started ServerConnector@118945ac{HTTP/1.1,[http/1.1, h2c]}{127.0.0.1:61236}
   [junit4]   2> 526310 INFO  (TEST-MissingSegmentRecoveryTest.testLeaderRecovery-seed#[E077A03BBA687400]) [    ] o.e.j.s.Server Started @526373ms
   [junit4]   2> 526310 INFO  (TEST-MissingSegmentRecoveryTest.testLeaderRecovery-seed#[E077A03BBA687400]) [    ] o.a.s.c.s.e.JettySolrRunner Jetty properties: {hostContext=/solr, hostPort=61236}
   [junit4]   2> 526310 ERROR (TEST-MissingSegmentRecoveryTest.testLeaderRecovery-seed#[E077A03BBA687400]) [    ] o.a.s.u.StartupLoggingUtils Missing Java Option solr.log.dir. Logging may be missing or incomplete.
   [junit4]   2> 526310 INFO  (TEST-MissingSegmentRecoveryTest.testLeaderRecovery-seed#[E077A03BBA687400]) [    ] o.a.s.s.SolrDispatchFilter Using logger factory org.apache.logging.slf4j.Log4jLoggerFactory
   [junit4]   2> 526310 INFO  (TEST-MissingSegmentRecoveryTest.testLeaderRecovery-seed#[E077A03BBA687400]) [    ] o.a.s.s.SolrDispatchFilter  ___      _       Welcome to Apache Solr? version 8.1.1
   [junit4]   2> 526310 INFO  (TEST-MissingSegmentRecoveryTest.testLeaderRecovery-seed#[E077A03BBA687400]) [    ] o.a.s.s.SolrDispatchFilter / __| ___| |_ _   Starting in cloud mode on port null
   [junit4]   2> 526310 INFO  (TEST-MissingSegmentRecoveryTest.testLeaderRecovery-seed#[E077A03BBA687400]) [    ] o.a.s.s.SolrDispatchFilter \__ \/ _ \ | '_|  Install dir: null
   [junit4]   2> 526310 INFO  (TEST-MissingSegmentRecoveryTest.testLeaderRecovery-seed#[E077A03BBA687400]) [    ] o.a.s.s.SolrDispatchFilter |___/\___/_|_|    Start time: 2019-06-02T00:14:02.438213600Z
   [junit4]   2> 526317 INFO  (zkConnectionManagerCallback-1518-thread-1) [    ] o.a.s.c.c.ConnectionManager zkClient has connected
   [junit4]   2> 526318 INFO  (TEST-MissingSegmentRecoveryTest.testLeaderRecovery-seed#[E077A03BBA687400]) [    ] o.a.s.s.SolrDispatchFilter solr.xml found in ZooKeeper. Loading...
   [junit4]   2> 526324 WARN  (NIOServerCxn.Factory:0.0.0.0/0.0.0.0:0) [    ] o.a.z.s.NIOServerCnxn Unable to read additional data from client sessionid 0x1005cc0090b000c, likely client has closed socket
   [junit4]   2> 526453 INFO  (TEST-MissingSegmentRecoveryTest.testLeaderRecovery-seed#[E077A03BBA687400]) [    ] o.a.s.h.c.HttpShardHandlerFactory Host whitelist initialized: WhitelistHostChecker [whitelistHosts=null, whitelistHostCheckingEnabled=true]
   [junit4]   2> 526464 WARN  (TEST-MissingSegmentRecoveryTest.testLeaderRecovery-seed#[E077A03BBA687400]) [    ] o.e.j.u.s.S.config No Client EndPointIdentificationAlgorithm configured for SslContextFactory@e1e6a14[provider=null,keyStore=null,trustStore=null]
   [junit4]   2> 526470 WARN  (TEST-MissingSegmentRecoveryTest.testLeaderRecovery-seed#[E077A03BBA687400]) [    ] o.e.j.u.s.S.config No Client EndPointIdentificationAlgorithm configured for SslContextFactory@53977b16[provider=null,keyStore=null,trustStore=null]
   [junit4]   2> 526472 INFO  (TEST-MissingSegmentRecoveryTest.testLeaderRecovery-seed#[E077A03BBA687400]) [    ] o.a.s.c.ZkContainer Zookeeper client=127.0.0.1:61225/solr
   [junit4]   2> 526479 INFO  (zkConnectionManagerCallback-1525-thread-1) [    ] o.a.s.c.c.ConnectionManager zkClient has connected
   [junit4]   2> 526481 WARN  (NIOServerCxn.Factory:0.0.0.0/0.0.0.0:0) [    ] o.a.z.s.NIOServerCnxn Unable to read additional data from client sessionid 0x1005cc0090b000d, likely client has closed socket
   [junit4]   2> 526485 INFO  (zkConnectionManagerCallback-1527-thread-1) [    ] o.a.s.c.c.ConnectionManager zkClient has connected
   [junit4]   2> 526500 INFO  (TEST-MissingSegmentRecoveryTest.testLeaderRecovery-seed#[E077A03BBA687400]) [n:127.0.0.1:61236_solr    ] o.a.s.c.c.ZkStateReader Updated live nodes from ZooKeeper... (0) -> (1)
   [junit4]   2> 526508 INFO  (TEST-MissingSegmentRecoveryTest.testLeaderRecovery-seed#[E077A03BBA687400]) [n:127.0.0.1:61236_solr    ] o.a.s.c.ZkController Publish node=127.0.0.1:61236_solr as DOWN
   [junit4]   2> 526510 INFO  (TEST-MissingSegmentRecoveryTest.testLeaderRecovery-seed#[E077A03BBA687400]) [n:127.0.0.1:61236_solr    ] o.a.s.c.TransientSolrCoreCacheDefault Allocating transient cache for 2147483647 transient cores
   [junit4]   2> 526510 INFO  (TEST-MissingSegmentRecoveryTest.testLeaderRecovery-seed#[E077A03BBA687400]) [n:127.0.0.1:61236_solr    ] o.a.s.c.ZkController Register node as live in ZooKeeper:/live_nodes/127.0.0.1:61236_solr
   [junit4]   2> 526512 INFO  (zkCallback-1503-thread-1) [    ] o.a.s.c.c.ZkStateReader Updated live nodes from ZooKeeper... (1) -> (2)
   [junit4]   2> 526512 INFO  (zkCallback-1495-thread-1) [    ] o.a.s.c.c.ZkStateReader Updated live nodes from ZooKeeper... (1) -> (2)
   [junit4]   2> 526512 INFO  (zkCallback-1509-thread-1) [    ] o.a.s.c.c.ZkStateReader Updated live nodes from ZooKeeper... (1) -> (2)
   [junit4]   2> 526514 INFO  (zkCallback-1526-thread-1) [    ] o.a.s.c.c.ZkStateReader Updated live nodes from ZooKeeper... (1) -> (2)
   [junit4]   2> 526559 INFO  (zkConnectionManagerCallback-1534-thread-1) [    ] o.a.s.c.c.ConnectionManager zkClient has connected
   [junit4]   2> 526560 INFO  (TEST-MissingSegmentRecoveryTest.testLeaderRecovery-seed#[E077A03BBA687400]) [n:127.0.0.1:61236_solr    ] o.a.s.c.c.ZkStateReader Updated live nodes from ZooKeeper... (0) -> (2)
   [junit4]   2> 526562 INFO  (TEST-MissingSegmentRecoveryTest.testLeaderRecovery-seed#[E077A03BBA687400]) [n:127.0.0.1:61236_solr    ] o.a.s.c.s.i.ZkClientClusterStateProvider Cluster at 127.0.0.1:61225/solr ready
   [junit4]   2> 526562 INFO  (TEST-MissingSegmentRecoveryTest.testLeaderRecovery-seed#[E077A03BBA687400]) [n:127.0.0.1:61236_solr    ] o.a.s.h.a.MetricsHistoryHandler No .system collection, keeping metrics history in memory.
   [junit4]   2> 526594 INFO  (TEST-MissingSegmentRecoveryTest.testLeaderRecovery-seed#[E077A03BBA687400]) [n:127.0.0.1:61236_solr    ] o.a.s.m.r.SolrJmxReporter JMX monitoring for 'solr_61236.solr.node' (registry 'solr.node') enabled at server: com.sun.jmx.mbeanserver.JmxMBeanServer@6a85b2c6
   [junit4]   2> 526608 INFO  (TEST-MissingSegmentRecoveryTest.testLeaderRecovery-seed#[E077A03BBA687400]) [n:127.0.0.1:61236_solr    ] o.a.s.m.r.SolrJmxReporter JMX monitoring for 'solr_61236.solr.jvm' (registry 'solr.jvm') enabled at server: com.sun.jmx.mbeanserver.JmxMBeanServer@6a85b2c6
   [junit4]   2> 526608 INFO  (TEST-MissingSegmentRecoveryTest.testLeaderRecovery-seed#[E077A03BBA687400]) [n:127.0.0.1:61236_solr    ] o.a.s.m.r.SolrJmxReporter JMX monitoring for 'solr_61236.solr.jetty' (registry 'solr.jetty') enabled at server: com.sun.jmx.mbeanserver.JmxMBeanServer@6a85b2c6
   [junit4]   2> 526608 INFO  (TEST-MissingSegmentRecoveryTest.testLeaderRecovery-seed#[E077A03BBA687400]) [n:127.0.0.1:61236_solr    ] o.a.s.c.CorePropertiesLocator Found 1 core definitions underneath C:\Users\jenkins\workspace\Lucene-Solr-8.1-Windows\solr\build\solr-core\test\J1\temp\solr.cloud.MissingSegmentRecoveryTest_E077A03BBA687400-001\tempDir-001\node2\.
   [junit4]   2> 526608 INFO  (TEST-MissingSegmentRecoveryTest.testLeaderRecovery-seed#[E077A03BBA687400]) [n:127.0.0.1:61236_solr    ] o.a.s.c.CorePropertiesLocator Cores are: [MissingSegmentRecoveryTest_shard1_replica_n1]
   [junit4]   2> 526622 INFO  (zkCallback-1495-thread-1) [    ] o.a.s.c.c.ZkStateReader A cluster state change: [WatchedEvent state:SyncConnected type:NodeDataChanged path:/collections/MissingSegmentRecoveryTest/state.json] for collection [MissingSegmentRecoveryTest] has occurred - updating... (live nodes size: [2])
   [junit4]   2> 526622 INFO  (zkCallback-1495-thread-3) [    ] o.a.s.c.c.ZkStateReader A cluster state change: [WatchedEvent state:SyncConnected type:NodeDataChanged path:/collections/MissingSegmentRecoveryTest/state.json] for collection [MissingSegmentRecoveryTest] has occurred - updating... (live nodes size: [2])
   [junit4]   2> 526622 INFO  (zkCallback-1495-thread-2) [    ] o.a.s.c.c.ZkStateReader A cluster state change: [WatchedEvent state:SyncConnected type:NodeDataChanged path:/collections/MissingSegmentRecoveryTest/state.json] for collection [MissingSegmentRecoveryTest] has occurred - updating... (live nodes size: [2])
   [junit4]   2> 526643 INFO  (coreLoadExecutor-1280-thread-1-processing-n:127.0.0.1:61236_solr) [n:127.0.0.1:61236_solr    ] o.a.s.c.SolrConfig Using Lucene MatchVersion: 8.1.1
   [junit4]   2> 526670 INFO  (coreLoadExecutor-1280-thread-1-processing-n:127.0.0.1:61236_solr) [n:127.0.0.1:61236_solr    ] o.a.s.s.IndexSchema [MissingSegmentRecoveryTest_shard1_replica_n1] Schema name=minimal
   [junit4]   2> 526670 INFO  (coreLoadExecutor-1280-thread-1-processing-n:127.0.0.1:61236_solr) [n:127.0.0.1:61236_solr    ] o.a.s.s.IndexSchema Loaded schema minimal/1.1 with uniqueid field id
   [junit4]   2> 526693 INFO  (coreLoadExecutor-1280-thread-1-processing-n:127.0.0.1:61236_solr) [n:127.0.0.1:61236_solr c:MissingSegmentRecoveryTest s:shard1 r:core_node3 x:MissingSegmentRecoveryTest_shard1_replica_n1] o.a.s.c.SolrConfig Using Lucene MatchVersion: 8.1.1
   [junit4]   2> 526718 INFO  (coreLoadExecutor-1280-thread-1-processing-n:127.0.0.1:61236_solr) [n:127.0.0.1:61236_solr c:MissingSegmentRecoveryTest s:shard1 r:core_node3 x:MissingSegmentRecoveryTest_shard1_replica_n1] o.a.s.s.IndexSchema [MissingSegmentRecoveryTest_shard1_replica_n1] Schema name=minimal
   [junit4]   2> 526720 INFO  (coreLoadExecutor-1280-thread-1-processing-n:127.0.0.1:61236_solr) [n:127.0.0.1:61236_solr c:MissingSegmentRecoveryTest s:shard1 r:core_node3 x:MissingSegmentRecoveryTest_shard1_replica_n1] o.a.s.s.IndexSchema Loaded schema minimal/1.1 with uniqueid field id
   [junit4]   2> 526720 INFO  (coreLoadExecutor-1280-thread-1-processing-n:127.0.0.1:61236_solr) [n:127.0.0.1:61236_solr c:MissingSegmentRecoveryTest s:shard1 r:core_node3 x:MissingSegmentRecoveryTest_shard1_replica_n1] o.a.s.c.CoreContainer Creating SolrCore 'MissingSegmentRecoveryTest_shard1_replica_n1' using configuration from collection MissingSegmentRecoveryTest, trusted=true
   [junit4]   2> 526721 INFO  (coreLoadExecutor-1280-thread-1-processing-n:127.0.0.1:61236_solr) [n:127.0.0.1:61236_solr c:MissingSegmentRecoveryTest s:shard1 r:core_node3 x:MissingSegmentRecoveryTest_shard1_replica_n1] o.a.s.m.r.SolrJmxReporter JMX monitoring for 'solr_61236.solr.core.MissingSegmentRecoveryTest.shard1.replica_n1' (registry 'solr.core.MissingSegmentRecoveryTest.shard1.replica_n1') enabled at server: com.sun.jmx.mbeanserver.JmxMBeanServer@6a85b2c6
   [junit4]   2> 526721 INFO  (coreLoadExecutor-1280-thread-1-processing-n:127.0.0.1:61236_solr) [n:127.0.0.1:61236_solr c:MissingSegmentRecoveryTest s:shard1 r:core_node3 x:MissingSegmentRecoveryTest_shard1_replica_n1] o.a.s.c.SolrCore [[MissingSegmentRecoveryTest_shard1_replica_n1] ] Opening new SolrCore at [C:\Users\jenkins\workspace\Lucene-Solr-8.1-Windows\solr\build\solr-core\test\J1\temp\solr.cloud.MissingSegmentRecoveryTest_E077A03BBA687400-001\tempDir-001\node2\MissingSegmentRecoveryTest_shard1_replica_n1], dataDir=[C:\Users\jenkins\workspace\Lucene-Solr-8.1-Windows\solr\build\solr-core\test\J1\temp\solr.cloud.MissingSegmentRecoveryTest_E077A03BBA687400-001\tempDir-001\node2\.\MissingSegmentRecoveryTest_shard1_replica_n1\data\]
   [junit4]   2> 526856 INFO  (coreLoadExecutor-1280-thread-1-processing-n:127.0.0.1:61236_solr) [n:127.0.0.1:61236_solr c:MissingSegmentRecoveryTest s:shard1 r:core_node3 x:MissingSegmentRecoveryTest_shard1_replica_n1] o.a.s.u.UpdateHandler Using UpdateLog implementation: org.apache.solr.update.UpdateLog
   [junit4]   2> 526856 INFO  (coreLoadExecutor-1280-thread-1-processing-n:127.0.0.1:61236_solr) [n:127.0.0.1:61236_solr c:MissingSegmentRecoveryTest s:shard1 r:core_node3 x:MissingSegmentRecoveryTest_shard1_replica_n1] o.a.s.u.UpdateLog Initializing UpdateLog: dataDir=null defaultSyncLevel=FLUSH numRecordsToKeep=100 maxNumLogsToKeep=10 numVersionBuckets=65536
   [junit4]   2> 526858 INFO  (coreLoadExecutor-1280-thread-1-processing-n:127.0.0.1:61236_solr) [n:127.0.0.1:61236_solr c:MissingSegmentRecoveryTest s:shard1 r:core_node3 x:MissingSegmentRecoveryTest_shard1_replica_n1] o.a.s.u.CommitTracker Hard AutoCommit: disabled
   [junit4]   2> 526858 INFO  (coreLoadExecutor-1280-thread-1-processing-n:127.0.0.1:61236_solr) [n:127.0.0.1:61236_solr c:MissingSegmentRecoveryTest s:shard1 r:core_node3 x:MissingSegmentRecoveryTest_shard1_replica_n1] o.a.s.u.CommitTracker Soft AutoCommit: disabled
   [junit4]   2> 526870 INFO  (coreLoadExecutor-1280-thread-1-processing-n:127.0.0.1:61236_solr) [n:127.0.0.1:61236_solr c:MissingSegmentRecoveryTest s:shard1 r:core_node3 x:MissingSegmentRecoveryTest_shard1_replica_n1] o.a.s.c.SolrCore [MissingSegmentRecoveryTest_shard1_replica_n1]  CLOSING SolrCore org.apache.solr.core.SolrCore@406ec5b2
   [junit4]   2> 526870 INFO  (coreLoadExecutor-1280-thread-1-processing-n:127.0.0.1:61236_solr) [n:127.0.0.1:61236_solr c:MissingSegmentRecoveryTest s:shard1 r:core_node3 x:MissingSegmentRecoveryTest_shard1_replica_n1] o.a.s.m.SolrMetricManager Closing metric reporters for registry=solr.core.MissingSegmentRecoveryTest.shard1.replica_n1, tag=406ec5b2
   [junit4]   2> 526870 INFO  (coreLoadExecutor-1280-thread-1-processing-n:127.0.0.1:61236_solr) [n:127.0.0.1:61236_solr c:MissingSegmentRecoveryTest s:shard1 r:core_node3 x:MissingSegmentRecoveryTest_shard1_replica_n1] o.a.s.m.r.SolrJmxReporter Closing reporter [org.apache.solr.metrics.reporters.SolrJmxReporter@72d571c8: rootName = solr_61236, domain = solr.core.MissingSegmentRecoveryTest.shard1.replica_n1, service url = null, agent id = null] for registry solr.core.MissingSegmentRecoveryTest.shard1.replica_n1 / com.codahale.metrics.MetricRegistry@3cee30a6
   [junit4]   2> 526879 INFO  (coreLoadExecutor-1280-thread-1-processing-n:127.0.0.1:61236_solr) [n:127.0.0.1:61236_solr c:MissingSegmentRecoveryTest s:shard1 r:core_node3 x:MissingSegmentRecoveryTest_shard1_replica_n1] o.a.s.m.SolrMetricManager Closing metric reporters for registry=solr.collection.MissingSegmentRecoveryTest.shard1.leader, tag=406ec5b2
   [junit4]   2> 526883 INFO  (coreLoadExecutor-1280-thread-1-processing-n:127.0.0.1:61236_solr) [n:127.0.0.1:61236_solr c:MissingSegmentRecoveryTest s:shard1 r:core_node3 x:MissingSegmentRecoveryTest_shard1_replica_n1] o.a.s.c.CoreContainer Found active leader, will attempt to create fresh core and recover.
   [junit4]   2> 526884 INFO  (coreLoadExecutor-1280-thread-1-processing-n:127.0.0.1:61236_solr) [n:127.0.0.1:61236_solr c:MissingSegmentRecoveryTest s:shard1 r:core_node3 x:MissingSegmentRecoveryTest_shard1_replica_n1] o.a.s.c.SolrCore Updating index properties... index=index.20190602011403012
   [junit4]   2> 526890 INFO  (coreLoadExecutor-1280-thread-1-processing-n:127.0.0.1:61236_solr) [n:127.0.0.1:61236_solr c:MissingSegmentRecoveryTest s:shard1 r:core_node3 x:MissingSegmentRecoveryTest_shard1_replica_n1] o.a.s.c.ZkShardTerms Successful update of terms at /collections/MissingSegmentRecoveryTest/terms/shard1 to Terms{values={core_node3=0, core_node4=1}, version=3}
   [junit4]   2> 526909 INFO  (coreLoadExecutor-1280-thread-1-processing-n:127.0.0.1:61236_solr) [n:127.0.0.1:61236_solr c:MissingSegmentRecoveryTest s:shard1 r:core_node3 x:MissingSegmentRecoveryTest_shard1_replica_n1] o.a.s.m.r.SolrJmxReporter JMX monitoring for 'solr_61236.solr.core.MissingSegmentRecoveryTest.shard1.replica_n1' (registry 'solr.core.MissingSegmentRecoveryTest.shard1.replica_n1') enabled at server: com.sun.jmx.mbeanserver.JmxMBeanServer@6a85b2c6
   [junit4]   2> 526909 INFO  (coreLoadExecutor-1280-thread-1-processing-n:127.0.0.1:61236_solr) [n:127.0.0.1:61236_solr c:MissingSegmentRecoveryTest s:shard1 r:core_node3 x:MissingSegmentRecoveryTest_shard1_replica_n1] o.a.s.c.SolrCore [[MissingSegmentRecoveryTest_shard1_replica_n1] ] Opening new SolrCore at [C:\Users\jenkins\workspace\Lucene-Solr-8.1-Windows\solr\build\solr-core\test\J1\temp\solr.cloud.MissingSegmentRecoveryTest_E077A03BBA687400-001\tempDir-001\node2\MissingSegmentRecoveryTest_shard1_replica_n1], dataDir=[C:\Users\jenkins\workspace\Lucene-Solr-8.1-Windows\solr\build\solr-core\test\J1\temp\solr.cloud.MissingSegmentRecoveryTest_E077A03BBA687400-001\tempDir-001\node2\.\MissingSegmentRecoveryTest_shard1_replica_n1\data\]
   [junit4]   2> 526940 INFO  (OldIndexDirectoryCleanupThreadForCore-MissingSegmentRecoveryTest_shard1_replica_n1) [    ] o.a.s.c.DirectoryFactory Found 1 old index directories to clean-up under C:\Users\jenkins\workspace\Lucene-Solr-8.1-Windows\solr\build\solr-core\test\J1\temp\solr.cloud.MissingSegmentRecoveryTest_E077A03BBA687400-001\tempDir-001\node2\.\MissingSegmentRecoveryTest_shard1_replica_n1\data\ afterReload=false
   [junit4]   2> 526993 INFO  (OldIndexDirectoryCleanupThreadForCore-MissingSegmentRecoveryTest_shard1_replica_n1) [    ] o.a.s.c.DirectoryFactory Found 1 old index directories to clean-up under C:\Users\jenkins\workspace\Lucene-Solr-8.1-Windows\solr\build\solr-core\test\J1\temp\solr.cloud.MissingSegmentRecoveryTest_E077A03BBA687400-001\tempDir-001\node2\.\MissingSegmentRecoveryTest_shard1_replica_n1\data\ afterReload=false
   [junit4]   2> 526995 INFO  (OldIndexDirectoryCleanupThreadForCore-MissingSegmentRecoveryTest_shard1_replica_n1) [    ] o.a.s.c.DirectoryFactory Deleted old index directory: C:\Users\jenkins\workspace\Lucene-Solr-8.1-Windows\solr\build\solr-core\test\J1\temp\solr.cloud.MissingSegmentRecoveryTest_E077A03BBA687400-001\tempDir-001\node2\.\MissingSegmentRecoveryTest_shard1_replica_n1\data\index.20190602011403012
   [junit4]   2> 527009 INFO  (OldIndexDirectoryCleanupThreadForCore-MissingSegmentRecoveryTest_shard1_replica_n1) [    ] o.a.s.c.DirectoryFactory Deleted old index directory: C:\Users\jenkins\workspace\Lucene-Solr-8.1-Windows\solr\build\solr-core\test\J1\temp\solr.cloud.MissingSegmentRecoveryTest_E077A03BBA687400-001\tempDir-001\node2\.\MissingSegmentRecoveryTest_shard1_replica_n1\data\index
   [junit4]   2> 527052 INFO  (coreLoadExecutor-1280-thread-1-processing-n:127.0.0.1:61236_solr) [n:127.0.0.1:61236_solr c:MissingSegmentRecoveryTest s:shard1 r:core_node3 x:MissingSegmentRecoveryTest_shard1_replica_n1] o.a.s.u.UpdateHandler Using UpdateLog implementation: org.apache.solr.update.UpdateLog
   [junit4]   2> 527052 INFO  (coreLoadExecutor-1280-thread-1-processing-n:127.0.0.1:61236_solr) [n:127.0.0.1:61236_solr c:MissingSegmentRecoveryTest s:shard1 r:core_node3 x:MissingSegmentRecoveryTest_shard1_replica_n1] o.a.s.u.UpdateLog Initializing UpdateLog: dataDir=null defaultSyncLevel=FLUSH numRecordsToKeep=100 maxNumLogsToKeep=10 numVersionBuckets=65536
   [junit4]   2> 527054 INFO  (coreLoadExecutor-1280-thread-1-processing-n:127.0.0.1:61236_solr) [n:127.0.0.1:61236_solr c:MissingSegmentRecoveryTest s:shard1 r:core_node3 x:MissingSegmentRecoveryTest_shard1_replica_n1] o.a.s.u.CommitTracker Hard AutoCommit: disabled
   [junit4]   2> 527054 INFO  (coreLoadExecutor-1280-thread-1-processing-n:127.0.0.1:61236_solr) [n:127.0.0.1:61236_solr c:MissingSegmentRecoveryTest s:shard1 r:core_node3 x:MissingSegmentRecoveryTest_shard1_replica_n1] o.a.s.u.CommitTracker Soft AutoCommit: disabled
   [junit4]   2> 527060 INFO  (coreLoadExecutor-1280-thread-1-processing-n:127.0.0.1:61236_solr) [n:127.0.0.1:61236_solr c:MissingSegmentRecoveryTest s:shard1 r:core_node3 x:MissingSegmentRecoveryTest_shard1_replica_n1] o.a.s.c.SolrCore [MissingSegmentRecoveryTest_shard1_replica_n1]  CLOSING SolrCore org.apache.solr.core.SolrCore@49aca807
   [junit4]   2> 527061 INFO  (coreLoadExecutor-1280-thread-1-processing-n:127.0.0.1:61236_solr) [n:127.0.0.1:61236_solr c:MissingSegmentRecoveryTest s:shard1 r:core_node3 x:MissingSegmentRecoveryTest_shard1_replica_n1] o.a.s.m.SolrMetricManager Closing metric reporters for registry=solr.core.MissingSegmentRecoveryTest.shard1.replica_n1, tag=49aca807
   [junit4]   2> 527061 INFO  (coreLoadExecutor-1280-thread-1-processing-n:127.0.0.1:61236_solr) [n:127.0.0.1:61236_solr c:MissingSegmentRecoveryTest s:shard1 r:core_node3 x:MissingSegmentRecoveryTest_shard1_replica_n1] o.a.s.m.r.SolrJmxReporter Closing reporter [org.apache.solr.metrics.reporters.SolrJmxReporter@139e2846: rootName = solr_61236, domain = solr.core.MissingSegmentRecoveryTest.shard1.replica_n1, service url = null, agent id = null] for registry solr.core.MissingSegmentRecoveryTest.shard1.replica_n1 / com.codahale.metrics.MetricRegistry@3cee30a6
   [junit4]   2> 527070 INFO  (coreLoadExecutor-1280-thread-1-processing-n:127.0.0.1:61236_solr) [n:127.0.0.1:61236_solr c:MissingSegmentRecoveryTest s:shard1 r:core_node3 x:MissingSegmentRecoveryTest_shard1_replica_n1] o.a.s.m.SolrMetricManager Closing metric reporters for registry=solr.collection.MissingSegmentRecoveryTest.shard1.leader, tag=49aca807
   [junit4]   2> 527073 ERROR (coreContainerWorkExecutor-1273-thread-1-processing-n:127.0.0.1:61236_solr) [n:127.0.0.1:61236_solr    ] o.a.s.c.CoreContainer Error waiting for SolrCore to be loaded on startup
   [junit4]   2>           => org.apache.solr.common.SolrException: Unable to create core [MissingSegmentRecoveryTest_shard1_replica_n1]
   [junit4]   2> 	at org.apache.solr.core.CoreContainer.createFromDescriptor(CoreContainer.java:1259)
   [junit4]   2> org.apache.solr.common.SolrException: Unable to create core [MissingSegmentRecoveryTest_shard1_replica_n1]
   [junit4]   2> 	at org.apache.solr.core.CoreContainer.createFromDescriptor(CoreContainer.java:1259) ~[java/:?]
   [junit4]   2> 	at org.apache.solr.core.CoreContainer.lambda$load$13(CoreContainer.java:749) ~[java/:?]
   [junit4]   2> 	at com.codahale.metrics.InstrumentedExecutorService$InstrumentedCallable.call(InstrumentedExecutorService.java:202) ~[metrics-core-4.0.5.jar:4.0.5]
   [junit4]   2> 	at java.util.concurrent.FutureTask.run(FutureTask.java:264) ~[?:?]
   [junit4]   2> 	at org.apache.solr.common.util.ExecutorUtil$MDCAwareThreadPoolExecutor.lambda$execute$0(ExecutorUtil.java:209) ~[java/:?]
   [junit4]   2> 	at java.util.concurrent.ThreadPoolExecutor.runWorker(ThreadPoolExecutor.java:1128) ~[?:?]
   [junit4]   2> 	at java.util.concurrent.ThreadPoolExecutor$Worker.run(ThreadPoolExecutor.java:628) ~[?:?]
   [junit4]   2> 	at java.lang.Thread.run(Thread.java:835) [?:?]
   [junit4]   2> Caused by: org.apache.solr.common.SolrException: Error opening new searcher
   [junit4]   2> 	at org.apache.solr.core.SolrCore.<init>(SolrCore.java:1057) ~[java/:?]
   [junit4]   2> 	at org.apache.solr.core.SolrCore.<init>(SolrCore.java:883) ~[java/:?]
   [junit4]   2> 	at org.apache.solr.core.CoreContainer.processCoreCreateException(CoreContainer.java:1336) ~[java/:?]
   [junit4]   2> 	at org.apache.solr.core.CoreContainer.createFromDescriptor(CoreContainer.java:1240) ~[java/:?]
   [junit4]   2> 	... 7 more
   [junit4]   2> 	Suppressed: org.apache.solr.common.SolrException: Error opening new searcher
   [junit4]   2> 		at org.apache.solr.core.SolrCore.<init>(SolrCore.java:1057) ~[java/:?]
   [junit4]   2> 		at org.apache.solr.core.SolrCore.<init>(SolrCore.java:883) ~[java/:?]
   [junit4]   2> 		at org.apache.solr.core.CoreContainer.createFromDescriptor(CoreContainer.java:1238) ~[java/:?]
   [junit4]   2> 		at org.apache.solr.core.CoreContainer.lambda$load$13(CoreContainer.java:749) ~[java/:?]
   [junit4]   2> 		at com.codahale.metrics.InstrumentedExecutorService$InstrumentedCallable.call(InstrumentedExecutorService.java:202) ~[metrics-core-4.0.5.jar:4.0.5]
   [junit4]   2> 		at java.util.concurrent.FutureTask.run(FutureTask.java:264) ~[?:?]
   [junit4]   2> 		at org.apache.solr.common.util.ExecutorUtil$MDCAwareThreadPoolExecutor.lambda$execute$0(ExecutorUtil.java:209) ~[java/:?]
   [junit4]   2> 		at java.util.concurrent.ThreadPoolExecutor.runWorker(ThreadPoolExecutor.java:1128) ~[?:?]
   [junit4]   2> 		at java.util.concurrent.ThreadPoolExecutor$Worker.run(ThreadPoolExecutor.java:628) ~[?:?]
   [junit4]   2> 		at java.lang.Thread.run(Thread.java:835) [?:?]
   [junit4]   2> 	Caused by: org.apache.solr.common.SolrException: Error opening new searcher
   [junit4]   2> 		at org.apache.solr.core.SolrCore.openNewSearcher(SolrCore.java:2152) ~[java/:?]
   [junit4]   2> 		at org.apache.solr.core.SolrCore.getSearcher(SolrCore.java:2272) ~[java/:?]
   [junit4]   2> 		at org.apache.solr.core.SolrCore.initSearcher(SolrCore.java:1115) ~[java/:?]
   [junit4]   2> 		at org.apache.solr.core.SolrCore.<init>(SolrCore.java:1002) ~[java/:?]
   [junit4]   2> 		... 9 more
   [junit4]   2> 	Caused by: org.apache.lucene.index.CorruptIndexException: Unexpected file read error while reading index. (resource=BufferedChecksumIndexInput(MMapIndexInput(path="C:\Users\jenkins\workspace\Lucene-Solr-8.1-Windows\solr\build\solr-core\test\J1\temp\solr.cloud.MissingSegmentRecoveryTest_E077A03BBA687400-001\tempDir-001\node2\MissingSegmentRecoveryTest_shard1_replica_n1\data\index\segments_2")))
   [junit4]   2> 		at org.apache.lucene.index.SegmentInfos.readCommit(SegmentInfos.java:291) ~[java/:?]
   [junit4]   2> 		at org.apache.lucene.index.IndexWriter.<init>(IndexWriter.java:846) ~[java/:?]
   [junit4]   2> 		at org.apache.solr.update.SolrIndexWriter.<init>(SolrIndexWriter.java:128) ~[java/:?]
   [junit4]   2> 		at org.apache.solr.update.SolrIndexWriter.create(SolrIndexWriter.java:101) ~[java/:?]
   [junit4]   2> 		at org.apache.solr.update.DefaultSolrCoreState.createMainIndexWriter(DefaultSolrCoreState.java:259) ~[java/:?]
   [junit4]   2> 		at org.apache.solr.update.DefaultSolrCoreState.getIndexWriter(DefaultSolrCoreState.java:133) ~[java/:?]
   [junit4]   2> 		at org.apache.solr.core.SolrCore.openNewSearcher(SolrCore.java:2113) ~[java/:?]
   [junit4]   2> 		at org.apache.solr.core.SolrC

[...truncated too long message...]

icRegistry@68742e07
   [junit4]   2> 572375 INFO  (jetty-closer-1538-thread-1) [    ] o.a.s.m.r.SolrJmxReporter Closing reporter [org.apache.solr.metrics.reporters.SolrJmxReporter@3c26cc3b: rootName = solr_61236, domain = solr.node, service url = null, agent id = null] for registry solr.node / com.codahale.metrics.MetricRegistry@3bd1cfa1
   [junit4]   2> 572384 INFO  (jetty-closer-1538-thread-2) [    ] o.a.s.m.SolrMetricManager Closing metric reporters for registry=solr.jvm, tag=null
   [junit4]   2> 572384 INFO  (jetty-closer-1538-thread-2) [    ] o.a.s.m.r.SolrJmxReporter Closing reporter [org.apache.solr.metrics.reporters.SolrJmxReporter@655ffec9: rootName = solr_61237, domain = solr.jvm, service url = null, agent id = null] for registry solr.jvm / com.codahale.metrics.MetricRegistry@228d1c2a
   [junit4]   2> 572386 INFO  (jetty-closer-1538-thread-1) [    ] o.a.s.m.SolrMetricManager Closing metric reporters for registry=solr.jvm, tag=null
   [junit4]   2> 572386 INFO  (jetty-closer-1538-thread-1) [    ] o.a.s.m.r.SolrJmxReporter Closing reporter [org.apache.solr.metrics.reporters.SolrJmxReporter@918674b: rootName = solr_61236, domain = solr.jvm, service url = null, agent id = null] for registry solr.jvm / com.codahale.metrics.MetricRegistry@228d1c2a
   [junit4]   2> 572386 INFO  (jetty-closer-1538-thread-2) [    ] o.a.s.m.SolrMetricManager Closing metric reporters for registry=solr.jetty, tag=null
   [junit4]   2> 572386 INFO  (jetty-closer-1538-thread-2) [    ] o.a.s.m.r.SolrJmxReporter Closing reporter [org.apache.solr.metrics.reporters.SolrJmxReporter@62136f34: rootName = solr_61237, domain = solr.jetty, service url = null, agent id = null] for registry solr.jetty / com.codahale.metrics.MetricRegistry@bb95bc0
   [junit4]   2> 572386 INFO  (jetty-closer-1538-thread-2) [    ] o.a.s.m.SolrMetricManager Closing metric reporters for registry=solr.cluster, tag=null
   [junit4]   2> 572389 INFO  (jetty-closer-1538-thread-1) [    ] o.a.s.m.SolrMetricManager Closing metric reporters for registry=solr.jetty, tag=null
   [junit4]   2> 572389 INFO  (jetty-closer-1538-thread-1) [    ] o.a.s.m.r.SolrJmxReporter Closing reporter [org.apache.solr.metrics.reporters.SolrJmxReporter@72298794: rootName = solr_61236, domain = solr.jetty, service url = null, agent id = null] for registry solr.jetty / com.codahale.metrics.MetricRegistry@bb95bc0
   [junit4]   2> 572389 INFO  (jetty-closer-1538-thread-1) [    ] o.a.s.m.SolrMetricManager Closing metric reporters for registry=solr.cluster, tag=null
   [junit4]   2> 572390 INFO  (jetty-closer-1538-thread-2) [    ] o.a.s.c.Overseer Overseer (id=72159573893120009-127.0.0.1:61237_solr-n_0000000001) closing
   [junit4]   2> 572390 INFO  (OverseerStateUpdate-72159573893120009-127.0.0.1:61237_solr-n_0000000001) [n:127.0.0.1:61237_solr    ] o.a.s.c.Overseer Overseer Loop exiting : 127.0.0.1:61237_solr
   [junit4]   2> 572401 INFO  (zkCallback-1533-thread-1) [    ] o.a.s.c.c.ZkStateReader Updated live nodes from ZooKeeper... (2) -> (1)
   [junit4]   2> 572401 INFO  (zkCallback-1503-thread-1) [    ] o.a.s.c.c.ZkStateReader Updated live nodes from ZooKeeper... (2) -> (1)
   [junit4]   2> 572401 INFO  (OverseerAutoScalingTriggerThread-72159573893120009-127.0.0.1:61237_solr-n_0000000001) [    ] o.a.s.c.a.OverseerTriggerThread OverseerTriggerThread woken up but we are closed, exiting.
   [junit4]   2> 572404 WARN  (NIOServerCxn.Factory:0.0.0.0/0.0.0.0:0) [    ] o.a.z.s.NIOServerCnxn Unable to read additional data from client sessionid 0x1005cc0090b000e, likely client has closed socket
   [junit4]   2> 572405 INFO  (zkCallback-1533-thread-1) [    ] o.a.s.c.c.ZkStateReader Updated live nodes from ZooKeeper... (1) -> (0)
   [junit4]   2> 572406 INFO  (closeThreadPool-1545-thread-1) [    ] o.a.s.c.Overseer Overseer (id=72159573893120009-127.0.0.1:61237_solr-n_0000000001) closing
   [junit4]   2> 572406 INFO  (closeThreadPool-1545-thread-2) [    ] o.a.s.c.Overseer Overseer (id=72159573893120009-127.0.0.1:61237_solr-n_0000000001) closing
   [junit4]   2> 572409 INFO  (jetty-closer-1538-thread-2) [    ] o.e.j.s.AbstractConnector Stopped ServerConnector@18a6bbe7{HTTP/1.1,[http/1.1, h2c]}{127.0.0.1:0}
   [junit4]   2> 572410 INFO  (jetty-closer-1538-thread-2) [    ] o.e.j.s.h.ContextHandler Stopped o.e.j.s.ServletContextHandler@2a66cb16{/solr,null,UNAVAILABLE}
   [junit4]   2> 572410 INFO  (jetty-closer-1538-thread-2) [    ] o.e.j.s.session node0 Stopped scavenging
   [junit4]   2> 572411 INFO  (jetty-closer-1538-thread-1) [    ] o.e.j.s.AbstractConnector Stopped ServerConnector@118945ac{HTTP/1.1,[http/1.1, h2c]}{127.0.0.1:61236}
   [junit4]   2> 572411 INFO  (jetty-closer-1538-thread-1) [    ] o.e.j.s.h.ContextHandler Stopped o.e.j.s.ServletContextHandler@6c248d57{/solr,null,UNAVAILABLE}
   [junit4]   2> 572411 INFO  (jetty-closer-1538-thread-1) [    ] o.e.j.s.session node0 Stopped scavenging
   [junit4]   2> 572414 INFO  (SUITE-MissingSegmentRecoveryTest-seed#[E077A03BBA687400]-worker) [    ] o.a.s.c.ZkTestServer Shutting down ZkTestServer.
   [junit4]   2> 572415 WARN  (NIOServerCxn.Factory:0.0.0.0/0.0.0.0:0) [    ] o.a.z.s.NIOServerCnxn Unable to read additional data from client sessionid 0x1005cc0090b0000, likely client has closed socket
   [junit4]   2> 572416 WARN  (NIOServerCxn.Factory:0.0.0.0/0.0.0.0:0) [    ] o.a.z.s.NIOServerCnxn Unable to read additional data from client sessionid 0x1005cc0090b0001, likely client has closed socket
   [junit4]   2> 572416 WARN  (ZkTestServer Run Thread) [    ] o.a.s.c.ZkTestServer Watch limit violations: 
   [junit4]   2> Maximum concurrent create/delete watches above limit:
   [junit4]   2> 
   [junit4]   2> 	12	/solr/collections/MissingSegmentRecoveryTest/terms/shard1
   [junit4]   2> 	7	/solr/aliases.json
   [junit4]   2> 	7	/solr/clusterprops.json
   [junit4]   2> 	3	/solr/security.json
   [junit4]   2> 	3	/solr/collections/MissingSegmentRecoveryTest/state.json
   [junit4]   2> 	2	/solr/configs/conf
   [junit4]   2> 
   [junit4]   2> Maximum concurrent data watches above limit:
   [junit4]   2> 
   [junit4]   2> 	18	/solr/collections/MissingSegmentRecoveryTest/state.json
   [junit4]   2> 	7	/solr/clusterstate.json
   [junit4]   2> 	2	/solr/autoscaling.json
   [junit4]   2> 
   [junit4]   2> Maximum concurrent children watches above limit:
   [junit4]   2> 
   [junit4]   2> 	7	/solr/collections
   [junit4]   2> 	6	/solr/live_nodes
   [junit4]   2> 	2	/solr/overseer/queue
   [junit4]   2> 	2	/solr/autoscaling/events/.scheduled_maintenance
   [junit4]   2> 	2	/solr/autoscaling/events/.auto_add_replicas
   [junit4]   2> 	2	/solr/overseer/collection-queue-work
   [junit4]   2> 	2	/solr/overseer/queue-work
   [junit4]   2> 
   [junit4]   2> 572419 INFO  (SUITE-MissingSegmentRecoveryTest-seed#[E077A03BBA687400]-worker) [    ] o.a.s.c.ZkTestServer parse host and port list: 127.0.0.1:61225
   [junit4]   2> 572419 INFO  (SUITE-MissingSegmentRecoveryTest-seed#[E077A03BBA687400]-worker) [    ] o.a.s.c.ZkTestServer connecting to 127.0.0.1 61225
   [junit4]   2> NOTE: leaving temporary files on disk at: C:\Users\jenkins\workspace\Lucene-Solr-8.1-Windows\solr\build\solr-core\test\J1\temp\solr.cloud.MissingSegmentRecoveryTest_E077A03BBA687400-001
   [junit4]   2> NOTE: test params are: codec=Asserting(Lucene80), sim=Asserting(org.apache.lucene.search.similarities.AssertingSimilarity@b8d9334), locale=fr-MQ, timezone=Africa/Bangui
   [junit4]   2> NOTE: Windows 10 10.0 amd64/Oracle Corporation 12 (64-bit)/cpus=3,threads=1,free=151729768,total=407371776
   [junit4]   2> NOTE: All tests run in this JVM: [BaseCdcrDistributedZkTest, ForceLeaderTest, CdcrUpdateLogTest, PeerSyncWithLeaderAndIndexFingerprintCachingTest, MoreLikeThisHandlerTest, TestAtomicUpdateErrorCases, MaxSizeAutoCommitTest, TestCoreBackup, TestDistribDocBasedVersion, CreateCollectionCleanupTest, RandomizedTaggerTest, FieldAnalysisRequestHandlerTest, TestSolrQueryResponse, TestFieldCache, TestSimDistribStateManager, TestInPlaceUpdatesDistrib, TestUniqueKeyFieldResource, SmileWriterTest, ZkShardTermsTest, TestRecoveryHdfs, MetricTriggerTest, BadCopyFieldTest, TestHashPartitioner, UninvertDocValuesMergePolicyTest, TestWordDelimiterFilterFactory, RequestLoggingTest, TestRandomDVFaceting, TestGeoJSONResponseWriter, ScheduledTriggerIntegrationTest, TemplateUpdateProcessorTest, TestPayloadScoreQParserPlugin, CleanupOldIndexTest, UUIDFieldTest, RequestHandlersTest, TestNumericRangeQuery32, SolrGraphiteReporterTest, HttpPartitionWithTlogReplicasTest, PeerSyncReplicationTest, HighlighterConfigTest, HdfsRecoverLeaseTest, NumberUtilsTest, BlockDirectoryTest, DocValuesTest, HLLSerializationTest, ActionThrottleTest, BasicAuthIntegrationTest, SolrRequestParserTest, BasicZkTest, RootFieldTest, ParsingFieldUpdateProcessorsTest, TestDocumentBuilder, TestDistributedStatsComponentCardinality, MissingSegmentRecoveryTest]
   [junit4] Completed [129/855 (1!)] on J1 in 50.76s, 1 test, 1 failure <<< FAILURES!

[...truncated 45664 lines...]
[repro] Jenkins log URL: https://jenkins.thetaphi.de/job/Lucene-Solr-8.1-Windows/124/consoleText

[repro] Revision: c08bb21f99402b32e6b4b45b66af8f3c7b8539aa

[repro] Ant options: "-Dargs=-XX:-UseCompressedOops -XX:+UseParallelGC"

[repro] ant clean

[...truncated 6 lines...]
[repro] Test suites by module:
[repro]    solr\core
[repro]       MissingSegmentRecoveryTest
[repro] ant compile-test

[...truncated 3603 lines...]
[repro] ant test-nocompile -Dtests.dups=5 -Dtests.maxfailures=5 -Dtests.class="*.MissingSegmentRecoveryTest" -Dtests.showOutput=onerror "-Dargs=-XX:-UseCompressedOops -XX:+UseParallelGC" -Dtests.seed=E077A03BBA687400 -Dtests.slow=true -Dtests.locale=fr-MQ -Dtests.timezone=Africa/Bangui -Dtests.asserts=true -Dtests.file.encoding=ISO-8859-1

[...truncated 73 lines...]
[repro] Failures:
[repro]   0/5 failed: org.apache.solr.cloud.MissingSegmentRecoveryTest
[repro] Exiting with code 0

[...truncated 78 lines...]

Mime
View raw message