lucene-dev mailing list archives

Site index · List index
Message view « Date » · « Thread »
Top « Date » · « Thread »
From Policeman Jenkins Server <jenk...@thetaphi.de>
Subject [JENKINS-EA] Lucene-Solr-master-Linux (64bit/jdk-13-ea+18) - Build # 24174 - Still Unstable!
Date Sun, 02 Jun 2019 10:18:18 GMT
Build: https://jenkins.thetaphi.de/job/Lucene-Solr-master-Linux/24174/
Java: 64bit/jdk-13-ea+18 -XX:-UseCompressedOops -XX:+UseSerialGC

1 tests failed.
FAILED:  org.apache.solr.security.JWTAuthPluginIntegrationTest.testMetrics

Error Message:
Server returned HTTP response code: 401 for URL: http://127.0.0.1:36519/solr/jwtColl/query?q=*:*

Stack Trace:
java.io.IOException: Server returned HTTP response code: 401 for URL: http://127.0.0.1:36519/solr/jwtColl/query?q=*:*
	at __randomizedtesting.SeedInfo.seed([484DD026808FE08E:B65F02849C85973D]:0)
	at java.base/sun.net.www.protocol.http.HttpURLConnection.getInputStream0(HttpURLConnection.java:1913)
	at java.base/sun.net.www.protocol.http.HttpURLConnection.getInputStream(HttpURLConnection.java:1509)
	at java.base/java.net.URLConnection.getContent(URLConnection.java:749)
	at org.apache.solr.security.JWTAuthPluginIntegrationTest.get(JWTAuthPluginIntegrationTest.java:207)
	at org.apache.solr.security.JWTAuthPluginIntegrationTest.testMetrics(JWTAuthPluginIntegrationTest.java:149)
	at java.base/jdk.internal.reflect.NativeMethodAccessorImpl.invoke0(Native Method)
	at java.base/jdk.internal.reflect.NativeMethodAccessorImpl.invoke(NativeMethodAccessorImpl.java:62)
	at java.base/jdk.internal.reflect.DelegatingMethodAccessorImpl.invoke(DelegatingMethodAccessorImpl.java:43)
	at java.base/java.lang.reflect.Method.invoke(Method.java:567)
	at com.carrotsearch.randomizedtesting.RandomizedRunner.invoke(RandomizedRunner.java:1750)
	at com.carrotsearch.randomizedtesting.RandomizedRunner$8.evaluate(RandomizedRunner.java:938)
	at com.carrotsearch.randomizedtesting.RandomizedRunner$9.evaluate(RandomizedRunner.java:974)
	at com.carrotsearch.randomizedtesting.RandomizedRunner$10.evaluate(RandomizedRunner.java:988)
	at com.carrotsearch.randomizedtesting.rules.SystemPropertiesRestoreRule$1.evaluate(SystemPropertiesRestoreRule.java:57)
	at org.apache.lucene.util.TestRuleSetupTeardownChained$1.evaluate(TestRuleSetupTeardownChained.java:49)
	at org.apache.lucene.util.AbstractBeforeAfterRule$1.evaluate(AbstractBeforeAfterRule.java:45)
	at org.apache.lucene.util.TestRuleThreadAndTestName$1.evaluate(TestRuleThreadAndTestName.java:48)
	at org.apache.lucene.util.TestRuleIgnoreAfterMaxFailures$1.evaluate(TestRuleIgnoreAfterMaxFailures.java:64)
	at org.apache.lucene.util.TestRuleMarkFailure$1.evaluate(TestRuleMarkFailure.java:47)
	at com.carrotsearch.randomizedtesting.rules.StatementAdapter.evaluate(StatementAdapter.java:36)
	at com.carrotsearch.randomizedtesting.ThreadLeakControl$StatementRunner.run(ThreadLeakControl.java:368)
	at com.carrotsearch.randomizedtesting.ThreadLeakControl.forkTimeoutingTask(ThreadLeakControl.java:817)
	at com.carrotsearch.randomizedtesting.ThreadLeakControl$3.evaluate(ThreadLeakControl.java:468)
	at com.carrotsearch.randomizedtesting.RandomizedRunner.runSingleTest(RandomizedRunner.java:947)
	at com.carrotsearch.randomizedtesting.RandomizedRunner$5.evaluate(RandomizedRunner.java:832)
	at com.carrotsearch.randomizedtesting.RandomizedRunner$6.evaluate(RandomizedRunner.java:883)
	at com.carrotsearch.randomizedtesting.RandomizedRunner$7.evaluate(RandomizedRunner.java:894)
	at com.carrotsearch.randomizedtesting.rules.StatementAdapter.evaluate(StatementAdapter.java:36)
	at com.carrotsearch.randomizedtesting.rules.SystemPropertiesRestoreRule$1.evaluate(SystemPropertiesRestoreRule.java:57)
	at org.apache.lucene.util.AbstractBeforeAfterRule$1.evaluate(AbstractBeforeAfterRule.java:45)
	at com.carrotsearch.randomizedtesting.rules.StatementAdapter.evaluate(StatementAdapter.java:36)
	at org.apache.lucene.util.TestRuleStoreClassName$1.evaluate(TestRuleStoreClassName.java:41)
	at com.carrotsearch.randomizedtesting.rules.NoShadowingOrOverridesOnMethodsRule$1.evaluate(NoShadowingOrOverridesOnMethodsRule.java:40)
	at com.carrotsearch.randomizedtesting.rules.NoShadowingOrOverridesOnMethodsRule$1.evaluate(NoShadowingOrOverridesOnMethodsRule.java:40)
	at com.carrotsearch.randomizedtesting.rules.StatementAdapter.evaluate(StatementAdapter.java:36)
	at com.carrotsearch.randomizedtesting.rules.StatementAdapter.evaluate(StatementAdapter.java:36)
	at org.apache.lucene.util.TestRuleAssertionsRequired$1.evaluate(TestRuleAssertionsRequired.java:53)
	at org.apache.lucene.util.TestRuleMarkFailure$1.evaluate(TestRuleMarkFailure.java:47)
	at org.apache.lucene.util.TestRuleIgnoreAfterMaxFailures$1.evaluate(TestRuleIgnoreAfterMaxFailures.java:64)
	at org.apache.lucene.util.TestRuleIgnoreTestSuites$1.evaluate(TestRuleIgnoreTestSuites.java:54)
	at com.carrotsearch.randomizedtesting.rules.StatementAdapter.evaluate(StatementAdapter.java:36)
	at com.carrotsearch.randomizedtesting.ThreadLeakControl$StatementRunner.run(ThreadLeakControl.java:368)
	at java.base/java.lang.Thread.run(Thread.java:835)




Build Log:
[...truncated 13960 lines...]
   [junit4] Suite: org.apache.solr.security.JWTAuthPluginIntegrationTest
   [junit4]   2> 1375308 INFO  (SUITE-JWTAuthPluginIntegrationTest-seed#[484DD026808FE08E]-worker) [    ] o.a.s.SolrTestCaseJ4 SecureRandom sanity checks: test.solr.allowed.securerandom=null & java.security.egd=file:/dev/./urandom
   [junit4]   2> Creating dataDir: /home/jenkins/workspace/Lucene-Solr-master-Linux/solr/build/solr-core/test/J2/temp/solr.security.JWTAuthPluginIntegrationTest_484DD026808FE08E-001/init-core-data-001
   [junit4]   2> 1375308 WARN  (SUITE-JWTAuthPluginIntegrationTest-seed#[484DD026808FE08E]-worker) [    ] o.a.s.SolrTestCaseJ4 startTrackingSearchers: numOpens=2 numCloses=2
   [junit4]   2> 1375308 INFO  (SUITE-JWTAuthPluginIntegrationTest-seed#[484DD026808FE08E]-worker) [    ] o.a.s.SolrTestCaseJ4 Using PointFields (NUMERIC_POINTS_SYSPROP=true) w/NUMERIC_DOCVALUES_SYSPROP=false
   [junit4]   2> 1375309 INFO  (SUITE-JWTAuthPluginIntegrationTest-seed#[484DD026808FE08E]-worker) [    ] o.a.s.SolrTestCaseJ4 Randomized ssl (false) and clientAuth (false) via: @org.apache.solr.SolrTestCaseJ4$SuppressSSL(bugUrl="None")
   [junit4]   2> 1375311 INFO  (TEST-JWTAuthPluginIntegrationTest.infoRequestWithoutToken-seed#[484DD026808FE08E]) [    ] o.a.s.SolrTestCaseJ4 ###Starting infoRequestWithoutToken
   [junit4]   2> 1375312 INFO  (TEST-JWTAuthPluginIntegrationTest.infoRequestWithoutToken-seed#[484DD026808FE08E]) [    ] o.a.s.c.MiniSolrCloudCluster Starting cluster of 2 servers in /home/jenkins/workspace/Lucene-Solr-master-Linux/solr/build/solr-core/test/J2/temp/solr.security.JWTAuthPluginIntegrationTest_484DD026808FE08E-001/tempDir-001
   [junit4]   2> 1375312 INFO  (TEST-JWTAuthPluginIntegrationTest.infoRequestWithoutToken-seed#[484DD026808FE08E]) [    ] o.a.s.c.ZkTestServer STARTING ZK TEST SERVER
   [junit4]   2> 1375312 INFO  (ZkTestServer Run Thread) [    ] o.a.s.c.ZkTestServer client port:0.0.0.0/0.0.0.0:0
   [junit4]   2> 1375312 INFO  (ZkTestServer Run Thread) [    ] o.a.s.c.ZkTestServer Starting server
   [junit4]   2> 1375412 INFO  (TEST-JWTAuthPluginIntegrationTest.infoRequestWithoutToken-seed#[484DD026808FE08E]) [    ] o.a.s.c.ZkTestServer start zk server on port:33505
   [junit4]   2> 1375412 INFO  (TEST-JWTAuthPluginIntegrationTest.infoRequestWithoutToken-seed#[484DD026808FE08E]) [    ] o.a.s.c.ZkTestServer parse host and port list: 127.0.0.1:33505
   [junit4]   2> 1375412 INFO  (TEST-JWTAuthPluginIntegrationTest.infoRequestWithoutToken-seed#[484DD026808FE08E]) [    ] o.a.s.c.ZkTestServer connecting to 127.0.0.1 33505
   [junit4]   2> 1375414 INFO  (zkConnectionManagerCallback-5732-thread-1) [    ] o.a.s.c.c.ConnectionManager zkClient has connected
   [junit4]   2> 1375415 INFO  (zkConnectionManagerCallback-5734-thread-1) [    ] o.a.s.c.c.ConnectionManager zkClient has connected
   [junit4]   2> 1375416 INFO  (zkConnectionManagerCallback-5736-thread-1) [    ] o.a.s.c.c.ConnectionManager zkClient has connected
   [junit4]   2> 1375417 WARN  (jetty-launcher-5737-thread-1) [    ] o.e.j.s.AbstractConnector Ignoring deprecated socket close linger time
   [junit4]   2> 1375418 INFO  (jetty-launcher-5737-thread-1) [    ] o.a.s.c.s.e.JettySolrRunner Start Jetty (original configured port=0)
   [junit4]   2> 1375418 INFO  (jetty-launcher-5737-thread-1) [    ] o.a.s.c.s.e.JettySolrRunner Trying to start Jetty on port 0 try number 1 ...
   [junit4]   2> 1375418 INFO  (jetty-launcher-5737-thread-1) [    ] o.e.j.s.Server jetty-9.4.14.v20181114; built: 2018-11-14T21:20:31.478Z; git: c4550056e785fb5665914545889f21dc136ad9e6; jvm 13-ea+18
   [junit4]   2> 1375420 WARN  (jetty-launcher-5737-thread-2) [    ] o.e.j.s.AbstractConnector Ignoring deprecated socket close linger time
   [junit4]   2> 1375421 INFO  (jetty-launcher-5737-thread-2) [    ] o.a.s.c.s.e.JettySolrRunner Start Jetty (original configured port=0)
   [junit4]   2> 1375421 INFO  (jetty-launcher-5737-thread-2) [    ] o.a.s.c.s.e.JettySolrRunner Trying to start Jetty on port 0 try number 1 ...
   [junit4]   2> 1375421 INFO  (jetty-launcher-5737-thread-2) [    ] o.e.j.s.Server jetty-9.4.14.v20181114; built: 2018-11-14T21:20:31.478Z; git: c4550056e785fb5665914545889f21dc136ad9e6; jvm 13-ea+18
   [junit4]   2> 1375426 INFO  (jetty-launcher-5737-thread-2) [    ] o.e.j.s.session DefaultSessionIdManager workerName=node0
   [junit4]   2> 1375426 INFO  (jetty-launcher-5737-thread-1) [    ] o.e.j.s.session DefaultSessionIdManager workerName=node0
   [junit4]   2> 1375426 INFO  (jetty-launcher-5737-thread-2) [    ] o.e.j.s.session No SessionScavenger set, using defaults
   [junit4]   2> 1375426 INFO  (jetty-launcher-5737-thread-1) [    ] o.e.j.s.session No SessionScavenger set, using defaults
   [junit4]   2> 1375426 INFO  (jetty-launcher-5737-thread-2) [    ] o.e.j.s.session node0 Scavenging every 600000ms
   [junit4]   2> 1375426 INFO  (jetty-launcher-5737-thread-1) [    ] o.e.j.s.session node0 Scavenging every 600000ms
   [junit4]   2> 1375426 INFO  (jetty-launcher-5737-thread-2) [    ] o.e.j.s.h.ContextHandler Started o.e.j.s.ServletContextHandler@4255dee{/solr,null,AVAILABLE}
   [junit4]   2> 1375426 INFO  (jetty-launcher-5737-thread-1) [    ] o.e.j.s.h.ContextHandler Started o.e.j.s.ServletContextHandler@4ef764d6{/solr,null,AVAILABLE}
   [junit4]   2> 1375427 INFO  (jetty-launcher-5737-thread-1) [    ] o.e.j.s.AbstractConnector Started ServerConnector@74127ff4{HTTP/1.1,[http/1.1, h2c]}{127.0.0.1:37375}
   [junit4]   2> 1375427 INFO  (jetty-launcher-5737-thread-1) [    ] o.e.j.s.Server Started @1375463ms
   [junit4]   2> 1375427 INFO  (jetty-launcher-5737-thread-1) [    ] o.a.s.c.s.e.JettySolrRunner Jetty properties: {hostContext=/solr, hostPort=37375}
   [junit4]   2> 1375427 INFO  (jetty-launcher-5737-thread-2) [    ] o.e.j.s.AbstractConnector Started ServerConnector@1d1522d1{HTTP/1.1,[http/1.1, h2c]}{127.0.0.1:40069}
   [junit4]   2> 1375427 INFO  (jetty-launcher-5737-thread-2) [    ] o.e.j.s.Server Started @1375463ms
   [junit4]   2> 1375427 INFO  (jetty-launcher-5737-thread-2) [    ] o.a.s.c.s.e.JettySolrRunner Jetty properties: {hostContext=/solr, hostPort=40069}
   [junit4]   2> 1375427 ERROR (jetty-launcher-5737-thread-1) [    ] o.a.s.u.StartupLoggingUtils Missing Java Option solr.log.dir. Logging may be missing or incomplete.
   [junit4]   2> 1375427 INFO  (jetty-launcher-5737-thread-1) [    ] o.a.s.s.SolrDispatchFilter Using logger factory org.apache.logging.slf4j.Log4jLoggerFactory
   [junit4]   2> 1375427 INFO  (jetty-launcher-5737-thread-1) [    ] o.a.s.s.SolrDispatchFilter  ___      _       Welcome to Apache Solr? version 9.0.0
   [junit4]   2> 1375427 INFO  (jetty-launcher-5737-thread-1) [    ] o.a.s.s.SolrDispatchFilter / __| ___| |_ _   Starting in cloud mode on port null
   [junit4]   2> 1375427 ERROR (jetty-launcher-5737-thread-2) [    ] o.a.s.u.StartupLoggingUtils Missing Java Option solr.log.dir. Logging may be missing or incomplete.
   [junit4]   2> 1375427 INFO  (jetty-launcher-5737-thread-1) [    ] o.a.s.s.SolrDispatchFilter \__ \/ _ \ | '_|  Install dir: null
   [junit4]   2> 1375427 INFO  (jetty-launcher-5737-thread-2) [    ] o.a.s.s.SolrDispatchFilter Using logger factory org.apache.logging.slf4j.Log4jLoggerFactory
   [junit4]   2> 1375427 INFO  (jetty-launcher-5737-thread-1) [    ] o.a.s.s.SolrDispatchFilter |___/\___/_|_|    Start time: 2019-06-02T09:46:02.490577Z
   [junit4]   2> 1375427 INFO  (jetty-launcher-5737-thread-2) [    ] o.a.s.s.SolrDispatchFilter  ___      _       Welcome to Apache Solr? version 9.0.0
   [junit4]   2> 1375427 INFO  (jetty-launcher-5737-thread-2) [    ] o.a.s.s.SolrDispatchFilter / __| ___| |_ _   Starting in cloud mode on port null
   [junit4]   2> 1375427 INFO  (jetty-launcher-5737-thread-2) [    ] o.a.s.s.SolrDispatchFilter \__ \/ _ \ | '_|  Install dir: null
   [junit4]   2> 1375427 INFO  (jetty-launcher-5737-thread-2) [    ] o.a.s.s.SolrDispatchFilter |___/\___/_|_|    Start time: 2019-06-02T09:46:02.490648Z
   [junit4]   2> 1375428 INFO  (zkConnectionManagerCallback-5739-thread-1) [    ] o.a.s.c.c.ConnectionManager zkClient has connected
   [junit4]   2> 1375429 INFO  (jetty-launcher-5737-thread-1) [    ] o.a.s.s.SolrDispatchFilter solr.xml found in ZooKeeper. Loading...
   [junit4]   2> 1375433 INFO  (zkConnectionManagerCallback-5741-thread-1) [    ] o.a.s.c.c.ConnectionManager zkClient has connected
   [junit4]   2> 1375433 INFO  (jetty-launcher-5737-thread-2) [    ] o.a.s.s.SolrDispatchFilter solr.xml found in ZooKeeper. Loading...
   [junit4]   2> 1375534 INFO  (jetty-launcher-5737-thread-2) [    ] o.a.s.h.c.HttpShardHandlerFactory Host whitelist initialized: WhitelistHostChecker [whitelistHosts=null, whitelistHostCheckingEnabled=true]
   [junit4]   2> 1375535 WARN  (jetty-launcher-5737-thread-2) [    ] o.e.j.u.s.S.config No Client EndPointIdentificationAlgorithm configured for SslContextFactory@1fc25352[provider=null,keyStore=null,trustStore=null]
   [junit4]   2> 1375537 WARN  (jetty-launcher-5737-thread-2) [    ] o.e.j.u.s.S.config No Client EndPointIdentificationAlgorithm configured for SslContextFactory@7a305cbd[provider=null,keyStore=null,trustStore=null]
   [junit4]   2> 1375538 INFO  (jetty-launcher-5737-thread-2) [    ] o.a.s.c.ZkContainer Zookeeper client=127.0.0.1:33505/solr
   [junit4]   2> 1375544 INFO  (zkConnectionManagerCallback-5749-thread-1) [    ] o.a.s.c.c.ConnectionManager zkClient has connected
   [junit4]   2> 1375546 INFO  (zkConnectionManagerCallback-5751-thread-1) [    ] o.a.s.c.c.ConnectionManager zkClient has connected
   [junit4]   2> 1375549 INFO  (jetty-launcher-5737-thread-1) [    ] o.a.s.h.c.HttpShardHandlerFactory Host whitelist initialized: WhitelistHostChecker [whitelistHosts=null, whitelistHostCheckingEnabled=true]
   [junit4]   2> 1375550 WARN  (jetty-launcher-5737-thread-1) [    ] o.e.j.u.s.S.config No Client EndPointIdentificationAlgorithm configured for SslContextFactory@77043227[provider=null,keyStore=null,trustStore=null]
   [junit4]   2> 1375557 WARN  (jetty-launcher-5737-thread-1) [    ] o.e.j.u.s.S.config No Client EndPointIdentificationAlgorithm configured for SslContextFactory@55cfebef[provider=null,keyStore=null,trustStore=null]
   [junit4]   2> 1375558 INFO  (jetty-launcher-5737-thread-1) [    ] o.a.s.c.ZkContainer Zookeeper client=127.0.0.1:33505/solr
   [junit4]   2> 1375558 INFO  (zkConnectionManagerCallback-5759-thread-1) [    ] o.a.s.c.c.ConnectionManager zkClient has connected
   [junit4]   2> 1375560 INFO  (zkConnectionManagerCallback-5761-thread-1) [    ] o.a.s.c.c.ConnectionManager zkClient has connected
   [junit4]   2> 1375563 INFO  (jetty-launcher-5737-thread-1) [n:127.0.0.1:37375_solr    ] o.a.s.c.OverseerElectionContext I am going to be the leader 127.0.0.1:37375_solr
   [junit4]   2> 1375564 INFO  (jetty-launcher-5737-thread-1) [n:127.0.0.1:37375_solr    ] o.a.s.c.Overseer Overseer (id=72356706741387272-127.0.0.1:37375_solr-n_0000000000) starting
   [junit4]   2> 1375567 INFO  (zkConnectionManagerCallback-5768-thread-1) [    ] o.a.s.c.c.ConnectionManager zkClient has connected
   [junit4]   2> 1375568 INFO  (jetty-launcher-5737-thread-1) [n:127.0.0.1:37375_solr    ] o.a.s.c.s.i.ZkClientClusterStateProvider Cluster at 127.0.0.1:33505/solr ready
   [junit4]   2> 1375569 INFO  (OverseerStateUpdate-72356706741387272-127.0.0.1:37375_solr-n_0000000000) [n:127.0.0.1:37375_solr    ] o.a.s.c.Overseer Starting to work on the main queue : 127.0.0.1:37375_solr
   [junit4]   2> 1375569 INFO  (jetty-launcher-5737-thread-1) [n:127.0.0.1:37375_solr    ] o.a.s.c.ZkController Register node as live in ZooKeeper:/live_nodes/127.0.0.1:37375_solr
   [junit4]   2> 1375570 INFO  (OverseerStateUpdate-72356706741387272-127.0.0.1:37375_solr-n_0000000000) [n:127.0.0.1:37375_solr    ] o.a.s.c.c.ZkStateReader Updated live nodes from ZooKeeper... (0) -> (1)
   [junit4]   2> 1375571 INFO  (zkCallback-5767-thread-1) [    ] o.a.s.c.c.ZkStateReader Updated live nodes from ZooKeeper... (0) -> (1)
   [junit4]   2> 1375571 INFO  (jetty-launcher-5737-thread-1) [n:127.0.0.1:37375_solr    ] o.a.s.c.CoreContainer Initializing authentication plugin: solr.JWTAuthPlugin
   [junit4]   2> 1375595 WARN  (jetty-launcher-5737-thread-1) [n:127.0.0.1:37375_solr    ] o.a.s.s.JWTAuthPlugin Warning: No adminUiScope provided, fallback to 'solr' as required scope. If this is not correct, the Admin UI login may not work
   [junit4]   2> 1375604 INFO  (jetty-launcher-5737-thread-2) [n:127.0.0.1:40069_solr    ] o.a.s.c.c.ZkStateReader Updated live nodes from ZooKeeper... (0) -> (1)
   [junit4]   2> 1375605 INFO  (jetty-launcher-5737-thread-2) [n:127.0.0.1:40069_solr    ] o.a.s.c.ZkController Publish node=127.0.0.1:40069_solr as DOWN
   [junit4]   2> 1375606 INFO  (jetty-launcher-5737-thread-2) [n:127.0.0.1:40069_solr    ] o.a.s.c.TransientSolrCoreCacheDefault Allocating transient cache for 2147483647 transient cores
   [junit4]   2> 1375606 INFO  (jetty-launcher-5737-thread-2) [n:127.0.0.1:40069_solr    ] o.a.s.c.ZkController Register node as live in ZooKeeper:/live_nodes/127.0.0.1:40069_solr
   [junit4]   2> 1375607 INFO  (zkCallback-5760-thread-1) [    ] o.a.s.c.c.ZkStateReader Updated live nodes from ZooKeeper... (1) -> (2)
   [junit4]   2> 1375607 INFO  (zkCallback-5767-thread-1) [    ] o.a.s.c.c.ZkStateReader Updated live nodes from ZooKeeper... (1) -> (2)
   [junit4]   2> 1375607 INFO  (zkCallback-5750-thread-1) [    ] o.a.s.c.c.ZkStateReader Updated live nodes from ZooKeeper... (1) -> (2)
   [junit4]   2> 1375608 INFO  (zkConnectionManagerCallback-5773-thread-1) [    ] o.a.s.c.c.ConnectionManager zkClient has connected
   [junit4]   2> 1375609 INFO  (jetty-launcher-5737-thread-2) [n:127.0.0.1:40069_solr    ] o.a.s.c.c.ZkStateReader Updated live nodes from ZooKeeper... (0) -> (2)
   [junit4]   2> 1375609 INFO  (jetty-launcher-5737-thread-2) [n:127.0.0.1:40069_solr    ] o.a.s.c.s.i.ZkClientClusterStateProvider Cluster at 127.0.0.1:33505/solr ready
   [junit4]   2> 1375610 INFO  (jetty-launcher-5737-thread-2) [n:127.0.0.1:40069_solr    ] o.a.s.c.CoreContainer Initializing authentication plugin: solr.JWTAuthPlugin
   [junit4]   2> 1375610 WARN  (jetty-launcher-5737-thread-2) [n:127.0.0.1:40069_solr    ] o.a.s.s.JWTAuthPlugin Warning: No adminUiScope provided, fallback to 'solr' as required scope. If this is not correct, the Admin UI login may not work
   [junit4]   2> 1375617 INFO  (jetty-launcher-5737-thread-1) [n:127.0.0.1:37375_solr    ] o.a.s.h.a.MetricsHistoryHandler No .system collection, keeping metrics history in memory.
   [junit4]   2> 1375624 INFO  (jetty-launcher-5737-thread-2) [n:127.0.0.1:40069_solr    ] o.a.s.h.a.MetricsHistoryHandler No .system collection, keeping metrics history in memory.
   [junit4]   2> 1375632 INFO  (jetty-launcher-5737-thread-1) [n:127.0.0.1:37375_solr    ] o.a.s.m.r.SolrJmxReporter JMX monitoring for 'solr_37375.solr.node' (registry 'solr.node') enabled at server: com.sun.jmx.mbeanserver.JmxMBeanServer@3f67933a
   [junit4]   2> 1375638 INFO  (jetty-launcher-5737-thread-1) [n:127.0.0.1:37375_solr    ] o.a.s.m.r.SolrJmxReporter JMX monitoring for 'solr_37375.solr.jvm' (registry 'solr.jvm') enabled at server: com.sun.jmx.mbeanserver.JmxMBeanServer@3f67933a
   [junit4]   2> 1375638 INFO  (jetty-launcher-5737-thread-1) [n:127.0.0.1:37375_solr    ] o.a.s.m.r.SolrJmxReporter JMX monitoring for 'solr_37375.solr.jetty' (registry 'solr.jetty') enabled at server: com.sun.jmx.mbeanserver.JmxMBeanServer@3f67933a
   [junit4]   2> 1375639 INFO  (jetty-launcher-5737-thread-1) [n:127.0.0.1:37375_solr    ] o.a.s.c.CorePropertiesLocator Found 0 core definitions underneath /home/jenkins/workspace/Lucene-Solr-master-Linux/solr/build/solr-core/test/J2/temp/solr.security.JWTAuthPluginIntegrationTest_484DD026808FE08E-001/tempDir-001/node1/.
   [junit4]   2> 1375642 INFO  (jetty-launcher-5737-thread-2) [n:127.0.0.1:40069_solr    ] o.a.s.m.r.SolrJmxReporter JMX monitoring for 'solr_40069.solr.node' (registry 'solr.node') enabled at server: com.sun.jmx.mbeanserver.JmxMBeanServer@3f67933a
   [junit4]   2> 1375652 INFO  (jetty-launcher-5737-thread-2) [n:127.0.0.1:40069_solr    ] o.a.s.m.r.SolrJmxReporter JMX monitoring for 'solr_40069.solr.jvm' (registry 'solr.jvm') enabled at server: com.sun.jmx.mbeanserver.JmxMBeanServer@3f67933a
   [junit4]   2> 1375652 INFO  (jetty-launcher-5737-thread-2) [n:127.0.0.1:40069_solr    ] o.a.s.m.r.SolrJmxReporter JMX monitoring for 'solr_40069.solr.jetty' (registry 'solr.jetty') enabled at server: com.sun.jmx.mbeanserver.JmxMBeanServer@3f67933a
   [junit4]   2> 1375653 INFO  (jetty-launcher-5737-thread-2) [n:127.0.0.1:40069_solr    ] o.a.s.c.CorePropertiesLocator Found 0 core definitions underneath /home/jenkins/workspace/Lucene-Solr-master-Linux/solr/build/solr-core/test/J2/temp/solr.security.JWTAuthPluginIntegrationTest_484DD026808FE08E-001/tempDir-001/node2/.
   [junit4]   2> 1375673 INFO  (zkConnectionManagerCallback-5780-thread-1) [    ] o.a.s.c.c.ConnectionManager zkClient has connected
   [junit4]   2> 1375674 INFO  (TEST-JWTAuthPluginIntegrationTest.infoRequestWithoutToken-seed#[484DD026808FE08E]) [    ] o.a.s.c.c.ZkStateReader Updated live nodes from ZooKeeper... (0) -> (2)
   [junit4]   2> 1375674 INFO  (TEST-JWTAuthPluginIntegrationTest.infoRequestWithoutToken-seed#[484DD026808FE08E]) [    ] o.a.s.c.s.i.ZkClientClusterStateProvider Cluster at 127.0.0.1:33505/solr ready
   [junit4]   2> 1376025 INFO  (qtp1182464176-17092) [    ] o.a.s.s.JWTAuthPlugin JWT Authentication attempt failed: Require authentication
   [junit4]   2> 1376027 INFO  (jetty-closer-5781-thread-1) [    ] o.a.s.c.CoreContainer Shutting down CoreContainer instance=2124829040
   [junit4]   2> 1376028 INFO  (jetty-closer-5781-thread-1) [    ] o.a.s.c.ZkController Remove node as live in ZooKeeper:/live_nodes/127.0.0.1:37375_solr
   [junit4]   2> 1376028 INFO  (jetty-closer-5781-thread-1) [    ] o.a.s.c.ZkController Publish this node as DOWN...
   [junit4]   2> 1376028 INFO  (jetty-closer-5781-thread-1) [    ] o.a.s.c.ZkController Publish node=127.0.0.1:37375_solr as DOWN
   [junit4]   2> 1376028 INFO  (jetty-closer-5781-thread-2) [    ] o.a.s.c.CoreContainer Shutting down CoreContainer instance=375148725
   [junit4]   2> 1376028 INFO  (jetty-closer-5781-thread-2) [    ] o.a.s.c.ZkController Remove node as live in ZooKeeper:/live_nodes/127.0.0.1:40069_solr
   [junit4]   2> 1376028 INFO  (jetty-closer-5781-thread-2) [    ] o.a.s.c.ZkController Publish this node as DOWN...
   [junit4]   2> 1376028 INFO  (jetty-closer-5781-thread-2) [    ] o.a.s.c.ZkController Publish node=127.0.0.1:40069_solr as DOWN
   [junit4]   2> 1376029 INFO  (jetty-closer-5781-thread-1) [    ] o.a.s.c.TransientSolrCoreCacheDefault Allocating transient cache for 2147483647 transient cores
   [junit4]   2> 1376029 INFO  (jetty-closer-5781-thread-1) [    ] o.a.s.m.SolrMetricManager Closing metric reporters for registry=solr.node, tag=null
   [junit4]   2> 1376029 INFO  (jetty-closer-5781-thread-1) [    ] o.a.s.m.r.SolrJmxReporter Closing reporter [org.apache.solr.metrics.reporters.SolrJmxReporter@fb4c7b4: rootName = solr_37375, domain = solr.node, service url = null, agent id = null] for registry solr.node / com.codahale.metrics.MetricRegistry@b4f2691
   [junit4]   2> 1376029 INFO  (jetty-closer-5781-thread-2) [    ] o.a.s.m.SolrMetricManager Closing metric reporters for registry=solr.node, tag=null
   [junit4]   2> 1376029 INFO  (jetty-closer-5781-thread-2) [    ] o.a.s.m.r.SolrJmxReporter Closing reporter [org.apache.solr.metrics.reporters.SolrJmxReporter@4f8e12c3: rootName = solr_40069, domain = solr.node, service url = null, agent id = null] for registry solr.node / com.codahale.metrics.MetricRegistry@3baf20a4
   [junit4]   2> 1376033 INFO  (jetty-closer-5781-thread-1) [    ] o.a.s.m.SolrMetricManager Closing metric reporters for registry=solr.jvm, tag=null
   [junit4]   2> 1376033 INFO  (jetty-closer-5781-thread-1) [    ] o.a.s.m.r.SolrJmxReporter Closing reporter [org.apache.solr.metrics.reporters.SolrJmxReporter@1e86a4a4: rootName = solr_37375, domain = solr.jvm, service url = null, agent id = null] for registry solr.jvm / com.codahale.metrics.MetricRegistry@14633ddb
   [junit4]   2> 1376033 INFO  (jetty-closer-5781-thread-2) [    ] o.a.s.m.SolrMetricManager Closing metric reporters for registry=solr.jvm, tag=null
   [junit4]   2> 1376033 INFO  (jetty-closer-5781-thread-2) [    ] o.a.s.m.r.SolrJmxReporter Closing reporter [org.apache.solr.metrics.reporters.SolrJmxReporter@2de3fc98: rootName = solr_40069, domain = solr.jvm, service url = null, agent id = null] for registry solr.jvm / com.codahale.metrics.MetricRegistry@14633ddb
   [junit4]   2> 1376035 INFO  (jetty-closer-5781-thread-2) [    ] o.a.s.m.SolrMetricManager Closing metric reporters for registry=solr.jetty, tag=null
   [junit4]   2> 1376035 INFO  (jetty-closer-5781-thread-2) [    ] o.a.s.m.r.SolrJmxReporter Closing reporter [org.apache.solr.metrics.reporters.SolrJmxReporter@3e0acd57: rootName = solr_40069, domain = solr.jetty, service url = null, agent id = null] for registry solr.jetty / com.codahale.metrics.MetricRegistry@516044a3
   [junit4]   2> 1376035 INFO  (jetty-closer-5781-thread-2) [    ] o.a.s.m.SolrMetricManager Closing metric reporters for registry=solr.cluster, tag=null
   [junit4]   2> 1376035 INFO  (jetty-closer-5781-thread-1) [    ] o.a.s.m.SolrMetricManager Closing metric reporters for registry=solr.jetty, tag=null
   [junit4]   2> 1376035 INFO  (jetty-closer-5781-thread-1) [    ] o.a.s.m.r.SolrJmxReporter Closing reporter [org.apache.solr.metrics.reporters.SolrJmxReporter@bee8395: rootName = solr_37375, domain = solr.jetty, service url = null, agent id = null] for registry solr.jetty / com.codahale.metrics.MetricRegistry@516044a3
   [junit4]   2> 1376035 INFO  (jetty-closer-5781-thread-1) [    ] o.a.s.m.SolrMetricManager Closing metric reporters for registry=solr.cluster, tag=null
   [junit4]   2> 1376036 INFO  (closeThreadPool-5789-thread-1) [    ] o.a.s.c.Overseer Overseer (id=72356706741387272-127.0.0.1:37375_solr-n_0000000000) closing
   [junit4]   2> 1376036 INFO  (OverseerStateUpdate-72356706741387272-127.0.0.1:37375_solr-n_0000000000) [n:127.0.0.1:37375_solr    ] o.a.s.c.Overseer Overseer Loop exiting : 127.0.0.1:37375_solr
   [junit4]   2> 1376036 INFO  (OverseerAutoScalingTriggerThread-72356706741387272-127.0.0.1:37375_solr-n_0000000000) [    ] o.a.s.c.a.OverseerTriggerThread OverseerTriggerThread woken up but we are closed, exiting.
   [junit4]   2> 1376036 WARN  (NIOServerCxn.Factory:0.0.0.0/0.0.0.0:0) [    ] o.a.z.s.NIOServerCnxn Unable to read additional data from client sessionid 0x101100a9a700006, likely client has closed socket
   [junit4]   2> 1376037 INFO  (zkCallback-5767-thread-1) [    ] o.a.s.c.c.ZkStateReader Updated live nodes from ZooKeeper... (2) -> (1)
   [junit4]   2> 1376037 INFO  (zkCallback-5772-thread-1) [    ] o.a.s.c.c.ZkStateReader Updated live nodes from ZooKeeper... (2) -> (1)
   [junit4]   2> 1376037 INFO  (zkCallback-5760-thread-1) [    ] o.a.s.c.c.ZkStateReader Updated live nodes from ZooKeeper... (2) -> (1)
   [junit4]   2> 1376037 WARN  (NIOServerCxn.Factory:0.0.0.0/0.0.0.0:0) [    ] o.a.z.s.NIOServerCnxn Unable to read additional data from client sessionid 0x101100a9a70000a, likely client has closed socket
   [junit4]   2> 1376038 WARN  (NIOServerCxn.Factory:0.0.0.0/0.0.0.0:0) [    ] o.a.z.s.NIOServerCnxn Unable to read additional data from client sessionid 0x101100a9a700009, likely client has closed socket
   [junit4]   2> 1376038 INFO  (jetty-closer-5781-thread-1) [    ] o.a.s.c.Overseer Overseer (id=72356706741387272-127.0.0.1:37375_solr-n_0000000000) closing
   [junit4]   2> 1376038 INFO  (closeThreadPool-5789-thread-2) [    ] o.a.s.c.Overseer Overseer (id=72356706741387272-127.0.0.1:37375_solr-n_0000000000) closing
   [junit4]   2> 1376039 INFO  (jetty-closer-5781-thread-2) [    ] o.e.j.s.AbstractConnector Stopped ServerConnector@1d1522d1{HTTP/1.1,[http/1.1, h2c]}{127.0.0.1:0}
   [junit4]   2> 1376039 INFO  (jetty-closer-5781-thread-2) [    ] o.e.j.s.h.ContextHandler Stopped o.e.j.s.ServletContextHandler@4255dee{/solr,null,UNAVAILABLE}
   [junit4]   2> 1376040 INFO  (jetty-closer-5781-thread-2) [    ] o.e.j.s.session node0 Stopped scavenging
   [junit4]   2> 1376040 INFO  (jetty-closer-5781-thread-1) [    ] o.e.j.s.AbstractConnector Stopped ServerConnector@74127ff4{HTTP/1.1,[http/1.1, h2c]}{127.0.0.1:0}
   [junit4]   2> 1376040 INFO  (jetty-closer-5781-thread-1) [    ] o.e.j.s.h.ContextHandler Stopped o.e.j.s.ServletContextHandler@4ef764d6{/solr,null,UNAVAILABLE}
   [junit4]   2> 1376040 INFO  (jetty-closer-5781-thread-1) [    ] o.e.j.s.session node0 Stopped scavenging
   [junit4]   2> 1376040 INFO  (TEST-JWTAuthPluginIntegrationTest.infoRequestWithoutToken-seed#[484DD026808FE08E]) [    ] o.a.s.c.ZkTestServer Shutting down ZkTestServer.
   [junit4]   2> 1376041 WARN  (ZkTestServer Run Thread) [    ] o.a.s.c.ZkTestServer Watch limit violations: 
   [junit4]   2> Maximum concurrent create/delete watches above limit:
   [junit4]   2> 
   [junit4]   2> 	5	/solr/aliases.json
   [junit4]   2> 	5	/solr/clusterprops.json
   [junit4]   2> 	2	/solr/security.json
   [junit4]   2> 
   [junit4]   2> Maximum concurrent data watches above limit:
   [junit4]   2> 
   [junit4]   2> 	5	/solr/clusterstate.json
   [junit4]   2> 	5	/solr/clusterprops.json
   [junit4]   2> 
   [junit4]   2> Maximum concurrent children watches above limit:
   [junit4]   2> 
   [junit4]   2> 	5	/solr/live_nodes
   [junit4]   2> 	5	/solr/collections
   [junit4]   2> 
   [junit4]   2> 1376042 INFO  (TEST-JWTAuthPluginIntegrationTest.infoRequestWithoutToken-seed#[484DD026808FE08E]) [    ] o.a.s.c.ZkTestServer parse host and port list: 127.0.0.1:33505
   [junit4]   2> 1376042 INFO  (TEST-JWTAuthPluginIntegrationTest.infoRequestWithoutToken-seed#[484DD026808FE08E]) [    ] o.a.s.c.ZkTestServer connecting to 127.0.0.1 33505
   [junit4]   2> 1376042 INFO  (TEST-JWTAuthPluginIntegrationTest.infoRequestWithoutToken-seed#[484DD026808FE08E]) [    ] o.a.s.SolrTestCaseJ4 ###Ending infoRequestWithoutToken
   [junit4]   2> 1376045 INFO  (TEST-JWTAuthPluginIntegrationTest.createCollectionUpdateAndQueryDistributed-seed#[484DD026808FE08E]) [    ] o.a.s.SolrTestCaseJ4 ###Starting createCollectionUpdateAndQueryDistributed
   [junit4]   2> 1376045 INFO  (TEST-JWTAuthPluginIntegrationTest.createCollectionUpdateAndQueryDistributed-seed#[484DD026808FE08E]) [    ] o.a.s.c.MiniSolrCloudCluster Starting cluster of 2 servers in /home/jenkins/workspace/Lucene-Solr-master-Linux/solr/build/solr-core/test/J2/temp/solr.security.JWTAuthPluginIntegrationTest_484DD026808FE08E-001/tempDir-002
   [junit4]   2> 1376045 INFO  (TEST-JWTAuthPluginIntegrationTest.createCollectionUpdateAndQueryDistributed-seed#[484DD026808FE08E]) [    ] o.a.s.c.ZkTestServer STARTING ZK TEST SERVER
   [junit4]   2> 1376046 INFO  (ZkTestServer Run Thread) [    ] o.a.s.c.ZkTestServer client port:0.0.0.0/0.0.0.0:0
   [junit4]   2> 1376046 INFO  (ZkTestServer Run Thread) [    ] o.a.s.c.ZkTestServer Starting server
   [junit4]   2> 1376146 INFO  (TEST-JWTAuthPluginIntegrationTest.createCollectionUpdateAndQueryDistributed-seed#[484DD026808FE08E]) [    ] o.a.s.c.ZkTestServer start zk server on port:39299
   [junit4]   2> 1376146 INFO  (TEST-JWTAuthPluginIntegrationTest.createCollectionUpdateAndQueryDistributed-seed#[484DD026808FE08E]) [    ] o.a.s.c.ZkTestServer parse host and port list: 127.0.0.1:39299
   [junit4]   2> 1376146 INFO  (TEST-JWTAuthPluginIntegrationTest.createCollectionUpdateAndQueryDistributed-seed#[484DD026808FE08E]) [    ] o.a.s.c.ZkTestServer connecting to 127.0.0.1 39299
   [junit4]   2> 1376148 INFO  (zkConnectionManagerCallback-5791-thread-1) [    ] o.a.s.c.c.ConnectionManager zkClient has connected
   [junit4]   2> 1376149 INFO  (zkConnectionManagerCallback-5793-thread-1) [    ] o.a.s.c.c.ConnectionManager zkClient has connected
   [junit4]   2> 1376150 INFO  (zkConnectionManagerCallback-5795-thread-1) [    ] o.a.s.c.c.ConnectionManager zkClient has connected
   [junit4]   2> 1376151 WARN  (jetty-launcher-5796-thread-1) [    ] o.e.j.s.AbstractConnector Ignoring deprecated socket close linger time
   [junit4]   2> 1376151 WARN  (jetty-launcher-5796-thread-2) [    ] o.e.j.s.AbstractConnector Ignoring deprecated socket close linger time
   [junit4]   2> 1376151 INFO  (jetty-launcher-5796-thread-1) [    ] o.a.s.c.s.e.JettySolrRunner Start Jetty (original configured port=0)
   [junit4]   2> 1376151 INFO  (jetty-launcher-5796-thread-2) [    ] o.a.s.c.s.e.JettySolrRunner Start Jetty (original configured port=0)
   [junit4]   2> 1376151 INFO  (jetty-launcher-5796-thread-1) [    ] o.a.s.c.s.e.JettySolrRunner Trying to start Jetty on port 0 try number 1 ...
   [junit4]   2> 1376151 INFO  (jetty-launcher-5796-thread-2) [    ] o.a.s.c.s.e.JettySolrRunner Trying to start Jetty on port 0 try number 1 ...
   [junit4]   2> 1376152 INFO  (jetty-launcher-5796-thread-1) [    ] o.e.j.s.Server jetty-9.4.14.v20181114; built: 2018-11-14T21:20:31.478Z; git: c4550056e785fb5665914545889f21dc136ad9e6; jvm 13-ea+18
   [junit4]   2> 1376152 INFO  (jetty-launcher-5796-thread-2) [    ] o.e.j.s.Server jetty-9.4.14.v20181114; built: 2018-11-14T21:20:31.478Z; git: c4550056e785fb5665914545889f21dc136ad9e6; jvm 13-ea+18
   [junit4]   2> 1376152 INFO  (jetty-launcher-5796-thread-2) [    ] o.e.j.s.session DefaultSessionIdManager workerName=node0
   [junit4]   2> 1376152 INFO  (jetty-launcher-5796-thread-2) [    ] o.e.j.s.session No SessionScavenger set, using defaults
   [junit4]   2> 1376152 INFO  (jetty-launcher-5796-thread-1) [    ] o.e.j.s.session DefaultSessionIdManager workerName=node0
   [junit4]   2> 1376152 INFO  (jetty-launcher-5796-thread-1) [    ] o.e.j.s.session No SessionScavenger set, using defaults
   [junit4]   2> 1376152 INFO  (jetty-launcher-5796-thread-2) [    ] o.e.j.s.session node0 Scavenging every 600000ms
   [junit4]   2> 1376152 INFO  (jetty-launcher-5796-thread-1) [    ] o.e.j.s.session node0 Scavenging every 600000ms
   [junit4]   2> 1376152 INFO  (jetty-launcher-5796-thread-1) [    ] o.e.j.s.h.ContextHandler Started o.e.j.s.ServletContextHandler@3410fbee{/solr,null,AVAILABLE}
   [junit4]   2> 1376153 INFO  (jetty-launcher-5796-thread-1) [    ] o.e.j.s.AbstractConnector Started ServerConnector@280c473c{HTTP/1.1,[http/1.1, h2c]}{127.0.0.1:42337}
   [junit4]   2> 1376153 INFO  (jetty-launcher-5796-thread-2) [    ] o.e.j.s.h.ContextHandler Started o.e.j.s.ServletContextHandler@bb2fa55{/solr,null,AVAILABLE}
   [junit4]   2> 1376153 INFO  (jetty-launcher-5796-thread-1) [    ] o.e.j.s.Server Started @1376189ms
   [junit4]   2> 1376153 INFO  (jetty-launcher-5796-thread-1) [    ] o.a.s.c.s.e.JettySolrRunner Jetty properties: {hostContext=/solr, hostPort=42337}
   [junit4]   2> 1376153 ERROR (jetty-launcher-5796-thread-1) [    ] o.a.s.u.StartupLoggingUtils Missing Java Option solr.log.dir. Logging may be missing or incomplete.
   [junit4]   2> 1376153 INFO  (jetty-launcher-5796-thread-1) [    ] o.a.s.s.SolrDispatchFilter Using logger factory org.apache.logging.slf4j.Log4jLoggerFactory
   [junit4]   2> 1376153 INFO  (jetty-launcher-5796-thread-2) [    ] o.e.j.s.AbstractConnector Started ServerConnector@5938a7c8{HTTP/1.1,[http/1.1, h2c]}{127.0.0.1:46757}
   [junit4]   2> 1376153 INFO  (jetty-launcher-5796-thread-2) [    ] o.e.j.s.Server Started @1376189ms
   [junit4]   2> 1376153 INFO  (jetty-launcher-5796-thread-1) [    ] o.a.s.s.SolrDispatchFilter  ___      _       Welcome to Apache Solr? version 9.0.0
   [junit4]   2> 1376153 INFO  (jetty-launcher-5796-thread-1) [    ] o.a.s.s.SolrDispatchFilter / __| ___| |_ _   Starting in cloud mode on port null
   [junit4]   2> 1376153 INFO  (jetty-launcher-5796-thread-1) [    ] o.a.s.s.SolrDispatchFilter \__ \/ _ \ | '_|  Install dir: null
   [junit4]   2> 1376153 INFO  (jetty-launcher-5796-thread-1) [    ] o.a.s.s.SolrDispatchFilter |___/\___/_|_|    Start time: 2019-06-02T09:46:03.216445Z
   [junit4]   2> 1376153 INFO  (jetty-launcher-5796-thread-2) [    ] o.a.s.c.s.e.JettySolrRunner Jetty properties: {hostContext=/solr, hostPort=46757}
   [junit4]   2> 1376153 ERROR (jetty-launcher-5796-thread-2) [    ] o.a.s.u.StartupLoggingUtils Missing Java Option solr.log.dir. Logging may be missing or incomplete.
   [junit4]   2> 1376153 INFO  (jetty-launcher-5796-thread-2) [    ] o.a.s.s.SolrDispatchFilter Using logger factory org.apache.logging.slf4j.Log4jLoggerFactory
   [junit4]   2> 1376153 INFO  (jetty-launcher-5796-thread-2) [    ] o.a.s.s.SolrDispatchFilter  ___      _       Welcome to Apache Solr? version 9.0.0
   [junit4]   2> 1376153 INFO  (jetty-launcher-5796-thread-2) [    ] o.a.s.s.SolrDispatchFilter / __| ___| |_ _   Starting in cloud mode on port null
   [junit4]   2> 1376153 INFO  (jetty-launcher-5796-thread-2) [    ] o.a.s.s.SolrDispatchFilter \__ \/ _ \ | '_|  Install dir: null
   [junit4]   2> 1376153 INFO  (jetty-launcher-5796-thread-2) [    ] o.a.s.s.SolrDispatchFilter |___/\___/_|_|    Start time: 2019-06-02T09:46:03.216655Z
   [junit4]   2> 1376154 INFO  (zkConnectionManagerCallback-5798-thread-1) [    ] o.a.s.c.c.ConnectionManager zkClient has connected
   [junit4]   2> 1376154 INFO  (zkConnectionManagerCallback-5800-thread-1) [    ] o.a.s.c.c.ConnectionManager zkClient has connected
   [junit4]   2> 1376155 INFO  (jetty-launcher-5796-thread-1) [    ] o.a.s.s.SolrDispatchFilter solr.xml found in ZooKeeper. Loading...
   [junit4]   2> 1376155 INFO  (jetty-launcher-5796-thread-2) [    ] o.a.s.s.SolrDispatchFilter solr.xml found in ZooKeeper. Loading...
   [junit4]   2> 1376228 INFO  (jetty-launcher-5796-thread-2) [    ] o.a.s.h.c.HttpShardHandlerFactory Host whitelist initialized: WhitelistHostChecker [whitelistHosts=null, whitelistHostCheckingEnabled=true]
   [junit4]   2> 1376228 WARN  (jetty-launcher-5796-thread-2) [    ] o.e.j.u.s.S.config No Client EndPointIdentificationAlgorithm configured for SslContextFactory@1b9a8657[provider=null,keyStore=null,trustStore=null]
   [junit4]   2> 1376231 WARN  (jetty-launcher-5796-thread-2) [    ] o.e.j.u.s.S.config No Client EndPointIdentificationAlgorithm configured for SslContextFactory@56012410[provider=null,keyStore=null,trustStore=null]
   [junit4]   2> 1376232 INFO  (jetty-launcher-5796-thread-2) [    ] o.a.s.c.ZkContainer Zookeeper client=127.0.0.1:39299/solr
   [junit4]   2> 1376233 INFO  (zkConnectionManagerCallback-5808-thread-1) [    ] o.a.s.c.c.ConnectionManager zkClient has connected
   [junit4]   2> 1376234 INFO  (zkConnectionManagerCallback-5810-thread-1) [    ] o.a.s.c.c.ConnectionManager zkClient has connected
   [junit4]   2> 1376267 INFO  (jetty-launcher-5796-thread-2) [n:127.0.0.1:46757_solr    ] o.a.s.c.OverseerElectionContext I am going to be the leader 127.0.0.1:46757_solr
   [junit4]   2> 1376268 INFO  (jetty-launcher-5796-thread-2) [n:127.0.0.1:46757_solr    ] o.a.s.c.Overseer Overseer (id=72356706789228550-127.0.0.1:46757_solr-n_0000000000) starting
   [junit4]   2> 1376270 INFO  (zkConnectionManagerCallback-5817-thread-1) [    ] o.a.s.c.c.ConnectionManager zkClient has connected
   [junit4]   2> 1376271 INFO  (jetty-launcher-5796-thread-2) [n:127.0.0.1:46757_solr    ] o.a.s.c.s.i.ZkClientClusterStateProvider Cluster at 127.0.0.1:39299/solr ready
   [junit4]   2> 1376272 INFO  (OverseerStateUpdate-72356706789228550-127.0.0.1:46757_solr-n_0000000000) [n:127.0.0.1:46757_solr    ] o.a.s.c.Overseer Starting to work on the main queue : 127.0.0.1:46757_solr
   [junit4]   2> 1376272 INFO  (jetty-launcher-5796-thread-2) [n:127.0.0.1:46757_solr    ] o.a.s.c.ZkController Register node as live in ZooKeeper:/live_nodes/127.0.0.1:46757_solr
   [junit4]   2> 1376273 INFO  (jetty-launcher-5796-thread-2) [n:127.0.0.1:46757_solr    ] o.a.s.c.CoreContainer Initializing authentication plugin: solr.JWTAuthPlugin
   [junit4]   2> 1376274 WARN  (jetty-launcher-5796-thread-2) [n:127.0.0.1:46757_solr    ] o.a.s.s.JWTAuthPlugin Warning: No adminUiScope provided, fallback to 'solr' as required scope. If this is not correct, the Admin UI login may not work
   [junit4]   2> 1376287 INFO  (jetty-launcher-5796-thread-2) [n:127.0.0.1:46757_solr    ] o.a.s.h.a.MetricsHistoryHandler No .system collection, keeping metrics history in memory.
   [junit4]   2> 1376288 INFO  (zkCallback-5816-thread-1) [    ] o.a.s.c.c.ZkStateReader Updated live nodes from ZooKeeper... (0) -> (1)
   [junit4]   2> 1376288 INFO  (zkCallback-5809-thread-1) [    ] o.a.s.c.c.ZkStateReader Updated live nodes from ZooKeeper... (0) -> (1)
   [junit4]   2> 1376310 INFO  (jetty-launcher-5796-thread-2) [n:127.0.0.1:46757_solr    ] o.a.s.m.r.SolrJmxReporter JMX monitoring for 'solr_46757.solr.node' (registry 'solr.node') enabled at server: com.sun.jmx.mbeanserver.JmxMBeanServer@3f67933a
   [junit4]   2> 1376316 INFO  (jetty-launcher-5796-thread-1) [    ] o.a.s.h.c.HttpShardHandlerFactory Host whitelist initialized: WhitelistHostChecker [whitelistHosts=null, whitelistHostCheckingEnabled=true]
   [junit4]   2> 1376316 INFO  (jetty-launcher-5796-thread-2) [n:127.0.0.1:46757_solr    ] o.a.s.m.r.SolrJmxReporter JMX monitoring for 'solr_46757.solr.jvm' (registry 'solr.jvm') enabled at server: com.sun.jmx.mbeanserver.JmxMBeanServer@3f67933a
   [junit4]   2> 1376316 INFO  (jetty-launcher-5796-thread-2) [n:127.0.0.1:46757_solr    ] o.a.s.m.r.SolrJmxReporter JMX monitoring for 'solr_46757.solr.jetty' (registry 'solr.jetty') enabled at server: com.sun.jmx.mbeanserver.JmxMBeanServer@3f67933a
   [junit4]   2> 1376317 WARN  (jetty-launcher-5796-thread-1) [    ] o.e.j.u.s.S.config No Client EndPointIdentificationAlgorithm configured for SslContextFactory@2163ae37[provider=null,keyStore=null,trustStore=null]
   [junit4]   2> 1376317 INFO  (jetty-launcher-5796-thread-2) [n:127.0.0.1:46757_solr    ] o.a.s.c.CorePropertiesLocator Found 0 core definitions underneath /home/jenkins/workspace/Lucene-Solr-master-Linux/solr/build/solr-core/test/J2/temp/solr.security.JWTAuthPluginIntegrationTest_484DD026808FE08E-001/tempDir-002/node2/.
   [junit4]   2> 1376321 WARN  (jetty-launcher-5796-thread-1) [    ] o.e.j.u.s.S.config No Client EndPointIdentificationAlgorithm configured for SslContextFactory@46639bf1[provider=null,keyStore=null,trustStore=null]
   [junit4]   2> 1376322 INFO  (jetty-launcher-5796-thread-1) [    ] o.a.s.c.ZkContainer Zookeeper client=127.0.0.1:39299/solr
   [junit4]   2> 1376336 INFO  (zkConnectionManagerCallback-5824-thread-1) [    ] o.a.s.c.c.ConnectionManager zkClient has connected
   [junit4]   2> 1376344 INFO  (zkConnectionManagerCallback-5826-thread-1) [    ] o.a.s.c.c.ConnectionManager zkClient has connected
   [junit4]   2> 1376346 INFO  (jetty-launcher-5796-thread-1) [n:127.0.0.1:42337_solr    ] o.a.s.c.c.ZkStateReader Updated live nodes from ZooKeeper... (0) -> (1)
   [junit4]   2> 1376348 INFO  (jetty-launcher-5796-thread-1) [n:127.0.0.1:42337_solr    ] o.a.s.c.ZkController Publish node=127.0.0.1:42337_solr as DOWN
   [junit4]   2> 1376348 INFO  (jetty-launcher-5796-thread-1) [n:127.0.0.1:42337_solr    ] o.a.s.c.TransientSolrCoreCacheDefault Allocating transient cache for 2147483647 transient cores
   [junit4]   2> 1376348 INFO  (jetty-launcher-5796-thread-1) [n:127.0.0.1:42337_solr    ] o.a.s.c.ZkController Register node as live in ZooKeeper:/live_nodes/127.0.0.1:42337_solr
   [junit4]   2> 1376348 INFO  (zkCallback-5809-thread-1) [    ] o.a.s.c.c.ZkStateReader Updated live nodes from ZooKeeper... (1) -> (2)
   [junit4]   2> 1376349 INFO  (zkCallback-5816-thread-1) [    ] o.a.s.c.c.ZkStateReader Updated live nodes from ZooKeeper... (1) -> (2)
   [junit4]   2> 1376352 INFO  (zkCallback-5825-thread-1) [    ] o.a.s.c.c.ZkStateReader Updated live nodes from ZooKeeper... (1) -> (2)
   [junit4]   2> 1376356 INFO  (zkConnectionManagerCallback-5833-thread-1) [    ] o.a.s.c.c.ConnectionManager zkClient has connected
   [junit4]   2> 1376357 INFO  (jetty-launcher-5796-thread-1) [n:127.0.0.1:42337_solr    ] o.a.s.c.c.ZkStateReader Updated live nodes from ZooKeeper... (0) -> (2)
   [junit4]   2> 1376357 INFO  (jetty-launcher-5796-thread-1) [n:127.0.0.1:42337_solr    ] o.a.s.c.s.i.ZkClientClusterStateProvider Cluster at 127.0.0.1:39299/solr ready
   [junit4]   2> 1376358 INFO  (jetty-launcher-5796-thread-1) [n:127.0.0.1:42337_solr    ] o.a.s.c.CoreContainer Initializing authentication plugin: solr.JWTAuthPlugin
   [junit4]   2> 1376358 WARN  (jetty-launcher-5796-thread-1) [n:127.0.0.1:42337_solr    ] o.a.s.s.JWTAuthPlugin Warning: No adminUiScope provided, fallback to 'solr' as required scope. If this is not correct, the Admin UI login may not work
   [junit4]   2> 1376370 INFO  (jetty-launcher-5796-thread-1) [n:127.0.0.1:42337_solr    ] o.a.s.h.a.MetricsHistoryHandler No .system collection, keeping metrics history in memory.
   [junit4]   2> 1376381 INFO  (jetty-launcher-5796-thread-1) [n:127.0.0.1:42337_solr    ] o.a.s.m.r.SolrJmxReporter JMX monitoring for 'solr_42337.solr.node' (registry 'solr.node') enabled at server: com.sun.jmx.mbeanserver.JmxMBeanServer@3f67933a
   [junit4]   2> 1376388 INFO  (jetty-launcher-5796-thread-1) [n:127.0.0.1:42337_solr    ] o.a.s.m.r.SolrJmxReporter JMX monitoring for 'solr_42337.solr.jvm' (registry 'solr.jvm') enabled at server: com.sun.jmx.mbeanserver.JmxMBeanServer@3f67933a
   [junit4]   2> 1376388 INFO  (jetty-launcher-5796-thread-1) [n:127.0.0.1:42337_solr    ] o.a.s.m.r.SolrJmxReporter JMX monitoring for 'solr_42337.solr.jetty' (registry 'solr.jetty') enabled at server: com.sun.jmx.mbeanserver.JmxMBeanServer@3f67933a
   [junit4]   2> 1376388 INFO  (jetty-launcher-5796-thread-1) [n:127.0.0.1:42337_solr    ] o.a.s.c.CorePropertiesLocator Found 0 core definitions underneath /home/jenkins/workspace/Lucene-Solr-master-Linux/solr/build/solr-core/test/J2/temp/solr.security.JWTAuthPluginIntegrationTest_484DD026808FE08E-001/tempDir-002/node1/.
   [junit4]   2> 1376405 INFO  (zkConnectionManagerCallback-5839-thread-1) [    ] o.a.s.c.c.ConnectionManager zkClient has connected
   [junit4]   2> 1376406 INFO  (TEST-JWTAuthPluginIntegrationTest.createCollectionUpdateAndQueryDistributed-seed#[484DD026808FE08E]) [    ] o.a.s.c.c.ZkStateReader Updated live nodes from ZooKeeper... (0) -> (2)
   [junit4]   2> 1376406 INFO  (TEST-JWTAuthPluginIntegrationTest.createCollectionUpdateAndQueryDistributed-seed#[484DD026808FE08E]) [    ] o.a.s.c.s.i.ZkClientClusterStateProvider Cluster at 127.0.0.1:39299/solr ready
   [junit4]   2> 1376568 INFO  (qtp1512459792-17202) [n:127.0.0.1:42337_solr    ] o.a.s.h.a.CollectionsHandler Invoked Collection Action :create with params name=jwtColl&action=CREATE&numShards=2 and sendToOCPQueue=true
   [junit4]   2> 1376570 INFO  (OverseerThreadFactory-5576-thread-1-processing-n:127.0.0.1:46757_solr) [n:127.0.0.1:46757_solr    ] o.a.s.c.a.c.CreateCollectionCmd Create collection jwtColl
   [junit4]   2> 1376570 INFO  (OverseerThreadFactory-5576-thread-1-processing-n:127.0.0.1:46757_solr) [n:127.0.0.1:46757_solr    ] o.a.s.c.c.ZkConfigManager Copying zk node /configs/_default/protwords.txt to /configs/jwtColl.AUTOCREATED/protwords.txt
   [junit4]   2> 1376571 INFO  (OverseerThreadFactory-5576-thread-1-processing-n:127.0.0.1:46757_solr) [n:127.0.0.1:46757_solr    ] o.a.s.c.c.ZkConfigManager Copying zk node /configs/_default/managed-schema to /configs/jwtColl.AUTOCREATED/managed-schema
   [junit4]   2> 1376571 INFO  (OverseerThreadFactory-5576-thread-1-processing-n:127.0.0.1:46757_solr) [n:127.0.0.1:46757_solr    ] o.a.s.c.c.ZkConfigManager Copying zk node /configs/_default/solrconfig.xml to /configs/jwtColl.AUTOCREATED/solrconfig.xml
   [junit4]   2> 1376572 INFO  (OverseerThreadFactory-5576-thread-1-processing-n:127.0.0.1:46757_solr) [n:127.0.0.1:46757_solr    ] o.a.s.c.c.ZkConfigManager Copying zk node /configs/_default/synonyms.txt to /configs/jwtColl.AUTOCREATED/synonyms.txt
   [junit4]   2> 1376572 INFO  (OverseerThreadFactory-5576-thread-1-processing-n:127.0.0.1:46757_solr) [n:127.0.0.1:46757_solr    ] o.a.s.c.c.ZkConfigManager Copying zk node /configs/_default/stopwords.txt to /configs/jwtColl.AUTOCREATED/stopwords.txt
   [junit4]   2> 1376573 INFO  (OverseerThreadFactory-5576-thread-1-processing-n:127.0.0.1:46757_solr) [n:127.0.0.1:46757_solr    ] o.a.s.c.c.ZkConfigManager Copying zk node /configs/_default/lang/contractions_it.txt to /configs/jwtColl.AUTOCREATED/lang/contractions_it.txt
   [junit4]   2> 1376573 INFO  (OverseerThreadFactory-5576-thread-1-processing-n:127.0.0.1:46757_solr) [n:127.0.0.1:46757_solr    ] o.a.s.c.c.ZkConfigManager Copying zk node /configs/_default/lang/stemdict_nl.txt to /configs/jwtColl.AUTOCREATED/lang/stemdict_nl.txt
   [junit4]   2> 1376574 INFO  (OverseerThreadFactory-5576-thread-1-processing-n:127.0.0.1:46757_solr) [n:127.0.0.1:46757_solr    ] o.a.s.c.c.ZkConfigManager Copying zk node /configs/_default/lang/stopwords_hy.txt to /configs/jwtColl.AUTOCREATED/lang/stopwords_hy.txt
   [junit4]   2> 1376574 INFO  (OverseerThreadFactory-5576-thread-1-processing-n:127.0.0.1:46757_solr) [n:127.0.0.1:46757_solr    ] o.a.s.c.c.ZkConfigManager Copying zk node /configs/_default/lang/stopwords_no.txt to /configs/jwtColl.AUTOCREATED/lang/stopwords_no.txt
   [junit4]   2> 1376575 INFO  (OverseerThreadFactory-5576-thread-1-processing-n:127.0.0.1:46757_solr) [n:127.0.0.1:46757_solr    ] o.a.s.c.c.ZkConfigManager Copying zk node /configs/_default/lang/contractions_ca.txt to /configs/jwtColl.AUTOCREATED/lang/contractions_ca.txt
   [junit4]   2> 1376575 INFO  (OverseerThreadFactory-5576-thread-1-processing-n:127.0.0.1:46757_solr) [n:127.0.0.1:46757_solr    ] o.a.s.c.c.ZkConfigManager Copying zk node /configs/_default/lang/stopwords_id.txt to /configs/jwtColl.AUTOCREATED/lang/stopwords_id.txt
   [junit4]   2> 1376576 INFO  (OverseerThreadFactory-5576-thread-1-processing-n:127.0.0.1:46757_solr) [n:127.0.0.1:46757_solr    ] o.a.s.c.c.ZkConfigManager Copying zk node /configs/_default/lang/stopwords_ga.txt to /configs/jwtColl.AUTOCREATED/lang/stopwords_ga.txt
   [junit4]   2> 1376576 INFO  (OverseerThreadFactory-5576-thread-1-processing-n:127.0.0.1:46757_solr) [n:127.0.0.1:46757_solr    ] o.a.s.c.c.ZkConfigManager Copying zk node /configs/_default/lang/stopwords_hi.txt to /configs/jwtColl.AUTOCREATED/lang/stopwords_hi.txt
   [junit4]   2> 1376576 INFO  (OverseerThreadFactory-5576-thread-1-processing-n:127.0.0.1:46757_solr) [n:127.0.0.1:46757_solr    ] o.a.s.c.c.ZkConfigManager Copying zk node /configs/_default/lang/stopwords_da.txt to /configs/jwtColl.AUTOCREATED/lang/stopwords_da.txt
   [junit4]   2> 1376577 INFO  (OverseerThreadFactory-5576-thread-1-processing-n:127.0.0.1:46757_solr) [n:127.0.0.1:46757_solr    ] o.a.s.c.c.ZkConfigManager Copying zk node /configs/_default/lang/stopwords_ja.txt to /configs/jwtColl.AUTOCREATED/lang/stopwords_ja.txt
   [junit4]   2> 1376577 INFO  (OverseerThreadFactory-5576-thread-1-processing-n:127.0.0.1:46757_solr) [n:127.0.0.1:46757_solr    ] o.a.s.c.c.ZkConfigManager Copying zk node /configs/_default/lang/stopwords_pt.txt to /configs/jwtColl.AUTOCREATED/lang/stopwords_pt.txt
   [junit4]   2> 1376578 INFO  (OverseerThreadFactory-5576-thread-1-processing-n:127.0.0.1:46757_solr) [n:127.0.0.1:46757_solr    ] o.a.s.c.c.ZkConfigManager Copying zk node /configs/_default/lang/stopwords_hu.txt to /configs/jwtColl.AUTOCREATED/lang/stopwords_hu.txt
   [junit4]   2> 1376578 INFO  (OverseerThreadFactory-5576-thread-1-processing-n:127.0.0.1:46757_solr) [n:127.0.0.1:46757_solr    ] o.a.s.c.c.ZkConfigManager Copying zk node /configs/_default/lang/stopwords_el.txt to /configs/jwtColl.AUTOCREATED/lang/stopwords_el.txt
   [junit4]   2> 1376579 INFO  (OverseerThreadFactory-5576-thread-1-processing-n:127.0.0.1:46757_solr) [n:127.0.0.1:46757_solr    ] o.a.s.c.c.ZkConfigManager Copying zk node /configs/_default/lang/stopwords_ru.txt to /configs/jwtColl.AUTOCREATED/lang/stopwords_ru.txt
   [junit4]   2> 1376579 INFO  (OverseerThreadFactory-5576-thread-1-processing-n:127.0.0.1:46757_solr) [n:127.0.0.1:46757_solr    ] o.a.s.c.c.ZkConfigManager Copying zk node /configs/_default/lang/stopwords_tr.txt to /configs/jwtColl.AUTOCREATED/lang/stopwords_tr.txt
   [junit4]   2> 1376580 INFO  (OverseerThreadFactory-5576-thread-1-processing-n:127.0.0.1:46757_solr) [n:127.0.0.1:46757_solr    ] o.a.s.c.c.ZkConfigManager Copying zk node /configs/_default/lang/stopwords_ar.txt to /configs/jwtColl.AUTOCREATED/lang/stopwords_ar.txt
   [junit4]   2> 1376580 INFO  (OverseerThreadFactory-5576-thread-1-processing-n:127.0.0.1:46757_solr) [n:127.0.0.1:46757_solr    ] o.a.s.c.c.ZkConfigManager Copying zk node /configs/_default/lang/userdict_ja.txt to /configs/jwtColl.AUTOCREATED/lang/userdict_ja.txt
   [junit4]   2> 1376581 INFO  (OverseerThreadFactory-5576-thread-1-processing-n:127.0.0.1:46757_solr) [n:127.0.0.1:46757_solr    ] o.a.s.c.c.ZkConfigManager Copying zk node /configs/_default/lang/stopwords_eu.txt to /configs/jwtColl.AUTOCREATED/lang/stopwords_eu.txt
   [junit4]   2> 1376581 INFO  (OverseerThreadFactory-5576-thread-1-processing-n:127.0.0.1:46757_solr) [n:127.0.0.1:46757_solr    ] o.a.s.c.c.ZkConfigManager Copying zk node /configs/_default/lang/stopwords_it.txt to /configs/jwtColl.AUTOCREATED/lang/stopwords_it.txt
   [junit4]   2> 1376582 INFO  (OverseerThreadFactory-5576-thread-1-processing-n:127.0.0.1:46757_solr) [n:127.0.0.1:46757_solr    ] o.a.s.c.c.ZkConfigManager Copying zk node /configs/_default/lang/stopwords_cz.txt to /configs/jwtColl.AUTOCREATED/lang/stopwords_cz.txt
   [junit4]   2> 1376582 INFO  (OverseerThreadFactory-5576-thread-1-processing-n:127.0.0.1:46757_solr) [n:127.0.0.1:46757_solr    ] o.a.s.c.c.ZkConfigManager Copying zk node /configs/_default/lang/stoptags_ja.txt to /configs/jwtColl.AUTOCREATED/lang/stoptags_ja.txt
   [junit4]   2> 1376583 INFO  (OverseerThreadFactory-5576-thread-1-processing-n:127.0.0.1:46757_solr) [n:127.0.0.1:46757_solr    ] o.a.s.c.c.ZkConfigManager Copying zk node /configs/_default/lang/contractions_fr.txt to /configs/jwtColl.AUTOCREATED/lang/contractions_fr.txt
   [junit4]   2> 1376583 INFO  (OverseerThreadFactory-5576-thread-1-processing-n:127.0.0.1:46757_solr) [n:127.0.0.1:46757_solr    ] o.a.s.c.c.ZkConfigManager Copying zk node /configs/_default/lang/stopwords_de.txt to /configs/jwtColl.AUTOCREATED/lang/stopwords_de.txt
   [junit4]   2> 1376584 INFO  (OverseerThreadFactory-5576-thread-1-processing-n:127.0.0.1:46757_solr) [n:127.0.0.1:46757_solr    ] o.a.s.c.c.ZkConfigManager Copying zk node /configs/_default/lang/stopwords_fa.txt to /configs/jwtColl.AUTOCREATED/lang/stopwords_fa.txt
   [junit4]   2> 1376584 INFO  (OverseerThreadFactory-5576-thread-1-processing-n:127.0.0.1:46757_solr) [n:127.0.0.1:46757_solr    ] o.a.s.c.c.ZkConfigManager Copying zk node /configs/_default/lang/contractions_ga.txt to /configs/jwtColl.AUTOCREATED/lang/contractions_ga.txt
   [junit4]   2> 1376585 INFO  (OverseerThreadFactory-5576-thread-1-processing-n:127.0.0.1:46757_solr) [n:127.0.0.1:46757_solr    ] o.a.s.c.c.ZkConfigManager Copying zk node /configs/_default/lang/stopwords_ca.txt to /configs/jwtColl.AUTOCREATED/lang/stopwords_ca.txt
   [junit4]   2> 1376585 INFO  (OverseerThreadFactory-5576-thread-1-processing-n:127.0.0.1:46757_solr) [n:127.0.0.1:46757_solr    ] o.a.s.c.c.ZkConfigManager Copying zk node /configs/_default/lang/stopwords_nl.txt to /configs/jwtColl.AUTOCREATED/lang/stopwords_nl.txt
   [junit4]   2> 1376586 INFO  (OverseerThreadFactory-5576-thread-1-processing-n:127.0.0.1:46757_solr) [n:127.0.0.1:46757_solr    ] o.a.s.c.c.ZkConfigManager Copying zk node /configs/_default/lang/stopwords_bg.txt to /configs/jwtColl.AUTOCREATED/lang/stopwords_bg.txt
   [junit4]   2> 1376586 INFO  (OverseerThreadFactory-5576-thread-1-processing-n:127.0.0.1:46757_solr) [n:127.0.0.1:46757_solr    ] o.a.s.c.c.ZkConfigManager Copying zk node /configs/_default/lang/stopwords_lv.txt to /configs/jwtColl.AUTOCREATED/lang/stopwords_lv.txt
   [junit4]   2> 1376587 INFO  (OverseerThreadFactory-5576-thread-1-processing-n:127.0.0.1:46757_solr) [n:127.0.0.1:46757_solr    ] o.a.s.c.c.ZkConfigManager Copying zk node /configs/_default/lang/stopwords_en.txt to /configs/jwtColl.AUTOCREATED/lang/stopwords_en.txt
   [junit4]   2> 1376588 INFO  (OverseerThreadFactory-5576-thread-1-processing-n:127.0.0.1:46757_solr) [n:127.0.0.1:46757_solr    ] o.a.s.c.c.ZkConfigManager Copying zk node /configs/_default/lang/stopwords_es.txt to /configs/jwtColl.AUTOCREATED/lang/stopwords_es.txt
   [junit4]   2> 1376588 INFO  (OverseerThreadFactory-5576-thread-1-processing-n:127.0.0.1:46757_solr) [n:127.0.0.1:46757_solr    ] o.a.s.c.c.ZkConfigManager Copying zk node /configs/_default/lang/stopwords_th.txt to /configs/jwtColl.AUTOCREATED/lang/stopwords_th.txt
   [junit4]   2> 1376589 INFO  (OverseerThreadFactory-5576-thread-1-processing-n:127.0.0.1:46757_solr) [n:127.0.0.1:46757_solr    ] o.a.s.c.c.ZkConfigManager Copying zk node /configs/_default/lang/stopwords_ro.txt to /configs/jwtColl.AUTOCREATED/lang/stopwords_ro.txt
   [junit4]   2> 1376589 INFO  (OverseerThreadFactory-5576-thread-1-processing-n:127.0.0.1:46757_solr) [n:127.0.0.1:46757_solr    ] o.a.s.c.c.ZkConfigManager Copying zk node /configs/_default/lang/stopwords_fr.txt to /configs/jwtColl.AUTOCREATED/lang/stopwords_fr.txt
   [junit4]   2> 1376590 INFO  (OverseerThreadFactory-5576-thread-1-processing-n:127.0.0.1:46757_solr) [n:127.0.0.1:46757_solr    ] o.a.s.c.c.ZkConfigManager Copying zk node /configs/_default/lang/stopwords_sv.txt to /configs/jwtColl.AUTOCREATED/lang/stopwords_sv.txt
   [junit4]   2> 1376591 INFO  (OverseerThreadFactory-5576-thread-1-processing-n:127.0.0.1:46757_solr) [n:127.0.0.1:46757_solr    ] o.a.s.c.c.ZkConfigManager Copying zk node /configs/_default/lang/stopwords_fi.txt to /configs/jwtColl.AUTOCREATED/lang/stopwords_fi.txt
   [junit4]   2> 1376591 INFO  (OverseerThreadFactory-5576-thread-1-processing-n:127.0.0.1:46757_solr) [n:127.0.0.1:46757_solr    ] o.a.s.c.c.ZkConfigManager Copying zk node /configs/_default/lang/hyphenations_ga.txt to /configs/jwtColl.AUTOCREATED/lang/hyphenations_ga.txt
   [junit4]   2> 1376592 INFO  (OverseerThreadFactory-5576-thread-1-processing-n:127.0.0.1:46757_solr) [n:127.0.0.1:46757_solr    ] o.a.s.c.c.ZkConfigManager Copying zk node /configs/_default/lang/stopwords_gl.txt to /configs/jwtColl.AUTOCREATED/lang/stopwords_gl.txt
   [junit4]   2> 1376592 INFO  (OverseerThreadFactory-5576-thread-1-processing-n:127.0.0.1:46757_solr) [n:127.0.0.1:46757_solr    ] o.a.s.c.c.ZkConfigManager Copying zk node /configs/_default/params.json to /configs/jwtColl.AUTOCREATED/params.json
   [junit4]   2> 1376704 INFO  (qtp1512459792-17266) [n:127.0.0.1:42337_solr    ] o.a.s.s.HttpSolrCall [admin] webapp=null path=/admin/info/key params={omitHeader=true&wt=json} status=0 QTime=0
   [junit4]   2> 1376704 INFO  (qtp1512459792-17200) [    ] o.a.s.s.PKIAuthenticationPlugin New Key obtained from  node: 127.0.0.1:42337_solr / MIIBIjANBgkqhkiG9w0BAQEFAAOCAQ8AMIIBCgKCAQEA2GViykS+kTs4xa8w+9bnkvm4/kqn477/K9dWZy9Y2urAEudM4MZgycYzW6W4H0E6i5H2VhM8XYty7oIp+typV4vyLkOs/MFHrOOxdW27qsapgWGBU9HxBLOt+m0wo0GrotvVmlJrk9GLvWK7d8PJPJL6XuXO5BGcaoagXwZT4pC3oTAc1d/x/xCvWLKrePdo7vvWJen6cBWFCWdcyXoxv7jD3f/cfY/fkzQlP7eMD9pQCG4ffbYxc7wJrsrH+BHldFhmijFFcuncTeFaTIl+7XPFP4IrWgOANL1f3DPcsNt1TRI0qeE69v04KEgH2qS8a9rZovhc+I7oUzK2Kn0l4wIDAQAB
   [junit4]   2> 1376705 INFO  (qtp1512459792-17200) [n:127.0.0.1:42337_solr    ] o.a.s.s.HttpSolrCall [admin] webapp=null path=/admin/metrics params={prefix=CONTAINER.fs.usableSpace,CONTAINER.fs.totalSpace,CORE.coreName&wt=javabin&version=2&group=solr.node,solr.core} status=0 QTime=0
   [junit4]   2> 1376711 INFO  (qtp1512459792-17204) [n:127.0.0.1:42337_solr    ] o.a.s.s.HttpSolrCall [admin] webapp=null path=/admin/info/key params={omitHeader=true&wt=json} status=0 QTime=0
   [junit4]   2> 1376711 INFO  (qtp218025455-17201) [    ] o.a.s.s.PKIAuthenticationPlugin New Key obtained from  node: 127.0.0.1:42337_solr / MIIBIjANBgkqhkiG9w0BAQEFAAOCAQ8AMIIBCgKCAQEA2GViykS+kTs4xa8w+9bnkvm4/kqn477/K9dWZy9Y2urAEudM4MZgycYzW6W4H0E6i5H2VhM8XYty7oIp+typV4vyLkOs/MFHrOOxdW27qsapgWGBU9HxBLOt+m0wo0GrotvVmlJrk9GLvWK7d8PJPJL6XuXO5BGcaoagXwZT4pC3oTAc1d/x/xCvWLKrePdo7vvWJen6cBWFCWdcyXoxv7jD3f/cfY/fkzQlP7eMD9pQCG4ffbYxc7wJrsrH+BHldFhmijFFcuncTeFaTIl+7XPFP4IrWgOANL1f3DPcsNt1TRI0qeE69v04KEgH2qS8a9rZovhc+I7oUzK2Kn0l4wIDAQAB
   [junit4]   2> 1376712 INFO  (qtp218025455-17201) [n:127.0.0.1:46757_solr    ] o.a.s.s.HttpSolrCall [admin] webapp=null path=/admin/metrics params={prefix=CONTAINER.fs.usableSpace,CONTAINER.fs.totalSpace,CORE.coreName&wt=javabin&version=2&group=solr.node,solr.core} status=0 QTime=0
   [junit4]   2> 1376715 INFO  (OverseerStateUpdate-72356706789228550-127.0.0.1:46757_solr-n_0000000000) [n:127.0.0.1:46757_solr    ] o.a.s.c.o.SliceMutator createReplica() {
   [junit4]   2>   "operation":"ADDREPLICA",
   [junit4]   2>   "collection":"jwtColl",
   [junit4]   2>   "shard":"shard1",
   [junit4]   2>   "core":"jwtColl_shard1_replica_n1",
   [junit4]   2>   "state":"down",
   [junit4]   2>   "base_url":"http://127.0.0.1:46757/solr",
   [junit4]   2>   "type":"NRT",
   [junit4]   2>   "waitForFinalState":"false"} 
   [junit4]   2> 1376716 INFO  (OverseerStateUpdate-72356706789228550-127.0.0.1:46757_solr-n_0000000000) [n:127.0.0.1:46757_solr    ] o.a.s.c.o.SliceMutator createReplica() {
   [junit4]   2>   "operation":"ADDREPLICA",
   [junit4]   2>   "collection":"jwtColl",
   [junit4]   2>   "shard":"shard2",
   [junit4]   2>   "core":"jwtColl_shard2_replica_n2",
   [junit4]   2>   "state":"down",
   [junit4]   2>   "base_url":"http://127.0.0.1:42337/solr",
   [junit4]   2>   "type":"NRT",
   [junit4]   2>   "waitForFinalState":"false"} 
   [junit4]   2> 1376922 INFO  (qtp218025455-17203) [n:127.0.0.1:46757_solr    x:jwtColl_shard1_replica_n1] o.a.s.h.a.CoreAdminOperation core create command qt=/admin/cores&coreNodeName=core_node3&collection.configName=jwtColl.AUTOCREATED&newCollection=true&name=jwtColl_shard1_replica_n1&action=CREATE&numShards=2&collection=jwtColl&shard=shard1&wt=javabin&version=2&replicaType=NRT
   [junit4]   2> 1376922 INFO  (qtp218025455-17203) [n:127.0.0.1:46757_solr    x:jwtColl_shard1_replica_n1] o.a.s.c.TransientSolrCoreCacheDefault Allocating transient cache for 2147483647 transient cores
   [junit4]   2> 1376923 INFO  (qtp1512459792-17266) [n:127.0.0.1:42337_solr    x:jwtColl_shard2_replica_n2] o.a.s.h.a.CoreAdminOperation core create command qt=/admin/cores&coreNodeName=core_node4&collection.configName=jwtColl.AUTOCREATED&newCollection=true&name=jwtColl_shard2_replica_n2&action=CREATE&numShards=2&collection=jwtColl&shard=shard2&wt=javabin&version=2&replicaType=NRT
   [junit4]   2> 1377930 INFO  (qtp218025455-17203) [n:127.0.0.1:46757_solr c:jwtColl s:shard1 r:core_node3 x:jwtColl_shard1_replica_n1] o.a.s.c.RequestParams conf resource params.json loaded . version : 0 
   [junit4]   2> 1377930 INFO  (qtp218025455-17203) [n:127.0.0.1:46757_solr c:jwtColl s:shard1 r:core_node3 x:jwtColl_shard1_replica_n1] o.a.s.c.RequestParams request params refreshed to version 0
   [junit4]   2> 1377930 INFO  (qtp1512459792-17266) [n:127.0.0.1:42337_solr c:jwtColl s:shard2 r:core_node4 x:jwtColl_shard2_replica_n2] o.a.s.c.RequestParams conf resource params.json loaded . version : 0 
   [junit4]   2> 1377930 INFO  (qtp1512459792-17266) [n:127.0.0.1:42337_solr c:jwtColl s:shard2 r:core_node4 x:jwtColl_shard2_replica_n2] o.a.s.c.RequestParams request params refreshed to version 0
   [junit4]   2> 1377931 WARN  (qtp1512459792-17266) [n:127.0.0.1:42337_solr c:jwtColl s:shard2 r:core_node4 x:jwtColl_shard2_replica_n2] o.a.s.c.SolrConfig Couldn't add files from /home/jenkins/workspace/Lucene-Solr-master-Linux/solr/build/solr-core/test/J2/temp/solr.security.JWTAuthPluginIntegrationTest_484DD026808FE08E-001/tempDir-002/node1/jwtColl_shard2_replica_n2/../../../../contrib/extraction/lib filtered by .*\.jar to classpath: /home/jenkins/workspace/Lucene-Solr-master-Linux/solr/build/solr-core/test/J2/temp/solr.security.JWTAuthPluginIntegrationTest_484DD026808FE08E-001/tempDir-002/node1/jwtColl_shard2_replica_n2/../../../../contrib/extraction/lib
   [junit4]   2> 1377931 WARN  (qtp218025455-17203) [n:127.0.0.1:46757_solr c:jwtColl s:shard1 r:core_node3 x:jwtColl_shard1_replica_n1] o.a.s.c.SolrConfig Couldn't add files from /home/jenkins/workspace/Lucene-Solr-master-Linux/solr/build/solr-core/test/J2/temp/solr.security.JWTAuthPluginIntegrationTest_484DD026808FE08E-001/tempDir-002/node2/jwtColl_shard1_replica_n1/../../../../contrib/extraction/lib filtered by .*\.jar to classpath: /home/jenkins/workspace/Lucene-Solr-master-Linux/solr/build/solr-core/test/J2/temp/solr.security.JWTAuthPluginIntegrationTest_484DD026808FE08E-001/tempDir-002/node2/jwtColl_shard1_replica_n1/../../../../contrib/extraction/lib
   [junit4]   2> 1377931 WARN  (qtp1512459792-17266) [n:127.0.0.1:42337_solr c:jwtColl s:shard2 r:core_node4 x:jwtColl_shard2_replica_n2] o.a.s.c.SolrConfig Couldn't add files from /home/jenkins/workspace/Lucene-Solr-master-Linux/solr/build/solr-core/test/J2/temp/solr.security.JWTAuthPluginIntegrationTest_484DD026808FE08E-001/tempDir-002/node1/jwtColl_shard2_replica_n2/../../../../dist filtered by solr-cell-\d.*\.jar to classpath: /home/jenkins/workspace/Lucene-Solr-master-Linux/solr/build/solr-core/test/J2/temp/solr.security.JWTAuthPluginIntegrationTest_484DD026808FE08E-001/tempDir-002/node1/jwtColl_shard2_replica_n2/../../../../dist
   [junit4]   2> 1377931 WARN  (qtp1512459792-17266) [n:127.0.0.1:42337_solr c:jwtColl s:shard2 r:core_node4 x:jwtColl_shard2_replica_n2] o.a.s.c.SolrConfig Couldn't add files from /home/jenkins/workspace/Lucene-Solr-master-Linux/solr/build/solr-core/test/J2/temp/solr.security.JWTAuthPluginIntegrationTest_484DD026808FE08E-001/tempDir-002/node1/jwtColl_shard2_replica_n2/../../../../contrib/clustering/lib filtered by .*\.jar to classpath: /home/jenkins/workspace/Lucene-Solr-master-Linux/solr/build/solr-core/test/J2/temp/solr.security.JWTAuthPluginIntegrationTest_484DD026808FE08E-001/tempDir-002/node1/jwtColl_shard2_replica_n2/../../../../contrib/clustering/lib
   [junit4]   2> 1377931 WARN  (qtp218025455-17203) [n:127.0.0.1:46757_solr c:jwtColl s:shard1 r:core_node3 x:jwtColl_shard1_replica_n1] o.a.s.c.SolrConfig Couldn't add files from /home/jenkins/workspace/Lucene-Solr-master-Linux/solr/build/solr-core/test/J2/temp/solr.security.JWTAuthPluginIntegrationTest_484DD026808FE08E-001/tempDir-002/node2/jwtColl_shard1_replica_n1/../../../../dist filtered by solr-cell-\d.*\.jar to classpath: /home/jenkins/workspace/Lucene-Solr-master-Linux/solr/build/solr-core/test/J2/temp/solr.security.JWTAuthPluginIntegrationTest_484DD026808FE08E-001/tempDir-002/node2/jwtColl_shard1_replica_n1/../../../../dist
   [junit4]   2> 1377931 WARN  (qtp1512459792-17266) [n:127.0.0.1:42337_solr c:jwtColl s:shard2 r:core_node4 x:jwtColl_shard2_replica_n2] o.a.s.c.SolrConfig Couldn't add files from /home/jenkins/workspace/Lucene-Solr-master-Linux/solr/build/solr-core/test/J2/temp/solr.security.JWTAuthPluginIntegrationTest_484DD026808FE08E-001/tempDir-002/node1/jwtColl_shard2_replica_n2/../../../../dist filtered by solr-clustering-\d.*\.jar to classpath: /home/jenkins/workspace/Lucene-Solr-master-Linux/solr/build/solr-core/test/J2/temp/solr.security.JWTAuthPluginIntegrationTest_484DD026808FE08E-001/tempDir-002/node1/jwtColl_shard2_replica_n2/../../../../dist
   [junit4]   2> 1377931 WARN  (qtp1512459792-17266) [n:127.0.0.1:42337_solr c:jwtColl s:shard2 r:core_node4 x:jwtColl_shard2_replica_n2] o.a.s.c.SolrConfig Couldn't add files from /home/jenkins/workspace/Lucene-Solr-master-Linux/solr/build/solr-core/test/J2/temp/solr.security.JWTAuthPluginIntegrationTest_484DD026808FE08E-001/tempDir-002/node1/jwtColl_shard2_replica_n2/../../../../contrib/langid/lib filtered by .*\.jar to classpath: /home/jenkins/workspace/Lucene-Solr-master-Linux/solr/build/solr-core/test/J2/temp/solr.security.JWTAuthPluginIntegrationTest_484DD026808FE08E-001/tempDir-002/node1/jwtColl_shard2_replica_n2/../../../../contrib/langid/lib
   [junit4]   2> 1377931 WARN  (qtp218025455-17203) [n:127.0.0.1:46757_solr c:jwtColl s:shard1 r:core_node3 x:jwtColl_shard1_replica_n1] o.a.s.c.SolrConfig Couldn't add files from /home/jenkins/workspace/Lucene-Solr-master-Linux/solr/build/solr-core/test/J2/temp/solr.security.JWTAuthPluginIntegrationTest_484DD026808FE08E-001/tempDir-002/node2/jwtColl_shard1_replica_n1/../../../../contrib/clustering/lib filtered by .*\.jar to classpath: /home/jenkins/workspace/Lucene-Solr-master-Linux/solr/build/solr-core/test/J2/temp/solr.security.JWTAuthPluginIntegrationTest_484DD026808FE08E-001/tempDir-002/node2/jwtColl_shard1_replica_n1/../../../../contrib/clustering/lib
   [junit4]   2> 1377931 WARN  (qtp1512459792-17266) [n:127.0.0.1:42337_solr c:jwtColl s:shard2 r:core_node4 x:jwtColl_shard2_replica_n2] o.a.s.c.SolrConfig Couldn't add files from /home/jenkins/workspace/Lucene-Solr-master-Linux/solr/build/solr-core/test/J2/temp/solr.security.JWTAuthPluginIntegrationTest_484DD026808FE08E-001/tempDir-002/node1/jwtColl_shard2_replica_n2/../../../../dist filtered by solr-langid-\d.*\.jar to classpath: /home/jenkins/workspace/Lucene-Solr-master-Linux/solr/build/solr-core/test/J2/temp/solr.security.JWTAuthPluginIntegrationTest_484DD026808FE08E-001/tempDir-002/node1/jwtColl_shard2_replica_n2/../../../../dist
   [junit4]   2> 1377931 WARN  (qtp218025455-17203) [n:127.0.0.1:46757_solr c:jwtColl s:shard1 r:core_node3 x:jwtColl_shard1_replica_n1] o.a.s.c.SolrConfig Couldn't add files from /home/jenkins/workspace/Lucene-Solr-master-Linux/solr/build/solr-core/test/J2/temp/solr.security.JWTAuthPluginIntegrationTest_484DD026808FE08E-001/tempDir-002/node2/jwtColl_shard1_replica_n1/../../../../dist filtered by solr-clustering-\d.*\.jar to classpath: /home/jenkins/workspace/Lucene-Solr-master-Linux/solr/build/solr-core/test/J2/temp/solr.security.JWTAuthPluginIntegrationTest_484DD026808FE08E-001/tempDir-002/node2/jwtColl_shard1_replica_n1/../../../../dist
   [junit4]   2> 1377931 WARN  (qtp1512459792-17266) [n:127.0.0.1:42337_solr c:jwtColl s:shard2 r:core_node4 x:jwtColl_shard2_replica_n2] o.a.s.c.SolrConfig Couldn't add files from /home/jenkins/workspace/Lucene-Solr-master-Linux/solr/build/solr-core/test/J2/temp/solr.security.JWTAuthPluginIntegrationTest_484DD026808FE08E-001/tempDir-002/node1/jwtColl_shard2_replica_n2/../../../../contrib/velocity/lib filtered by .*\.jar to classpath: /home/jenkins/workspace/Lucene-Solr-master-Linux/solr/build/solr-core/test/J2/temp/solr.security.JWTAuthPluginIntegrationTest_484DD026808FE08E-001/tempDir-002/node1/jwtColl_shard2_replica_n2/../../../../contrib/velocity/lib
   [junit4]   2> 1377931 WARN  (qtp1512459792-17266) [n:127.0.0.1:42337_solr c:jwtColl s:shard2 r:core_node4 x:jwtColl_shard2_replica_n2] o.a.s.c.SolrConfig Couldn't add files from /home/jenkins/workspace/Lucene-Solr-master-Linux/solr/build/solr-core/test/J2/temp/solr.security.JWTAuthPluginIntegrationTest_484DD026808FE08E-001/tempDir-002/node1/jwtColl_shard2_replica_n2/../../../../dist filtered by solr-velocity-\d.*\.jar to classpath: /home/jenkins/workspace/Lucene-Solr-master-Linux/solr/build/solr-core/test/J2/temp/solr.security.JWTAuthPluginIntegrationTest_484DD026808FE08E-001/tempDir-002/node1/jwtColl_shard2_replica_n2/../../../../dist
   [junit4]   2> 1377931 WARN  (qtp218025455-17203) [n:127.0.0.1:46757_solr c:jwtColl s:shard1 r:core_node3 x:jwtColl_shard1_replica_n1] o.a.s.c.SolrConfig Couldn't add files from /home/jenkins/workspace/Lucene-Solr-master-Linux/solr/build/solr-core/test/J2/temp/solr.security.JWTAuthPluginIntegrationTest_484DD026808FE08E-001/tempDir-002/node2/jwtColl_shard1_replica_n1/../../../../contrib/langid/lib filtered by .*\.jar to classpath: /home/jenkins/workspace/Lucene-Solr-master-Linux/solr/build/solr-core/test/J2/temp/solr.security.JWTAuthPluginIntegrationTest_484DD026808FE08E-001/tempDir-002/node2/jwtColl_shard1_replica_n1/../../../../contrib/langid/lib
   [junit4]   2> 1377931 WARN  (qtp1512459792-17266) [n:127.0.0.1:42337_solr c:jwtColl s:shard2 r:core_node4 x:jwtColl_shard2_replica_n2] o.a.s.c.SolrConfig Couldn't add files from /home/jenkins/workspace/Lucene-Solr-master-Linux/solr/build/solr-core/test/J2/temp/solr.security.JWTAuthPluginIntegrationTest_484DD026808FE08E-001/tempDir-002/node1/jwtColl_shard2_replica_n2/../../../../dist filtered by solr-ltr-\d.*\.jar to classpath: /home/jenkins/workspace/Lucene-Solr-master-Linux/solr/build/solr-core/test/J2/temp/solr.security.JWTAuthPluginIntegrationTest_484DD026808FE08E-001/tempDir-002/node1/jwtColl_shard2_replica_n2/../../../../dist
   [junit4]   2> 1377931 WARN  (qtp218025455-17203) [n:127.0.0.1:46757_solr c:jwtColl s:shard1 r:core_node3 x:jwtColl_shard1_replica_n1] o.a.s.c.SolrConfig Couldn't add files from /home/jenkins/workspace/Lucene-Solr-master-Linux/solr/build/solr-core/test/J2/temp/solr.security.JWTAuthPluginIntegrationTest_484DD026808FE08E-001/tempDir-002/node2/jwtColl_shard1_replica_n1/../../../../dist filtered by solr-langid-\d.*\.jar to classpath: /home/jenkins/workspace/Lucene-Solr-master-Linux/solr/build/solr-core/test/J2/temp/solr.security.JWTAuthPluginIntegrationTest_484DD026808FE08E-001/tempDir-002/node2/jwtColl_shard1_replica_n1/../../../../dist
   [junit4]   2> 1377931 WARN  (qtp218025455-17203) [n:127.0.0.1:46757_solr c:jwtColl s:shard1 r:core_node3 x:jwtColl_shard1_replica_n1] o.a.s.c.SolrConfig Couldn't add files from /home/jenkins/workspace/Lucene-Solr-master-Linux/solr/build/solr-core/test/J2/temp/solr.security.JWTAuthPluginIntegrationTest_484DD026808FE08E-001/tempDir-002/node2/jwtColl_shard1_replica_n1/../../../../contrib/velocity/lib filtered by .*\.jar to classpath: /home/jenkins/workspace/Lucene-Solr-master-Linux/solr/build/solr-core/test/J2/temp/solr.security.JWTAuthPluginIntegrationTest_484DD026808FE08E-001/tempDir-002/node2/jwtColl_shard1_replica_n1/../../../../contrib/velocity/lib
   [junit4]   2> 1377931 WARN  (qtp218025455-17203) [n:127.0.0.1:46757_solr c:jwtColl s:shard1 r:core_node3 x:jwtColl_shard1_replica_n1] o.a.s.c.SolrConfig Couldn't add files from /home/jenkins/workspace/Lucene-Solr-master-Linux/solr/build/solr-core/test/J2/temp/solr.security.JWTAuthPluginIntegrationTest_484DD026808FE08E-001/tempDir-002/node2/jwtColl_shard1_replica_n1/../../../../dist filtered by solr-velocity-\d.*\.jar to classpath: /home/jenkins/workspace/Lucene-Solr-master-Linux/solr/build/solr-core/test/J2/temp/solr.security.JWTAuthPluginIntegrationTest_484DD026808FE08E-001/tempDir-002/node2/jwtColl_shard1_replica_n1/../../../../dist
   [junit4]   2> 1377931 WARN  (qtp218025455-17203) [n:127.0.0.1:46757_solr c:jwtColl s:shard1 r:core_node3 x:jwtColl_shard1_replica_n1] o.a.s.c.SolrConfig Couldn't add files from /home/jenkins/workspace/Lucene-Solr-master-Linux/solr/build/solr-core/test/J2/temp/solr.security.JWTAuthPluginIntegrationTest_484DD026808FE08E-001/tempDir-002/node2/jwtColl_shard1_replica_n1/../../../../dist filtered by solr-ltr-\d.*\.jar to classpath: /home/jenkins/workspace/Lucene-Solr-master-Linux/solr/build/solr-core/test/J2/temp/solr.security.JWTAuthPluginIntegrationTest_484DD026808FE08E-001/tempDir-002/node2/jwtColl_shard1_replica_n1/../../../../dist
   [junit4]   2> 1377931 INFO  (qtp1512459792-17266) [n:127.0.0.1:42337_solr c:jwtColl s:shard2 r:core_node4 x:jwtColl_shard2_replica_n2] o.a.s.c.SolrConfig Using Lucene MatchVersion: 9.0.0
   [junit4]   2> 1377932 INFO  (qtp218025455-17203) [n:127.0.0.1:46757_solr c:jwtColl s:shard1 r:core_node3 x:jwtColl_shard1_replica_n1] o.a.s.c.SolrConfig Using Lucene MatchVersion: 9.0.0
   [junit4]   2> 1377965 INFO  (qtp1512459792-17266) [n:127.0.0.1:42337_solr c:jwtColl s:shard2 r:core_node4 x:jwtColl_shard2_replica_n2] o.a.s.s.IndexSchema [jwtColl_shard2_replica_n2] Schema name=default-config
   [junit4]   2> 1377974 INFO  (qtp218025455-17203) [n:127.0.0.1:46757_solr c:jwtColl s:shard1 r:core_node3 x:jwtColl_shard1_replica_n1] o.a.s.s.IndexSchema [jwtColl_shard1_replica_n1] Schema name=default-config
   [junit4]   2> 1378099 INFO  (qtp1512459792-17266) [n:127.0.0.1:42337_solr c:jwtColl s:shard2 r:core_node4 x:jwtColl_shard2_replica_n2] o.a.s.s.IndexSchema Loaded schema default-config/1.6 with uniqueid field id
   [junit4]   2> 1378115 INFO  (qtp1512459792-17266) [n:127.0.0.1:42337_solr c:jwtColl s:shard2 r:core_node4 x:jwtColl_shard2_replica_n2] o.a.s.c.CoreContainer Creating SolrCore 'jwtColl_shard2_replica_n2' using configuration from collection jwtColl, trusted=true
   [junit4]   2> 1378116 INFO  (qtp1512459792-17266) [n:127.0.0.1:42337_solr c:jwtColl s:shard2 r:core_node4 x:jwtColl_shard2_replica_n2] o.a.s.m.r.SolrJmxReporter JMX monitoring for 'solr_42337.solr.core.jwtColl.shard2.replica_n2' (registry 'solr.core.jwtColl.shard2.replica_n2') enabled at server: com.sun.jmx.mbeanserver.JmxMBeanServer@3f67933a
   [junit4]   2> 1378116 INFO  (qtp1512459792-17266) [n:127.0.0.1:42337_solr c:jwtColl s:shard2 r:core_node4 x:jwtColl_shard2_replica_n2] o.a.s.c.SolrCore [[jwtColl_shard2_replica_n2] ] Opening new SolrCore at [/home/jenkins/workspace/Lucene-Solr-master-Linux/solr/build/solr-core/test/J2/temp/solr.security.JWTAuthPluginIntegrationTest_484DD026808FE08E-001/tempDir-002/node1/jwtColl_shard2_replica_n2], dataDir=[/home/jenkins/workspace/Lucene-Solr-master-Linux/solr/build/solr-core/test/J2/temp/solr.security.JWTAuthPluginIntegrationTest_484DD026808FE08E-001/tempDir-002/node1/./jwtColl_shard2_replica_n2/data/]
   [junit4]   2> 1378117 INFO  (qtp1512459792-17266) [n:127.0.0.1:42337_solr c:jwtColl s:shard2 r:core_node4 x:jwtColl_shard2_replica_n2] o.a.s.r.XSLTResponseWriter xsltCacheLifetimeSeconds=5
   [junit4]   2> 1378161 INFO  (qtp218025455-17203) [n:127.0.0.1:46757_solr c:jwtColl s:shard1 r:core_node3 x:jwtColl_shard1_replica_n1] o.a.s.s.IndexSchema Loaded schema default-config/1.6 with uniqueid field id
   [junit4]   2> 1378175 INFO  (qtp218025455-17203) [n:127.0.0.1:46757_solr c:jwtColl s:shard1 r:core_node3 x:jwtColl_shard1_replica_n1] o.a.s.c.CoreContainer Creating SolrCore 'jwtColl_shard1_replica_n1' using configuration from collection jwtColl, trusted=true
   [junit4]   2> 1378176 INFO  (qtp218025455-17203) [n:127.0.0.1:46757_solr c:jwtColl s:shard1 r:core_node3 x:jwtColl_shard1_replica_n1] o.a.s.m.r.SolrJmxReporter JMX monitoring for 'solr_46757.solr.core.jwtColl.shard1.replica_n1' (registry 'solr.core.jwtColl.shard1.replica_n1') enabled at server: com.sun.jmx.mbeanserver.JmxMBeanServer@3f67933a
   [junit4]   2> 1378176 INFO  (qtp218025455-17203) [n:127.0.0.1:46757_solr c:jwtColl s:shard1 r:core_node3 x:jwtColl_shard1_replica_n1] o.a.s.c.SolrCore [[jwtColl_shard1_replica_n1] ] Opening new SolrCore at [/home/jenkins/workspace/Lucene-Solr-master-Linux/solr/build/solr-core/test/J2/temp/solr.security.JWTAuthPluginIntegrationTest_484DD026808FE08E-001/tempDir-002/node2/jwtColl_shard1_replica_n1], dataDir=[/home/jenkins/workspace/Lucene-Solr-master-Linux/solr/build/solr-core/test/J2/temp/solr.security.JWTAuthPluginIntegrationTest_484DD026808FE08E-001/tempDir-002/node2/./jwtColl_shard1_replica_n1/data/]
   [junit4]   2> 1378177 INFO  (qtp1512459792-17266) [n:127.0.0.1:42337_solr c:jwtColl s:shard2 r:core_node4 x:jwtColl_shard2_replica_n2] o.a.s.u.UpdateHandler Using UpdateLog implementation: org.apache.solr.update.UpdateLog
   [junit4]   2> 1378177 INFO  (qtp1512459792-17266) [n:127.0.0.1:42337_solr c:jwtColl s:shard2 r:core_node4 x:jwtColl_shard2_replica_n2] o.a.s.u.UpdateLog Initializing UpdateLog: dataDir= defaultSyncLevel=FLUSH numRecordsToKeep=100 maxNumLogsToKeep=10 numVersionBuckets=65536
   [junit4]   2> 1378177 INFO  (qtp218025455-17203) [n:127.0.0.1:46757_solr c:jwtColl s:shard1 r:core_node3 x:jwtColl_shard1_replica_n1] o.a.s.r.XSLTResponseWriter xsltCacheLifetimeSeconds=5
   [junit4]   2> 1378178 INFO  (qtp1512459792-17266) [n:127.0.0.1:42337_solr c:jwtColl s:shard2 r:core_node4 x:jwtColl_shard2_replica_n2] o.a.s.u.CommitTracker Hard AutoCommit: if uncommitted for 15000ms; 
   [junit4]   2> 1378178 INFO  (qtp1512459792-17266) [n:127.0.0.1:42337_solr c:jwtColl s:shard2 r:core_node4 x:jwtColl_shard2_replica_n2] o.a.s.u.CommitTracker Soft AutoCommit: disabled
   [junit4]   2> 1378180 INFO  (qtp1512459792-17266) [n:127.0.0.1:42337_solr c:jwtColl s:shard2 r:core_node4 x:jwtColl_shard2_replica_n2] o.a.s.s.SolrIndexSearcher Opening [Searcher@26872efc[jwtColl_shard2_replica_n2] main]
   [junit4]   2> 1378180 INFO  (qtp1512459792-17266) [n:127.0.0.1:42337_solr c:jwtColl s:shard2 r:core_node4 x:jwtColl_shard2_replica_n2] o.a.s.r.ManagedResourceStorage Configured ZooKeeperStorageIO with znodeBase: /configs/jwtColl.AUTOCREATED
   [junit4]   2> 1378180 INFO  (qtp1512459792-17266) [n:127.0.0.1:42337_solr c:jwtColl s:shard2 r:core_node4 x:jwtColl_shard2_replica_n2] o.a.s.r.ManagedResourceStorage Loaded null at path _rest_managed.json using ZooKeeperStorageIO:path=/configs/jwtColl.AUTOCREATED
   [junit4]   2> 1378180 INFO  (qtp1512459792-17266) [n:127.0.0.1:42337_solr c:jwtColl s:shard2 r:core_node4 x:jwtColl_shard2_replica_n2] o.a.s.s.ZkIndexSchemaReader Creating ZooKeeper watch for the managed schema at /configs/jwtColl.AUTOCREATED/managed-schema
   [junit4]   2> 1378181 INFO  (qtp1512459792-17266) [n:127.0.0.1:42337_solr c:jwtColl s:shard2 r:core_node4 x:jwtColl_shard2_replica_n2] o.a.s.s.ZkIndexSchemaReader Current schema version 0 is already the latest
   [junit4]   2> 1378181 INFO  (qtp1512459792-17266) [n:127.0.0.1:42337_solr c:jwtColl s:shard2 r:core_node4 x:jwtColl_shard2_replica_n2] o.a.s.h.c.SpellCheckComponent Initializing spell checkers
   [junit4]   2> 1378181 INFO  (qtp1512459792-17266) [n:127.0.0.1:42337_solr c:jwtColl s:shard2 r:core_node4 x:jwtColl_shard2_replica_n2] o.a.s.s.DirectSolrSpellChecker init: {name=default,field=_text_,classname=solr.DirectSolrSpellChecker,distanceMeasure=internal,accuracy=0.5,maxEdits=2,minPrefix=1,maxInspections=5,minQueryLength=4,maxQueryFrequency=0.01}
   [junit4]   2> 1378182 INFO  (qtp1512459792-17266) [n:127.0.0.1:42337_solr c:jwtColl s:shard2 r:core_node4 x:jwtColl_shard2_replica_n2] o.a.s.h.ReplicationHandler Commits will be reserved for 10000ms.
   [junit4]   2> 1378182 INFO  (qtp1512459792-17266) [n:127.0.0.1:42337_solr c:jwtColl s:shard2 r:core_node4 x:jwtColl_shard2_replica_n2] o.a.s.u.UpdateLog Could not find max version in index or recent updates, using new clock 1635221519985541120
   [junit4]   2> 1378184 INFO  (searcherExecutor-5588-thread-1-processing-n:127.0.0.1:42337_solr x:jwtColl_shard2_replica_n2 c:jwtColl s:shard2 r:core_node4) [n:127.0.0.1:42337_solr c:jwtColl s:shard2 r:core_node4 x:jwtColl_shard2_replica_n2] o.a.s.c.QuerySenderListener QuerySenderListener sending requests to Searcher@26872efc[jwtColl_shard2_replica_n2] main{ExitableDirectoryReader(UninvertingDirectoryReader())}
   [junit4]   2> 1378184 INFO  (searcherExecutor-5588-thread-1-processing-n:127.0.0.1:42337_solr x:jwtColl_shard2_replica_n2 c:jwtColl s:shard2 r:core_node4) [n:127.0.0.1:42337_solr c:jwtColl s:shard2 r:core_node4 x:jwtColl_shard2_replica_n2] o.a.s.c.QuerySenderListener QuerySenderListener done.
   [junit4]   2> 1378184 INFO  (searcherExecutor-5588-thread-1-processing-n:127.0.0.1:42337_solr x:jwtColl_shard2_replica_n2 c:jwtColl s:shard2 r:core_node4) [n:127.0.0.1:42337_solr c:jwtColl s:shard2 r:core_node4 x:jwtColl_shard2_replica_n2] o.a.s.h.c.SpellCheckComponent Loading spell index for spellchecker: default
   [junit4]   2> 1378185 INFO  (searcherExecutor-5588-thread-1-processing-n:127.0.0.1:42337_solr x:jwtColl_shard2_replica_n2 c:jwtColl s:shard2 r:core_node4) [n:127.0.0.1:42337_solr c:jwtColl s:shard2 r:core_node4 x:jwtColl_shard2_replica_n2] o.a.s.c.SolrCore [jwtColl_shard2_replica_n2] Registered new searcher Searcher@26872efc[jwtColl_shard2_replica_n2] main{ExitableDirectoryReader(UninvertingDirectoryReader())}
   [junit4]   2> 1378186 INFO  (qtp1512459792-17266) [n:127.0.0.1:42337_solr c:jwtColl s:shard2 r:core_node4 x:jwtColl_shard2_replica_n2] o.a.s.c.ZkShardTerms Successful update of terms at /collections/jwtColl/terms/shard2 to Terms{values={core_node4=0}, version=0}
   [junit4]   2> 1378186 INFO  (qtp1512459792-17266) [n:127.0.0.1:42337_solr c:jwtColl s:shard2 r:core_node4 x:jwtColl_shard2_replica_n2] o.a.s.c.ShardLeaderElectionContextBase make sure parent is created /collections/jwtColl/leaders/shard2
   [junit4]   2> 1378188 INFO  (qtp1512459792-17266) [n:127.0.0.1:42337_solr c:jwtColl s:shard2 r:core_node4 x:jwtColl_shard2_replica_n2] o.a.s.c.ShardLeaderElectionContext Enough replicas found to continue.
   [junit4]   2> 1378188 INFO  (qtp1512459792-17266) [n:127.0.0.1:42337_solr c:jwtColl s:shard2 r:core_node4 x:jwtColl_shard2_replica_n2] o.a.s.c.ShardLeaderElectionContext I may be the new leader - try and sync
   [junit4]   2> 1378188 INFO  (qtp1512459792-17266) [n:127.0.0.1:42337_solr c:jwtColl s:shard2 r:core_node4 x:jwtColl_shard2_replica_n2] o.a.s.c.SyncStrategy Sync replicas to http://127.0.0.1:42337/solr/jwtColl_shard2_replica_n2/
   [junit4]   2> 1378188 INFO  (qtp1512459792-17266) [n:127.0.0.1:42337_solr c:jwtColl s:shard2 r:core_node4 x:jwtColl_shard2_replica_n2] o.a.s.c.SyncStrategy Sync Success - now sync replicas to me
   [junit4]   2> 1378188 INFO  (qtp1512459792-17266) [n:127.0.0.1:42337_solr c:jwtColl s:shard2 r:core_node4 x:jwtColl_shard2_replica_n2] o.a.s.c.SyncStrategy http://127.0.0.1:42337/solr/jwtColl_shard2_replica_n2/ has no replicas
   [junit4]   2> 1378188 INFO  (qtp1512459792-17266) [n:127.0.0.1:42337_solr c:jwtColl s:shard2 r:core_node4 x:jwtColl_shard2_replica_n2] o.a.s.c.ShardLeaderElectionContextBase Creating leader registration node /collections/jwtColl/leaders/shard2/leader after winning as /collections/jwtColl/leader_elect/shard2/election/72356706789228553-core_node4-n_0000000000
   [junit4]   2> 1378193 INFO  (qtp1512459792-17266) [n:127.0.0.1:42337_solr c:jwtColl s:shard2 r:core_node4 x:jwtColl_shard2_replica_n2] o.a.s.c.ShardLeaderElectionContext I am the new leader: http://127.0.0.1:42337/solr/jwtColl_shard2_replica_n2/ shard2
   [junit4]   2> 1378215 INFO  (qtp218025455-17203) [n:127.0.0.1:46757_solr c:jwtColl s:shard1 r:core_node3 x:jwtColl_shard1_replica_n1] o.a.s.u.UpdateHandler Using UpdateLog implementation: org.apache.solr.update.UpdateLog
   [junit4]   2> 1378215 INFO  (qtp218025455-17203) [n:127.0.0.1:46757_solr c:jwtColl s:shard1 r:core_node3 x:jwtColl_shard1_replica_n1] o.a.s.u.UpdateLog Initializing UpdateLog: dataDir= defaultSyncLevel=FLUSH numRecordsToKeep=100 maxNumLogsToKeep=10 numVersionBuckets=65536
   [junit4]   2> 1378216 INFO  (qtp218025455-17203) [n:127.0.0.1:46757_solr c:jwtColl s:shard1 r:core_node3 x:jwtColl_shard1_replica_n1] o.a.s.u.CommitTracker Hard AutoCommit: if uncommitted for 15000ms; 
   [junit4]   2> 1378216 INFO  (qtp218025455-17203) [n:127.0.0.1:46757_solr c:jwtColl s:shard1 r:core_node3 x:jwtColl_shard1_replica_n1] o.a.s.u.CommitTracker Soft AutoCommit: disabled
   [junit4]   2> 1378217 INFO  (qtp218025455-17203) [n:127.0.0.1:46757_solr c:jwtColl s:shard1 r:core_node3 x:jwtColl_shard1_replica_n1] o.a.s.s.SolrIndexSearcher Opening [Searcher@11a8caab[jwtColl_shard1_replica_n1] main]
   [junit4]   2> 1378217 INFO  (qtp218025455-17203) [n:127.0.0.1:46757_solr c:jwtColl s:shard1 r:core_node3 x:jwtColl_shard1_replica_n1] o.a.s.r.ManagedResourceStorage Configured ZooKeeperStorageIO with znodeBase: /configs/jwtColl.AUTOCREATED
   [junit4]   2> 1378217 INFO  (qtp218025455-17203) [n:127.0.0.1:46757_solr c:jwtColl s:shard1 r:core_node3 x:jwtColl_shard1_replica_n1] o.a.s.r.ManagedResourceStorage Loaded null at path _rest_managed.json using ZooKeeperStorageIO:path=/configs/jwtColl.AUTOCREATED
   [junit4]   2> 1378217 INFO  (qtp218025455-17203) [n:127.0.0.1:46757_solr c:jwtColl s:shard1 r:core_node3 x:jwtColl_shard1_replica_n1] o.a.s.s.ZkIndexSchemaReader Creating ZooKeeper watch for the managed schema at /configs/jwtColl.AUTOCREATED/managed-schema
   [junit4]   2> 1378218 INFO  (qtp218025455-17203) [n:127.0.0.1:46757_solr c:jwtColl s:shard1 r:core_node3 x:jwtColl_shard1_replica_n1] o.a.s.s.ZkIndexSchemaReader Current schema version 0 is already the latest
   [junit4]   2> 1378218 INFO  (qtp218025455-17203) [n:127.0.0.1:46757_solr c:jwtColl s:shard1 r:core_node3 x:jwtColl_shard1_replica_n1] o.a.s.h.c.SpellCheckComponent Initializing spell checkers
   [junit4]   2> 1378218 INFO  (qtp218025455-17203) [n:127.0.0.1:46757_solr c:jwtColl s:shard1 r:core_node3 x:jwtColl_shard1_replica_n1] o.a.s.s.DirectSolrSpellChecker init: {name=default,field=_text_,classname=solr.DirectSolrSpellChecker,distanceMeasure=internal,accuracy=0.5,maxEdits=2,minPrefix=1,maxInspections=5,minQueryLength=4,maxQueryFrequency=0.01}
   [junit4]   2> 1378218 INFO  (qtp218025455-17203) [n:127.0.0.1:46757_solr c:jwtColl s:shard1 r:core_node3 x:jwtColl_shard1_replica_n1] o.a.s.h.ReplicationHandler Commits will be reserved for 10000ms.
   [junit4]   2> 1378219 INFO  (qtp218025455-17203) [n:127.0.0.1:46757_solr c:jwtColl s:shard1 r:core_node3 x:jwtColl_shard1_replica_n1] o.a.s.u.UpdateLog Could not find max version in index or recent updates, using new clock 1635221520024338432
   [junit4]   2> 1378220 INFO  (searcherExecutor-5590-thread-1-

[...truncated too long message...]

o.a.s.m.SolrMetricManager Closing metric reporters for registry=solr.jetty, tag=null
   [junit4]   2> 1381190 INFO  (jetty-closer-5903-thread-1) [    ] o.a.s.m.r.SolrJmxReporter Closing reporter [org.apache.solr.metrics.reporters.SolrJmxReporter@17835f22: rootName = solr_36519, domain = solr.jetty, service url = null, agent id = null] for registry solr.jetty / com.codahale.metrics.MetricRegistry@516044a3
   [junit4]   2> 1381190 INFO  (jetty-closer-5903-thread-1) [    ] o.a.s.m.SolrMetricManager Closing metric reporters for registry=solr.cluster, tag=null
   [junit4]   2> 1381190 INFO  (closeThreadPool-5911-thread-2) [    ] o.a.s.c.Overseer Overseer (id=72356706971615238-127.0.0.1:36519_solr-n_0000000000) closing
   [junit4]   2> 1381190 INFO  (OverseerStateUpdate-72356706971615238-127.0.0.1:36519_solr-n_0000000000) [n:127.0.0.1:36519_solr    ] o.a.s.c.Overseer Overseer Loop exiting : 127.0.0.1:36519_solr
   [junit4]   2> 1381190 INFO  (OverseerAutoScalingTriggerThread-72356706971615238-127.0.0.1:36519_solr-n_0000000000) [    ] o.a.s.c.a.OverseerTriggerThread OverseerTriggerThread woken up but we are closed, exiting.
   [junit4]   2> 1381192 INFO  (zkCallback-5877-thread-1) [    ] o.a.s.c.c.ZkStateReader Updated live nodes from ZooKeeper... (1) -> (0)
   [junit4]   2> 1381193 INFO  (closeThreadPool-5911-thread-1) [    ] o.a.s.c.Overseer Overseer (id=72356706971615238-127.0.0.1:36519_solr-n_0000000000) closing
   [junit4]   2> 1381193 INFO  (jetty-closer-5903-thread-1) [    ] o.a.s.c.Overseer Overseer (id=72356706971615238-127.0.0.1:36519_solr-n_0000000000) closing
   [junit4]   2> 1381195 INFO  (jetty-closer-5903-thread-1) [    ] o.e.j.s.AbstractConnector Stopped ServerConnector@4087854f{HTTP/1.1,[http/1.1, h2c]}{127.0.0.1:0}
   [junit4]   2> 1381195 INFO  (jetty-closer-5903-thread-1) [    ] o.e.j.s.h.ContextHandler Stopped o.e.j.s.ServletContextHandler@4aa9323a{/solr,null,UNAVAILABLE}
   [junit4]   2> 1381195 INFO  (jetty-closer-5903-thread-1) [    ] o.e.j.s.session node0 Stopped scavenging
   [junit4]   2> 1381196 INFO  (TEST-JWTAuthPluginIntegrationTest.testMetrics-seed#[484DD026808FE08E]) [    ] o.a.s.c.ZkTestServer Shutting down ZkTestServer.
   [junit4]   2> 1381197 WARN  (ZkTestServer Run Thread) [    ] o.a.s.c.ZkTestServer Watch limit violations: 
   [junit4]   2> Maximum concurrent create/delete watches above limit:
   [junit4]   2> 
   [junit4]   2> 	5	/solr/aliases.json
   [junit4]   2> 	5	/solr/clusterprops.json
   [junit4]   2> 	2	/solr/configs/jwtColl.AUTOCREATED
   [junit4]   2> 	2	/solr/collections/jwtColl/terms/shard2
   [junit4]   2> 	2	/solr/security.json
   [junit4]   2> 	2	/solr/configs/jwtColl.AUTOCREATED/managed-schema
   [junit4]   2> 	2	/solr/collections/jwtColl/terms/shard1
   [junit4]   2> 
   [junit4]   2> Maximum concurrent data watches above limit:
   [junit4]   2> 
   [junit4]   2> 	13	/solr/collections/jwtColl/state.json
   [junit4]   2> 	5	/solr/clusterstate.json
   [junit4]   2> 	5	/solr/clusterprops.json
   [junit4]   2> 
   [junit4]   2> Maximum concurrent children watches above limit:
   [junit4]   2> 
   [junit4]   2> 	5	/solr/live_nodes
   [junit4]   2> 	5	/solr/collections
   [junit4]   2> 
   [junit4]   2> 1381198 INFO  (TEST-JWTAuthPluginIntegrationTest.testMetrics-seed#[484DD026808FE08E]) [    ] o.a.s.c.ZkTestServer parse host and port list: 127.0.0.1:37951
   [junit4]   2> 1381198 INFO  (TEST-JWTAuthPluginIntegrationTest.testMetrics-seed#[484DD026808FE08E]) [    ] o.a.s.c.ZkTestServer connecting to 127.0.0.1 37951
   [junit4]   2> 1381198 INFO  (TEST-JWTAuthPluginIntegrationTest.testMetrics-seed#[484DD026808FE08E]) [    ] o.a.s.SolrTestCaseJ4 ###Ending testMetrics
   [junit4]   2> NOTE: reproduce with: ant test  -Dtestcase=JWTAuthPluginIntegrationTest -Dtests.method=testMetrics -Dtests.seed=484DD026808FE08E -Dtests.multiplier=3 -Dtests.slow=true -Dtests.locale=fr-PF -Dtests.timezone=Asia/Kuala_Lumpur -Dtests.asserts=true -Dtests.file.encoding=US-ASCII
   [junit4] ERROR   2.38s J2 | JWTAuthPluginIntegrationTest.testMetrics <<<
   [junit4]    > Throwable #1: java.io.IOException: Server returned HTTP response code: 401 for URL: http://127.0.0.1:36519/solr/jwtColl/query?q=*:*
   [junit4]    > 	at __randomizedtesting.SeedInfo.seed([484DD026808FE08E:B65F02849C85973D]:0)
   [junit4]    > 	at java.base/sun.net.www.protocol.http.HttpURLConnection.getInputStream0(HttpURLConnection.java:1913)
   [junit4]    > 	at java.base/sun.net.www.protocol.http.HttpURLConnection.getInputStream(HttpURLConnection.java:1509)
   [junit4]    > 	at java.base/java.net.URLConnection.getContent(URLConnection.java:749)
   [junit4]    > 	at org.apache.solr.security.JWTAuthPluginIntegrationTest.get(JWTAuthPluginIntegrationTest.java:207)
   [junit4]    > 	at org.apache.solr.security.JWTAuthPluginIntegrationTest.testMetrics(JWTAuthPluginIntegrationTest.java:149)
   [junit4]    > 	at java.base/jdk.internal.reflect.NativeMethodAccessorImpl.invoke0(Native Method)
   [junit4]    > 	at java.base/jdk.internal.reflect.NativeMethodAccessorImpl.invoke(NativeMethodAccessorImpl.java:62)
   [junit4]    > 	at java.base/jdk.internal.reflect.DelegatingMethodAccessorImpl.invoke(DelegatingMethodAccessorImpl.java:43)
   [junit4]    > 	at java.base/java.lang.reflect.Method.invoke(Method.java:567)
   [junit4]    > 	at java.base/java.lang.Thread.run(Thread.java:835)
   [junit4]   2> NOTE: leaving temporary files on disk at: /home/jenkins/workspace/Lucene-Solr-master-Linux/solr/build/solr-core/test/J2/temp/solr.security.JWTAuthPluginIntegrationTest_484DD026808FE08E-001
   [junit4]   2> Jun 02, 2019 9:46:08 AM com.carrotsearch.randomizedtesting.ThreadLeakControl checkThreadLeaks
   [junit4]   2> WARNING: Will linger awaiting termination of 1 leaked thread(s).
   [junit4]   2> NOTE: test params are: codec=Asserting(Lucene80): {}, docValues:{}, maxPointsInLeafNode=1392, maxMBSortInHeap=7.819239126753738, sim=Asserting(org.apache.lucene.search.similarities.AssertingSimilarity@68b7bb75), locale=fr-PF, timezone=Asia/Kuala_Lumpur
   [junit4]   2> NOTE: Linux 4.18.0-17-generic amd64/Oracle Corporation 13-ea (64-bit)/cpus=8,threads=1,free=224227160,total=518979584
   [junit4]   2> NOTE: All tests run in this JVM: [TestCorePropertiesReload, TestCloudJSONFacetSKG, TestRTimerTree, DocumentBuilderTest, DistribCursorPagingTest, TestReversedWildcardFilterFactory, ForceLeaderTest, ShardSplitTest, DistributedDebugComponentTest, TestCollectionsAPIViaSolrCloudCluster, TestApiFramework, TestCustomDocTransformer, BlobRepositoryCloudTest, TestFieldCache, TestDocumentBuilder, UUIDFieldTest, IndexSchemaRuntimeFieldTest, SolrCoreCheckLockOnStartupTest, HdfsRecoveryZkTest, PolyFieldTest, TestPartialUpdateDeduplication, TestCloudPseudoReturnFields, TestSortByMinMaxFunction, SSLMigrationTest, ShufflingReplicaListTransformerTest, TestNestedUpdateProcessor, BitVectorTest, AddSchemaFieldsUpdateProcessorFactoryTest, TestFastOutputStream, ZkNodePropsTest, TestConfigOverlay, LeaderElectionTest, TestCollationFieldDocValues, TestAuthenticationFramework, CachingDirectoryFactoryTest, ShowFileRequestHandlerTest, BadIndexSchemaTest, TestLazyCores, MoveReplicaTest, PrimitiveFieldTypeTest, LeaderTragicEventTest, TestSolrQueryResponse, SortSpecParsingTest, TestInfoStreamLogging, TestHdfsUpdateLog, PeerSyncWithBufferUpdatesTest, EmbeddedSolrNoSerializeTest, ConcurrentDeleteAndCreateCollectionTest, TestEmbeddedSolrServerSchemaAPI, ExecutePlanActionTest, RangeFacetCloudTest, DocValuesTest, HdfsBasicDistributedZk2Test, RankQueryTest, RegexBoostProcessorTest, TestPayloadScoreQParserPlugin, TestQuerySenderListener, TestStressReorder, TriLevelCompositeIdRoutingTest, TestHighFrequencyDictionaryFactory, TestSimLargeCluster, TestJavabinTupleStreamParser, AtomicUpdatesTest, MBeansHandlerTest, UpdateRequestProcessorFactoryTest, TestPKIAuthenticationPlugin, SearchRateTriggerIntegrationTest, NotRequiredUniqueKeyTest, CustomHighlightComponentTest, CopyFieldTest, CheckHdfsIndexTest, HttpSolrCallGetCoreTest, HealthCheckHandlerTest, TestReplicaProperties, TestCharFilters, HdfsWriteToMultipleCollectionsTest, TestRestoreCore, ChaosMonkeySafeLeaderTest, SolrJmxReporterTest, BasicZkTest, TestRecovery, InfoHandlerTest, PKIAuthenticationIntegrationTest, TaggerTest, IndexSizeTriggerTest, JsonLoaderTest, TestSuggestSpellingConverter, SuggestComponentContextFilterQueryTest, TestJsonFacetsStatsParsing, OverseerTest, MergeStrategyTest, ZkCLITest, RequestHandlersTest, CloudMLTQParserTest, SchemaVersionSpecificBehaviorTest, TestLegacyBM25SimilarityFactory, TestTrie, TestDynamicFieldResource, CoreAdminRequestStatusTest, TestPullReplica, JWTAuthPluginIntegrationTest]
   [junit4] Completed [422/858 (1!)] on J2 in 6.52s, 3 tests, 1 error <<< FAILURES!

[...truncated 44699 lines...]
[repro] Jenkins log URL: https://jenkins.thetaphi.de/job/Lucene-Solr-master-Linux/24174/consoleText

[repro] Revision: b28de243be3144312543fdd7d7bde94de1938478

[repro] Ant options: "-Dargs=-XX:-UseCompressedOops -XX:+UseSerialGC"
[repro] Repro line:  ant test  -Dtestcase=JWTAuthPluginIntegrationTest -Dtests.method=testMetrics -Dtests.seed=484DD026808FE08E -Dtests.multiplier=3 -Dtests.slow=true -Dtests.locale=fr-PF -Dtests.timezone=Asia/Kuala_Lumpur -Dtests.asserts=true -Dtests.file.encoding=US-ASCII

[repro] ant clean

[...truncated 6 lines...]
[repro] Test suites by module:
[repro]    solr/core
[repro]       JWTAuthPluginIntegrationTest
[repro] ant compile-test

[...truncated 3310 lines...]
[repro] ant test-nocompile -Dtests.dups=5 -Dtests.maxfailures=5 -Dtests.class="*.JWTAuthPluginIntegrationTest" -Dtests.showOutput=onerror "-Dargs=-XX:-UseCompressedOops -XX:+UseSerialGC" -Dtests.seed=484DD026808FE08E -Dtests.multiplier=3 -Dtests.slow=true -Dtests.locale=fr-PF -Dtests.timezone=Asia/Kuala_Lumpur -Dtests.asserts=true -Dtests.file.encoding=US-ASCII

[...truncated 85 lines...]
[repro] Failures:
[repro]   0/5 failed: org.apache.solr.security.JWTAuthPluginIntegrationTest
[repro] Exiting with code 0

[...truncated 43 lines...]

Mime
View raw message