lucene-dev mailing list archives

Site index · List index
Message view « Date » · « Thread »
Top « Date » · « Thread »
From Apache Jenkins Server <jenk...@builds.apache.org>
Subject [JENKINS] Lucene-Solr-NightlyTests-master - Build # 1859 - Failure
Date Sat, 01 Jun 2019 14:29:25 GMT
Build: https://builds.apache.org/job/Lucene-Solr-NightlyTests-master/1859/

1 tests failed.
FAILED:  org.apache.solr.cloud.autoscaling.HdfsAutoAddReplicasIntegrationTest.testSimple

Error Message:
Waiting for collection testSimple2 Timeout waiting to see state for collection=testSimple2 :DocCollection(testSimple2//collections/testSimple2/state.json/23)={   "pullReplicas":"0",   "replicationFactor":"2",   "shards":{     "shard1":{       "range":"80000000-ffffffff",       "state":"active",       "replicas":{         "core_node3":{           "dataDir":"hdfs://localhost:45877/solr_hdfs_home/testSimple2/core_node3/data/",           "base_url":"http://127.0.0.1:45011/solr",           "node_name":"127.0.0.1:45011_solr",           "type":"NRT",           "force_set_state":"false",           "ulogDir":"hdfs://localhost:45877/solr_hdfs_home/testSimple2/core_node3/data/tlog",           "core":"testSimple2_shard1_replica_n1",           "shared_storage":"true",           "state":"down"},         "core_node5":{           "dataDir":"hdfs://localhost:45877/solr_hdfs_home/testSimple2/core_node5/data/",           "base_url":"http://127.0.0.1:32960/solr",           "node_name":"127.0.0.1:32960_solr",           "type":"NRT",           "force_set_state":"false",           "ulogDir":"hdfs://localhost:45877/solr_hdfs_home/testSimple2/core_node5/data/tlog",           "core":"testSimple2_shard1_replica_n2",           "shared_storage":"true",           "state":"active",           "leader":"true"}}},     "shard2":{       "range":"0-7fffffff",       "state":"active",       "replicas":{         "core_node7":{           "dataDir":"hdfs://localhost:45877/solr_hdfs_home/testSimple2/core_node7/data/",           "base_url":"http://127.0.0.1:45011/solr",           "node_name":"127.0.0.1:45011_solr",           "type":"NRT",           "force_set_state":"false",           "ulogDir":"hdfs://localhost:45877/solr_hdfs_home/testSimple2/core_node7/data/tlog",           "core":"testSimple2_shard2_replica_n4",           "shared_storage":"true",           "state":"down"},         "core_node8":{           "dataDir":"hdfs://localhost:45877/solr_hdfs_home/testSimple2/core_node8/data/",           "base_url":"http://127.0.0.1:32960/solr",           "node_name":"127.0.0.1:32960_solr",           "type":"NRT",           "force_set_state":"false",           "ulogDir":"hdfs://localhost:45877/solr_hdfs_home/testSimple2/core_node8/data/tlog",           "core":"testSimple2_shard2_replica_n6",           "shared_storage":"true",           "state":"active",           "leader":"true"}}}},   "router":{"name":"compositeId"},   "maxShardsPerNode":"2",   "autoAddReplicas":"true",   "nrtReplicas":"2",   "tlogReplicas":"0"} Live Nodes: [127.0.0.1:32960_solr, 127.0.0.1:35101_solr] Last available state: DocCollection(testSimple2//collections/testSimple2/state.json/23)={   "pullReplicas":"0",   "replicationFactor":"2",   "shards":{     "shard1":{       "range":"80000000-ffffffff",       "state":"active",       "replicas":{         "core_node3":{           "dataDir":"hdfs://localhost:45877/solr_hdfs_home/testSimple2/core_node3/data/",           "base_url":"http://127.0.0.1:45011/solr",           "node_name":"127.0.0.1:45011_solr",           "type":"NRT",           "force_set_state":"false",           "ulogDir":"hdfs://localhost:45877/solr_hdfs_home/testSimple2/core_node3/data/tlog",           "core":"testSimple2_shard1_replica_n1",           "shared_storage":"true",           "state":"down"},         "core_node5":{           "dataDir":"hdfs://localhost:45877/solr_hdfs_home/testSimple2/core_node5/data/",           "base_url":"http://127.0.0.1:32960/solr",           "node_name":"127.0.0.1:32960_solr",           "type":"NRT",           "force_set_state":"false",           "ulogDir":"hdfs://localhost:45877/solr_hdfs_home/testSimple2/core_node5/data/tlog",           "core":"testSimple2_shard1_replica_n2",           "shared_storage":"true",           "state":"active",           "leader":"true"}}},     "shard2":{       "range":"0-7fffffff",       "state":"active",       "replicas":{         "core_node7":{           "dataDir":"hdfs://localhost:45877/solr_hdfs_home/testSimple2/core_node7/data/",           "base_url":"http://127.0.0.1:45011/solr",           "node_name":"127.0.0.1:45011_solr",           "type":"NRT",           "force_set_state":"false",           "ulogDir":"hdfs://localhost:45877/solr_hdfs_home/testSimple2/core_node7/data/tlog",           "core":"testSimple2_shard2_replica_n4",           "shared_storage":"true",           "state":"down"},         "core_node8":{           "dataDir":"hdfs://localhost:45877/solr_hdfs_home/testSimple2/core_node8/data/",           "base_url":"http://127.0.0.1:32960/solr",           "node_name":"127.0.0.1:32960_solr",           "type":"NRT",           "force_set_state":"false",           "ulogDir":"hdfs://localhost:45877/solr_hdfs_home/testSimple2/core_node8/data/tlog",           "core":"testSimple2_shard2_replica_n6",           "shared_storage":"true",           "state":"active",           "leader":"true"}}}},   "router":{"name":"compositeId"},   "maxShardsPerNode":"2",   "autoAddReplicas":"true",   "nrtReplicas":"2",   "tlogReplicas":"0"}

Stack Trace:
java.lang.AssertionError: Waiting for collection testSimple2
Timeout waiting to see state for collection=testSimple2 :DocCollection(testSimple2//collections/testSimple2/state.json/23)={
  "pullReplicas":"0",
  "replicationFactor":"2",
  "shards":{
    "shard1":{
      "range":"80000000-ffffffff",
      "state":"active",
      "replicas":{
        "core_node3":{
          "dataDir":"hdfs://localhost:45877/solr_hdfs_home/testSimple2/core_node3/data/",
          "base_url":"http://127.0.0.1:45011/solr",
          "node_name":"127.0.0.1:45011_solr",
          "type":"NRT",
          "force_set_state":"false",
          "ulogDir":"hdfs://localhost:45877/solr_hdfs_home/testSimple2/core_node3/data/tlog",
          "core":"testSimple2_shard1_replica_n1",
          "shared_storage":"true",
          "state":"down"},
        "core_node5":{
          "dataDir":"hdfs://localhost:45877/solr_hdfs_home/testSimple2/core_node5/data/",
          "base_url":"http://127.0.0.1:32960/solr",
          "node_name":"127.0.0.1:32960_solr",
          "type":"NRT",
          "force_set_state":"false",
          "ulogDir":"hdfs://localhost:45877/solr_hdfs_home/testSimple2/core_node5/data/tlog",
          "core":"testSimple2_shard1_replica_n2",
          "shared_storage":"true",
          "state":"active",
          "leader":"true"}}},
    "shard2":{
      "range":"0-7fffffff",
      "state":"active",
      "replicas":{
        "core_node7":{
          "dataDir":"hdfs://localhost:45877/solr_hdfs_home/testSimple2/core_node7/data/",
          "base_url":"http://127.0.0.1:45011/solr",
          "node_name":"127.0.0.1:45011_solr",
          "type":"NRT",
          "force_set_state":"false",
          "ulogDir":"hdfs://localhost:45877/solr_hdfs_home/testSimple2/core_node7/data/tlog",
          "core":"testSimple2_shard2_replica_n4",
          "shared_storage":"true",
          "state":"down"},
        "core_node8":{
          "dataDir":"hdfs://localhost:45877/solr_hdfs_home/testSimple2/core_node8/data/",
          "base_url":"http://127.0.0.1:32960/solr",
          "node_name":"127.0.0.1:32960_solr",
          "type":"NRT",
          "force_set_state":"false",
          "ulogDir":"hdfs://localhost:45877/solr_hdfs_home/testSimple2/core_node8/data/tlog",
          "core":"testSimple2_shard2_replica_n6",
          "shared_storage":"true",
          "state":"active",
          "leader":"true"}}}},
  "router":{"name":"compositeId"},
  "maxShardsPerNode":"2",
  "autoAddReplicas":"true",
  "nrtReplicas":"2",
  "tlogReplicas":"0"}
Live Nodes: [127.0.0.1:32960_solr, 127.0.0.1:35101_solr]
Last available state: DocCollection(testSimple2//collections/testSimple2/state.json/23)={
  "pullReplicas":"0",
  "replicationFactor":"2",
  "shards":{
    "shard1":{
      "range":"80000000-ffffffff",
      "state":"active",
      "replicas":{
        "core_node3":{
          "dataDir":"hdfs://localhost:45877/solr_hdfs_home/testSimple2/core_node3/data/",
          "base_url":"http://127.0.0.1:45011/solr",
          "node_name":"127.0.0.1:45011_solr",
          "type":"NRT",
          "force_set_state":"false",
          "ulogDir":"hdfs://localhost:45877/solr_hdfs_home/testSimple2/core_node3/data/tlog",
          "core":"testSimple2_shard1_replica_n1",
          "shared_storage":"true",
          "state":"down"},
        "core_node5":{
          "dataDir":"hdfs://localhost:45877/solr_hdfs_home/testSimple2/core_node5/data/",
          "base_url":"http://127.0.0.1:32960/solr",
          "node_name":"127.0.0.1:32960_solr",
          "type":"NRT",
          "force_set_state":"false",
          "ulogDir":"hdfs://localhost:45877/solr_hdfs_home/testSimple2/core_node5/data/tlog",
          "core":"testSimple2_shard1_replica_n2",
          "shared_storage":"true",
          "state":"active",
          "leader":"true"}}},
    "shard2":{
      "range":"0-7fffffff",
      "state":"active",
      "replicas":{
        "core_node7":{
          "dataDir":"hdfs://localhost:45877/solr_hdfs_home/testSimple2/core_node7/data/",
          "base_url":"http://127.0.0.1:45011/solr",
          "node_name":"127.0.0.1:45011_solr",
          "type":"NRT",
          "force_set_state":"false",
          "ulogDir":"hdfs://localhost:45877/solr_hdfs_home/testSimple2/core_node7/data/tlog",
          "core":"testSimple2_shard2_replica_n4",
          "shared_storage":"true",
          "state":"down"},
        "core_node8":{
          "dataDir":"hdfs://localhost:45877/solr_hdfs_home/testSimple2/core_node8/data/",
          "base_url":"http://127.0.0.1:32960/solr",
          "node_name":"127.0.0.1:32960_solr",
          "type":"NRT",
          "force_set_state":"false",
          "ulogDir":"hdfs://localhost:45877/solr_hdfs_home/testSimple2/core_node8/data/tlog",
          "core":"testSimple2_shard2_replica_n6",
          "shared_storage":"true",
          "state":"active",
          "leader":"true"}}}},
  "router":{"name":"compositeId"},
  "maxShardsPerNode":"2",
  "autoAddReplicas":"true",
  "nrtReplicas":"2",
  "tlogReplicas":"0"}
	at __randomizedtesting.SeedInfo.seed([10677DD7C00EF4B3:28D45929E7FD2062]:0)
	at org.junit.Assert.fail(Assert.java:88)
	at org.apache.solr.cloud.SolrCloudTestCase.waitForState(SolrCloudTestCase.java:310)
	at org.apache.solr.cloud.autoscaling.AutoAddReplicasIntegrationTest.testSimple(AutoAddReplicasIntegrationTest.java:169)
	at java.base/jdk.internal.reflect.NativeMethodAccessorImpl.invoke0(Native Method)
	at java.base/jdk.internal.reflect.NativeMethodAccessorImpl.invoke(NativeMethodAccessorImpl.java:62)
	at java.base/jdk.internal.reflect.DelegatingMethodAccessorImpl.invoke(DelegatingMethodAccessorImpl.java:43)
	at java.base/java.lang.reflect.Method.invoke(Method.java:566)
	at com.carrotsearch.randomizedtesting.RandomizedRunner.invoke(RandomizedRunner.java:1750)
	at com.carrotsearch.randomizedtesting.RandomizedRunner$8.evaluate(RandomizedRunner.java:938)
	at com.carrotsearch.randomizedtesting.RandomizedRunner$9.evaluate(RandomizedRunner.java:974)
	at com.carrotsearch.randomizedtesting.RandomizedRunner$10.evaluate(RandomizedRunner.java:988)
	at com.carrotsearch.randomizedtesting.rules.SystemPropertiesRestoreRule$1.evaluate(SystemPropertiesRestoreRule.java:57)
	at org.apache.lucene.util.TestRuleSetupTeardownChained$1.evaluate(TestRuleSetupTeardownChained.java:49)
	at org.apache.lucene.util.AbstractBeforeAfterRule$1.evaluate(AbstractBeforeAfterRule.java:45)
	at org.apache.lucene.util.TestRuleThreadAndTestName$1.evaluate(TestRuleThreadAndTestName.java:48)
	at org.apache.lucene.util.TestRuleIgnoreAfterMaxFailures$1.evaluate(TestRuleIgnoreAfterMaxFailures.java:64)
	at org.apache.lucene.util.TestRuleMarkFailure$1.evaluate(TestRuleMarkFailure.java:47)
	at com.carrotsearch.randomizedtesting.rules.StatementAdapter.evaluate(StatementAdapter.java:36)
	at com.carrotsearch.randomizedtesting.ThreadLeakControl$StatementRunner.run(ThreadLeakControl.java:368)
	at com.carrotsearch.randomizedtesting.ThreadLeakControl.forkTimeoutingTask(ThreadLeakControl.java:817)
	at com.carrotsearch.randomizedtesting.ThreadLeakControl$3.evaluate(ThreadLeakControl.java:468)
	at com.carrotsearch.randomizedtesting.RandomizedRunner.runSingleTest(RandomizedRunner.java:947)
	at com.carrotsearch.randomizedtesting.RandomizedRunner$5.evaluate(RandomizedRunner.java:832)
	at com.carrotsearch.randomizedtesting.RandomizedRunner$6.evaluate(RandomizedRunner.java:883)
	at com.carrotsearch.randomizedtesting.RandomizedRunner$7.evaluate(RandomizedRunner.java:894)
	at com.carrotsearch.randomizedtesting.rules.StatementAdapter.evaluate(StatementAdapter.java:36)
	at com.carrotsearch.randomizedtesting.rules.SystemPropertiesRestoreRule$1.evaluate(SystemPropertiesRestoreRule.java:57)
	at org.apache.lucene.util.AbstractBeforeAfterRule$1.evaluate(AbstractBeforeAfterRule.java:45)
	at com.carrotsearch.randomizedtesting.rules.StatementAdapter.evaluate(StatementAdapter.java:36)
	at org.apache.lucene.util.TestRuleStoreClassName$1.evaluate(TestRuleStoreClassName.java:41)
	at com.carrotsearch.randomizedtesting.rules.NoShadowingOrOverridesOnMethodsRule$1.evaluate(NoShadowingOrOverridesOnMethodsRule.java:40)
	at com.carrotsearch.randomizedtesting.rules.NoShadowingOrOverridesOnMethodsRule$1.evaluate(NoShadowingOrOverridesOnMethodsRule.java:40)
	at com.carrotsearch.randomizedtesting.rules.StatementAdapter.evaluate(StatementAdapter.java:36)
	at com.carrotsearch.randomizedtesting.rules.StatementAdapter.evaluate(StatementAdapter.java:36)
	at org.apache.lucene.util.TestRuleAssertionsRequired$1.evaluate(TestRuleAssertionsRequired.java:53)
	at org.apache.lucene.util.TestRuleMarkFailure$1.evaluate(TestRuleMarkFailure.java:47)
	at org.apache.lucene.util.TestRuleIgnoreAfterMaxFailures$1.evaluate(TestRuleIgnoreAfterMaxFailures.java:64)
	at org.apache.lucene.util.TestRuleIgnoreTestSuites$1.evaluate(TestRuleIgnoreTestSuites.java:54)
	at com.carrotsearch.randomizedtesting.rules.StatementAdapter.evaluate(StatementAdapter.java:36)
	at com.carrotsearch.randomizedtesting.ThreadLeakControl$StatementRunner.run(ThreadLeakControl.java:368)
	at java.base/java.lang.Thread.run(Thread.java:834)




Build Log:
[...truncated 14941 lines...]
   [junit4] Suite: org.apache.solr.cloud.autoscaling.HdfsAutoAddReplicasIntegrationTest
   [junit4]   2> 3979438 INFO  (SUITE-HdfsAutoAddReplicasIntegrationTest-seed#[10677DD7C00EF4B3]-worker) [    ] o.a.s.SolrTestCaseJ4 SecureRandom sanity checks: test.solr.allowed.securerandom=null & java.security.egd=file:/dev/./urandom
   [junit4]   2> Creating dataDir: /x1/jenkins/jenkins-slave/workspace/Lucene-Solr-NightlyTests-master/checkout/solr/build/solr-core/test/J1/temp/solr.cloud.autoscaling.HdfsAutoAddReplicasIntegrationTest_10677DD7C00EF4B3-001/init-core-data-001
   [junit4]   2> 3979439 WARN  (SUITE-HdfsAutoAddReplicasIntegrationTest-seed#[10677DD7C00EF4B3]-worker) [    ] o.a.s.SolrTestCaseJ4 startTrackingSearchers: numOpens=34 numCloses=34
   [junit4]   2> 3979439 INFO  (SUITE-HdfsAutoAddReplicasIntegrationTest-seed#[10677DD7C00EF4B3]-worker) [    ] o.a.s.SolrTestCaseJ4 Using PointFields (NUMERIC_POINTS_SYSPROP=true) w/NUMERIC_DOCVALUES_SYSPROP=false
   [junit4]   2> 3979440 INFO  (SUITE-HdfsAutoAddReplicasIntegrationTest-seed#[10677DD7C00EF4B3]-worker) [    ] o.a.s.SolrTestCaseJ4 Randomized ssl (false) and clientAuth (true) via: @org.apache.solr.util.RandomizeSSL(reason="", ssl=0.0/0.0, value=0.0/0.0, clientAuth=0.0/0.0)
   [junit4]   1> Formatting using clusterid: testClusterID
   [junit4]   2> 3979481 WARN  (SUITE-HdfsAutoAddReplicasIntegrationTest-seed#[10677DD7C00EF4B3]-worker) [    ] o.a.h.m.i.MetricsConfig Cannot locate configuration: tried hadoop-metrics2-namenode.properties,hadoop-metrics2.properties
   [junit4]   2> 3979510 WARN  (SUITE-HdfsAutoAddReplicasIntegrationTest-seed#[10677DD7C00EF4B3]-worker) [    ] o.a.h.h.HttpRequestLog Jetty request log can only be enabled using Log4j
   [junit4]   2> 3979512 INFO  (SUITE-HdfsAutoAddReplicasIntegrationTest-seed#[10677DD7C00EF4B3]-worker) [    ] o.e.j.s.Server jetty-9.4.14.v20181114; built: 2018-11-14T21:20:31.478Z; git: c4550056e785fb5665914545889f21dc136ad9e6; jvm 11.0.1+13-LTS
   [junit4]   2> 3979514 INFO  (SUITE-HdfsAutoAddReplicasIntegrationTest-seed#[10677DD7C00EF4B3]-worker) [    ] o.e.j.s.session DefaultSessionIdManager workerName=node0
   [junit4]   2> 3979514 INFO  (SUITE-HdfsAutoAddReplicasIntegrationTest-seed#[10677DD7C00EF4B3]-worker) [    ] o.e.j.s.session No SessionScavenger set, using defaults
   [junit4]   2> 3979514 INFO  (SUITE-HdfsAutoAddReplicasIntegrationTest-seed#[10677DD7C00EF4B3]-worker) [    ] o.e.j.s.session node0 Scavenging every 600000ms
   [junit4]   2> 3979514 INFO  (SUITE-HdfsAutoAddReplicasIntegrationTest-seed#[10677DD7C00EF4B3]-worker) [    ] o.e.j.s.h.ContextHandler Started o.e.j.s.ServletContextHandler@39729781{static,/static,jar:file:/x1/jenkins/.ivy2/cache/org.apache.hadoop/hadoop-hdfs/tests/hadoop-hdfs-3.2.0-tests.jar!/webapps/static,AVAILABLE}
   [junit4]   2> 3979685 INFO  (SUITE-HdfsAutoAddReplicasIntegrationTest-seed#[10677DD7C00EF4B3]-worker) [    ] o.e.j.s.h.ContextHandler Started o.e.j.w.WebAppContext@122fbda4{hdfs,/,file:///x1/jenkins/jenkins-slave/workspace/Lucene-Solr-NightlyTests-master/checkout/solr/build/solr-core/test/J1/temp/jetty-localhost-42003-hdfs-_-any-3961427032236587243.dir/webapp/,AVAILABLE}{/hdfs}
   [junit4]   2> 3979686 INFO  (SUITE-HdfsAutoAddReplicasIntegrationTest-seed#[10677DD7C00EF4B3]-worker) [    ] o.e.j.s.AbstractConnector Started ServerConnector@2a0f31bf{HTTP/1.1,[http/1.1]}{localhost:42003}
   [junit4]   2> 3979686 INFO  (SUITE-HdfsAutoAddReplicasIntegrationTest-seed#[10677DD7C00EF4B3]-worker) [    ] o.e.j.s.Server Started @3979735ms
   [junit4]   2> 3979760 WARN  (SUITE-HdfsAutoAddReplicasIntegrationTest-seed#[10677DD7C00EF4B3]-worker) [    ] o.a.h.h.HttpRequestLog Jetty request log can only be enabled using Log4j
   [junit4]   2> 3979762 INFO  (SUITE-HdfsAutoAddReplicasIntegrationTest-seed#[10677DD7C00EF4B3]-worker) [    ] o.e.j.s.Server jetty-9.4.14.v20181114; built: 2018-11-14T21:20:31.478Z; git: c4550056e785fb5665914545889f21dc136ad9e6; jvm 11.0.1+13-LTS
   [junit4]   2> 3979763 INFO  (SUITE-HdfsAutoAddReplicasIntegrationTest-seed#[10677DD7C00EF4B3]-worker) [    ] o.e.j.s.session DefaultSessionIdManager workerName=node0
   [junit4]   2> 3979763 INFO  (SUITE-HdfsAutoAddReplicasIntegrationTest-seed#[10677DD7C00EF4B3]-worker) [    ] o.e.j.s.session No SessionScavenger set, using defaults
   [junit4]   2> 3979763 INFO  (SUITE-HdfsAutoAddReplicasIntegrationTest-seed#[10677DD7C00EF4B3]-worker) [    ] o.e.j.s.session node0 Scavenging every 660000ms
   [junit4]   2> 3979764 INFO  (SUITE-HdfsAutoAddReplicasIntegrationTest-seed#[10677DD7C00EF4B3]-worker) [    ] o.e.j.s.h.ContextHandler Started o.e.j.s.ServletContextHandler@348eecbf{static,/static,jar:file:/x1/jenkins/.ivy2/cache/org.apache.hadoop/hadoop-hdfs/tests/hadoop-hdfs-3.2.0-tests.jar!/webapps/static,AVAILABLE}
   [junit4]   2> 3979973 INFO  (SUITE-HdfsAutoAddReplicasIntegrationTest-seed#[10677DD7C00EF4B3]-worker) [    ] o.e.j.s.h.ContextHandler Started o.e.j.w.WebAppContext@610f3ca2{datanode,/,file:///x1/jenkins/jenkins-slave/workspace/Lucene-Solr-NightlyTests-master/checkout/solr/build/solr-core/test/J1/temp/jetty-localhost-33315-datanode-_-any-11170477955664541907.dir/webapp/,AVAILABLE}{/datanode}
   [junit4]   2> 3979974 INFO  (SUITE-HdfsAutoAddReplicasIntegrationTest-seed#[10677DD7C00EF4B3]-worker) [    ] o.e.j.s.AbstractConnector Started ServerConnector@9bdec38{HTTP/1.1,[http/1.1]}{localhost:33315}
   [junit4]   2> 3979974 INFO  (SUITE-HdfsAutoAddReplicasIntegrationTest-seed#[10677DD7C00EF4B3]-worker) [    ] o.e.j.s.Server Started @3980023ms
   [junit4]   2> 3980088 INFO  (Block report processor) [    ] BlockStateChange BLOCK* processReport 0x38e93a6bd82c042: Processing first storage report for DS-3dbf6477-93bf-4a4d-b054-acde0d145a76 from datanode 70e843be-cfbe-4c53-b671-65dc39b1460d
   [junit4]   2> 3980089 INFO  (Block report processor) [    ] BlockStateChange BLOCK* processReport 0x38e93a6bd82c042: from storage DS-3dbf6477-93bf-4a4d-b054-acde0d145a76 node DatanodeRegistration(127.0.0.1:39122, datanodeUuid=70e843be-cfbe-4c53-b671-65dc39b1460d, infoPort=32843, infoSecurePort=0, ipcPort=46806, storageInfo=lv=-57;cid=testClusterID;nsid=358290576;c=1559396822072), blocks: 0, hasStaleStorage: true, processing time: 0 msecs, invalidatedBlocks: 0
   [junit4]   2> 3980089 INFO  (Block report processor) [    ] BlockStateChange BLOCK* processReport 0x38e93a6bd82c042: Processing first storage report for DS-bc63e626-764a-4ac6-83c8-2fa026e44e03 from datanode 70e843be-cfbe-4c53-b671-65dc39b1460d
   [junit4]   2> 3980089 INFO  (Block report processor) [    ] BlockStateChange BLOCK* processReport 0x38e93a6bd82c042: from storage DS-bc63e626-764a-4ac6-83c8-2fa026e44e03 node DatanodeRegistration(127.0.0.1:39122, datanodeUuid=70e843be-cfbe-4c53-b671-65dc39b1460d, infoPort=32843, infoSecurePort=0, ipcPort=46806, storageInfo=lv=-57;cid=testClusterID;nsid=358290576;c=1559396822072), blocks: 0, hasStaleStorage: false, processing time: 0 msecs, invalidatedBlocks: 0
   [junit4]   2> 3980284 INFO  (TEST-HdfsAutoAddReplicasIntegrationTest.testSimple-seed#[10677DD7C00EF4B3]) [    ] o.a.s.SolrTestCaseJ4 ###Starting testSimple
   [junit4]   2> 3980285 INFO  (TEST-HdfsAutoAddReplicasIntegrationTest.testSimple-seed#[10677DD7C00EF4B3]) [    ] o.a.s.c.MiniSolrCloudCluster Starting cluster of 3 servers in /x1/jenkins/jenkins-slave/workspace/Lucene-Solr-NightlyTests-master/checkout/solr/build/solr-core/test/J1/temp/solr.cloud.autoscaling.HdfsAutoAddReplicasIntegrationTest_10677DD7C00EF4B3-001/tempDir-002
   [junit4]   2> 3980285 INFO  (TEST-HdfsAutoAddReplicasIntegrationTest.testSimple-seed#[10677DD7C00EF4B3]) [    ] o.a.s.c.ZkTestServer STARTING ZK TEST SERVER
   [junit4]   2> 3980286 INFO  (ZkTestServer Run Thread) [    ] o.a.s.c.ZkTestServer client port:0.0.0.0/0.0.0.0:0
   [junit4]   2> 3980286 INFO  (ZkTestServer Run Thread) [    ] o.a.s.c.ZkTestServer Starting server
   [junit4]   2> 3980386 INFO  (TEST-HdfsAutoAddReplicasIntegrationTest.testSimple-seed#[10677DD7C00EF4B3]) [    ] o.a.s.c.ZkTestServer start zk server on port:34849
   [junit4]   2> 3980386 INFO  (TEST-HdfsAutoAddReplicasIntegrationTest.testSimple-seed#[10677DD7C00EF4B3]) [    ] o.a.s.c.ZkTestServer parse host and port list: 127.0.0.1:34849
   [junit4]   2> 3980386 INFO  (TEST-HdfsAutoAddReplicasIntegrationTest.testSimple-seed#[10677DD7C00EF4B3]) [    ] o.a.s.c.ZkTestServer connecting to 127.0.0.1 34849
   [junit4]   2> 3980407 INFO  (zkConnectionManagerCallback-18238-thread-1) [    ] o.a.s.c.c.ConnectionManager zkClient has connected
   [junit4]   2> 3980411 INFO  (zkConnectionManagerCallback-18240-thread-1) [    ] o.a.s.c.c.ConnectionManager zkClient has connected
   [junit4]   2> 3980412 INFO  (zkConnectionManagerCallback-18242-thread-1) [    ] o.a.s.c.c.ConnectionManager zkClient has connected
   [junit4]   2> 3980414 WARN  (jetty-launcher-18243-thread-1) [    ] o.e.j.s.AbstractConnector Ignoring deprecated socket close linger time
   [junit4]   2> 3980415 INFO  (jetty-launcher-18243-thread-1) [    ] o.a.s.c.s.e.JettySolrRunner Start Jetty (original configured port=0)
   [junit4]   2> 3980415 INFO  (jetty-launcher-18243-thread-1) [    ] o.a.s.c.s.e.JettySolrRunner Trying to start Jetty on port 0 try number 1 ...
   [junit4]   2> 3980415 INFO  (jetty-launcher-18243-thread-1) [    ] o.e.j.s.Server jetty-9.4.14.v20181114; built: 2018-11-14T21:20:31.478Z; git: c4550056e785fb5665914545889f21dc136ad9e6; jvm 11.0.1+13-LTS
   [junit4]   2> 3980415 WARN  (jetty-launcher-18243-thread-2) [    ] o.e.j.s.AbstractConnector Ignoring deprecated socket close linger time
   [junit4]   2> 3980416 INFO  (jetty-launcher-18243-thread-2) [    ] o.a.s.c.s.e.JettySolrRunner Start Jetty (original configured port=0)
   [junit4]   2> 3980416 INFO  (jetty-launcher-18243-thread-2) [    ] o.a.s.c.s.e.JettySolrRunner Trying to start Jetty on port 0 try number 1 ...
   [junit4]   2> 3980416 INFO  (jetty-launcher-18243-thread-2) [    ] o.e.j.s.Server jetty-9.4.14.v20181114; built: 2018-11-14T21:20:31.478Z; git: c4550056e785fb5665914545889f21dc136ad9e6; jvm 11.0.1+13-LTS
   [junit4]   2> 3980416 WARN  (jetty-launcher-18243-thread-3) [    ] o.e.j.s.AbstractConnector Ignoring deprecated socket close linger time
   [junit4]   2> 3980417 INFO  (jetty-launcher-18243-thread-3) [    ] o.a.s.c.s.e.JettySolrRunner Start Jetty (original configured port=0)
   [junit4]   2> 3980417 INFO  (jetty-launcher-18243-thread-3) [    ] o.a.s.c.s.e.JettySolrRunner Trying to start Jetty on port 0 try number 1 ...
   [junit4]   2> 3980417 INFO  (jetty-launcher-18243-thread-3) [    ] o.e.j.s.Server jetty-9.4.14.v20181114; built: 2018-11-14T21:20:31.478Z; git: c4550056e785fb5665914545889f21dc136ad9e6; jvm 11.0.1+13-LTS
   [junit4]   2> 3980418 INFO  (jetty-launcher-18243-thread-2) [    ] o.e.j.s.session DefaultSessionIdManager workerName=node0
   [junit4]   2> 3980418 INFO  (jetty-launcher-18243-thread-2) [    ] o.e.j.s.session No SessionScavenger set, using defaults
   [junit4]   2> 3980418 INFO  (jetty-launcher-18243-thread-2) [    ] o.e.j.s.session node0 Scavenging every 600000ms
   [junit4]   2> 3980418 INFO  (jetty-launcher-18243-thread-2) [    ] o.e.j.s.h.ContextHandler Started o.e.j.s.ServletContextHandler@6d2aabe5{/solr,null,AVAILABLE}
   [junit4]   2> 3980419 INFO  (jetty-launcher-18243-thread-2) [    ] o.e.j.s.AbstractConnector Started ServerConnector@5e4ac213{HTTP/1.1,[http/1.1, h2c]}{127.0.0.1:35101}
   [junit4]   2> 3980419 INFO  (jetty-launcher-18243-thread-2) [    ] o.e.j.s.Server Started @3980468ms
   [junit4]   2> 3980419 INFO  (jetty-launcher-18243-thread-2) [    ] o.a.s.c.s.e.JettySolrRunner Jetty properties: {hostContext=/solr, hostPort=35101}
   [junit4]   2> 3980419 ERROR (jetty-launcher-18243-thread-2) [    ] o.a.s.u.StartupLoggingUtils Missing Java Option solr.log.dir. Logging may be missing or incomplete.
   [junit4]   2> 3980419 INFO  (jetty-launcher-18243-thread-2) [    ] o.a.s.s.SolrDispatchFilter Using logger factory org.apache.logging.slf4j.Log4jLoggerFactory
   [junit4]   2> 3980419 INFO  (jetty-launcher-18243-thread-2) [    ] o.a.s.s.SolrDispatchFilter  ___      _       Welcome to Apache Solr™ version 9.0.0
   [junit4]   2> 3980419 INFO  (jetty-launcher-18243-thread-2) [    ] o.a.s.s.SolrDispatchFilter / __| ___| |_ _   Starting in cloud mode on port null
   [junit4]   2> 3980419 INFO  (jetty-launcher-18243-thread-2) [    ] o.a.s.s.SolrDispatchFilter \__ \/ _ \ | '_|  Install dir: null
   [junit4]   2> 3980419 INFO  (jetty-launcher-18243-thread-2) [    ] o.a.s.s.SolrDispatchFilter |___/\___/_|_|    Start time: 2019-06-01T13:47:03.032933Z
   [junit4]   2> 3980421 INFO  (jetty-launcher-18243-thread-1) [    ] o.e.j.s.session DefaultSessionIdManager workerName=node0
   [junit4]   2> 3980421 INFO  (jetty-launcher-18243-thread-1) [    ] o.e.j.s.session No SessionScavenger set, using defaults
   [junit4]   2> 3980421 INFO  (jetty-launcher-18243-thread-1) [    ] o.e.j.s.session node0 Scavenging every 660000ms
   [junit4]   2> 3980422 INFO  (jetty-launcher-18243-thread-1) [    ] o.e.j.s.h.ContextHandler Started o.e.j.s.ServletContextHandler@48717d12{/solr,null,AVAILABLE}
   [junit4]   2> 3980422 INFO  (jetty-launcher-18243-thread-1) [    ] o.e.j.s.AbstractConnector Started ServerConnector@4b0fabf1{HTTP/1.1,[http/1.1, h2c]}{127.0.0.1:45011}
   [junit4]   2> 3980422 INFO  (jetty-launcher-18243-thread-1) [    ] o.e.j.s.Server Started @3980471ms
   [junit4]   2> 3980422 INFO  (jetty-launcher-18243-thread-1) [    ] o.a.s.c.s.e.JettySolrRunner Jetty properties: {hostContext=/solr, hostPort=45011}
   [junit4]   2> 3980422 ERROR (jetty-launcher-18243-thread-1) [    ] o.a.s.u.StartupLoggingUtils Missing Java Option solr.log.dir. Logging may be missing or incomplete.
   [junit4]   2> 3980422 INFO  (jetty-launcher-18243-thread-1) [    ] o.a.s.s.SolrDispatchFilter Using logger factory org.apache.logging.slf4j.Log4jLoggerFactory
   [junit4]   2> 3980422 INFO  (jetty-launcher-18243-thread-1) [    ] o.a.s.s.SolrDispatchFilter  ___      _       Welcome to Apache Solr™ version 9.0.0
   [junit4]   2> 3980422 INFO  (jetty-launcher-18243-thread-1) [    ] o.a.s.s.SolrDispatchFilter / __| ___| |_ _   Starting in cloud mode on port null
   [junit4]   2> 3980422 INFO  (jetty-launcher-18243-thread-1) [    ] o.a.s.s.SolrDispatchFilter \__ \/ _ \ | '_|  Install dir: null
   [junit4]   2> 3980422 INFO  (jetty-launcher-18243-thread-1) [    ] o.a.s.s.SolrDispatchFilter |___/\___/_|_|    Start time: 2019-06-01T13:47:03.035888Z
   [junit4]   2> 3980425 INFO  (jetty-launcher-18243-thread-3) [    ] o.e.j.s.session DefaultSessionIdManager workerName=node0
   [junit4]   2> 3980425 INFO  (jetty-launcher-18243-thread-3) [    ] o.e.j.s.session No SessionScavenger set, using defaults
   [junit4]   2> 3980425 INFO  (jetty-launcher-18243-thread-3) [    ] o.e.j.s.session node0 Scavenging every 660000ms
   [junit4]   2> 3980425 INFO  (jetty-launcher-18243-thread-3) [    ] o.e.j.s.h.ContextHandler Started o.e.j.s.ServletContextHandler@7f3f5c23{/solr,null,AVAILABLE}
   [junit4]   2> 3980426 INFO  (jetty-launcher-18243-thread-3) [    ] o.e.j.s.AbstractConnector Started ServerConnector@60f123a5{HTTP/1.1,[http/1.1, h2c]}{127.0.0.1:32960}
   [junit4]   2> 3980426 INFO  (jetty-launcher-18243-thread-3) [    ] o.e.j.s.Server Started @3980475ms
   [junit4]   2> 3980426 INFO  (jetty-launcher-18243-thread-3) [    ] o.a.s.c.s.e.JettySolrRunner Jetty properties: {hostContext=/solr, hostPort=32960}
   [junit4]   2> 3980426 ERROR (jetty-launcher-18243-thread-3) [    ] o.a.s.u.StartupLoggingUtils Missing Java Option solr.log.dir. Logging may be missing or incomplete.
   [junit4]   2> 3980426 INFO  (jetty-launcher-18243-thread-3) [    ] o.a.s.s.SolrDispatchFilter Using logger factory org.apache.logging.slf4j.Log4jLoggerFactory
   [junit4]   2> 3980427 INFO  (jetty-launcher-18243-thread-3) [    ] o.a.s.s.SolrDispatchFilter  ___      _       Welcome to Apache Solr™ version 9.0.0
   [junit4]   2> 3980427 INFO  (jetty-launcher-18243-thread-3) [    ] o.a.s.s.SolrDispatchFilter / __| ___| |_ _   Starting in cloud mode on port null
   [junit4]   2> 3980427 INFO  (jetty-launcher-18243-thread-3) [    ] o.a.s.s.SolrDispatchFilter \__ \/ _ \ | '_|  Install dir: null
   [junit4]   2> 3980427 INFO  (jetty-launcher-18243-thread-3) [    ] o.a.s.s.SolrDispatchFilter |___/\___/_|_|    Start time: 2019-06-01T13:47:03.040515Z
   [junit4]   2> 3980429 INFO  (zkConnectionManagerCallback-18245-thread-1) [    ] o.a.s.c.c.ConnectionManager zkClient has connected
   [junit4]   2> 3980429 INFO  (zkConnectionManagerCallback-18247-thread-1) [    ] o.a.s.c.c.ConnectionManager zkClient has connected
   [junit4]   2> 3980430 INFO  (jetty-launcher-18243-thread-2) [    ] o.a.s.s.SolrDispatchFilter solr.xml found in ZooKeeper. Loading...
   [junit4]   2> 3980430 INFO  (jetty-launcher-18243-thread-1) [    ] o.a.s.s.SolrDispatchFilter solr.xml found in ZooKeeper. Loading...
   [junit4]   2> 3980437 INFO  (jetty-launcher-18243-thread-1) [    ] o.a.s.c.SolrXmlConfig Configuration parameter autoReplicaFailoverWorkLoopDelay is ignored
   [junit4]   2> 3980437 INFO  (jetty-launcher-18243-thread-1) [    ] o.a.s.c.SolrXmlConfig Configuration parameter autoReplicaFailoverBadNodeExpiration is ignored
   [junit4]   2> 3980438 INFO  (jetty-launcher-18243-thread-1) [    ] o.a.s.c.SolrXmlConfig MBean server found: com.sun.jmx.mbeanserver.JmxMBeanServer@65b080f2, but no JMX reporters were configured - adding default JMX reporter.
   [junit4]   2> 3980442 INFO  (jetty-launcher-18243-thread-2) [    ] o.a.s.c.SolrXmlConfig Configuration parameter autoReplicaFailoverWorkLoopDelay is ignored
   [junit4]   2> 3980442 INFO  (jetty-launcher-18243-thread-2) [    ] o.a.s.c.SolrXmlConfig Configuration parameter autoReplicaFailoverBadNodeExpiration is ignored
   [junit4]   2> 3980443 INFO  (jetty-launcher-18243-thread-2) [    ] o.a.s.c.SolrXmlConfig MBean server found: com.sun.jmx.mbeanserver.JmxMBeanServer@65b080f2, but no JMX reporters were configured - adding default JMX reporter.
   [junit4]   2> 3980463 INFO  (zkConnectionManagerCallback-18249-thread-1) [    ] o.a.s.c.c.ConnectionManager zkClient has connected
   [junit4]   2> 3980464 INFO  (jetty-launcher-18243-thread-3) [    ] o.a.s.s.SolrDispatchFilter solr.xml found in ZooKeeper. Loading...
   [junit4]   2> 3980467 INFO  (jetty-launcher-18243-thread-3) [    ] o.a.s.c.SolrXmlConfig Configuration parameter autoReplicaFailoverWorkLoopDelay is ignored
   [junit4]   2> 3980467 INFO  (jetty-launcher-18243-thread-3) [    ] o.a.s.c.SolrXmlConfig Configuration parameter autoReplicaFailoverBadNodeExpiration is ignored
   [junit4]   2> 3980469 INFO  (jetty-launcher-18243-thread-3) [    ] o.a.s.c.SolrXmlConfig MBean server found: com.sun.jmx.mbeanserver.JmxMBeanServer@65b080f2, but no JMX reporters were configured - adding default JMX reporter.
   [junit4]   2> 3980572 INFO  (jetty-launcher-18243-thread-2) [    ] o.a.s.h.c.HttpShardHandlerFactory Host whitelist initialized: WhitelistHostChecker [whitelistHosts=null, whitelistHostCheckingEnabled=true]
   [junit4]   2> 3980573 WARN  (jetty-launcher-18243-thread-2) [    ] o.e.j.u.s.S.config No Client EndPointIdentificationAlgorithm configured for SslContextFactory@5f2ed72b[provider=null,keyStore=null,trustStore=null]
   [junit4]   2> 3980576 WARN  (jetty-launcher-18243-thread-2) [    ] o.e.j.u.s.S.config No Client EndPointIdentificationAlgorithm configured for SslContextFactory@61e643db[provider=null,keyStore=null,trustStore=null]
   [junit4]   2> 3980578 INFO  (jetty-launcher-18243-thread-2) [    ] o.a.s.c.ZkContainer Zookeeper client=127.0.0.1:34849/solr
   [junit4]   2> 3980583 INFO  (zkConnectionManagerCallback-18258-thread-1) [    ] o.a.s.c.c.ConnectionManager zkClient has connected
   [junit4]   2> 3980589 INFO  (jetty-launcher-18243-thread-1) [    ] o.a.s.h.c.HttpShardHandlerFactory Host whitelist initialized: WhitelistHostChecker [whitelistHosts=null, whitelistHostCheckingEnabled=true]
   [junit4]   2> 3980592 WARN  (jetty-launcher-18243-thread-1) [    ] o.e.j.u.s.S.config No Client EndPointIdentificationAlgorithm configured for SslContextFactory@2560013e[provider=null,keyStore=null,trustStore=null]
   [junit4]   2> 3980595 INFO  (zkConnectionManagerCallback-18260-thread-1) [    ] o.a.s.c.c.ConnectionManager zkClient has connected
   [junit4]   2> 3980597 WARN  (jetty-launcher-18243-thread-1) [    ] o.e.j.u.s.S.config No Client EndPointIdentificationAlgorithm configured for SslContextFactory@765cc171[provider=null,keyStore=null,trustStore=null]
   [junit4]   2> 3980598 INFO  (jetty-launcher-18243-thread-1) [    ] o.a.s.c.ZkContainer Zookeeper client=127.0.0.1:34849/solr
   [junit4]   2> 3980602 INFO  (zkConnectionManagerCallback-18266-thread-1) [    ] o.a.s.c.c.ConnectionManager zkClient has connected
   [junit4]   2> 3980605 INFO  (zkConnectionManagerCallback-18270-thread-1) [    ] o.a.s.c.c.ConnectionManager zkClient has connected
   [junit4]   2> 3980628 INFO  (jetty-launcher-18243-thread-2) [n:127.0.0.1:35101_solr    ] o.a.s.c.OverseerElectionContext I am going to be the leader 127.0.0.1:35101_solr
   [junit4]   2> 3980629 INFO  (jetty-launcher-18243-thread-2) [n:127.0.0.1:35101_solr    ] o.a.s.c.Overseer Overseer (id=73403151157035015-127.0.0.1:35101_solr-n_0000000000) starting
   [junit4]   2> 3980640 INFO  (zkConnectionManagerCallback-18277-thread-1) [    ] o.a.s.c.c.ConnectionManager zkClient has connected
   [junit4]   2> 3980644 INFO  (jetty-launcher-18243-thread-2) [n:127.0.0.1:35101_solr    ] o.a.s.c.s.i.ZkClientClusterStateProvider Cluster at 127.0.0.1:34849/solr ready
   [junit4]   2> 3980646 INFO  (OverseerStateUpdate-73403151157035015-127.0.0.1:35101_solr-n_0000000000) [n:127.0.0.1:35101_solr    ] o.a.s.c.Overseer Starting to work on the main queue : 127.0.0.1:35101_solr
   [junit4]   2> 3980652 INFO  (jetty-launcher-18243-thread-2) [n:127.0.0.1:35101_solr    ] o.a.s.c.ZkController Register node as live in ZooKeeper:/live_nodes/127.0.0.1:35101_solr
   [junit4]   2> 3980654 INFO  (zkCallback-18276-thread-1) [    ] o.a.s.c.c.ZkStateReader Updated live nodes from ZooKeeper... (0) -> (1)
   [junit4]   2> 3980669 INFO  (jetty-launcher-18243-thread-3) [    ] o.a.s.h.c.HttpShardHandlerFactory Host whitelist initialized: WhitelistHostChecker [whitelistHosts=null, whitelistHostCheckingEnabled=true]
   [junit4]   2> 3980670 INFO  (zkCallback-18259-thread-1) [    ] o.a.s.c.c.ZkStateReader Updated live nodes from ZooKeeper... (0) -> (1)
   [junit4]   2> 3980672 WARN  (jetty-launcher-18243-thread-3) [    ] o.e.j.u.s.S.config No Client EndPointIdentificationAlgorithm configured for SslContextFactory@6cd94883[provider=null,keyStore=null,trustStore=null]
   [junit4]   2> 3980675 WARN  (jetty-launcher-18243-thread-3) [    ] o.e.j.u.s.S.config No Client EndPointIdentificationAlgorithm configured for SslContextFactory@7a4f18fb[provider=null,keyStore=null,trustStore=null]
   [junit4]   2> 3980677 INFO  (jetty-launcher-18243-thread-3) [    ] o.a.s.c.ZkContainer Zookeeper client=127.0.0.1:34849/solr
   [junit4]   2> 3980679 INFO  (jetty-launcher-18243-thread-2) [n:127.0.0.1:35101_solr    ] o.a.s.h.a.MetricsHistoryHandler No .system collection, keeping metrics history in memory.
   [junit4]   2> 3980679 INFO  (zkConnectionManagerCallback-18284-thread-1) [    ] o.a.s.c.c.ConnectionManager zkClient has connected
   [junit4]   2> 3980683 INFO  (zkConnectionManagerCallback-18286-thread-1) [    ] o.a.s.c.c.ConnectionManager zkClient has connected
   [junit4]   2> 3980696 INFO  (jetty-launcher-18243-thread-3) [n:127.0.0.1:32960_solr    ] o.a.s.c.c.ZkStateReader Updated live nodes from ZooKeeper... (0) -> (1)
   [junit4]   2> 3980701 INFO  (jetty-launcher-18243-thread-3) [n:127.0.0.1:32960_solr    ] o.a.s.c.ZkController Publish node=127.0.0.1:32960_solr as DOWN
   [junit4]   2> 3980702 INFO  (jetty-launcher-18243-thread-3) [n:127.0.0.1:32960_solr    ] o.a.s.c.TransientSolrCoreCacheDefault Allocating transient cache for 4 transient cores
   [junit4]   2> 3980702 INFO  (jetty-launcher-18243-thread-3) [n:127.0.0.1:32960_solr    ] o.a.s.c.ZkController Register node as live in ZooKeeper:/live_nodes/127.0.0.1:32960_solr
   [junit4]   2> 3980704 INFO  (zkCallback-18276-thread-1) [    ] o.a.s.c.c.ZkStateReader Updated live nodes from ZooKeeper... (1) -> (2)
   [junit4]   2> 3980704 INFO  (zkCallback-18259-thread-1) [    ] o.a.s.c.c.ZkStateReader Updated live nodes from ZooKeeper... (1) -> (2)
   [junit4]   2> 3980705 INFO  (zkCallback-18285-thread-1) [    ] o.a.s.c.c.ZkStateReader Updated live nodes from ZooKeeper... (1) -> (2)
   [junit4]   2> 3980707 INFO  (zkConnectionManagerCallback-18293-thread-1) [    ] o.a.s.c.c.ConnectionManager zkClient has connected
   [junit4]   2> 3980709 INFO  (jetty-launcher-18243-thread-3) [n:127.0.0.1:32960_solr    ] o.a.s.c.c.ZkStateReader Updated live nodes from ZooKeeper... (0) -> (2)
   [junit4]   2> 3980710 INFO  (jetty-launcher-18243-thread-2) [n:127.0.0.1:35101_solr    ] o.a.s.m.r.SolrJmxReporter JMX monitoring for 'solr.node' (registry 'solr.node') enabled at server: com.sun.jmx.mbeanserver.JmxMBeanServer@65b080f2
   [junit4]   2> 3980711 INFO  (jetty-launcher-18243-thread-3) [n:127.0.0.1:32960_solr    ] o.a.s.c.s.i.ZkClientClusterStateProvider Cluster at 127.0.0.1:34849/solr ready
   [junit4]   2> 3980716 INFO  (jetty-launcher-18243-thread-1) [n:127.0.0.1:45011_solr    ] o.a.s.c.c.ZkStateReader Updated live nodes from ZooKeeper... (0) -> (2)
   [junit4]   2> 3980720 INFO  (jetty-launcher-18243-thread-1) [n:127.0.0.1:45011_solr    ] o.a.s.c.ZkController Publish node=127.0.0.1:45011_solr as DOWN
   [junit4]   2> 3980721 INFO  (jetty-launcher-18243-thread-1) [n:127.0.0.1:45011_solr    ] o.a.s.c.TransientSolrCoreCacheDefault Allocating transient cache for 4 transient cores
   [junit4]   2> 3980721 INFO  (jetty-launcher-18243-thread-1) [n:127.0.0.1:45011_solr    ] o.a.s.c.ZkController Register node as live in ZooKeeper:/live_nodes/127.0.0.1:45011_solr
   [junit4]   2> 3980723 INFO  (zkCallback-18285-thread-1) [    ] o.a.s.c.c.ZkStateReader Updated live nodes from ZooKeeper... (2) -> (3)
   [junit4]   2> 3980723 INFO  (zkCallback-18259-thread-1) [    ] o.a.s.c.c.ZkStateReader Updated live nodes from ZooKeeper... (2) -> (3)
   [junit4]   2> 3980723 INFO  (zkCallback-18276-thread-1) [    ] o.a.s.c.c.ZkStateReader Updated live nodes from ZooKeeper... (2) -> (3)
   [junit4]   2> 3980724 INFO  (zkCallback-18292-thread-1) [    ] o.a.s.c.c.ZkStateReader Updated live nodes from ZooKeeper... (2) -> (3)
   [junit4]   2> 3980727 INFO  (zkCallback-18269-thread-1) [    ] o.a.s.c.c.ZkStateReader Updated live nodes from ZooKeeper... (2) -> (3)
   [junit4]   2> 3980729 INFO  (jetty-launcher-18243-thread-2) [n:127.0.0.1:35101_solr    ] o.a.s.m.r.SolrJmxReporter JMX monitoring for 'solr.jvm' (registry 'solr.jvm') enabled at server: com.sun.jmx.mbeanserver.JmxMBeanServer@65b080f2
   [junit4]   2> 3980729 INFO  (jetty-launcher-18243-thread-2) [n:127.0.0.1:35101_solr    ] o.a.s.m.r.SolrJmxReporter JMX monitoring for 'solr.jetty' (registry 'solr.jetty') enabled at server: com.sun.jmx.mbeanserver.JmxMBeanServer@65b080f2
   [junit4]   2> 3980729 INFO  (zkConnectionManagerCallback-18298-thread-1) [    ] o.a.s.c.c.ConnectionManager zkClient has connected
   [junit4]   2> 3980731 INFO  (jetty-launcher-18243-thread-2) [n:127.0.0.1:35101_solr    ] o.a.s.c.CorePropertiesLocator Found 0 core definitions underneath /x1/jenkins/jenkins-slave/workspace/Lucene-Solr-NightlyTests-master/checkout/solr/build/solr-core/test/J1/temp/solr.cloud.autoscaling.HdfsAutoAddReplicasIntegrationTest_10677DD7C00EF4B3-001/tempDir-002/node2/.
   [junit4]   2> 3980731 INFO  (jetty-launcher-18243-thread-1) [n:127.0.0.1:45011_solr    ] o.a.s.c.c.ZkStateReader Updated live nodes from ZooKeeper... (0) -> (3)
   [junit4]   2> 3980733 INFO  (jetty-launcher-18243-thread-1) [n:127.0.0.1:45011_solr    ] o.a.s.c.s.i.ZkClientClusterStateProvider Cluster at 127.0.0.1:34849/solr ready
   [junit4]   2> 3980735 INFO  (jetty-launcher-18243-thread-3) [n:127.0.0.1:32960_solr    ] o.a.s.h.a.MetricsHistoryHandler No .system collection, keeping metrics history in memory.
   [junit4]   2> 3980753 INFO  (jetty-launcher-18243-thread-1) [n:127.0.0.1:45011_solr    ] o.a.s.h.a.MetricsHistoryHandler No .system collection, keeping metrics history in memory.
   [junit4]   2> 3980771 INFO  (jetty-launcher-18243-thread-3) [n:127.0.0.1:32960_solr    ] o.a.s.m.r.SolrJmxReporter JMX monitoring for 'solr.node' (registry 'solr.node') enabled at server: com.sun.jmx.mbeanserver.JmxMBeanServer@65b080f2
   [junit4]   2> 3980786 INFO  (jetty-launcher-18243-thread-1) [n:127.0.0.1:45011_solr    ] o.a.s.m.r.SolrJmxReporter JMX monitoring for 'solr.node' (registry 'solr.node') enabled at server: com.sun.jmx.mbeanserver.JmxMBeanServer@65b080f2
   [junit4]   2> 3980794 INFO  (jetty-launcher-18243-thread-3) [n:127.0.0.1:32960_solr    ] o.a.s.m.r.SolrJmxReporter JMX monitoring for 'solr.jvm' (registry 'solr.jvm') enabled at server: com.sun.jmx.mbeanserver.JmxMBeanServer@65b080f2
   [junit4]   2> 3980794 INFO  (jetty-launcher-18243-thread-3) [n:127.0.0.1:32960_solr    ] o.a.s.m.r.SolrJmxReporter JMX monitoring for 'solr.jetty' (registry 'solr.jetty') enabled at server: com.sun.jmx.mbeanserver.JmxMBeanServer@65b080f2
   [junit4]   2> 3980796 INFO  (jetty-launcher-18243-thread-3) [n:127.0.0.1:32960_solr    ] o.a.s.c.CorePropertiesLocator Found 0 core definitions underneath /x1/jenkins/jenkins-slave/workspace/Lucene-Solr-NightlyTests-master/checkout/solr/build/solr-core/test/J1/temp/solr.cloud.autoscaling.HdfsAutoAddReplicasIntegrationTest_10677DD7C00EF4B3-001/tempDir-002/node3/.
   [junit4]   2> 3980809 INFO  (jetty-launcher-18243-thread-1) [n:127.0.0.1:45011_solr    ] o.a.s.m.r.SolrJmxReporter JMX monitoring for 'solr.jvm' (registry 'solr.jvm') enabled at server: com.sun.jmx.mbeanserver.JmxMBeanServer@65b080f2
   [junit4]   2> 3980809 INFO  (jetty-launcher-18243-thread-1) [n:127.0.0.1:45011_solr    ] o.a.s.m.r.SolrJmxReporter JMX monitoring for 'solr.jetty' (registry 'solr.jetty') enabled at server: com.sun.jmx.mbeanserver.JmxMBeanServer@65b080f2
   [junit4]   2> 3980811 INFO  (jetty-launcher-18243-thread-1) [n:127.0.0.1:45011_solr    ] o.a.s.c.CorePropertiesLocator Found 0 core definitions underneath /x1/jenkins/jenkins-slave/workspace/Lucene-Solr-NightlyTests-master/checkout/solr/build/solr-core/test/J1/temp/solr.cloud.autoscaling.HdfsAutoAddReplicasIntegrationTest_10677DD7C00EF4B3-001/tempDir-002/node1/.
   [junit4]   2> 3980913 INFO  (zkConnectionManagerCallback-18305-thread-1) [    ] o.a.s.c.c.ConnectionManager zkClient has connected
   [junit4]   2> 3980915 INFO  (TEST-HdfsAutoAddReplicasIntegrationTest.testSimple-seed#[10677DD7C00EF4B3]) [    ] o.a.s.c.c.ZkStateReader Updated live nodes from ZooKeeper... (0) -> (3)
   [junit4]   2> 3980916 INFO  (TEST-HdfsAutoAddReplicasIntegrationTest.testSimple-seed#[10677DD7C00EF4B3]) [    ] o.a.s.c.s.i.ZkClientClusterStateProvider Cluster at 127.0.0.1:34849/solr ready
   [junit4]   2> 3980923 INFO  (qtp1282395907-122894) [n:127.0.0.1:32960_solr    ] o.a.s.s.HttpSolrCall [admin] webapp=null path=/cluster params={wt=javabin&version=2} status=0 QTime=1
   [junit4]   2> 3980925 INFO  (qtp2090721238-122873) [n:127.0.0.1:35101_solr    ] o.a.s.h.a.CollectionsHandler Invoked Collection Action :create with params collection.configName=conf&maxShardsPerNode=2&autoAddReplicas=true&name=testSimple1&nrtReplicas=2&action=CREATE&numShards=2&createNodeSet=127.0.0.1:35101_solr,127.0.0.1:45011_solr&wt=javabin&version=2 and sendToOCPQueue=true
   [junit4]   2> 3980928 INFO  (OverseerThreadFactory-14941-thread-1-processing-n:127.0.0.1:35101_solr) [n:127.0.0.1:35101_solr    ] o.a.s.c.a.c.CreateCollectionCmd Create collection testSimple1
   [junit4]   2> 3981039 INFO  (OverseerStateUpdate-73403151157035015-127.0.0.1:35101_solr-n_0000000000) [n:127.0.0.1:35101_solr    ] o.a.s.c.o.SliceMutator createReplica() {
   [junit4]   2>   "operation":"ADDREPLICA",
   [junit4]   2>   "collection":"testSimple1",
   [junit4]   2>   "shard":"shard1",
   [junit4]   2>   "core":"testSimple1_shard1_replica_n1",
   [junit4]   2>   "state":"down",
   [junit4]   2>   "base_url":"http://127.0.0.1:35101/solr",
   [junit4]   2>   "type":"NRT",
   [junit4]   2>   "waitForFinalState":"false"} 
   [junit4]   2> 3981042 INFO  (OverseerStateUpdate-73403151157035015-127.0.0.1:35101_solr-n_0000000000) [n:127.0.0.1:35101_solr    ] o.a.s.c.o.SliceMutator createReplica() {
   [junit4]   2>   "operation":"ADDREPLICA",
   [junit4]   2>   "collection":"testSimple1",
   [junit4]   2>   "shard":"shard1",
   [junit4]   2>   "core":"testSimple1_shard1_replica_n2",
   [junit4]   2>   "state":"down",
   [junit4]   2>   "base_url":"http://127.0.0.1:45011/solr",
   [junit4]   2>   "type":"NRT",
   [junit4]   2>   "waitForFinalState":"false"} 
   [junit4]   2> 3981046 INFO  (OverseerStateUpdate-73403151157035015-127.0.0.1:35101_solr-n_0000000000) [n:127.0.0.1:35101_solr    ] o.a.s.c.o.SliceMutator createReplica() {
   [junit4]   2>   "operation":"ADDREPLICA",
   [junit4]   2>   "collection":"testSimple1",
   [junit4]   2>   "shard":"shard2",
   [junit4]   2>   "core":"testSimple1_shard2_replica_n5",
   [junit4]   2>   "state":"down",
   [junit4]   2>   "base_url":"http://127.0.0.1:35101/solr",
   [junit4]   2>   "type":"NRT",
   [junit4]   2>   "waitForFinalState":"false"} 
   [junit4]   2> 3981050 INFO  (OverseerStateUpdate-73403151157035015-127.0.0.1:35101_solr-n_0000000000) [n:127.0.0.1:35101_solr    ] o.a.s.c.o.SliceMutator createReplica() {
   [junit4]   2>   "operation":"ADDREPLICA",
   [junit4]   2>   "collection":"testSimple1",
   [junit4]   2>   "shard":"shard2",
   [junit4]   2>   "core":"testSimple1_shard2_replica_n7",
   [junit4]   2>   "state":"down",
   [junit4]   2>   "base_url":"http://127.0.0.1:45011/solr",
   [junit4]   2>   "type":"NRT",
   [junit4]   2>   "waitForFinalState":"false"} 
   [junit4]   2> 3981254 INFO  (qtp2090721238-122876) [n:127.0.0.1:35101_solr    x:testSimple1_shard1_replica_n1] o.a.s.h.a.CoreAdminOperation core create command qt=/admin/cores&coreNodeName=core_node3&collection.configName=conf&newCollection=true&name=testSimple1_shard1_replica_n1&action=CREATE&numShards=2&collection=testSimple1&shard=shard1&wt=javabin&version=2&replicaType=NRT
   [junit4]   2> 3981254 INFO  (qtp2090721238-122872) [n:127.0.0.1:35101_solr    x:testSimple1_shard2_replica_n5] o.a.s.h.a.CoreAdminOperation core create command qt=/admin/cores&coreNodeName=core_node6&collection.configName=conf&newCollection=true&name=testSimple1_shard2_replica_n5&action=CREATE&numShards=2&collection=testSimple1&shard=shard2&wt=javabin&version=2&replicaType=NRT
   [junit4]   2> 3981255 INFO  (qtp2090721238-122872) [n:127.0.0.1:35101_solr    x:testSimple1_shard2_replica_n5] o.a.s.c.TransientSolrCoreCacheDefault Allocating transient cache for 4 transient cores
   [junit4]   2> 3981257 INFO  (qtp1364517442-122884) [n:127.0.0.1:45011_solr    x:testSimple1_shard1_replica_n2] o.a.s.h.a.CoreAdminOperation core create command qt=/admin/cores&coreNodeName=core_node4&collection.configName=conf&newCollection=true&name=testSimple1_shard1_replica_n2&action=CREATE&numShards=2&collection=testSimple1&shard=shard1&wt=javabin&version=2&replicaType=NRT
   [junit4]   2> 3981259 INFO  (qtp1364517442-122885) [n:127.0.0.1:45011_solr    x:testSimple1_shard2_replica_n7] o.a.s.h.a.CoreAdminOperation core create command qt=/admin/cores&coreNodeName=core_node8&collection.configName=conf&newCollection=true&name=testSimple1_shard2_replica_n7&action=CREATE&numShards=2&collection=testSimple1&shard=shard2&wt=javabin&version=2&replicaType=NRT
   [junit4]   2> 3982270 INFO  (qtp2090721238-122872) [n:127.0.0.1:35101_solr c:testSimple1 s:shard2 r:core_node6 x:testSimple1_shard2_replica_n5] o.a.s.c.SolrConfig Using Lucene MatchVersion: 9.0.0
   [junit4]   2> 3982278 INFO  (qtp1364517442-122884) [n:127.0.0.1:45011_solr c:testSimple1 s:shard1 r:core_node4 x:testSimple1_shard1_replica_n2] o.a.s.c.SolrConfig Using Lucene MatchVersion: 9.0.0
   [junit4]   2> 3982280 INFO  (qtp2090721238-122872) [n:127.0.0.1:35101_solr c:testSimple1 s:shard2 r:core_node6 x:testSimple1_shard2_replica_n5] o.a.s.s.IndexSchema [testSimple1_shard2_replica_n5] Schema name=minimal
   [junit4]   2> 3982305 INFO  (qtp2090721238-122876) [n:127.0.0.1:35101_solr c:testSimple1 s:shard1 r:core_node3 x:testSimple1_shard1_replica_n1] o.a.s.c.SolrConfig Using Lucene MatchVersion: 9.0.0
   [junit4]   2> 3982305 INFO  (qtp2090721238-122872) [n:127.0.0.1:35101_solr c:testSimple1 s:shard2 r:core_node6 x:testSimple1_shard2_replica_n5] o.a.s.s.IndexSchema Loaded schema minimal/1.1 with uniqueid field id
   [junit4]   2> 3982305 INFO  (qtp2090721238-122872) [n:127.0.0.1:35101_solr c:testSimple1 s:shard2 r:core_node6 x:testSimple1_shard2_replica_n5] o.a.s.c.CoreContainer Creating SolrCore 'testSimple1_shard2_replica_n5' using configuration from collection testSimple1, trusted=true
   [junit4]   2> 3982306 INFO  (qtp2090721238-122872) [n:127.0.0.1:35101_solr c:testSimple1 s:shard2 r:core_node6 x:testSimple1_shard2_replica_n5] o.a.s.m.r.SolrJmxReporter JMX monitoring for 'solr.core.testSimple1.shard2.replica_n5' (registry 'solr.core.testSimple1.shard2.replica_n5') enabled at server: com.sun.jmx.mbeanserver.JmxMBeanServer@65b080f2
   [junit4]   2> 3982306 INFO  (qtp1364517442-122885) [n:127.0.0.1:45011_solr c:testSimple1 s:shard2 r:core_node8 x:testSimple1_shard2_replica_n7] o.a.s.c.SolrConfig Using Lucene MatchVersion: 9.0.0
   [junit4]   2> 3982306 INFO  (qtp2090721238-122872) [n:127.0.0.1:35101_solr c:testSimple1 s:shard2 r:core_node6 x:testSimple1_shard2_replica_n5] o.a.s.c.HdfsDirectoryFactory solr.hdfs.home=hdfs://localhost:45877/solr_hdfs_home
   [junit4]   2> 3982306 INFO  (qtp2090721238-122872) [n:127.0.0.1:35101_solr c:testSimple1 s:shard2 r:core_node6 x:testSimple1_shard2_replica_n5] o.a.s.c.HdfsDirectoryFactory Solr Kerberos Authentication disabled
   [junit4]   2> 3982307 INFO  (qtp2090721238-122872) [n:127.0.0.1:35101_solr c:testSimple1 s:shard2 r:core_node6 x:testSimple1_shard2_replica_n5] o.a.s.c.SolrCore [[testSimple1_shard2_replica_n5] ] Opening new SolrCore at [/x1/jenkins/jenkins-slave/workspace/Lucene-Solr-NightlyTests-master/checkout/solr/build/solr-core/test/J1/temp/solr.cloud.autoscaling.HdfsAutoAddReplicasIntegrationTest_10677DD7C00EF4B3-001/tempDir-002/node2/testSimple1_shard2_replica_n5], dataDir=[hdfs://localhost:45877/solr_hdfs_home/testSimple1/core_node6/data/]
   [junit4]   2> 3982309 INFO  (qtp2090721238-122872) [n:127.0.0.1:35101_solr c:testSimple1 s:shard2 r:core_node6 x:testSimple1_shard2_replica_n5] o.a.s.c.HdfsDirectoryFactory creating directory factory for path hdfs://localhost:45877/solr_hdfs_home/testSimple1/core_node6/data/snapshot_metadata
   [junit4]   2> 3982317 INFO  (qtp2090721238-122872) [n:127.0.0.1:35101_solr c:testSimple1 s:shard2 r:core_node6 x:testSimple1_shard2_replica_n5] o.a.s.c.HdfsDirectoryFactory Number of slabs of block cache [1] with direct memory allocation set to [true]
   [junit4]   2> 3982318 INFO  (qtp2090721238-122872) [n:127.0.0.1:35101_solr c:testSimple1 s:shard2 r:core_node6 x:testSimple1_shard2_replica_n5] o.a.s.c.HdfsDirectoryFactory Block cache target memory usage, slab size of [4194304] will allocate [1] slabs and use ~[4194304] bytes
   [junit4]   2> 3982318 INFO  (qtp2090721238-122872) [n:127.0.0.1:35101_solr c:testSimple1 s:shard2 r:core_node6 x:testSimple1_shard2_replica_n5] o.a.s.c.HdfsDirectoryFactory Creating new single instance HDFS BlockCache
   [junit4]   2> 3982323 INFO  (qtp2090721238-122876) [n:127.0.0.1:35101_solr c:testSimple1 s:shard1 r:core_node3 x:testSimple1_shard1_replica_n1] o.a.s.s.IndexSchema [testSimple1_shard1_replica_n1] Schema name=minimal
   [junit4]   2> 3982323 INFO  (qtp1364517442-122885) [n:127.0.0.1:45011_solr c:testSimple1 s:shard2 r:core_node8 x:testSimple1_shard2_replica_n7] o.a.s.s.IndexSchema [testSimple1_shard2_replica_n7] Schema name=minimal
   [junit4]   2> 3982323 INFO  (qtp1364517442-122884) [n:127.0.0.1:45011_solr c:testSimple1 s:shard1 r:core_node4 x:testSimple1_shard1_replica_n2] o.a.s.s.IndexSchema [testSimple1_shard1_replica_n2] Schema name=minimal
   [junit4]   2> 3982325 INFO  (qtp1364517442-122885) [n:127.0.0.1:45011_solr c:testSimple1 s:shard2 r:core_node8 x:testSimple1_shard2_replica_n7] o.a.s.s.IndexSchema Loaded schema minimal/1.1 with uniqueid field id
   [junit4]   2> 3982326 INFO  (qtp1364517442-122885) [n:127.0.0.1:45011_solr c:testSimple1 s:shard2 r:core_node8 x:testSimple1_shard2_replica_n7] o.a.s.c.CoreContainer Creating SolrCore 'testSimple1_shard2_replica_n7' using configuration from collection testSimple1, trusted=true
   [junit4]   2> 3982326 INFO  (qtp1364517442-122885) [n:127.0.0.1:45011_solr c:testSimple1 s:shard2 r:core_node8 x:testSimple1_shard2_replica_n7] o.a.s.m.r.SolrJmxReporter JMX monitoring for 'solr.core.testSimple1.shard2.replica_n7' (registry 'solr.core.testSimple1.shard2.replica_n7') enabled at server: com.sun.jmx.mbeanserver.JmxMBeanServer@65b080f2
   [junit4]   2> 3982326 INFO  (qtp1364517442-122885) [n:127.0.0.1:45011_solr c:testSimple1 s:shard2 r:core_node8 x:testSimple1_shard2_replica_n7] o.a.s.c.HdfsDirectoryFactory solr.hdfs.home=hdfs://localhost:45877/solr_hdfs_home
   [junit4]   2> 3982326 INFO  (qtp1364517442-122885) [n:127.0.0.1:45011_solr c:testSimple1 s:shard2 r:core_node8 x:testSimple1_shard2_replica_n7] o.a.s.c.HdfsDirectoryFactory Solr Kerberos Authentication disabled
   [junit4]   2> 3982326 INFO  (qtp1364517442-122885) [n:127.0.0.1:45011_solr c:testSimple1 s:shard2 r:core_node8 x:testSimple1_shard2_replica_n7] o.a.s.c.SolrCore [[testSimple1_shard2_replica_n7] ] Opening new SolrCore at [/x1/jenkins/jenkins-slave/workspace/Lucene-Solr-NightlyTests-master/checkout/solr/build/solr-core/test/J1/temp/solr.cloud.autoscaling.HdfsAutoAddReplicasIntegrationTest_10677DD7C00EF4B3-001/tempDir-002/node1/testSimple1_shard2_replica_n7], dataDir=[hdfs://localhost:45877/solr_hdfs_home/testSimple1/core_node8/data/]
   [junit4]   2> 3982327 INFO  (qtp2090721238-122872) [n:127.0.0.1:35101_solr c:testSimple1 s:shard2 r:core_node6 x:testSimple1_shard2_replica_n5] o.a.s.s.b.BlockDirectory Block cache on write is disabled
   [junit4]   2> 3982328 INFO  (qtp2090721238-122872) [n:127.0.0.1:35101_solr c:testSimple1 s:shard2 r:core_node6 x:testSimple1_shard2_replica_n5] o.a.s.c.HdfsDirectoryFactory creating directory factory for path hdfs://localhost:45877/solr_hdfs_home/testSimple1/core_node6/data
   [junit4]   2> 3982329 INFO  (qtp1364517442-122884) [n:127.0.0.1:45011_solr c:testSimple1 s:shard1 r:core_node4 x:testSimple1_shard1_replica_n2] o.a.s.s.IndexSchema Loaded schema minimal/1.1 with uniqueid field id
   [junit4]   2> 3982329 INFO  (qtp1364517442-122885) [n:127.0.0.1:45011_solr c:testSimple1 s:shard2 r:core_node8 x:testSimple1_shard2_replica_n7] o.a.s.c.HdfsDirectoryFactory creating directory factory for path hdfs://localhost:45877/solr_hdfs_home/testSimple1/core_node8/data/snapshot_metadata
   [junit4]   2> 3982329 INFO  (qtp1364517442-122884) [n:127.0.0.1:45011_solr c:testSimple1 s:shard1 r:core_node4 x:testSimple1_shard1_replica_n2] o.a.s.c.CoreContainer Creating SolrCore 'testSimple1_shard1_replica_n2' using configuration from collection testSimple1, trusted=true
   [junit4]   2> 3982329 INFO  (qtp1364517442-122884) [n:127.0.0.1:45011_solr c:testSimple1 s:shard1 r:core_node4 x:testSimple1_shard1_replica_n2] o.a.s.m.r.SolrJmxReporter JMX monitoring for 'solr.core.testSimple1.shard1.replica_n2' (registry 'solr.core.testSimple1.shard1.replica_n2') enabled at server: com.sun.jmx.mbeanserver.JmxMBeanServer@65b080f2
   [junit4]   2> 3982329 INFO  (qtp1364517442-122884) [n:127.0.0.1:45011_solr c:testSimple1 s:shard1 r:core_node4 x:testSimple1_shard1_replica_n2] o.a.s.c.HdfsDirectoryFactory solr.hdfs.home=hdfs://localhost:45877/solr_hdfs_home
   [junit4]   2> 3982330 INFO  (qtp2090721238-122876) [n:127.0.0.1:35101_solr c:testSimple1 s:shard1 r:core_node3 x:testSimple1_shard1_replica_n1] o.a.s.s.IndexSchema Loaded schema minimal/1.1 with uniqueid field id
   [junit4]   2> 3982330 INFO  (qtp1364517442-122884) [n:127.0.0.1:45011_solr c:testSimple1 s:shard1 r:core_node4 x:testSimple1_shard1_replica_n2] o.a.s.c.HdfsDirectoryFactory Solr Kerberos Authentication disabled
   [junit4]   2> 3982330 INFO  (qtp2090721238-122876) [n:127.0.0.1:35101_solr c:testSimple1 s:shard1 r:core_node3 x:testSimple1_shard1_replica_n1] o.a.s.c.CoreContainer Creating SolrCore 'testSimple1_shard1_replica_n1' using configuration from collection testSimple1, trusted=true
   [junit4]   2> 3982330 INFO  (qtp2090721238-122876) [n:127.0.0.1:35101_solr c:testSimple1 s:shard1 r:core_node3 x:testSimple1_shard1_replica_n1] o.a.s.m.r.SolrJmxReporter JMX monitoring for 'solr.core.testSimple1.shard1.replica_n1' (registry 'solr.core.testSimple1.shard1.replica_n1') enabled at server: com.sun.jmx.mbeanserver.JmxMBeanServer@65b080f2
   [junit4]   2> 3982330 INFO  (qtp1364517442-122884) [n:127.0.0.1:45011_solr c:testSimple1 s:shard1 r:core_node4 x:testSimple1_shard1_replica_n2] o.a.s.c.SolrCore [[testSimple1_shard1_replica_n2] ] Opening new SolrCore at [/x1/jenkins/jenkins-slave/workspace/Lucene-Solr-NightlyTests-master/checkout/solr/build/solr-core/test/J1/temp/solr.cloud.autoscaling.HdfsAutoAddReplicasIntegrationTest_10677DD7C00EF4B3-001/tempDir-002/node1/testSimple1_shard1_replica_n2], dataDir=[hdfs://localhost:45877/solr_hdfs_home/testSimple1/core_node4/data/]
   [junit4]   2> 3982331 INFO  (qtp2090721238-122876) [n:127.0.0.1:35101_solr c:testSimple1 s:shard1 r:core_node3 x:testSimple1_shard1_replica_n1] o.a.s.c.HdfsDirectoryFactory solr.hdfs.home=hdfs://localhost:45877/solr_hdfs_home
   [junit4]   2> 3982331 INFO  (qtp2090721238-122876) [n:127.0.0.1:35101_solr c:testSimple1 s:shard1 r:core_node3 x:testSimple1_shard1_replica_n1] o.a.s.c.HdfsDirectoryFactory Solr Kerberos Authentication disabled
   [junit4]   2> 3982331 INFO  (qtp2090721238-122876) [n:127.0.0.1:35101_solr c:testSimple1 s:shard1 r:core_node3 x:testSimple1_shard1_replica_n1] o.a.s.c.SolrCore [[testSimple1_shard1_replica_n1] ] Opening new SolrCore at [/x1/jenkins/jenkins-slave/workspace/Lucene-Solr-NightlyTests-master/checkout/solr/build/solr-core/test/J1/temp/solr.cloud.autoscaling.HdfsAutoAddReplicasIntegrationTest_10677DD7C00EF4B3-001/tempDir-002/node2/testSimple1_shard1_replica_n1], dataDir=[hdfs://localhost:45877/solr_hdfs_home/testSimple1/core_node3/data/]
   [junit4]   2> 3982333 INFO  (qtp2090721238-122876) [n:127.0.0.1:35101_solr c:testSimple1 s:shard1 r:core_node3 x:testSimple1_shard1_replica_n1] o.a.s.c.HdfsDirectoryFactory creating directory factory for path hdfs://localhost:45877/solr_hdfs_home/testSimple1/core_node3/data/snapshot_metadata
   [junit4]   2> 3982335 INFO  (qtp1364517442-122884) [n:127.0.0.1:45011_solr c:testSimple1 s:shard1 r:core_node4 x:testSimple1_shard1_replica_n2] o.a.s.c.HdfsDirectoryFactory creating directory factory for path hdfs://localhost:45877/solr_hdfs_home/testSimple1/core_node4/data/snapshot_metadata
   [junit4]   2> 3982337 INFO  (qtp1364517442-122885) [n:127.0.0.1:45011_solr c:testSimple1 s:shard2 r:core_node8 x:testSimple1_shard2_replica_n7] o.a.s.c.HdfsDirectoryFactory Number of slabs of block cache [1] with direct memory allocation set to [true]
   [junit4]   2> 3982337 INFO  (qtp1364517442-122885) [n:127.0.0.1:45011_solr c:testSimple1 s:shard2 r:core_node8 x:testSimple1_shard2_replica_n7] o.a.s.c.HdfsDirectoryFactory Block cache target memory usage, slab size of [4194304] will allocate [1] slabs and use ~[4194304] bytes
   [junit4]   2> 3982337 INFO  (qtp1364517442-122885) [n:127.0.0.1:45011_solr c:testSimple1 s:shard2 r:core_node8 x:testSimple1_shard2_replica_n7] o.a.s.c.HdfsDirectoryFactory Creating new single instance HDFS BlockCache
   [junit4]   2> 3982347 INFO  (qtp2090721238-122876) [n:127.0.0.1:35101_solr c:testSimple1 s:shard1 r:core_node3 x:testSimple1_shard1_replica_n1] o.a.s.c.HdfsDirectoryFactory Number of slabs of block cache [1] with direct memory allocation set to [true]
   [junit4]   2> 3982347 INFO  (qtp2090721238-122876) [n:127.0.0.1:35101_solr c:testSimple1 s:shard1 r:core_node3 x:testSimple1_shard1_replica_n1] o.a.s.c.HdfsDirectoryFactory Block cache target memory usage, slab size of [4194304] will allocate [1] slabs and use ~[4194304] bytes
   [junit4]   2> 3982347 INFO  (qtp2090721238-122876) [n:127.0.0.1:35101_solr c:testSimple1 s:shard1 r:core_node3 x:testSimple1_shard1_replica_n1] o.a.s.c.HdfsDirectoryFactory Creating new single instance HDFS BlockCache
   [junit4]   2> 3982347 INFO  (qtp1364517442-122885) [n:127.0.0.1:45011_solr c:testSimple1 s:shard2 r:core_node8 x:testSimple1_shard2_replica_n7] o.a.s.s.b.BlockDirectory Block cache on write is disabled
   [junit4]   2> 3982348 INFO  (qtp1364517442-122885) [n:127.0.0.1:45011_solr c:testSimple1 s:shard2 r:core_node8 x:testSimple1_shard2_replica_n7] o.a.s.c.HdfsDirectoryFactory creating directory factory for path hdfs://localhost:45877/solr_hdfs_home/testSimple1/core_node8/data
   [junit4]   2> 3982349 INFO  (qtp1364517442-122884) [n:127.0.0.1:45011_solr c:testSimple1 s:shard1 r:core_node4 x:testSimple1_shard1_replica_n2] o.a.s.c.HdfsDirectoryFactory Number of slabs of block cache [1] with direct memory allocation set to [true]
   [junit4]   2> 3982349 INFO  (qtp1364517442-122884) [n:127.0.0.1:45011_solr c:testSimple1 s:shard1 r:core_node4 x:testSimple1_shard1_replica_n2] o.a.s.c.HdfsDirectoryFactory Block cache target memory usage, slab size of [4194304] will allocate [1] slabs and use ~[4194304] bytes
   [junit4]   2> 3982349 INFO  (qtp1364517442-122884) [n:127.0.0.1:45011_solr c:testSimple1 s:shard1 r:core_node4 x:testSimple1_shard1_replica_n2] o.a.s.c.HdfsDirectoryFactory Creating new single instance HDFS BlockCache
   [junit4]   2> 3982359 INFO  (qtp1364517442-122884) [n:127.0.0.1:45011_solr c:testSimple1 s:shard1 r:core_node4 x:testSimple1_shard1_replica_n2] o.a.s.s.b.BlockDirectory Block cache on write is disabled
   [junit4]   2> 3982360 INFO  (qtp1364517442-122884) [n:127.0.0.1:45011_solr c:testSimple1 s:shard1 r:core_node4 x:testSimple1_shard1_replica_n2] o.a.s.c.HdfsDirectoryFactory creating directory factory for path hdfs://localhost:45877/solr_hdfs_home/testSimple1/core_node4/data
   [junit4]   2> 3982365 INFO  (qtp2090721238-122876) [n:127.0.0.1:35101_solr c:testSimple1 s:shard1 r:core_node3 x:testSimple1_shard1_replica_n1] o.a.s.s.b.BlockDirectory Block cache on write is disabled
   [junit4]   2> 3982370 INFO  (qtp2090721238-122876) [n:127.0.0.1:35101_solr c:testSimple1 s:shard1 r:core_node3 x:testSimple1_shard1_replica_n1] o.a.s.c.HdfsDirectoryFactory creating directory factory for path hdfs://localhost:45877/solr_hdfs_home/testSimple1/core_node3/data
   [junit4]   2> 3982371 INFO  (qtp1364517442-122885) [n:127.0.0.1:45011_solr c:testSimple1 s:shard2 r:core_node8 x:testSimple1_shard2_replica_n7] o.a.s.c.HdfsDirectoryFactory creating directory factory for path hdfs://localhost:45877/solr_hdfs_home/testSimple1/core_node8/data/index
   [junit4]   2> 3982376 INFO  (qtp2090721238-122872) [n:127.0.0.1:35101_solr c:testSimple1 s:shard2 r:core_node6 x:testSimple1_shard2_replica_n5] o.a.s.c.HdfsDirectoryFactory creating directory factory for path hdfs://localhost:45877/solr_hdfs_home/testSimple1/core_node6/data/index
   [junit4]   2> 3982381 INFO  (qtp1364517442-122885) [n:127.0.0.1:45011_solr c:testSimple1 s:shard2 r:core_node8 x:testSimple1_shard2_replica_n7] o.a.s.c.HdfsDirectoryFactory Number of slabs of block cache [1] with direct memory allocation set to [true]
   [junit4]   2> 3982381 INFO  (qtp1364517442-122885) [n:127.0.0.1:45011_solr c:testSimple1 s:shard2 r:core_node8 x:testSimple1_shard2_replica_n7] o.a.s.c.HdfsDirectoryFactory Block cache target memory usage, slab size of [4194304] will allocate [1] slabs and use ~[4194304] bytes
   [junit4]   2> 3982381 INFO  (qtp1364517442-122885) [n:127.0.0.1:45011_solr c:testSimple1 s:shard2 r:core_node8 x:testSimple1_shard2_replica_n7] o.a.s.c.HdfsDirectoryFactory Creating new single instance HDFS BlockCache
   [junit4]   2> 3982386 INFO  (qtp1364517442-122885) [n:127.0.0.1:45011_solr c:testSimple1 s:shard2 r:core_node8 x:testSimple1_shard2_replica_n7] o.a.s.s.b.BlockDirectory Block cache on write is disabled
   [junit4]   2> 3982387 INFO  (qtp2090721238-122872) [n:127.0.0.1:35101_solr c:testSimple1 s:shard2 r:core_node6 x:testSimple1_shard2_replica_n5] o.a.s.c.HdfsDirectoryFactory Number of slabs of block cache [1] with direct memory allocation set to [true]
   [junit4]   2> 3982387 INFO  (qtp2090721238-122872) [n:127.0.0.1:35101_solr c:testSimple1 s:shard2 r:core_node6 x:testSimple1_shard2_replica_n5] o.a.s.c.HdfsDirectoryFactory Block cache target memory usage, slab size of [4194304] will allocate [1] slabs and use ~[4194304] bytes
   [junit4]   2> 3982387 INFO  (qtp2090721238-122872) [n:127.0.0.1:35101_solr c:testSimple1 s:shard2 r:core_node6 x:testSimple1_shard2_replica_n5] o.a.s.c.HdfsDirectoryFactory Creating new single instance HDFS BlockCache
   [junit4]   2> 3982391 INFO  (qtp1364517442-122884) [n:127.0.0.1:45011_solr c:testSimple1 s:shard1 r:core_node4 x:testSimple1_shard1_replica_n2] o.a.s.c.HdfsDirectoryFactory creating directory factory for path hdfs://localhost:45877/solr_hdfs_home/testSimple1/core_node4/data/index
   [junit4]   2> 3982393 INFO  (qtp2090721238-122876) [n:127.0.0.1:35101_solr c:testSimple1 s:shard1 r:core_node3 x:testSimple1_shard1_replica_n1] o.a.s.c.HdfsDirectoryFactory creating directory factory for path hdfs://localhost:45877/solr_hdfs_home/testSimple1/core_node3/data/index
   [junit4]   2> 3982401 INFO  (qtp1364517442-122884) [n:127.0.0.1:45011_solr c:testSimple1 s:shard1 r:core_node4 x:testSimple1_shard1_replica_n2] o.a.s.c.HdfsDirectoryFactory Number of slabs of block cache [1] with direct memory allocation set to [true]
   [junit4]   2> 3982401 INFO  (qtp1364517442-122884) [n:127.0.0.1:45011_solr c:testSimple1 s:shard1 r:core_node4 x:testSimple1_shard1_replica_n2] o.a.s.c.HdfsDirectoryFactory Block cache target memory usage, slab size of [4194304] will allocate [1] slabs and use ~[4194304] bytes
   [junit4]   2> 3982401 INFO  (qtp1364517442-122884) [n:127.0.0.1:45011_solr c:testSimple1 s:shard1 r:core_node4 x:testSimple1_shard1_replica_n2] o.a.s.c.HdfsDirectoryFactory Creating new single instance HDFS BlockCache
   [junit4]   2> 3982401 INFO  (qtp2090721238-122876) [n:127.0.0.1:35101_solr c:testSimple1 s:shard1 r:core_node3 x:testSimple1_shard1_replica_n1] o.a.s.c.HdfsDirectoryFactory Number of slabs of block cache [1] with direct memory allocation set to [true]
   [junit4]   2> 3982401 INFO  (qtp2090721238-122876) [n:127.0.0.1:35101_solr c:testSimple1 s:shard1 r:core_node3 x:testSimple1_shard1_replica_n1] o.a.s.c.HdfsDirectoryFactory Block cache target memory usage, slab size of [4194304] will allocate [1] slabs and use ~[4194304] bytes
   [junit4]   2> 3982401 INFO  (qtp2090721238-122876) [n:127.0.0.1:35101_solr c:testSimple1 s:shard1 r:core_node3 x:testSimple1_shard1_replica_n1] o.a.s.c.HdfsDirectoryFactory Creating new single instance HDFS BlockCache
   [junit4]   2> 3982402 INFO  (qtp2090721238-122872) [n:127.0.0.1:35101_solr c:testSimple1 s:shard2 r:core_node6 x:testSimple1_shard2_replica_n5] o.a.s.s.b.BlockDirectory Block cache on write is disabled
   [junit4]   2> 3982407 INFO  (qtp1364517442-122884) [n:127.0.0.1:45011_solr c:testSimple1 s:shard1 r:core_node4 x:testSimple1_shard1_replica_n2] o.a.s.s.b.BlockDirectory Block cache on write is disabled
   [junit4]   2> 3982414 INFO  (qtp2090721238-122876) [n:127.0.0.1:35101_solr c:testSimple1 s:shard1 r:core_node3 x:testSimple1_shard1_replica_n1] o.a.s.s.b.BlockDirectory Block cache on write is disabled
   [junit4]   2> 3982539 INFO  (qtp2090721238-122872) [n:127.0.0.1:35101_solr c:testSimple1 s:shard2 r:core_node6 x:testSimple1_shard2_replica_n5] o.a.s.u.UpdateHandler Using UpdateLog implementation: org.apache.solr.update.HdfsUpdateLog
   [junit4]   2> 3982539 INFO  (qtp2090721238-122872) [n:127.0.0.1:35101_solr c:testSimple1 s:shard2 r:core_node6 x:testSimple1_shard2_replica_n5] o.a.s.u.UpdateLog Initializing UpdateLog: dataDir=null defaultSyncLevel=FLUSH numRecordsToKeep=100 maxNumLogsToKeep=10 numVersionBuckets=65536
   [junit4]   2> 3982539 INFO  (qtp2090721238-122872) [n:127.0.0.1:35101_solr c:testSimple1 s:shard2 r:core_node6 x:testSimple1_shard2_replica_n5] o.a.s.u.HdfsUpdateLog Initializing HdfsUpdateLog: tlogDfsReplication=3
   [junit4]   2> 3982552 INFO  (qtp2090721238-122872) [n:127.0.0.1:35101_solr c:testSimple1 s:shard2 r:core_node6 x:testSimple1_shard2_replica_n5] o.a.s.u.CommitTracker Hard AutoCommit: disabled
   [junit4]   2> 3982552 INFO  (qtp2090721238-122872) [n:127.0.0.1:35101_solr c:testSimple1 s:shard2 r:core_node6 x:testSimple1_shard2_replica_n5] o.a.s.u.CommitTracker Soft AutoCommit: disabled
   [junit4]   2> 3982555 INFO  (qtp1364517442-122885) [n:127.0.0.1:45011_solr c:testSimple1 s:shard2 r:core_node8 x:testSimple1_shard2_replica_n7] o.a.s.u.UpdateHandler Using UpdateLog implementation: org.apache.solr.update.HdfsUpdateLog
   [junit4]   2> 3982555 INFO  (qtp1364517442-122885) [n:127.0.0.1:45011_solr c:testSimple1 s:shard2 r:core_node8 x:testSimple1_shard2_replica_n7] o.a.s.u.UpdateLog Initializing UpdateLog: dataDir=null defaultSyncLevel=FLUSH numRecordsToKeep=100 maxNumLogsToKeep=10 numVersionBuckets=65536
   [junit4]   2> 3982556 INFO  (qtp1364517442-122885) [n:127.0.0.1:45011_solr c:testSimple1 s:shard2 r:core_node8 x:testSimple1_shard2_replica_n7] o.a.s.u.HdfsUpdateLog Initializing HdfsUpdateLog: tlogDfsReplication=3
   [junit4]   2> 3982556 INFO  (qtp1364517442-122884) [n:127.0.0.1:45011_solr c:testSimple1 s:shard1 r:core_node4 x:testSimple1_shard1_replica_n2] o.a.s.u.UpdateHandler Using UpdateLog implementation: org.apache.solr.update.HdfsUpdateLog
   [junit4]   2> 3982556 INFO  (qtp1364517442-122884) [n:127.0.0.1:45011_solr c:testSimple1 s:shard1 r:core_node4 x:testSimple1_shard1_replica_n2] o.a.s.u.UpdateLog Initializing UpdateLog: dataDir=null defaultSyncLevel=FLUSH numRecordsToKeep=100 maxNumLogsToKeep=10 numVersionBuckets=65536
   [junit4]   2> 3982556 INFO  (qtp1364517442-122884) [n:127.0.0.1:45011_solr c:testSimple1 s:shard1 r:core_node4 x:testSimple1_shard1_replica_n2] o.a.s.u.HdfsUpdateLog Initializing HdfsUpdateLog: tlogDfsReplication=3
   [junit4]   2> 3982570 INFO  (qtp1364517442-122885) [n:127.0.0.1:45011_solr c:testSimple1 s:shard2 r:core_node8 x:testSimple1_shard2_replica_n7] o.a.s.u.CommitTracker Hard AutoCommit: disabled
   [junit4]   2> 3982570 INFO  (qtp1364517442-122885) [n:127.0.0.1:45011_solr c:testSimple1 s:shard2 r:core_node8 x:testSimple1_shard2_replica_n7] o.a.s.u.CommitTracker Soft AutoCommit: disabled
   [junit4]   2> 3982573 INFO  (qtp1364517442-122884) [n:127.0.0.1:45011_solr c:testSimple1 s:shard1 r:core_node4 x:testSimple1_shard1_replica_n2] o.a.s.u.CommitTracker Hard AutoCommit: disabled
   [junit4]   2> 3982593 INFO  (qtp1364517442-122884) [n:127.0.0.1:45011_solr c:testSimple1 s:shard1 r:core_node4 x:testSimple1_shard1_replica_n2] o.a.s.u.CommitTracker Soft AutoCommit: disabled
   [junit4]   2> 3982596 INFO  (qtp2090721238-122876) [n:127.0.0.1:35101_solr c:testSimple1 s:shard1 r:core_node3 x:testSimple1_shard1_replica_n1] o.a.s.u.UpdateHandler Using UpdateLog implementation: org.apache.solr.update.HdfsUpdateLog
   [junit4]   2> 3982596 INFO  (qtp2090721238-122876) [n:127.0.0.1:35101_solr c:testSimple1 s:shard1 r:core_node3 x:testSimple1_shard1_replica_n1] o.a.s.u.UpdateLog Initializing UpdateLog: dataDir=null defaultSyncLevel=FLUSH numRecordsToKeep=100 maxNumLogsToKeep=10 numVersionBuckets=65536
   [junit4]   2> 3982596 INFO  (qtp2090721238-122876) [n:127.0.0.1:35101_solr c:testSimple1 s:shard1 r:core_node3 x:testSimple1_shard1_replica_n1] o.a.s.u.HdfsUpdateLog Initializing HdfsUpdateLog: tlogDfsReplication=3
   [junit4]   2> 3982600 INFO  (qtp2090721238-122872) [n:127.0.0.1:35101_solr c:testSimple1 s:shard2 r:core_node6 x:testSimple1_shard2_replica_n5] o.a.s.s.SolrIndexSearcher Opening [Searcher@5aaaed51[testSimple1_shard2_replica_n5] main]
   [junit4]   2> 3982603 INFO  (qtp2090721238-122872) [n:127.0.0.1:35101_solr c:testSimple1 s:shard2 r:core_node6 x:testSimple1_shard2_replica_n5] o.a.s.r.ManagedResourceStorage Configured ZooKeeperStorageIO with znodeBase: /configs/conf
   [junit4]   2> 3982603 INFO  (qtp2090721238-122872) [n:127.0.0.1:35101_solr c:testSimple1 s:shard2 r:core_node6 x:testSimple1_shard2_replica_n5] o.a.s.r.ManagedResourceStorage Loaded null at path _rest_managed.json using ZooKeeperStorageIO:path=/configs/conf
   [junit4]   2> 3982604 INFO  (qtp2090721238-122872) [n:127.0.0.1:35101_solr c:testSimple1 s:shard2 r:core_node6 x:testSimple1_shard2_replica_n5] o.a.s.h.ReplicationHandler Commits will be reserved for 10000ms.
   [junit4]   2> 3982605 INFO  (qtp2090721238-122872) [n:127.0.0.1:35101_solr c:testSimple1 s:shard2 r:core_node6 x:testSimple1_shard2_replica_n5] o.a.s.u.UpdateLog Could not find max version in index or recent updates, using new clock 1635146085399789568
   [junit4]   2> 3982612 INFO  (searcherExecutor-14957-thread-1-processing-n:127.0.0.1:35101_solr x:testSimple1_shard2_replica_n5 c:testSimple1 s:shard2 r:core_node6) [n:127.0.0.1:35101_solr c:testSimple1 s:shard2 r:core_node6 x:testSimple1_shard2_replica_n5] o.a.s.c.SolrCore [testSimple1_shard2_replica_n5] Registered new searcher Searcher@5aaaed51[testSimple1_shard2_replica_n5] main{ExitableDirectoryReader(UninvertingDirectoryReader())}
   [junit4]   2> 3982613 INFO  (qtp1364517442-122885) [n:127.0.0.1:45011_solr c:testSimple1 s:shard2 r:core_node8 x:testSimple1_shard2_replica_n7] o.a.s.s.SolrIndexSearcher Opening [Searcher@4fc36120[testSimple1_shard2_replica_n7] main]
   [junit4]   2> 3982615 INFO  (qtp1364517442-122885) [n:127.0.0.1:45011_solr c:testSimple1 s:shard2 r:core_node8 x:testSimple1_shard2_replica_n7] o.a.s.r.ManagedResourceStorage Configured ZooKeeperStorageIO with znodeBase: /configs/conf
   [junit4]   2> 3982615 INFO  (qtp1364517442-122885) [n:127.0.0.1:45011_solr c:testSimple1 s:shard2 r:core_node8 x:testSimple1_shard2_replica_n7] o.a.s.r.ManagedResourceStorage Loaded null at path _rest_managed.json using ZooKeeperStorageIO:path=/configs/conf
   [junit4]   2> 3982616 INFO  (qtp1364517442-122885) [n:127.0.0.1:45011_solr c:testSimple1 s:shard2 r:core_node8 x:testSimple1_shard2_replica_n7] o.a.s.h.ReplicationHandler Commits will be reserved for 10000ms.
   [junit4]   2> 3982616 INFO  (qtp1364517442-122885) [n:127.0.0.1:45011_solr c:testSimple1 s:shard2 r:core_node8 x:testSimple1_shard2_replica_n7] o.a.s.u.UpdateLog Could not find max version in index or recent updates, using new clock 1635146085411323904
   [junit4]   2> 3982616 INFO  (qtp1364517442-122884) [n:127.0.0.1:45011_solr c:testSimple1 s:shard1 r:core_node4 x:testSimple1_shard1_replica_n2] o.a.s.s.SolrIndexSearcher Opening [Searcher@4f106e3c[testSimple1_shard1_replica_n2] main]
   [junit4]   2> 3982617 INFO  (qtp2090721238-122872) [n:127.0.0.1:35101_solr c:testSimple1 s:shard2 r:core_node6 x:testSimple1_shard2_replica_n5] o.a.s.c.ZkShardTerms Successful update of terms at /collections/testSimple1/terms/shard2 to Terms{values={core_node6=0}, version=0}
   [junit4]   2> 3982617 INFO  (qtp2090721238-122872) [n:127.0.0.1:35101_solr c:testSimple1 s:shard2 r:core_node6 x:testSimple1_shard2_replica_n5] o.a.s.c.ShardLeaderElectionContextBase make sure parent is created /collections/testSimple1/leaders/shard2
   [junit4]   2> 3982618 INFO  (qtp1364517442-122884) [n:127.0.0.1:45011_solr c:testSimple1 s:shard1 r:core_node4 x:testSimple1_shard1_replica_n2] o.a.s.r.ManagedResourceStorage Configured ZooKeeperStorageIO with znodeBase: /configs/conf
   [junit4]   2> 3982619 INFO  (qtp1364517442-122884) [n:127.0.0.1:45011_solr c:testSimple1 s:shard1 r:core_node4 x:testSimple1_shard1_replica_n2] o.a.s.r.ManagedResourceStorage Loaded null at path _rest_managed.json using ZooKeeperStorageIO:path=/configs/conf
   [junit4]   2> 3982619 INFO  (qtp2090721238-122876) [n:127.0.0.1:35101_solr c:testSimple1 s:shard1 r:core_node3 x:testSimple1_shard1_replica_n1] o.a.s.u.CommitTracker Hard AutoCommit: disabled
   [junit4]   2> 3982619 INFO  (qtp2090721238-122876) [n:127.0.0.1:35101_solr c:testSimple1 s:shard1 r:core_node3 x:testSimple1_shard1_replica_n1] o.a.s.u.CommitTracker Soft AutoCommit: disabled
   [junit4]   2> 3982620 INFO  (qtp1364517442-122884) [n:127.0.0.1:45011_solr c:testSimple1 s:shard1 r:core_node4 x:testSimple1_shard1_replica_n2] o.a.s.h.ReplicationHandler Commits will be reserved for 10000ms.
   [junit4]   2> 3982620 INFO  (qtp1364517442-122884) [n:127.0.0.1:45011_solr c:testSimple1 s:shard1 r:core_node4 x:testSimple1_shard1_replica_n2] o.a.s.u.UpdateLog Could not find max version in index or recent updates, using new clock 1635146085415518208
   [junit4]   2> 3982620 INFO  (searcherExecutor-14958-thread-1-processing-n:127.0.0.1:45011_solr x:testSimple1_shard2_replica_n7 c:testSimple1 s:shard2 r:core_node8) [n:127.0.0.1:45011_solr c:testSimple1 s:shard2 r:core_node8 x:testSimple1_shard2_replica_n7] o.a.s.c.SolrCore [testSimple1_shard2_replica_n7] Registered new searcher Searcher@4fc36120[testSimple1_shard2_replica_n7] main{ExitableDirectoryReader(UninvertingDirectoryReader())}
   [junit4]   2> 3982624 INFO  (searcherExecutor-14959-thread-1-processing-n:127.0.0.1:45011_solr x:testSimple1_shard1_replica_n2 c:testSimple1 s:shard1 r:core_node4) [n:127.0.0.1:45011_solr c:testSimple1 s:shard1 r:core_node4 x:testSimple1_shard1_replica_n2] o.a.s.c.SolrCore [testSimple1_shard1_replica_n2] Registered new searcher Searcher@4f106e3c[testSimple1_shard1_replica_n2] main{ExitableDirectoryReader(UninvertingDirectoryReader())}
   [junit4]   2> 3982625 INFO  (qtp1364517442-122885) [n:127.0.0.1:45011_solr c:testSimple1 s:shard2 r:core_node8 x:testSimple1_shard2_replica_n7] o.a.s.c.ZkShardTerms Successful update of terms at /collections/testSimple1/terms/shard2 to Terms{values={core_node6=0, core_node8=0}, version=1}
   [junit4]   2> 3982626 INFO  (qtp1364517442-122885) [n:127.0.0.1:45011_solr c:testSimple1 s:shard2 r:core_node8 x:testSimple1_shard2_replica_n7] o.a.s.c.ShardLeaderElectionContextBase make sure parent is created /collections/testSimple1/leaders/shard2
   [junit4]   2> 3982630 INFO  (qtp2090721238-122876) [n:127.0.0.1:35101_solr c:testSimple1 s:shard1 r:core_node3 x:testSimple1_shard1_replica_n1] o.a.s.s.SolrIndexSearcher Opening [Searcher@667364eb[testSimple1_shard1_replica_n1] main]
   [junit4]   2> 3982631 INFO  (qtp1364517442-122885) [n:127.0.0.1:45011_solr c:testSimple1 s:shard2 r:core_node8 x:testSimple1_shard2_replica_n7] o.a.s.c.ShardLeaderElectionContext Enough replicas found to continue.
   [junit4]   2> 3982631 INFO  (qtp1364517442-122885) [n:127.0.0.1:45011_solr c:testSimple1 s:shard2 r:core_node8 x:testSimple1_shard2_replica_n7] o.a.s.c.ShardLeaderElectionContext I may be the new leader - try and sync
   [junit4]   2> 3982631 INFO  (qtp1364517442-122885) [n:127.0.0.1:45011_solr c:testSimple1 s:shard2 r:core_node8 x:testSimple1_shard2_replica_n7] o.a.s.c.SyncStrategy Sync replicas to http://127.0.0.1:45011/solr/testSimple1_shard2_replica_n7/
   [junit4]   2> 3982631 INFO  (qtp1364517442-122884) [n:127.0.0.1:45011_solr c:testSimple1 s:shard1 r:core_node4 x:testSimple1_shard1_replica_n2] o.a.s.c.ZkShardTerms Successful update of terms at /collections/testSimple1/terms/shard1 to Terms{values={core_node4=0}, version=0}
   [junit4]   2> 3982631 INFO  (qtp1364517442-122884) [n:127.0.0.1:45011_solr c:testSimple1 s:shard1 r:core_node4 x:testSimple1_shard1_replica_n2] o.a.s.c.ShardLeaderElectionContextBase make sure parent is created /collections/testSimple1/leaders/shard1
   [junit4]   2> 3982632 INFO  (qtp2090721238-122876) [n:127.0.0.1:35101_solr c:testSimple1 s:shard1 r:core_node3 x:testSimple1_shard1_replica_n1] o.a.s.r.ManagedResourceStorage Configured ZooKeeperStorageIO with znodeBase: /configs/conf
   [junit4]   2> 3982632 INFO  (qtp1364517442-122885) [n:127.0.0.1:45011_solr c:testSimple1 s:shard2 r:core_node8 x:testSimple1_shard2_replica_n7] o.a.s.u.PeerSync PeerSync: core=testSimple1_shard2_replica_n7 url=http://127.0.0.1:45011/solr START replicas=[http://127.0.0.1:35101/solr/testSimple1_shard2_replica_n5/] nUpdates=100
   [junit4]   2> 3982632 INFO  (qtp1364517442-122885) [n:127.0.0.1:45011_solr c:testSimple1 s:shard2 r:core_node8 x:testSimple1_shard2_replica_n7] o.a.s.u.PeerSync PeerSync: core=testSimple1_shard2_replica_n7 url=http://127.0.0.1:45011/solr DONE.  We have no versions.  sync failed.
   [junit4]   2> 3982633 INFO  (qtp2090721238-122876) [n:127.0.0.1:35101_solr c:testSimple1 s:shard1 r:core_node3 x:testSimple1_shard1_replica_n1] o.a.s.r.ManagedResourceStorage Loaded null at path _rest_managed.json using ZooKeeperStorageIO:path=/configs/conf
   [junit4]   2> 3982633 INFO  (qtp2090721238-122876) [n:127.0.0.1:35101_solr c:testSimple1 s:shard1 r:core_node3 x:testSimple1_shard1_replica_n1] o.a.s.h.ReplicationHandler Commits will be reserved for 10000ms.
   [junit4]   2> 3982634 INFO  (qtp2090721238-122876) [n:127.0.0.1:35101_solr c:testSimple1 s:shard1 r:core_node3 x:testSimple1_shard1_replica_n1] o.a.s.u.UpdateLog Could not find max version in index or recent updates, using new clock 1635146085430198272
   [junit4]   2> 3982634 INFO  (qtp2090721238-122875) [n:127.0.0.1:35101_solr c:testSimple1 s:shard2 r:core_node6 x:testSimple1_shard2_replica_n5] o.a.s.c.S.Request [testSimple1_shard2_replica_n5]  webapp=/solr path=/get params={distrib=false&qt=/get&fingerprint=false&getVersions=100&wt=javabin&version=2} status=0 QTime=0
   [junit4]   2> 3982634 INFO  (qtp1364517442-122885) [n:127.0.0.1:45011_solr c:testSimple1 s:shard2 r:core_node8 x:testSimple1_shard2_replica_n7] o.a.s.c.SyncStrategy Leader's attempt to sync with shard failed, moving to the next candidate
   [junit4]   2> 3982634 INFO  (qtp1364517442-122885) [n:127.0.0.1:45011_solr c:testSimple1 s:shard2 r:core_node8 x:testSimple1_shard2_replica_n7] o.a.s.c.ShardLeaderElectionContext We failed sync, but we have no versions - we can't sync in that case - we were active before, so become leader anyway
   [junit4]   2> 3982634 INFO  (qtp1364517442-122885) [n:127.0.0.1:45011_solr c:testSimple1 s:shard2 r:core_node8 x:testSimple1_shard2_replica_n7] o.a.s.c.ShardLeaderElectionContextBase Creating leader registration node /collections/testSimple1/leaders/shard2/leader after winning as /collections/testSimple1/leader_elect/shard2/election/73403151157035017-core_node8-n_0000000000
   [junit4]   2> 3982637 INFO  (qtp1364517442-122885) [n:127.0.0.1:45011_solr c:testSimple1 s:shard2 r:core_node8 x:testSimple1_shard2_replica_n7] o.a.s.c.ShardLeaderElectionContext I am the new leader: http://127.0.0.1:45011/solr/testSimple1_shard2_replica_n7/ shard2
   [junit4]   2> 3982640 INFO  (searcherExecutor-14960-thread-1-processing-n:127.0.0.1:35101_solr x:testSimple1_shard1_replica_n1 c:testSimple1 s:shard1 r:core_node3) [n:127.0.0.1:35101_solr c:testSimple1 s:shard1 r:core_node3 x:testSimple1_shard1_replica_n1] o.a.s.c.SolrCore [testSimple1_shard1_replica_n1] Registered new searcher Searcher@667364eb[testSimple1_shard1_replica_n1] main{ExitableDirectoryReader(UninvertingDirectoryReader())}
   [junit4]   2> 3982642 INFO  (qtp1364517442-122884) [n:127.0.0.1:45011_solr c:testSimple1 s:shard1 r:core_node4 x:testSimple1_shard1_replica_n2] o.a.s.c.ShardLeaderElectionContext Waiting until we see more replicas up for shard shard1: total=2 found=1 timeoutin=14999ms
   [junit4]   2> 3982645 INFO  (qtp2090721238-122876) [n:127.0.0.1:35101_solr c:testSimple1 s:shard1 r:core_node3 x:testSimple1_shard1_replica_n1] o.a.s.c.ZkShardTerms Successful update of terms at /collections/testSimple1/terms/shard1 to Terms{values={core_node3=0, core_node4=0}, version=1}
   [junit4]   2> 3982645 INFO  (qtp2090721238-122876) [n:127.0.0.1:35101_solr c:testSimple1 s:shard1 r:core_node3 x:testSimple1_shard1_replica_n1] o.a.s.c.ShardLeaderElectionContextBase make sure parent is created /collections/testSimple1/leaders/shard1
   [junit4]   2> 3982744 INFO  (zkCallback-18269-thread-1) [    ] o.a.s.c.c.ZkStateReader A cluster state change: [WatchedEvent state:SyncConnected type:NodeDataChanged path:/collections/testSimple1/state.json] for collection [testSimple1] has occurred - updating... (live nodes size: [3])
   [junit4]   2> 3982744 INFO  (zkCallback-18269-thread-2) [    ] o.a.s.c.c.ZkStateReader A cluster state change: [WatchedEvent state:SyncConnected type:NodeDataChanged path:/collections/testSimple1/state.json] for collection [testSimple1] has occurred - updating... (live nodes size: [3])
   [junit4]   2> 3982744 INFO  (zkCallback-18269-thread-3) [    ] o.a.s.c.c.ZkStateReader A cluster state change: [WatchedEvent state:SyncConnected type:NodeDataChanged path:/collections/testSimple1/state.json] for collection [testSimple1] has occurred - updating... (live nodes size: [3])
   [junit4]   2> 3982745 INFO  (qtp1364517442-122885) [n:127.0.0.1:45011_solr c:testSimple1 s:shard2 r:core_node8 x:testSimple1_shard2_replica_n7] o.a.s.c.ZkController I am the leader, no recovery necessary
   [junit4]   2> 3982747 INFO  (qtp1364517442-122885) [n:127.0.0.1:45011_solr c:testSimple1 s:shard2 r:core_node8 x:testSimple1_shard2_replica_n7] o.a.s.s.HttpSolrCall [admin] webapp=null path=/admin/cores params={qt=/admin/cores&coreNodeName=core_node8&collection.configName=conf&newCollection=true&name=testSimple1_shard2_replica_n7&action=CREATE&numShards=2&collection=testSimple1&shard=shard2&wt=javabin&version=2&replicaType=NRT} status=0 QTime=1488
   [junit4]   2> 3982848 INFO  (zkCallback-18269-thread-2) [    ] o.a.s.c.c.ZkStateReader A cluster state change: [WatchedEvent state:SyncConnected type:NodeDataChanged path:/collections/testSimple1/state.json] for collection [testSimple1] has occurred - updating... (live nodes size: [3])
   [junit4]   2> 3982848 INFO  (zkCallback-18269-thread-1) [    ] o.a.s.c.c.ZkStateReader A cluster state change: [WatchedEvent state:SyncConnected type:NodeDataChanged path:/collections/testSimple1/state.json] for collection [testSimple1] has occurred - updating... (live nodes size: [3])
   [junit4]   2> 3982848 INFO  (zkCallback-18269-thread-3) [    ] o.a.s.c.c.ZkStateReader A cluster state change: [WatchedEvent state:SyncConnected type:NodeDataChanged path:/collections/testSimple1/state.json] for collection [testSimple1] has occurred - updating... (live nodes size: [3])
   [junit4]   2> 3982848 INFO  (zkCallback-18269-thread-4) [    ] o.a.s.c.c.ZkStateReader A cluster state change: [WatchedEvent state:SyncConnected type:NodeDataChanged path:/collections/testSimple1/state.json] for collection [testSimple1] has occurred - updating... (live nodes size: [3])
   [junit4]   2> 3983143 INFO  (qtp1364517442-122884) [n:127.0.0.1:45011_solr c:testSimple1 s:shard1 r:core_node4 x:testSimple1_shard1_replica_n2] o.a.s.c.ShardLeaderElectionContext Enough replicas found to continue.
   [junit4]   2> 3983143 INFO  (qtp1364517442-122884) [n:127.0.0.1:45011_solr c:testSimple1 s:shard1 r:core_node4 x:testSimple1_shard1_replica_n2] o.a.s.c.ShardLeaderElectionContext I may be the new leader - try and sync
   [junit4]   2> 3983143 INFO  (qtp1364517442-122884) [n:127.0.0.1:45011_solr c:testSimple1 s:shard1 r:core_node4 x:testSimple1_shard1_replica_n2] o.a.s.c.SyncStrategy Sync replicas to http://127.0.0.1:45011/solr/testSimple1_shard1_replica_n2/
   [junit4]   2> 3983144 INFO  (qtp1364517442-122884) [n:127.0.0.1:45011_solr c:testSimple1 s:shard1 r:c

[...truncated too long message...]

ieldsOptimizer, DaemonStreamApiTest, TestSimClusterStateProvider, StatelessScriptUpdateProcessorFactoryTest, TestLMJelinekMercerSimilarityFactory, TestBulkSchemaConcurrent, TestPivotHelperCode, CdcrBootstrapTest, HdfsSyncSliceTest, HdfsChaosMonkeyNothingIsSafeTest, CreateRoutedAliasTest, TestNumericTokenStream, TestMultiWordSynonyms, TestSimGenericDistributedQueue, TestSQLHandlerNonCloud, TestSolrIndexConfig, TestFacetMethods, TestAuthorizationFramework, OverseerModifyCollectionTest, MultiThreadedOCPTest, TestPerFieldSimilarity, TestFuzzyAnalyzedSuggestions, HdfsCollectionsAPIDistributedZkTest, TestUtils, ScheduledTriggerTest, CircularListTest, TestJsonFacets, TestImplicitCoreProperties, TestFieldResource, RAMDirectoryFactoryTest, TestCollectionAPI, TestHashQParserPlugin, SolrJmxReporterCloudTest, JavabinLoaderTest, TestConfig, DirectSolrConnectionTest, SchemaApiFailureTest, TestLuceneMatchVersion, ImplicitSnitchTest, NodeLostTriggerIntegrationTest, CoreAdminOperationTest, TestComplexPhraseQParserPlugin, SignificantTermsQParserPluginTest, ScriptEngineTest, IgnoreLargeDocumentProcessorFactoryTest, MoreLikeThisComponentTest, SuggesterFSTTest, TestSubQueryTransformerDistrib, TestSolrCLIRunExample, TlogReplayBufferedWhileIndexingTest, TestQueryTypes, SparseHLLTest, OutOfBoxZkACLAndCredentialsProvidersTest, OrderedExecutorTest, TestStressRecovery, TestIndexingPerformance, TestUnifiedSolrHighlighter, TokenizerChainTest, TestDistributedMap, BasicDistributedZkTest, XmlInterpolationTest, ByteBuffersDirectoryFactoryTest, TestValueSourceCache, HttpPartitionTest, TestExactSharedStatsCache, LeaderElectionIntegrationTest, TestJsonRequest, TestOmitPositions, CloneFieldUpdateProcessorFactoryTest, TestExceedMaxTermLength, TransactionLogTest, TestHashPartitioner, ZkSolrClientTest, SoftAutoCommitTest, TestGraphMLResponseWriter, WrapperMergePolicyFactoryTest, TestManagedSchema, SOLR749Test, TestRemoteStreaming, MetricsConfigTest, MigrateRouteKeyTest, HighlighterMaxOffsetTest, BadCopyFieldTest, TestCloudPivotFacet, PreAnalyzedFieldTest, TestRestManager, TestSolrFieldCacheBean, StatsComponentTest, TestReplicationHandler, TestRealTimeGet, FullSolrCloudDistribCmdsTest, VersionInfoTest, TriggerEventQueueTest, TestNumericTerms64, TestSolr4Spatial, DirectUpdateHandlerTest, AlternateDirectoryTest, SortByFunctionTest, MinimalSchemaTest, TestBM25SimilarityFactory, DistributedFacetSimpleRefinementLongTailTest, ResponseHeaderTest, FullHLLTest, AnalysisAfterCoreReloadTest, BasicFunctionalityTest, ConvertedLegacyTest, CursorPagingTest, DisMaxRequestHandlerTest, DistributedIntervalFacetingTest, SampleTest, SolrInfoBeanTest, SolrTestCaseJ4Test, TestCrossCoreJoin, TestCursorMarkWithoutUniqueKey, TestDistributedGrouping, TestDistributedMissingSort, TestDistributedSearch, TestDocumentBuilder, TestGroupingSearch, TestHighlightDedupGrouping, TestJoin, TestRandomDVFaceting, TestSimpleTrackingShardHandler, PathHierarchyTokenizerFactoryTest, ProtectedTermFilterFactoryTest, TestCharFilters, TestJettySolrRunner, ConnectionReuseTest, ActionThrottleTest, AddReplicaTest, AliasIntegrationTest, ChaosMonkeySafeLeaderWithPullReplicasTest, ClusterStateTest, ClusterStateUpdateTest, CollectionPropsTest, ConcurrentCreateRoutedAliasTest, ConfigSetsAPITest, ConnectionManagerTest, DeleteLastCustomShardedReplicaTest, DeleteNodeTest, DeleteReplicaTest, DistributedVersionInfoTest, LeaderVoteWaitTimeoutTest, MoveReplicaHDFSTest, OverseerTest, RecoveryZkTest, RemoteQueryErrorTest, ReplaceNodeNoTargetTest, ReplaceNodeTest, ReplicationFactorTest, RoutingToNodesWithPropertiesTest, SSLMigrationTest, SaslZkACLProviderTest, ShardRoutingCustomTest, ShardRoutingTest, SharedFSAutoReplicaFailoverTest, SliceStateTest, SolrCLIZkUtilsTest, SolrCloudExampleTest, SyncSliceTest, TestCloudDeleteByQuery, TestCloudRecovery2, TestClusterProperties, TestConfigSetsAPI, TestConfigSetsAPIExclusivity, TestConfigSetsAPIZkFailure, TestCryptoKeys, TestLeaderElectionZkExpiry, TestPrepRecovery, TestRandomFlRTGCloud, TestShortCircuitedRequests, TestSkipOverseerOperations, TestSolrCloudWithDelegationTokens, TestSolrCloudWithSecureImpersonation, TestStressCloudBlindAtomicUpdates, TestTolerantUpdateProcessorRandomCloud, ZkControllerTest, ZkFailoverTest, ZkNodePropsTest, AsyncCallRequestStatusResponseTest, CollectionReloadTest, CollectionTooManyReplicasTest, CollectionsAPIAsyncDistributedZkTest, TestHdfsCloudBackupRestore, TestLocalFSCloudBackupRestore, TestReplicaProperties, AutoAddReplicasIntegrationTest, HdfsAutoAddReplicasIntegrationTest]
   [junit4] Completed [573/858 (1!)] on J1 in 82.40s, 1 test, 1 failure <<< FAILURES!

[...truncated 48233 lines...]
-ecj-javadoc-lint-tests:
    [mkdir] Created dir: /tmp/ecj42026678
 [ecj-lint] Compiling 48 source files to /tmp/ecj42026678
 [ecj-lint] invalid Class-Path header in manifest of jar file: /x1/jenkins/.ivy2/cache/org.restlet.jee/org.restlet/jars/org.restlet-2.3.0.jar
 [ecj-lint] invalid Class-Path header in manifest of jar file: /x1/jenkins/.ivy2/cache/org.restlet.jee/org.restlet.ext.servlet/jars/org.restlet.ext.servlet-2.3.0.jar
 [ecj-lint] ----------
 [ecj-lint] 1. ERROR in /x1/jenkins/jenkins-slave/workspace/Lucene-Solr-NightlyTests-master/checkout/solr/contrib/dataimporthandler/src/test/org/apache/solr/handler/dataimport/MockInitialContextFactory.java (at line 23)
 [ecj-lint] 	import javax.naming.NamingException;
 [ecj-lint] 	       ^^^^^^^^^^^^^^^^^^^^^^^^^^^^
 [ecj-lint] The type javax.naming.NamingException is not accessible
 [ecj-lint] ----------
 [ecj-lint] 2. ERROR in /x1/jenkins/jenkins-slave/workspace/Lucene-Solr-NightlyTests-master/checkout/solr/contrib/dataimporthandler/src/test/org/apache/solr/handler/dataimport/MockInitialContextFactory.java (at line 28)
 [ecj-lint] 	public class MockInitialContextFactory implements InitialContextFactory {
 [ecj-lint] 	             ^^^^^^^^^^^^^^^^^^^^^^^^^
 [ecj-lint] The type MockInitialContextFactory must implement the inherited abstract method InitialContextFactory.getInitialContext(Hashtable<?,?>)
 [ecj-lint] ----------
 [ecj-lint] 3. ERROR in /x1/jenkins/jenkins-slave/workspace/Lucene-Solr-NightlyTests-master/checkout/solr/contrib/dataimporthandler/src/test/org/apache/solr/handler/dataimport/MockInitialContextFactory.java (at line 30)
 [ecj-lint] 	private final javax.naming.Context context;
 [ecj-lint] 	              ^^^^^^^^^^^^^^^^^^^^
 [ecj-lint] The type javax.naming.Context is not accessible
 [ecj-lint] ----------
 [ecj-lint] 4. ERROR in /x1/jenkins/jenkins-slave/workspace/Lucene-Solr-NightlyTests-master/checkout/solr/contrib/dataimporthandler/src/test/org/apache/solr/handler/dataimport/MockInitialContextFactory.java (at line 33)
 [ecj-lint] 	context = mock(javax.naming.Context.class);
 [ecj-lint] 	^^^^^^^
 [ecj-lint] context cannot be resolved to a variable
 [ecj-lint] ----------
 [ecj-lint] 5. ERROR in /x1/jenkins/jenkins-slave/workspace/Lucene-Solr-NightlyTests-master/checkout/solr/contrib/dataimporthandler/src/test/org/apache/solr/handler/dataimport/MockInitialContextFactory.java (at line 33)
 [ecj-lint] 	context = mock(javax.naming.Context.class);
 [ecj-lint] 	               ^^^^^^^^^^^^^^^^^^^^
 [ecj-lint] The type javax.naming.Context is not accessible
 [ecj-lint] ----------
 [ecj-lint] 6. ERROR in /x1/jenkins/jenkins-slave/workspace/Lucene-Solr-NightlyTests-master/checkout/solr/contrib/dataimporthandler/src/test/org/apache/solr/handler/dataimport/MockInitialContextFactory.java (at line 36)
 [ecj-lint] 	when(context.lookup(anyString())).thenAnswer(invocation -> objects.get(invocation.getArgument(0)));
 [ecj-lint] 	     ^^^^^^^
 [ecj-lint] context cannot be resolved
 [ecj-lint] ----------
 [ecj-lint] 7. ERROR in /x1/jenkins/jenkins-slave/workspace/Lucene-Solr-NightlyTests-master/checkout/solr/contrib/dataimporthandler/src/test/org/apache/solr/handler/dataimport/MockInitialContextFactory.java (at line 38)
 [ecj-lint] 	} catch (NamingException e) {
 [ecj-lint] 	         ^^^^^^^^^^^^^^^
 [ecj-lint] NamingException cannot be resolved to a type
 [ecj-lint] ----------
 [ecj-lint] 8. ERROR in /x1/jenkins/jenkins-slave/workspace/Lucene-Solr-NightlyTests-master/checkout/solr/contrib/dataimporthandler/src/test/org/apache/solr/handler/dataimport/MockInitialContextFactory.java (at line 45)
 [ecj-lint] 	public javax.naming.Context getInitialContext(Hashtable env) {
 [ecj-lint] 	       ^^^^^^^^^^^^^^^^^^^^
 [ecj-lint] The type javax.naming.Context is not accessible
 [ecj-lint] ----------
 [ecj-lint] 9. ERROR in /x1/jenkins/jenkins-slave/workspace/Lucene-Solr-NightlyTests-master/checkout/solr/contrib/dataimporthandler/src/test/org/apache/solr/handler/dataimport/MockInitialContextFactory.java (at line 46)
 [ecj-lint] 	return context;
 [ecj-lint] 	       ^^^^^^^
 [ecj-lint] context cannot be resolved to a variable
 [ecj-lint] ----------
 [ecj-lint] 9 problems (9 errors)

BUILD FAILED
/x1/jenkins/jenkins-slave/workspace/Lucene-Solr-NightlyTests-master/checkout/build.xml:652: The following error occurred while executing this line:
/x1/jenkins/jenkins-slave/workspace/Lucene-Solr-NightlyTests-master/checkout/build.xml:101: The following error occurred while executing this line:
/x1/jenkins/jenkins-slave/workspace/Lucene-Solr-NightlyTests-master/checkout/solr/build.xml:651: The following error occurred while executing this line:
/x1/jenkins/jenkins-slave/workspace/Lucene-Solr-NightlyTests-master/checkout/solr/common-build.xml:479: The following error occurred while executing this line:
/x1/jenkins/jenkins-slave/workspace/Lucene-Solr-NightlyTests-master/checkout/lucene/common-build.xml:2015: The following error occurred while executing this line:
/x1/jenkins/jenkins-slave/workspace/Lucene-Solr-NightlyTests-master/checkout/lucene/common-build.xml:2048: Compile failed; see the compiler error output for details.

Total time: 338 minutes 57 seconds
Build step 'Invoke Ant' marked build as failure
Archiving artifacts
Recording test results
Email was triggered for: Failure - Any
Sending email for trigger: Failure - Any

Mime
View raw message