lucene-dev mailing list archives

Site index · List index
Message view « Date » · « Thread »
Top « Date » · « Thread »
From Apache Jenkins Server <jenk...@builds.apache.org>
Subject [JENKINS] Lucene-Solr-NightlyTests-8.x - Build # 87 - Still Failing
Date Wed, 01 May 2019 03:43:25 GMT
Build: https://builds.apache.org/job/Lucene-Solr-NightlyTests-8.x/87/

4 tests failed.
FAILED:  org.apache.solr.cloud.autoscaling.HdfsAutoAddReplicasIntegrationTest.testSimple

Error Message:
Waiting for collection testSimple2 Timeout waiting to see state for collection=testSimple2 :DocCollection(testSimple2//collections/testSimple2/state.json/24)={   "pullReplicas":"0",   "replicationFactor":"2",   "shards":{     "shard1":{       "range":"80000000-ffffffff",       "state":"active",       "replicas":{         "core_node3":{           "dataDir":"hdfs://localhost:44141/solr_hdfs_home/testSimple2/core_node3/data/",           "base_url":"https://127.0.0.1:32784/solr",           "node_name":"127.0.0.1:32784_solr",           "type":"NRT",           "force_set_state":"false",           "ulogDir":"hdfs://localhost:44141/solr_hdfs_home/testSimple2/core_node3/data/tlog",           "core":"testSimple2_shard1_replica_n1",           "shared_storage":"true",           "state":"down"},         "core_node5":{           "dataDir":"hdfs://localhost:44141/solr_hdfs_home/testSimple2/core_node5/data/",           "base_url":"https://127.0.0.1:41163/solr",           "node_name":"127.0.0.1:41163_solr",           "type":"NRT",           "force_set_state":"false",           "ulogDir":"hdfs://localhost:44141/solr_hdfs_home/testSimple2/core_node5/data/tlog",           "core":"testSimple2_shard1_replica_n2",           "shared_storage":"true",           "state":"active",           "leader":"true"}}},     "shard2":{       "range":"0-7fffffff",       "state":"active",       "replicas":{         "core_node7":{           "dataDir":"hdfs://localhost:44141/solr_hdfs_home/testSimple2/core_node7/data/",           "base_url":"https://127.0.0.1:32784/solr",           "node_name":"127.0.0.1:32784_solr",           "type":"NRT",           "force_set_state":"false",           "ulogDir":"hdfs://localhost:44141/solr_hdfs_home/testSimple2/core_node7/data/tlog",           "core":"testSimple2_shard2_replica_n4",           "shared_storage":"true",           "state":"down"},         "core_node8":{           "dataDir":"hdfs://localhost:44141/solr_hdfs_home/testSimple2/core_node8/data/",           "base_url":"https://127.0.0.1:41163/solr",           "node_name":"127.0.0.1:41163_solr",           "type":"NRT",           "force_set_state":"false",           "ulogDir":"hdfs://localhost:44141/solr_hdfs_home/testSimple2/core_node8/data/tlog",           "core":"testSimple2_shard2_replica_n6",           "shared_storage":"true",           "state":"active",           "leader":"true"}}}},   "router":{"name":"compositeId"},   "maxShardsPerNode":"2",   "autoAddReplicas":"true",   "nrtReplicas":"2",   "tlogReplicas":"0"} Live Nodes: [127.0.0.1:41163_solr, 127.0.0.1:41689_solr] Last available state: DocCollection(testSimple2//collections/testSimple2/state.json/24)={   "pullReplicas":"0",   "replicationFactor":"2",   "shards":{     "shard1":{       "range":"80000000-ffffffff",       "state":"active",       "replicas":{         "core_node3":{           "dataDir":"hdfs://localhost:44141/solr_hdfs_home/testSimple2/core_node3/data/",           "base_url":"https://127.0.0.1:32784/solr",           "node_name":"127.0.0.1:32784_solr",           "type":"NRT",           "force_set_state":"false",           "ulogDir":"hdfs://localhost:44141/solr_hdfs_home/testSimple2/core_node3/data/tlog",           "core":"testSimple2_shard1_replica_n1",           "shared_storage":"true",           "state":"down"},         "core_node5":{           "dataDir":"hdfs://localhost:44141/solr_hdfs_home/testSimple2/core_node5/data/",           "base_url":"https://127.0.0.1:41163/solr",           "node_name":"127.0.0.1:41163_solr",           "type":"NRT",           "force_set_state":"false",           "ulogDir":"hdfs://localhost:44141/solr_hdfs_home/testSimple2/core_node5/data/tlog",           "core":"testSimple2_shard1_replica_n2",           "shared_storage":"true",           "state":"active",           "leader":"true"}}},     "shard2":{       "range":"0-7fffffff",       "state":"active",       "replicas":{         "core_node7":{           "dataDir":"hdfs://localhost:44141/solr_hdfs_home/testSimple2/core_node7/data/",           "base_url":"https://127.0.0.1:32784/solr",           "node_name":"127.0.0.1:32784_solr",           "type":"NRT",           "force_set_state":"false",           "ulogDir":"hdfs://localhost:44141/solr_hdfs_home/testSimple2/core_node7/data/tlog",           "core":"testSimple2_shard2_replica_n4",           "shared_storage":"true",           "state":"down"},         "core_node8":{           "dataDir":"hdfs://localhost:44141/solr_hdfs_home/testSimple2/core_node8/data/",           "base_url":"https://127.0.0.1:41163/solr",           "node_name":"127.0.0.1:41163_solr",           "type":"NRT",           "force_set_state":"false",           "ulogDir":"hdfs://localhost:44141/solr_hdfs_home/testSimple2/core_node8/data/tlog",           "core":"testSimple2_shard2_replica_n6",           "shared_storage":"true",           "state":"active",           "leader":"true"}}}},   "router":{"name":"compositeId"},   "maxShardsPerNode":"2",   "autoAddReplicas":"true",   "nrtReplicas":"2",   "tlogReplicas":"0"}

Stack Trace:
java.lang.AssertionError: Waiting for collection testSimple2
Timeout waiting to see state for collection=testSimple2 :DocCollection(testSimple2//collections/testSimple2/state.json/24)={
  "pullReplicas":"0",
  "replicationFactor":"2",
  "shards":{
    "shard1":{
      "range":"80000000-ffffffff",
      "state":"active",
      "replicas":{
        "core_node3":{
          "dataDir":"hdfs://localhost:44141/solr_hdfs_home/testSimple2/core_node3/data/",
          "base_url":"https://127.0.0.1:32784/solr",
          "node_name":"127.0.0.1:32784_solr",
          "type":"NRT",
          "force_set_state":"false",
          "ulogDir":"hdfs://localhost:44141/solr_hdfs_home/testSimple2/core_node3/data/tlog",
          "core":"testSimple2_shard1_replica_n1",
          "shared_storage":"true",
          "state":"down"},
        "core_node5":{
          "dataDir":"hdfs://localhost:44141/solr_hdfs_home/testSimple2/core_node5/data/",
          "base_url":"https://127.0.0.1:41163/solr",
          "node_name":"127.0.0.1:41163_solr",
          "type":"NRT",
          "force_set_state":"false",
          "ulogDir":"hdfs://localhost:44141/solr_hdfs_home/testSimple2/core_node5/data/tlog",
          "core":"testSimple2_shard1_replica_n2",
          "shared_storage":"true",
          "state":"active",
          "leader":"true"}}},
    "shard2":{
      "range":"0-7fffffff",
      "state":"active",
      "replicas":{
        "core_node7":{
          "dataDir":"hdfs://localhost:44141/solr_hdfs_home/testSimple2/core_node7/data/",
          "base_url":"https://127.0.0.1:32784/solr",
          "node_name":"127.0.0.1:32784_solr",
          "type":"NRT",
          "force_set_state":"false",
          "ulogDir":"hdfs://localhost:44141/solr_hdfs_home/testSimple2/core_node7/data/tlog",
          "core":"testSimple2_shard2_replica_n4",
          "shared_storage":"true",
          "state":"down"},
        "core_node8":{
          "dataDir":"hdfs://localhost:44141/solr_hdfs_home/testSimple2/core_node8/data/",
          "base_url":"https://127.0.0.1:41163/solr",
          "node_name":"127.0.0.1:41163_solr",
          "type":"NRT",
          "force_set_state":"false",
          "ulogDir":"hdfs://localhost:44141/solr_hdfs_home/testSimple2/core_node8/data/tlog",
          "core":"testSimple2_shard2_replica_n6",
          "shared_storage":"true",
          "state":"active",
          "leader":"true"}}}},
  "router":{"name":"compositeId"},
  "maxShardsPerNode":"2",
  "autoAddReplicas":"true",
  "nrtReplicas":"2",
  "tlogReplicas":"0"}
Live Nodes: [127.0.0.1:41163_solr, 127.0.0.1:41689_solr]
Last available state: DocCollection(testSimple2//collections/testSimple2/state.json/24)={
  "pullReplicas":"0",
  "replicationFactor":"2",
  "shards":{
    "shard1":{
      "range":"80000000-ffffffff",
      "state":"active",
      "replicas":{
        "core_node3":{
          "dataDir":"hdfs://localhost:44141/solr_hdfs_home/testSimple2/core_node3/data/",
          "base_url":"https://127.0.0.1:32784/solr",
          "node_name":"127.0.0.1:32784_solr",
          "type":"NRT",
          "force_set_state":"false",
          "ulogDir":"hdfs://localhost:44141/solr_hdfs_home/testSimple2/core_node3/data/tlog",
          "core":"testSimple2_shard1_replica_n1",
          "shared_storage":"true",
          "state":"down"},
        "core_node5":{
          "dataDir":"hdfs://localhost:44141/solr_hdfs_home/testSimple2/core_node5/data/",
          "base_url":"https://127.0.0.1:41163/solr",
          "node_name":"127.0.0.1:41163_solr",
          "type":"NRT",
          "force_set_state":"false",
          "ulogDir":"hdfs://localhost:44141/solr_hdfs_home/testSimple2/core_node5/data/tlog",
          "core":"testSimple2_shard1_replica_n2",
          "shared_storage":"true",
          "state":"active",
          "leader":"true"}}},
    "shard2":{
      "range":"0-7fffffff",
      "state":"active",
      "replicas":{
        "core_node7":{
          "dataDir":"hdfs://localhost:44141/solr_hdfs_home/testSimple2/core_node7/data/",
          "base_url":"https://127.0.0.1:32784/solr",
          "node_name":"127.0.0.1:32784_solr",
          "type":"NRT",
          "force_set_state":"false",
          "ulogDir":"hdfs://localhost:44141/solr_hdfs_home/testSimple2/core_node7/data/tlog",
          "core":"testSimple2_shard2_replica_n4",
          "shared_storage":"true",
          "state":"down"},
        "core_node8":{
          "dataDir":"hdfs://localhost:44141/solr_hdfs_home/testSimple2/core_node8/data/",
          "base_url":"https://127.0.0.1:41163/solr",
          "node_name":"127.0.0.1:41163_solr",
          "type":"NRT",
          "force_set_state":"false",
          "ulogDir":"hdfs://localhost:44141/solr_hdfs_home/testSimple2/core_node8/data/tlog",
          "core":"testSimple2_shard2_replica_n6",
          "shared_storage":"true",
          "state":"active",
          "leader":"true"}}}},
  "router":{"name":"compositeId"},
  "maxShardsPerNode":"2",
  "autoAddReplicas":"true",
  "nrtReplicas":"2",
  "tlogReplicas":"0"}
	at __randomizedtesting.SeedInfo.seed([5F9892CFEB306221:672BB631CCC3B6F0]:0)
	at org.junit.Assert.fail(Assert.java:88)
	at org.apache.solr.cloud.SolrCloudTestCase.waitForState(SolrCloudTestCase.java:310)
	at org.apache.solr.cloud.autoscaling.AutoAddReplicasIntegrationTest.testSimple(AutoAddReplicasIntegrationTest.java:169)
	at sun.reflect.NativeMethodAccessorImpl.invoke0(Native Method)
	at sun.reflect.NativeMethodAccessorImpl.invoke(NativeMethodAccessorImpl.java:62)
	at sun.reflect.DelegatingMethodAccessorImpl.invoke(DelegatingMethodAccessorImpl.java:43)
	at java.lang.reflect.Method.invoke(Method.java:498)
	at com.carrotsearch.randomizedtesting.RandomizedRunner.invoke(RandomizedRunner.java:1750)
	at com.carrotsearch.randomizedtesting.RandomizedRunner$8.evaluate(RandomizedRunner.java:938)
	at com.carrotsearch.randomizedtesting.RandomizedRunner$9.evaluate(RandomizedRunner.java:974)
	at com.carrotsearch.randomizedtesting.RandomizedRunner$10.evaluate(RandomizedRunner.java:988)
	at com.carrotsearch.randomizedtesting.rules.SystemPropertiesRestoreRule$1.evaluate(SystemPropertiesRestoreRule.java:57)
	at org.apache.lucene.util.TestRuleSetupTeardownChained$1.evaluate(TestRuleSetupTeardownChained.java:49)
	at org.apache.lucene.util.AbstractBeforeAfterRule$1.evaluate(AbstractBeforeAfterRule.java:45)
	at org.apache.lucene.util.TestRuleThreadAndTestName$1.evaluate(TestRuleThreadAndTestName.java:48)
	at org.apache.lucene.util.TestRuleIgnoreAfterMaxFailures$1.evaluate(TestRuleIgnoreAfterMaxFailures.java:64)
	at org.apache.lucene.util.TestRuleMarkFailure$1.evaluate(TestRuleMarkFailure.java:47)
	at com.carrotsearch.randomizedtesting.rules.StatementAdapter.evaluate(StatementAdapter.java:36)
	at com.carrotsearch.randomizedtesting.ThreadLeakControl$StatementRunner.run(ThreadLeakControl.java:368)
	at com.carrotsearch.randomizedtesting.ThreadLeakControl.forkTimeoutingTask(ThreadLeakControl.java:817)
	at com.carrotsearch.randomizedtesting.ThreadLeakControl$3.evaluate(ThreadLeakControl.java:468)
	at com.carrotsearch.randomizedtesting.RandomizedRunner.runSingleTest(RandomizedRunner.java:947)
	at com.carrotsearch.randomizedtesting.RandomizedRunner$5.evaluate(RandomizedRunner.java:832)
	at com.carrotsearch.randomizedtesting.RandomizedRunner$6.evaluate(RandomizedRunner.java:883)
	at com.carrotsearch.randomizedtesting.RandomizedRunner$7.evaluate(RandomizedRunner.java:894)
	at com.carrotsearch.randomizedtesting.rules.StatementAdapter.evaluate(StatementAdapter.java:36)
	at com.carrotsearch.randomizedtesting.rules.SystemPropertiesRestoreRule$1.evaluate(SystemPropertiesRestoreRule.java:57)
	at org.apache.lucene.util.AbstractBeforeAfterRule$1.evaluate(AbstractBeforeAfterRule.java:45)
	at com.carrotsearch.randomizedtesting.rules.StatementAdapter.evaluate(StatementAdapter.java:36)
	at org.apache.lucene.util.TestRuleStoreClassName$1.evaluate(TestRuleStoreClassName.java:41)
	at com.carrotsearch.randomizedtesting.rules.NoShadowingOrOverridesOnMethodsRule$1.evaluate(NoShadowingOrOverridesOnMethodsRule.java:40)
	at com.carrotsearch.randomizedtesting.rules.NoShadowingOrOverridesOnMethodsRule$1.evaluate(NoShadowingOrOverridesOnMethodsRule.java:40)
	at com.carrotsearch.randomizedtesting.rules.StatementAdapter.evaluate(StatementAdapter.java:36)
	at com.carrotsearch.randomizedtesting.rules.StatementAdapter.evaluate(StatementAdapter.java:36)
	at com.carrotsearch.randomizedtesting.rules.StatementAdapter.evaluate(StatementAdapter.java:36)
	at org.apache.lucene.util.TestRuleAssertionsRequired$1.evaluate(TestRuleAssertionsRequired.java:53)
	at org.apache.lucene.util.TestRuleMarkFailure$1.evaluate(TestRuleMarkFailure.java:47)
	at org.apache.lucene.util.TestRuleIgnoreAfterMaxFailures$1.evaluate(TestRuleIgnoreAfterMaxFailures.java:64)
	at org.apache.lucene.util.TestRuleIgnoreTestSuites$1.evaluate(TestRuleIgnoreTestSuites.java:54)
	at com.carrotsearch.randomizedtesting.rules.StatementAdapter.evaluate(StatementAdapter.java:36)
	at com.carrotsearch.randomizedtesting.ThreadLeakControl$StatementRunner.run(ThreadLeakControl.java:368)
	at java.lang.Thread.run(Thread.java:748)


FAILED:  org.apache.solr.update.PeerSyncTest.test

Error Message:
Unexpected exception type, expected SolrException but got org.apache.solr.client.solrj.SolrServerException: Timeout occurred while waiting response from server at: http://127.0.0.1:36316/collection1

Stack Trace:
junit.framework.AssertionFailedError: Unexpected exception type, expected SolrException but got org.apache.solr.client.solrj.SolrServerException: Timeout occurred while waiting response from server at: http://127.0.0.1:36316/collection1
	at __randomizedtesting.SeedInfo.seed([5F9892CFEB306221:D7CCAD1545CC0FD9]:0)
	at org.apache.lucene.util.LuceneTestCase.expectThrows(LuceneTestCase.java:2700)
	at org.apache.lucene.util.LuceneTestCase.expectThrows(LuceneTestCase.java:2689)
	at org.apache.solr.update.PeerSyncTest.test(PeerSyncTest.java:279)
	at sun.reflect.NativeMethodAccessorImpl.invoke0(Native Method)
	at sun.reflect.NativeMethodAccessorImpl.invoke(NativeMethodAccessorImpl.java:62)
	at sun.reflect.DelegatingMethodAccessorImpl.invoke(DelegatingMethodAccessorImpl.java:43)
	at java.lang.reflect.Method.invoke(Method.java:498)
	at com.carrotsearch.randomizedtesting.RandomizedRunner.invoke(RandomizedRunner.java:1750)
	at com.carrotsearch.randomizedtesting.RandomizedRunner$8.evaluate(RandomizedRunner.java:938)
	at com.carrotsearch.randomizedtesting.RandomizedRunner$9.evaluate(RandomizedRunner.java:974)
	at com.carrotsearch.randomizedtesting.RandomizedRunner$10.evaluate(RandomizedRunner.java:988)
	at org.apache.solr.BaseDistributedSearchTestCase$ShardsRepeatRule$ShardsFixedStatement.callStatement(BaseDistributedSearchTestCase.java:1082)
	at org.apache.solr.BaseDistributedSearchTestCase$ShardsRepeatRule$ShardsStatement.evaluate(BaseDistributedSearchTestCase.java:1054)
	at com.carrotsearch.randomizedtesting.rules.SystemPropertiesRestoreRule$1.evaluate(SystemPropertiesRestoreRule.java:57)
	at org.apache.lucene.util.TestRuleSetupTeardownChained$1.evaluate(TestRuleSetupTeardownChained.java:49)
	at org.apache.lucene.util.AbstractBeforeAfterRule$1.evaluate(AbstractBeforeAfterRule.java:45)
	at org.apache.lucene.util.TestRuleThreadAndTestName$1.evaluate(TestRuleThreadAndTestName.java:48)
	at org.apache.lucene.util.TestRuleIgnoreAfterMaxFailures$1.evaluate(TestRuleIgnoreAfterMaxFailures.java:64)
	at org.apache.lucene.util.TestRuleMarkFailure$1.evaluate(TestRuleMarkFailure.java:47)
	at com.carrotsearch.randomizedtesting.rules.StatementAdapter.evaluate(StatementAdapter.java:36)
	at com.carrotsearch.randomizedtesting.ThreadLeakControl$StatementRunner.run(ThreadLeakControl.java:368)
	at com.carrotsearch.randomizedtesting.ThreadLeakControl.forkTimeoutingTask(ThreadLeakControl.java:817)
	at com.carrotsearch.randomizedtesting.ThreadLeakControl$3.evaluate(ThreadLeakControl.java:468)
	at com.carrotsearch.randomizedtesting.RandomizedRunner.runSingleTest(RandomizedRunner.java:947)
	at com.carrotsearch.randomizedtesting.RandomizedRunner$5.evaluate(RandomizedRunner.java:832)
	at com.carrotsearch.randomizedtesting.RandomizedRunner$6.evaluate(RandomizedRunner.java:883)
	at com.carrotsearch.randomizedtesting.RandomizedRunner$7.evaluate(RandomizedRunner.java:894)
	at com.carrotsearch.randomizedtesting.rules.StatementAdapter.evaluate(StatementAdapter.java:36)
	at com.carrotsearch.randomizedtesting.rules.SystemPropertiesRestoreRule$1.evaluate(SystemPropertiesRestoreRule.java:57)
	at org.apache.lucene.util.AbstractBeforeAfterRule$1.evaluate(AbstractBeforeAfterRule.java:45)
	at com.carrotsearch.randomizedtesting.rules.StatementAdapter.evaluate(StatementAdapter.java:36)
	at org.apache.lucene.util.TestRuleStoreClassName$1.evaluate(TestRuleStoreClassName.java:41)
	at com.carrotsearch.randomizedtesting.rules.NoShadowingOrOverridesOnMethodsRule$1.evaluate(NoShadowingOrOverridesOnMethodsRule.java:40)
	at com.carrotsearch.randomizedtesting.rules.NoShadowingOrOverridesOnMethodsRule$1.evaluate(NoShadowingOrOverridesOnMethodsRule.java:40)
	at com.carrotsearch.randomizedtesting.rules.StatementAdapter.evaluate(StatementAdapter.java:36)
	at com.carrotsearch.randomizedtesting.rules.StatementAdapter.evaluate(StatementAdapter.java:36)
	at com.carrotsearch.randomizedtesting.rules.StatementAdapter.evaluate(StatementAdapter.java:36)
	at org.apache.lucene.util.TestRuleAssertionsRequired$1.evaluate(TestRuleAssertionsRequired.java:53)
	at org.apache.lucene.util.TestRuleMarkFailure$1.evaluate(TestRuleMarkFailure.java:47)
	at org.apache.lucene.util.TestRuleIgnoreAfterMaxFailures$1.evaluate(TestRuleIgnoreAfterMaxFailures.java:64)
	at org.apache.lucene.util.TestRuleIgnoreTestSuites$1.evaluate(TestRuleIgnoreTestSuites.java:54)
	at com.carrotsearch.randomizedtesting.rules.StatementAdapter.evaluate(StatementAdapter.java:36)
	at com.carrotsearch.randomizedtesting.ThreadLeakControl$StatementRunner.run(ThreadLeakControl.java:368)
	at java.lang.Thread.run(Thread.java:748)
Caused by: org.apache.solr.client.solrj.SolrServerException: Timeout occurred while waiting response from server at: http://127.0.0.1:36316/collection1
	at org.apache.solr.client.solrj.impl.HttpSolrClient.executeMethod(HttpSolrClient.java:660)
	at org.apache.solr.client.solrj.impl.HttpSolrClient.request(HttpSolrClient.java:255)
	at org.apache.solr.client.solrj.impl.HttpSolrClient.request(HttpSolrClient.java:244)
	at org.apache.solr.client.solrj.SolrRequest.process(SolrRequest.java:207)
	at org.apache.solr.client.solrj.SolrRequest.process(SolrRequest.java:224)
	at org.apache.solr.BaseDistributedSearchTestCase.add(BaseDistributedSearchTestCase.java:576)
	at org.apache.solr.update.PeerSyncTest.lambda$test$0(PeerSyncTest.java:281)
	at org.apache.lucene.util.LuceneTestCase.expectThrows(LuceneTestCase.java:2695)
	... 43 more
Caused by: java.net.SocketTimeoutException: Read timed out
	at java.net.SocketInputStream.socketRead0(Native Method)
	at java.net.SocketInputStream.socketRead(SocketInputStream.java:116)
	at java.net.SocketInputStream.read(SocketInputStream.java:171)
	at java.net.SocketInputStream.read(SocketInputStream.java:141)
	at org.apache.http.impl.io.SessionInputBufferImpl.streamRead(SessionInputBufferImpl.java:137)
	at org.apache.http.impl.io.SessionInputBufferImpl.fillBuffer(SessionInputBufferImpl.java:153)
	at org.apache.http.impl.io.SessionInputBufferImpl.readLine(SessionInputBufferImpl.java:282)
	at org.apache.http.impl.conn.DefaultHttpResponseParser.parseHead(DefaultHttpResponseParser.java:138)
	at org.apache.http.impl.conn.DefaultHttpResponseParser.parseHead(DefaultHttpResponseParser.java:56)
	at org.apache.http.impl.io.AbstractMessageParser.parse(AbstractMessageParser.java:259)
	at org.apache.http.impl.DefaultBHttpClientConnection.receiveResponseHeader(DefaultBHttpClientConnection.java:163)
	at org.apache.http.impl.conn.CPoolProxy.receiveResponseHeader(CPoolProxy.java:165)
	at org.apache.http.protocol.HttpRequestExecutor.doReceiveResponse(HttpRequestExecutor.java:273)
	at org.apache.http.protocol.HttpRequestExecutor.execute(HttpRequestExecutor.java:125)
	at org.apache.http.impl.execchain.MainClientExec.execute(MainClientExec.java:272)
	at org.apache.http.impl.execchain.ProtocolExec.execute(ProtocolExec.java:185)
	at org.apache.http.impl.execchain.RetryExec.execute(RetryExec.java:89)
	at org.apache.http.impl.execchain.RedirectExec.execute(RedirectExec.java:110)
	at org.apache.http.impl.client.InternalHttpClient.doExecute(InternalHttpClient.java:185)
	at org.apache.http.impl.client.CloseableHttpClient.execute(CloseableHttpClient.java:83)
	at org.apache.http.impl.client.CloseableHttpClient.execute(CloseableHttpClient.java:56)
	at org.apache.solr.client.solrj.impl.HttpSolrClient.executeMethod(HttpSolrClient.java:548)
	... 50 more


FAILED:  org.apache.solr.update.PeerSyncWithLeaderTest.test

Error Message:
Unexpected exception type, expected SolrException but got org.apache.solr.client.solrj.SolrServerException: Timeout occurred while waiting response from server at: http://127.0.0.1:46046/collection1

Stack Trace:
junit.framework.AssertionFailedError: Unexpected exception type, expected SolrException but got org.apache.solr.client.solrj.SolrServerException: Timeout occurred while waiting response from server at: http://127.0.0.1:46046/collection1
	at __randomizedtesting.SeedInfo.seed([5F9892CFEB306221:D7CCAD1545CC0FD9]:0)
	at org.apache.lucene.util.LuceneTestCase.expectThrows(LuceneTestCase.java:2700)
	at org.apache.lucene.util.LuceneTestCase.expectThrows(LuceneTestCase.java:2689)
	at org.apache.solr.update.PeerSyncTest.test(PeerSyncTest.java:279)
	at sun.reflect.NativeMethodAccessorImpl.invoke0(Native Method)
	at sun.reflect.NativeMethodAccessorImpl.invoke(NativeMethodAccessorImpl.java:62)
	at sun.reflect.DelegatingMethodAccessorImpl.invoke(DelegatingMethodAccessorImpl.java:43)
	at java.lang.reflect.Method.invoke(Method.java:498)
	at com.carrotsearch.randomizedtesting.RandomizedRunner.invoke(RandomizedRunner.java:1750)
	at com.carrotsearch.randomizedtesting.RandomizedRunner$8.evaluate(RandomizedRunner.java:938)
	at com.carrotsearch.randomizedtesting.RandomizedRunner$9.evaluate(RandomizedRunner.java:974)
	at com.carrotsearch.randomizedtesting.RandomizedRunner$10.evaluate(RandomizedRunner.java:988)
	at org.apache.solr.BaseDistributedSearchTestCase$ShardsRepeatRule$ShardsFixedStatement.callStatement(BaseDistributedSearchTestCase.java:1082)
	at org.apache.solr.BaseDistributedSearchTestCase$ShardsRepeatRule$ShardsStatement.evaluate(BaseDistributedSearchTestCase.java:1054)
	at com.carrotsearch.randomizedtesting.rules.SystemPropertiesRestoreRule$1.evaluate(SystemPropertiesRestoreRule.java:57)
	at org.apache.lucene.util.TestRuleSetupTeardownChained$1.evaluate(TestRuleSetupTeardownChained.java:49)
	at org.apache.lucene.util.AbstractBeforeAfterRule$1.evaluate(AbstractBeforeAfterRule.java:45)
	at org.apache.lucene.util.TestRuleThreadAndTestName$1.evaluate(TestRuleThreadAndTestName.java:48)
	at org.apache.lucene.util.TestRuleIgnoreAfterMaxFailures$1.evaluate(TestRuleIgnoreAfterMaxFailures.java:64)
	at org.apache.lucene.util.TestRuleMarkFailure$1.evaluate(TestRuleMarkFailure.java:47)
	at com.carrotsearch.randomizedtesting.rules.StatementAdapter.evaluate(StatementAdapter.java:36)
	at com.carrotsearch.randomizedtesting.ThreadLeakControl$StatementRunner.run(ThreadLeakControl.java:368)
	at com.carrotsearch.randomizedtesting.ThreadLeakControl.forkTimeoutingTask(ThreadLeakControl.java:817)
	at com.carrotsearch.randomizedtesting.ThreadLeakControl$3.evaluate(ThreadLeakControl.java:468)
	at com.carrotsearch.randomizedtesting.RandomizedRunner.runSingleTest(RandomizedRunner.java:947)
	at com.carrotsearch.randomizedtesting.RandomizedRunner$5.evaluate(RandomizedRunner.java:832)
	at com.carrotsearch.randomizedtesting.RandomizedRunner$6.evaluate(RandomizedRunner.java:883)
	at com.carrotsearch.randomizedtesting.RandomizedRunner$7.evaluate(RandomizedRunner.java:894)
	at com.carrotsearch.randomizedtesting.rules.StatementAdapter.evaluate(StatementAdapter.java:36)
	at com.carrotsearch.randomizedtesting.rules.SystemPropertiesRestoreRule$1.evaluate(SystemPropertiesRestoreRule.java:57)
	at org.apache.lucene.util.AbstractBeforeAfterRule$1.evaluate(AbstractBeforeAfterRule.java:45)
	at com.carrotsearch.randomizedtesting.rules.StatementAdapter.evaluate(StatementAdapter.java:36)
	at org.apache.lucene.util.TestRuleStoreClassName$1.evaluate(TestRuleStoreClassName.java:41)
	at com.carrotsearch.randomizedtesting.rules.NoShadowingOrOverridesOnMethodsRule$1.evaluate(NoShadowingOrOverridesOnMethodsRule.java:40)
	at com.carrotsearch.randomizedtesting.rules.NoShadowingOrOverridesOnMethodsRule$1.evaluate(NoShadowingOrOverridesOnMethodsRule.java:40)
	at com.carrotsearch.randomizedtesting.rules.StatementAdapter.evaluate(StatementAdapter.java:36)
	at com.carrotsearch.randomizedtesting.rules.StatementAdapter.evaluate(StatementAdapter.java:36)
	at com.carrotsearch.randomizedtesting.rules.StatementAdapter.evaluate(StatementAdapter.java:36)
	at org.apache.lucene.util.TestRuleAssertionsRequired$1.evaluate(TestRuleAssertionsRequired.java:53)
	at org.apache.lucene.util.TestRuleMarkFailure$1.evaluate(TestRuleMarkFailure.java:47)
	at org.apache.lucene.util.TestRuleIgnoreAfterMaxFailures$1.evaluate(TestRuleIgnoreAfterMaxFailures.java:64)
	at org.apache.lucene.util.TestRuleIgnoreTestSuites$1.evaluate(TestRuleIgnoreTestSuites.java:54)
	at com.carrotsearch.randomizedtesting.rules.StatementAdapter.evaluate(StatementAdapter.java:36)
	at com.carrotsearch.randomizedtesting.ThreadLeakControl$StatementRunner.run(ThreadLeakControl.java:368)
	at java.lang.Thread.run(Thread.java:748)
Caused by: org.apache.solr.client.solrj.SolrServerException: Timeout occurred while waiting response from server at: http://127.0.0.1:46046/collection1
	at org.apache.solr.client.solrj.impl.HttpSolrClient.executeMethod(HttpSolrClient.java:660)
	at org.apache.solr.client.solrj.impl.HttpSolrClient.request(HttpSolrClient.java:255)
	at org.apache.solr.client.solrj.impl.HttpSolrClient.request(HttpSolrClient.java:244)
	at org.apache.solr.client.solrj.SolrRequest.process(SolrRequest.java:207)
	at org.apache.solr.client.solrj.SolrRequest.process(SolrRequest.java:224)
	at org.apache.solr.BaseDistributedSearchTestCase.add(BaseDistributedSearchTestCase.java:576)
	at org.apache.solr.update.PeerSyncTest.lambda$test$0(PeerSyncTest.java:281)
	at org.apache.lucene.util.LuceneTestCase.expectThrows(LuceneTestCase.java:2695)
	... 43 more
Caused by: java.net.SocketTimeoutException: Read timed out
	at java.net.SocketInputStream.socketRead0(Native Method)
	at java.net.SocketInputStream.socketRead(SocketInputStream.java:116)
	at java.net.SocketInputStream.read(SocketInputStream.java:171)
	at java.net.SocketInputStream.read(SocketInputStream.java:141)
	at org.apache.http.impl.io.SessionInputBufferImpl.streamRead(SessionInputBufferImpl.java:137)
	at org.apache.http.impl.io.SessionInputBufferImpl.fillBuffer(SessionInputBufferImpl.java:153)
	at org.apache.http.impl.io.SessionInputBufferImpl.readLine(SessionInputBufferImpl.java:282)
	at org.apache.http.impl.conn.DefaultHttpResponseParser.parseHead(DefaultHttpResponseParser.java:138)
	at org.apache.http.impl.conn.DefaultHttpResponseParser.parseHead(DefaultHttpResponseParser.java:56)
	at org.apache.http.impl.io.AbstractMessageParser.parse(AbstractMessageParser.java:259)
	at org.apache.http.impl.DefaultBHttpClientConnection.receiveResponseHeader(DefaultBHttpClientConnection.java:163)
	at org.apache.http.impl.conn.CPoolProxy.receiveResponseHeader(CPoolProxy.java:165)
	at org.apache.http.protocol.HttpRequestExecutor.doReceiveResponse(HttpRequestExecutor.java:273)
	at org.apache.http.protocol.HttpRequestExecutor.execute(HttpRequestExecutor.java:125)
	at org.apache.http.impl.execchain.MainClientExec.execute(MainClientExec.java:272)
	at org.apache.http.impl.execchain.ProtocolExec.execute(ProtocolExec.java:185)
	at org.apache.http.impl.execchain.RetryExec.execute(RetryExec.java:89)
	at org.apache.http.impl.execchain.RedirectExec.execute(RedirectExec.java:110)
	at org.apache.http.impl.client.InternalHttpClient.doExecute(InternalHttpClient.java:185)
	at org.apache.http.impl.client.CloseableHttpClient.execute(CloseableHttpClient.java:83)
	at org.apache.http.impl.client.CloseableHttpClient.execute(CloseableHttpClient.java:56)
	at org.apache.solr.client.solrj.impl.HttpSolrClient.executeMethod(HttpSolrClient.java:548)
	... 50 more


FAILED:  org.apache.solr.update.TestInPlaceUpdatesDistrib.test

Error Message:
Thread pool didn't terminate within 15 secs

Stack Trace:
java.lang.AssertionError: Thread pool didn't terminate within 15 secs
	at __randomizedtesting.SeedInfo.seed([5F9892CFEB306221:D7CCAD1545CC0FD9]:0)
	at org.junit.Assert.fail(Assert.java:88)
	at org.junit.Assert.assertTrue(Assert.java:41)
	at org.apache.solr.update.TestInPlaceUpdatesDistrib.reorderedDeletesTest(TestInPlaceUpdatesDistrib.java:776)
	at org.apache.solr.update.TestInPlaceUpdatesDistrib.test(TestInPlaceUpdatesDistrib.java:175)
	at sun.reflect.NativeMethodAccessorImpl.invoke0(Native Method)
	at sun.reflect.NativeMethodAccessorImpl.invoke(NativeMethodAccessorImpl.java:62)
	at sun.reflect.DelegatingMethodAccessorImpl.invoke(DelegatingMethodAccessorImpl.java:43)
	at java.lang.reflect.Method.invoke(Method.java:498)
	at com.carrotsearch.randomizedtesting.RandomizedRunner.invoke(RandomizedRunner.java:1750)
	at com.carrotsearch.randomizedtesting.RandomizedRunner$8.evaluate(RandomizedRunner.java:938)
	at com.carrotsearch.randomizedtesting.RandomizedRunner$9.evaluate(RandomizedRunner.java:974)
	at com.carrotsearch.randomizedtesting.RandomizedRunner$10.evaluate(RandomizedRunner.java:988)
	at org.apache.solr.BaseDistributedSearchTestCase$ShardsRepeatRule$ShardsFixedStatement.callStatement(BaseDistributedSearchTestCase.java:1082)
	at org.apache.solr.BaseDistributedSearchTestCase$ShardsRepeatRule$ShardsStatement.evaluate(BaseDistributedSearchTestCase.java:1054)
	at com.carrotsearch.randomizedtesting.rules.SystemPropertiesRestoreRule$1.evaluate(SystemPropertiesRestoreRule.java:57)
	at org.apache.lucene.util.TestRuleSetupTeardownChained$1.evaluate(TestRuleSetupTeardownChained.java:49)
	at org.apache.lucene.util.AbstractBeforeAfterRule$1.evaluate(AbstractBeforeAfterRule.java:45)
	at org.apache.lucene.util.TestRuleThreadAndTestName$1.evaluate(TestRuleThreadAndTestName.java:48)
	at org.apache.lucene.util.TestRuleIgnoreAfterMaxFailures$1.evaluate(TestRuleIgnoreAfterMaxFailures.java:64)
	at org.apache.lucene.util.TestRuleMarkFailure$1.evaluate(TestRuleMarkFailure.java:47)
	at com.carrotsearch.randomizedtesting.rules.StatementAdapter.evaluate(StatementAdapter.java:36)
	at com.carrotsearch.randomizedtesting.ThreadLeakControl$StatementRunner.run(ThreadLeakControl.java:368)
	at com.carrotsearch.randomizedtesting.ThreadLeakControl.forkTimeoutingTask(ThreadLeakControl.java:817)
	at com.carrotsearch.randomizedtesting.ThreadLeakControl$3.evaluate(ThreadLeakControl.java:468)
	at com.carrotsearch.randomizedtesting.RandomizedRunner.runSingleTest(RandomizedRunner.java:947)
	at com.carrotsearch.randomizedtesting.RandomizedRunner$5.evaluate(RandomizedRunner.java:832)
	at com.carrotsearch.randomizedtesting.RandomizedRunner$6.evaluate(RandomizedRunner.java:883)
	at com.carrotsearch.randomizedtesting.RandomizedRunner$7.evaluate(RandomizedRunner.java:894)
	at com.carrotsearch.randomizedtesting.rules.StatementAdapter.evaluate(StatementAdapter.java:36)
	at com.carrotsearch.randomizedtesting.rules.SystemPropertiesRestoreRule$1.evaluate(SystemPropertiesRestoreRule.java:57)
	at org.apache.lucene.util.AbstractBeforeAfterRule$1.evaluate(AbstractBeforeAfterRule.java:45)
	at com.carrotsearch.randomizedtesting.rules.StatementAdapter.evaluate(StatementAdapter.java:36)
	at org.apache.lucene.util.TestRuleStoreClassName$1.evaluate(TestRuleStoreClassName.java:41)
	at com.carrotsearch.randomizedtesting.rules.NoShadowingOrOverridesOnMethodsRule$1.evaluate(NoShadowingOrOverridesOnMethodsRule.java:40)
	at com.carrotsearch.randomizedtesting.rules.NoShadowingOrOverridesOnMethodsRule$1.evaluate(NoShadowingOrOverridesOnMethodsRule.java:40)
	at com.carrotsearch.randomizedtesting.rules.StatementAdapter.evaluate(StatementAdapter.java:36)
	at com.carrotsearch.randomizedtesting.rules.StatementAdapter.evaluate(StatementAdapter.java:36)
	at com.carrotsearch.randomizedtesting.rules.StatementAdapter.evaluate(StatementAdapter.java:36)
	at org.apache.lucene.util.TestRuleAssertionsRequired$1.evaluate(TestRuleAssertionsRequired.java:53)
	at org.apache.lucene.util.TestRuleMarkFailure$1.evaluate(TestRuleMarkFailure.java:47)
	at org.apache.lucene.util.TestRuleIgnoreAfterMaxFailures$1.evaluate(TestRuleIgnoreAfterMaxFailures.java:64)
	at org.apache.lucene.util.TestRuleIgnoreTestSuites$1.evaluate(TestRuleIgnoreTestSuites.java:54)
	at com.carrotsearch.randomizedtesting.rules.StatementAdapter.evaluate(StatementAdapter.java:36)
	at com.carrotsearch.randomizedtesting.ThreadLeakControl$StatementRunner.run(ThreadLeakControl.java:368)
	at java.lang.Thread.run(Thread.java:748)




Build Log:
[...truncated 15143 lines...]
   [junit4] Suite: org.apache.solr.cloud.autoscaling.HdfsAutoAddReplicasIntegrationTest
   [junit4]   2> Creating dataDir: /x1/jenkins/jenkins-slave/workspace/Lucene-Solr-NightlyTests-8.x/checkout/solr/build/solr-core/test/J0/temp/solr.cloud.autoscaling.HdfsAutoAddReplicasIntegrationTest_5F9892CFEB306221-001/init-core-data-001
   [junit4]   2> 3089547 INFO  (SUITE-HdfsAutoAddReplicasIntegrationTest-seed#[5F9892CFEB306221]-worker) [    ] o.a.s.SolrTestCaseJ4 Using TrieFields (NUMERIC_POINTS_SYSPROP=false) w/NUMERIC_DOCVALUES_SYSPROP=false
   [junit4]   2> 3089549 INFO  (SUITE-HdfsAutoAddReplicasIntegrationTest-seed#[5F9892CFEB306221]-worker) [    ] o.a.s.SolrTestCaseJ4 Randomized ssl (true) and clientAuth (true) via: @org.apache.solr.util.RandomizeSSL(reason=, ssl=NaN, value=NaN, clientAuth=NaN)
   [junit4]   2> 3089550 INFO  (SUITE-HdfsAutoAddReplicasIntegrationTest-seed#[5F9892CFEB306221]-worker) [    ] o.a.s.SolrTestCaseJ4 SecureRandom sanity checks: test.solr.allowed.securerandom=null & java.security.egd=file:/dev/./urandom
   [junit4]   1> Formatting using clusterid: testClusterID
   [junit4]   2> 3089623 WARN  (SUITE-HdfsAutoAddReplicasIntegrationTest-seed#[5F9892CFEB306221]-worker) [    ] o.a.h.m.i.MetricsConfig Cannot locate configuration: tried hadoop-metrics2-namenode.properties,hadoop-metrics2.properties
   [junit4]   2> 3089639 WARN  (SUITE-HdfsAutoAddReplicasIntegrationTest-seed#[5F9892CFEB306221]-worker) [    ] o.a.h.h.HttpRequestLog Jetty request log can only be enabled using Log4j
   [junit4]   2> 3089642 INFO  (SUITE-HdfsAutoAddReplicasIntegrationTest-seed#[5F9892CFEB306221]-worker) [    ] o.e.j.s.Server jetty-9.4.14.v20181114; built: 2018-11-14T21:20:31.478Z; git: c4550056e785fb5665914545889f21dc136ad9e6; jvm 1.8.0_191-b12
   [junit4]   2> 3089644 INFO  (SUITE-HdfsAutoAddReplicasIntegrationTest-seed#[5F9892CFEB306221]-worker) [    ] o.e.j.s.session DefaultSessionIdManager workerName=node0
   [junit4]   2> 3089644 INFO  (SUITE-HdfsAutoAddReplicasIntegrationTest-seed#[5F9892CFEB306221]-worker) [    ] o.e.j.s.session No SessionScavenger set, using defaults
   [junit4]   2> 3089644 INFO  (SUITE-HdfsAutoAddReplicasIntegrationTest-seed#[5F9892CFEB306221]-worker) [    ] o.e.j.s.session node0 Scavenging every 600000ms
   [junit4]   2> 3089645 INFO  (SUITE-HdfsAutoAddReplicasIntegrationTest-seed#[5F9892CFEB306221]-worker) [    ] o.e.j.s.h.ContextHandler Started o.e.j.s.ServletContextHandler@1d6b5776{static,/static,jar:file:/x1/jenkins/.ivy2/cache/org.apache.hadoop/hadoop-hdfs/tests/hadoop-hdfs-3.2.0-tests.jar!/webapps/static,AVAILABLE}
   [junit4]   2> 3089801 INFO  (SUITE-HdfsAutoAddReplicasIntegrationTest-seed#[5F9892CFEB306221]-worker) [    ] o.e.j.s.h.ContextHandler Started o.e.j.w.WebAppContext@33bf9d57{hdfs,/,file:///x1/jenkins/jenkins-slave/workspace/Lucene-Solr-NightlyTests-8.x/checkout/solr/build/solr-core/test/J0/temp/jetty-localhost-40280-hdfs-_-any-3287511009266535509.dir/webapp/,AVAILABLE}{/hdfs}
   [junit4]   2> 3089802 INFO  (SUITE-HdfsAutoAddReplicasIntegrationTest-seed#[5F9892CFEB306221]-worker) [    ] o.e.j.s.AbstractConnector Started ServerConnector@542d19fa{HTTP/1.1,[http/1.1]}{localhost:40280}
   [junit4]   2> 3089802 INFO  (SUITE-HdfsAutoAddReplicasIntegrationTest-seed#[5F9892CFEB306221]-worker) [    ] o.e.j.s.Server Started @3089940ms
   [junit4]   2> 3089896 WARN  (SUITE-HdfsAutoAddReplicasIntegrationTest-seed#[5F9892CFEB306221]-worker) [    ] o.a.h.h.HttpRequestLog Jetty request log can only be enabled using Log4j
   [junit4]   2> 3089898 INFO  (SUITE-HdfsAutoAddReplicasIntegrationTest-seed#[5F9892CFEB306221]-worker) [    ] o.e.j.s.Server jetty-9.4.14.v20181114; built: 2018-11-14T21:20:31.478Z; git: c4550056e785fb5665914545889f21dc136ad9e6; jvm 1.8.0_191-b12
   [junit4]   2> 3089899 INFO  (SUITE-HdfsAutoAddReplicasIntegrationTest-seed#[5F9892CFEB306221]-worker) [    ] o.e.j.s.session DefaultSessionIdManager workerName=node0
   [junit4]   2> 3089899 INFO  (SUITE-HdfsAutoAddReplicasIntegrationTest-seed#[5F9892CFEB306221]-worker) [    ] o.e.j.s.session No SessionScavenger set, using defaults
   [junit4]   2> 3089899 INFO  (SUITE-HdfsAutoAddReplicasIntegrationTest-seed#[5F9892CFEB306221]-worker) [    ] o.e.j.s.session node0 Scavenging every 660000ms
   [junit4]   2> 3089899 INFO  (SUITE-HdfsAutoAddReplicasIntegrationTest-seed#[5F9892CFEB306221]-worker) [    ] o.e.j.s.h.ContextHandler Started o.e.j.s.ServletContextHandler@42abe31a{static,/static,jar:file:/x1/jenkins/.ivy2/cache/org.apache.hadoop/hadoop-hdfs/tests/hadoop-hdfs-3.2.0-tests.jar!/webapps/static,AVAILABLE}
   [junit4]   2> 3090060 INFO  (SUITE-HdfsAutoAddReplicasIntegrationTest-seed#[5F9892CFEB306221]-worker) [    ] o.e.j.s.h.ContextHandler Started o.e.j.w.WebAppContext@5cd5825f{datanode,/,file:///x1/jenkins/jenkins-slave/workspace/Lucene-Solr-NightlyTests-8.x/checkout/solr/build/solr-core/test/J0/temp/jetty-localhost-34621-datanode-_-any-8238905775948206498.dir/webapp/,AVAILABLE}{/datanode}
   [junit4]   2> 3090060 INFO  (SUITE-HdfsAutoAddReplicasIntegrationTest-seed#[5F9892CFEB306221]-worker) [    ] o.e.j.s.AbstractConnector Started ServerConnector@529ec7dd{HTTP/1.1,[http/1.1]}{localhost:34621}
   [junit4]   2> 3090060 INFO  (SUITE-HdfsAutoAddReplicasIntegrationTest-seed#[5F9892CFEB306221]-worker) [    ] o.e.j.s.Server Started @3090198ms
   [junit4]   2> 3090276 WARN  (SUITE-HdfsAutoAddReplicasIntegrationTest-seed#[5F9892CFEB306221]-worker) [    ] o.a.h.h.HttpRequestLog Jetty request log can only be enabled using Log4j
   [junit4]   2> 3090278 INFO  (SUITE-HdfsAutoAddReplicasIntegrationTest-seed#[5F9892CFEB306221]-worker) [    ] o.e.j.s.Server jetty-9.4.14.v20181114; built: 2018-11-14T21:20:31.478Z; git: c4550056e785fb5665914545889f21dc136ad9e6; jvm 1.8.0_191-b12
   [junit4]   2> 3090278 INFO  (SUITE-HdfsAutoAddReplicasIntegrationTest-seed#[5F9892CFEB306221]-worker) [    ] o.e.j.s.session DefaultSessionIdManager workerName=node0
   [junit4]   2> 3090278 INFO  (SUITE-HdfsAutoAddReplicasIntegrationTest-seed#[5F9892CFEB306221]-worker) [    ] o.e.j.s.session No SessionScavenger set, using defaults
   [junit4]   2> 3090278 INFO  (SUITE-HdfsAutoAddReplicasIntegrationTest-seed#[5F9892CFEB306221]-worker) [    ] o.e.j.s.session node0 Scavenging every 600000ms
   [junit4]   2> 3090279 INFO  (SUITE-HdfsAutoAddReplicasIntegrationTest-seed#[5F9892CFEB306221]-worker) [    ] o.e.j.s.h.ContextHandler Started o.e.j.s.ServletContextHandler@1c86677a{static,/static,jar:file:/x1/jenkins/.ivy2/cache/org.apache.hadoop/hadoop-hdfs/tests/hadoop-hdfs-3.2.0-tests.jar!/webapps/static,AVAILABLE}
   [junit4]   2> 3090346 INFO  (Block report processor) [    ] BlockStateChange BLOCK* processReport 0xab7329c5ba012df2: Processing first storage report for DS-2fd9d52c-0f30-4196-9917-0405dc2a1821 from datanode b03ffe34-9e9c-4b03-8067-7e7212eb2453
   [junit4]   2> 3090346 INFO  (Block report processor) [    ] BlockStateChange BLOCK* processReport 0xab7329c5ba012df2: from storage DS-2fd9d52c-0f30-4196-9917-0405dc2a1821 node DatanodeRegistration(127.0.0.1:37160, datanodeUuid=b03ffe34-9e9c-4b03-8067-7e7212eb2453, infoPort=45721, infoSecurePort=0, ipcPort=42732, storageInfo=lv=-57;cid=testClusterID;nsid=730758625;c=1556679336461), blocks: 0, hasStaleStorage: true, processing time: 0 msecs, invalidatedBlocks: 0
   [junit4]   2> 3090347 INFO  (Block report processor) [    ] BlockStateChange BLOCK* processReport 0xab7329c5ba012df2: Processing first storage report for DS-73c7dfb7-fe5c-4143-9198-4f0b1de4c7fc from datanode b03ffe34-9e9c-4b03-8067-7e7212eb2453
   [junit4]   2> 3090347 INFO  (Block report processor) [    ] BlockStateChange BLOCK* processReport 0xab7329c5ba012df2: from storage DS-73c7dfb7-fe5c-4143-9198-4f0b1de4c7fc node DatanodeRegistration(127.0.0.1:37160, datanodeUuid=b03ffe34-9e9c-4b03-8067-7e7212eb2453, infoPort=45721, infoSecurePort=0, ipcPort=42732, storageInfo=lv=-57;cid=testClusterID;nsid=730758625;c=1556679336461), blocks: 0, hasStaleStorage: false, processing time: 0 msecs, invalidatedBlocks: 0
   [junit4]   2> 3090461 INFO  (SUITE-HdfsAutoAddReplicasIntegrationTest-seed#[5F9892CFEB306221]-worker) [    ] o.e.j.s.h.ContextHandler Started o.e.j.w.WebAppContext@73b29201{datanode,/,file:///x1/jenkins/jenkins-slave/workspace/Lucene-Solr-NightlyTests-8.x/checkout/solr/build/solr-core/test/J0/temp/jetty-localhost-45415-datanode-_-any-2277924125104122831.dir/webapp/,AVAILABLE}{/datanode}
   [junit4]   2> 3090463 INFO  (SUITE-HdfsAutoAddReplicasIntegrationTest-seed#[5F9892CFEB306221]-worker) [    ] o.e.j.s.AbstractConnector Started ServerConnector@3e0ce91{HTTP/1.1,[http/1.1]}{localhost:45415}
   [junit4]   2> 3090463 INFO  (SUITE-HdfsAutoAddReplicasIntegrationTest-seed#[5F9892CFEB306221]-worker) [    ] o.e.j.s.Server Started @3090601ms
   [junit4]   2> 3090636 INFO  (Block report processor) [    ] BlockStateChange BLOCK* processReport 0x115ce4dc19a1f46d: Processing first storage report for DS-7cdd75e2-e39e-4b5e-862e-bf776b4ffbe2 from datanode 853c6969-305e-4b5c-a606-0e77fe80c23b
   [junit4]   2> 3090636 INFO  (Block report processor) [    ] BlockStateChange BLOCK* processReport 0x115ce4dc19a1f46d: from storage DS-7cdd75e2-e39e-4b5e-862e-bf776b4ffbe2 node DatanodeRegistration(127.0.0.1:41930, datanodeUuid=853c6969-305e-4b5c-a606-0e77fe80c23b, infoPort=38838, infoSecurePort=0, ipcPort=34653, storageInfo=lv=-57;cid=testClusterID;nsid=730758625;c=1556679336461), blocks: 0, hasStaleStorage: true, processing time: 0 msecs, invalidatedBlocks: 0
   [junit4]   2> 3090637 INFO  (Block report processor) [    ] BlockStateChange BLOCK* processReport 0x115ce4dc19a1f46d: Processing first storage report for DS-3ac16640-8920-4c5a-8109-1c079bed61be from datanode 853c6969-305e-4b5c-a606-0e77fe80c23b
   [junit4]   2> 3090637 INFO  (Block report processor) [    ] BlockStateChange BLOCK* processReport 0x115ce4dc19a1f46d: from storage DS-3ac16640-8920-4c5a-8109-1c079bed61be node DatanodeRegistration(127.0.0.1:41930, datanodeUuid=853c6969-305e-4b5c-a606-0e77fe80c23b, infoPort=38838, infoSecurePort=0, ipcPort=34653, storageInfo=lv=-57;cid=testClusterID;nsid=730758625;c=1556679336461), blocks: 0, hasStaleStorage: false, processing time: 0 msecs, invalidatedBlocks: 0
   [junit4]   2> 3090924 INFO  (TEST-HdfsAutoAddReplicasIntegrationTest.testSimple-seed#[5F9892CFEB306221]) [    ] o.a.s.SolrTestCaseJ4 ###Starting testSimple
   [junit4]   2> 3090926 INFO  (TEST-HdfsAutoAddReplicasIntegrationTest.testSimple-seed#[5F9892CFEB306221]) [    ] o.a.s.c.MiniSolrCloudCluster Starting cluster of 3 servers in /x1/jenkins/jenkins-slave/workspace/Lucene-Solr-NightlyTests-8.x/checkout/solr/build/solr-core/test/J0/temp/solr.cloud.autoscaling.HdfsAutoAddReplicasIntegrationTest_5F9892CFEB306221-001/tempDir-002
   [junit4]   2> 3090926 INFO  (TEST-HdfsAutoAddReplicasIntegrationTest.testSimple-seed#[5F9892CFEB306221]) [    ] o.a.s.c.ZkTestServer STARTING ZK TEST SERVER
   [junit4]   2> 3090926 INFO  (ZkTestServer Run Thread) [    ] o.a.s.c.ZkTestServer client port:0.0.0.0/0.0.0.0:0
   [junit4]   2> 3090926 INFO  (ZkTestServer Run Thread) [    ] o.a.s.c.ZkTestServer Starting server
   [junit4]   2> 3091026 INFO  (TEST-HdfsAutoAddReplicasIntegrationTest.testSimple-seed#[5F9892CFEB306221]) [    ] o.a.s.c.ZkTestServer start zk server on port:43353
   [junit4]   2> 3091026 INFO  (TEST-HdfsAutoAddReplicasIntegrationTest.testSimple-seed#[5F9892CFEB306221]) [    ] o.a.s.c.ZkTestServer parse host and port list: 127.0.0.1:43353
   [junit4]   2> 3091027 INFO  (TEST-HdfsAutoAddReplicasIntegrationTest.testSimple-seed#[5F9892CFEB306221]) [    ] o.a.s.c.ZkTestServer connecting to 127.0.0.1 43353
   [junit4]   2> 3091032 INFO  (zkConnectionManagerCallback-78941-thread-1) [    ] o.a.s.c.c.ConnectionManager zkClient has connected
   [junit4]   2> 3091035 INFO  (zkConnectionManagerCallback-78943-thread-1) [    ] o.a.s.c.c.ConnectionManager zkClient has connected
   [junit4]   2> 3091036 INFO  (zkConnectionManagerCallback-78945-thread-1) [    ] o.a.s.c.c.ConnectionManager zkClient has connected
   [junit4]   2> 3091040 WARN  (jetty-launcher-78946-thread-1) [    ] o.e.j.s.AbstractConnector Ignoring deprecated socket close linger time
   [junit4]   2> 3091040 INFO  (jetty-launcher-78946-thread-1) [    ] o.a.s.c.s.e.JettySolrRunner Start Jetty (original configured port=0)
   [junit4]   2> 3091040 INFO  (jetty-launcher-78946-thread-1) [    ] o.a.s.c.s.e.JettySolrRunner Trying to start Jetty on port 0 try number 1 ...
   [junit4]   2> 3091040 INFO  (jetty-launcher-78946-thread-1) [    ] o.e.j.s.Server jetty-9.4.14.v20181114; built: 2018-11-14T21:20:31.478Z; git: c4550056e785fb5665914545889f21dc136ad9e6; jvm 1.8.0_191-b12
   [junit4]   2> 3091040 WARN  (jetty-launcher-78946-thread-2) [    ] o.e.j.s.AbstractConnector Ignoring deprecated socket close linger time
   [junit4]   2> 3091041 INFO  (jetty-launcher-78946-thread-2) [    ] o.a.s.c.s.e.JettySolrRunner Start Jetty (original configured port=0)
   [junit4]   2> 3091041 INFO  (jetty-launcher-78946-thread-2) [    ] o.a.s.c.s.e.JettySolrRunner Trying to start Jetty on port 0 try number 1 ...
   [junit4]   2> 3091041 INFO  (jetty-launcher-78946-thread-2) [    ] o.e.j.s.Server jetty-9.4.14.v20181114; built: 2018-11-14T21:20:31.478Z; git: c4550056e785fb5665914545889f21dc136ad9e6; jvm 1.8.0_191-b12
   [junit4]   2> 3091041 WARN  (jetty-launcher-78946-thread-3) [    ] o.e.j.s.AbstractConnector Ignoring deprecated socket close linger time
   [junit4]   2> 3091042 INFO  (jetty-launcher-78946-thread-3) [    ] o.a.s.c.s.e.JettySolrRunner Start Jetty (original configured port=0)
   [junit4]   2> 3091042 INFO  (jetty-launcher-78946-thread-3) [    ] o.a.s.c.s.e.JettySolrRunner Trying to start Jetty on port 0 try number 1 ...
   [junit4]   2> 3091042 INFO  (jetty-launcher-78946-thread-3) [    ] o.e.j.s.Server jetty-9.4.14.v20181114; built: 2018-11-14T21:20:31.478Z; git: c4550056e785fb5665914545889f21dc136ad9e6; jvm 1.8.0_191-b12
   [junit4]   2> 3091043 INFO  (jetty-launcher-78946-thread-1) [    ] o.e.j.s.session DefaultSessionIdManager workerName=node0
   [junit4]   2> 3091043 INFO  (jetty-launcher-78946-thread-1) [    ] o.e.j.s.session No SessionScavenger set, using defaults
   [junit4]   2> 3091043 INFO  (jetty-launcher-78946-thread-1) [    ] o.e.j.s.session node0 Scavenging every 660000ms
   [junit4]   2> 3091043 INFO  (jetty-launcher-78946-thread-1) [    ] o.e.j.s.h.ContextHandler Started o.e.j.s.ServletContextHandler@7715e4fb{/solr,null,AVAILABLE}
   [junit4]   2> 3091044 WARN  (jetty-launcher-78946-thread-1) [    ] o.e.j.u.s.S.config No Client EndPointIdentificationAlgorithm configured for SslContextFactory@2bc12d93[provider=null,keyStore=null,trustStore=null]
   [junit4]   2> 3091045 INFO  (jetty-launcher-78946-thread-2) [    ] o.e.j.s.session DefaultSessionIdManager workerName=node0
   [junit4]   2> 3091045 INFO  (jetty-launcher-78946-thread-2) [    ] o.e.j.s.session No SessionScavenger set, using defaults
   [junit4]   2> 3091045 INFO  (jetty-launcher-78946-thread-2) [    ] o.e.j.s.session node0 Scavenging every 660000ms
   [junit4]   2> 3091045 INFO  (jetty-launcher-78946-thread-2) [    ] o.e.j.s.h.ContextHandler Started o.e.j.s.ServletContextHandler@2c25a14d{/solr,null,AVAILABLE}
   [junit4]   2> 3091046 WARN  (jetty-launcher-78946-thread-2) [    ] o.e.j.u.s.S.config No Client EndPointIdentificationAlgorithm configured for SslContextFactory@16412b15[provider=null,keyStore=null,trustStore=null]
   [junit4]   2> 3091047 INFO  (jetty-launcher-78946-thread-3) [    ] o.e.j.s.session DefaultSessionIdManager workerName=node0
   [junit4]   2> 3091047 INFO  (jetty-launcher-78946-thread-3) [    ] o.e.j.s.session No SessionScavenger set, using defaults
   [junit4]   2> 3091047 INFO  (jetty-launcher-78946-thread-3) [    ] o.e.j.s.session node0 Scavenging every 660000ms
   [junit4]   2> 3091047 INFO  (jetty-launcher-78946-thread-3) [    ] o.e.j.s.h.ContextHandler Started o.e.j.s.ServletContextHandler@a6be8a{/solr,null,AVAILABLE}
   [junit4]   2> 3091047 WARN  (jetty-launcher-78946-thread-3) [    ] o.e.j.u.s.S.config No Client EndPointIdentificationAlgorithm configured for SslContextFactory@7e65855c[provider=null,keyStore=null,trustStore=null]
   [junit4]   2> 3091048 INFO  (jetty-launcher-78946-thread-3) [    ] o.e.j.s.AbstractConnector Started ServerConnector@6dc9767f{SSL,[ssl, http/1.1]}{127.0.0.1:41689}
   [junit4]   2> 3091048 INFO  (jetty-launcher-78946-thread-3) [    ] o.e.j.s.Server Started @3091186ms
   [junit4]   2> 3091048 INFO  (jetty-launcher-78946-thread-1) [    ] o.e.j.s.AbstractConnector Started ServerConnector@706b5765{SSL,[ssl, http/1.1]}{127.0.0.1:41163}
   [junit4]   2> 3091048 INFO  (jetty-launcher-78946-thread-3) [    ] o.a.s.c.s.e.JettySolrRunner Jetty properties: {hostContext=/solr, hostPort=41689}
   [junit4]   2> 3091048 INFO  (jetty-launcher-78946-thread-1) [    ] o.e.j.s.Server Started @3091186ms
   [junit4]   2> 3091048 INFO  (jetty-launcher-78946-thread-1) [    ] o.a.s.c.s.e.JettySolrRunner Jetty properties: {hostContext=/solr, hostPort=41163}
   [junit4]   2> 3091048 ERROR (jetty-launcher-78946-thread-1) [    ] o.a.s.u.StartupLoggingUtils Missing Java Option solr.log.dir. Logging may be missing or incomplete.
   [junit4]   2> 3091048 INFO  (jetty-launcher-78946-thread-1) [    ] o.a.s.s.SolrDispatchFilter Using logger factory org.apache.logging.slf4j.Log4jLoggerFactory
   [junit4]   2> 3091048 INFO  (jetty-launcher-78946-thread-1) [    ] o.a.s.s.SolrDispatchFilter  ___      _       Welcome to Apache Solr? version 8.1.0
   [junit4]   2> 3091048 INFO  (jetty-launcher-78946-thread-1) [    ] o.a.s.s.SolrDispatchFilter / __| ___| |_ _   Starting in cloud mode on port null
   [junit4]   2> 3091048 INFO  (jetty-launcher-78946-thread-1) [    ] o.a.s.s.SolrDispatchFilter \__ \/ _ \ | '_|  Install dir: null
   [junit4]   2> 3091048 INFO  (jetty-launcher-78946-thread-1) [    ] o.a.s.s.SolrDispatchFilter |___/\___/_|_|    Start time: 2019-05-01T02:55:37.935Z
   [junit4]   2> 3091049 ERROR (jetty-launcher-78946-thread-3) [    ] o.a.s.u.StartupLoggingUtils Missing Java Option solr.log.dir. Logging may be missing or incomplete.
   [junit4]   2> 3091049 INFO  (jetty-launcher-78946-thread-3) [    ] o.a.s.s.SolrDispatchFilter Using logger factory org.apache.logging.slf4j.Log4jLoggerFactory
   [junit4]   2> 3091049 INFO  (jetty-launcher-78946-thread-3) [    ] o.a.s.s.SolrDispatchFilter  ___      _       Welcome to Apache Solr? version 8.1.0
   [junit4]   2> 3091049 INFO  (jetty-launcher-78946-thread-3) [    ] o.a.s.s.SolrDispatchFilter / __| ___| |_ _   Starting in cloud mode on port null
   [junit4]   2> 3091049 INFO  (jetty-launcher-78946-thread-3) [    ] o.a.s.s.SolrDispatchFilter \__ \/ _ \ | '_|  Install dir: null
   [junit4]   2> 3091049 INFO  (jetty-launcher-78946-thread-3) [    ] o.a.s.s.SolrDispatchFilter |___/\___/_|_|    Start time: 2019-05-01T02:55:37.936Z
   [junit4]   2> 3091050 INFO  (jetty-launcher-78946-thread-2) [    ] o.e.j.s.AbstractConnector Started ServerConnector@40ad59c3{SSL,[ssl, http/1.1]}{127.0.0.1:32784}
   [junit4]   2> 3091050 INFO  (jetty-launcher-78946-thread-2) [    ] o.e.j.s.Server Started @3091189ms
   [junit4]   2> 3091050 INFO  (jetty-launcher-78946-thread-2) [    ] o.a.s.c.s.e.JettySolrRunner Jetty properties: {hostContext=/solr, hostPort=32784}
   [junit4]   2> 3091051 ERROR (jetty-launcher-78946-thread-2) [    ] o.a.s.u.StartupLoggingUtils Missing Java Option solr.log.dir. Logging may be missing or incomplete.
   [junit4]   2> 3091051 INFO  (jetty-launcher-78946-thread-2) [    ] o.a.s.s.SolrDispatchFilter Using logger factory org.apache.logging.slf4j.Log4jLoggerFactory
   [junit4]   2> 3091051 INFO  (jetty-launcher-78946-thread-2) [    ] o.a.s.s.SolrDispatchFilter  ___      _       Welcome to Apache Solr? version 8.1.0
   [junit4]   2> 3091051 INFO  (jetty-launcher-78946-thread-2) [    ] o.a.s.s.SolrDispatchFilter / __| ___| |_ _   Starting in cloud mode on port null
   [junit4]   2> 3091051 INFO  (jetty-launcher-78946-thread-2) [    ] o.a.s.s.SolrDispatchFilter \__ \/ _ \ | '_|  Install dir: null
   [junit4]   2> 3091051 INFO  (jetty-launcher-78946-thread-2) [    ] o.a.s.s.SolrDispatchFilter |___/\___/_|_|    Start time: 2019-05-01T02:55:37.938Z
   [junit4]   2> 3091053 INFO  (zkConnectionManagerCallback-78948-thread-1) [    ] o.a.s.c.c.ConnectionManager zkClient has connected
   [junit4]   2> 3091053 INFO  (zkConnectionManagerCallback-78952-thread-1) [    ] o.a.s.c.c.ConnectionManager zkClient has connected
   [junit4]   2> 3091054 INFO  (jetty-launcher-78946-thread-1) [    ] o.a.s.s.SolrDispatchFilter solr.xml found in ZooKeeper. Loading...
   [junit4]   2> 3091054 INFO  (jetty-launcher-78946-thread-2) [    ] o.a.s.s.SolrDispatchFilter solr.xml found in ZooKeeper. Loading...
   [junit4]   2> 3091059 INFO  (jetty-launcher-78946-thread-1) [    ] o.a.s.c.SolrXmlConfig Configuration parameter autoReplicaFailoverWorkLoopDelay is ignored
   [junit4]   2> 3091059 INFO  (jetty-launcher-78946-thread-1) [    ] o.a.s.c.SolrXmlConfig Configuration parameter autoReplicaFailoverBadNodeExpiration is ignored
   [junit4]   2> 3091060 INFO  (jetty-launcher-78946-thread-1) [    ] o.a.s.c.SolrXmlConfig MBean server found: com.sun.jmx.mbeanserver.JmxMBeanServer@3259d7d8, but no JMX reporters were configured - adding default JMX reporter.
   [junit4]   2> 3091064 INFO  (jetty-launcher-78946-thread-2) [    ] o.a.s.c.SolrXmlConfig Configuration parameter autoReplicaFailoverWorkLoopDelay is ignored
   [junit4]   2> 3091064 INFO  (jetty-launcher-78946-thread-2) [    ] o.a.s.c.SolrXmlConfig Configuration parameter autoReplicaFailoverBadNodeExpiration is ignored
   [junit4]   2> 3091066 INFO  (jetty-launcher-78946-thread-2) [    ] o.a.s.c.SolrXmlConfig MBean server found: com.sun.jmx.mbeanserver.JmxMBeanServer@3259d7d8, but no JMX reporters were configured - adding default JMX reporter.
   [junit4]   2> 3091078 INFO  (zkConnectionManagerCallback-78950-thread-1) [    ] o.a.s.c.c.ConnectionManager zkClient has connected
   [junit4]   2> 3091078 INFO  (jetty-launcher-78946-thread-3) [    ] o.a.s.s.SolrDispatchFilter solr.xml found in ZooKeeper. Loading...
   [junit4]   2> 3091082 INFO  (jetty-launcher-78946-thread-3) [    ] o.a.s.c.SolrXmlConfig Configuration parameter autoReplicaFailoverWorkLoopDelay is ignored
   [junit4]   2> 3091082 INFO  (jetty-launcher-78946-thread-3) [    ] o.a.s.c.SolrXmlConfig Configuration parameter autoReplicaFailoverBadNodeExpiration is ignored
   [junit4]   2> 3091084 INFO  (jetty-launcher-78946-thread-3) [    ] o.a.s.c.SolrXmlConfig MBean server found: com.sun.jmx.mbeanserver.JmxMBeanServer@3259d7d8, but no JMX reporters were configured - adding default JMX reporter.
   [junit4]   2> 3091203 INFO  (jetty-launcher-78946-thread-1) [    ] o.a.s.h.c.HttpShardHandlerFactory Host whitelist initialized: WhitelistHostChecker [whitelistHosts=null, whitelistHostCheckingEnabled=true]
   [junit4]   2> 3091204 WARN  (jetty-launcher-78946-thread-1) [    ] o.a.s.c.s.i.Http2SolrClient Create Http2SolrClient with HTTP/1.1 transport since Java 8 or lower versions does not support SSL + HTTP/2
   [junit4]   2> 3091205 WARN  (jetty-launcher-78946-thread-1) [    ] o.e.j.u.s.S.config No Client EndPointIdentificationAlgorithm configured for SslContextFactory@478b91e4[provider=null,keyStore=null,trustStore=null]
   [junit4]   2> 3091230 WARN  (jetty-launcher-78946-thread-1) [    ] o.a.s.c.s.i.Http2SolrClient Create Http2SolrClient with HTTP/1.1 transport since Java 8 or lower versions does not support SSL + HTTP/2
   [junit4]   2> 3091237 WARN  (jetty-launcher-78946-thread-1) [    ] o.e.j.u.s.S.config No Client EndPointIdentificationAlgorithm configured for SslContextFactory@3d56dec0[provider=null,keyStore=null,trustStore=null]
   [junit4]   2> 3091239 INFO  (jetty-launcher-78946-thread-1) [    ] o.a.s.c.ZkContainer Zookeeper client=127.0.0.1:43353/solr
   [junit4]   2> 3091249 INFO  (zkConnectionManagerCallback-78961-thread-1) [    ] o.a.s.c.c.ConnectionManager zkClient has connected
   [junit4]   2> 3091273 INFO  (zkConnectionManagerCallback-78963-thread-1) [    ] o.a.s.c.c.ConnectionManager zkClient has connected
   [junit4]   2> 3091290 INFO  (jetty-launcher-78946-thread-3) [    ] o.a.s.h.c.HttpShardHandlerFactory Host whitelist initialized: WhitelistHostChecker [whitelistHosts=null, whitelistHostCheckingEnabled=true]
   [junit4]   2> 3091291 WARN  (jetty-launcher-78946-thread-3) [    ] o.a.s.c.s.i.Http2SolrClient Create Http2SolrClient with HTTP/1.1 transport since Java 8 or lower versions does not support SSL + HTTP/2
   [junit4]   2> 3091292 WARN  (jetty-launcher-78946-thread-3) [    ] o.e.j.u.s.S.config No Client EndPointIdentificationAlgorithm configured for SslContextFactory@7bdd47e7[provider=null,keyStore=null,trustStore=null]
   [junit4]   2> 3091294 WARN  (jetty-launcher-78946-thread-3) [    ] o.a.s.c.s.i.Http2SolrClient Create Http2SolrClient with HTTP/1.1 transport since Java 8 or lower versions does not support SSL + HTTP/2
   [junit4]   2> 3091295 WARN  (jetty-launcher-78946-thread-3) [    ] o.e.j.u.s.S.config No Client EndPointIdentificationAlgorithm configured for SslContextFactory@4701788a[provider=null,keyStore=null,trustStore=null]
   [junit4]   2> 3091296 INFO  (jetty-launcher-78946-thread-3) [    ] o.a.s.c.ZkContainer Zookeeper client=127.0.0.1:43353/solr
   [junit4]   2> 3091307 INFO  (zkConnectionManagerCallback-78971-thread-1) [    ] o.a.s.c.c.ConnectionManager zkClient has connected
   [junit4]   2> 3091308 WARN  (NIOServerCxn.Factory:0.0.0.0/0.0.0.0:0) [    ] o.a.z.s.NIOServerCnxn Unable to read additional data from client sessionid 0x10425cd6f190008, likely client has closed socket
   [junit4]   2> 3091313 INFO  (zkConnectionManagerCallback-78973-thread-1) [    ] o.a.s.c.c.ConnectionManager zkClient has connected
   [junit4]   2> 3091325 INFO  (jetty-launcher-78946-thread-3) [n:127.0.0.1:41689_solr    ] o.a.s.c.OverseerElectionContext I am going to be the leader 127.0.0.1:41689_solr
   [junit4]   2> 3091326 INFO  (jetty-launcher-78946-thread-3) [n:127.0.0.1:41689_solr    ] o.a.s.c.Overseer Overseer (id=73225058207203337-127.0.0.1:41689_solr-n_0000000000) starting
   [junit4]   2> 3091336 INFO  (jetty-launcher-78946-thread-2) [    ] o.a.s.h.c.HttpShardHandlerFactory Host whitelist initialized: WhitelistHostChecker [whitelistHosts=null, whitelistHostCheckingEnabled=true]
   [junit4]   2> 3091337 WARN  (jetty-launcher-78946-thread-2) [    ] o.a.s.c.s.i.Http2SolrClient Create Http2SolrClient with HTTP/1.1 transport since Java 8 or lower versions does not support SSL + HTTP/2
   [junit4]   2> 3091337 INFO  (zkConnectionManagerCallback-78980-thread-1) [    ] o.a.s.c.c.ConnectionManager zkClient has connected
   [junit4]   2> 3091338 WARN  (jetty-launcher-78946-thread-2) [    ] o.e.j.u.s.S.config No Client EndPointIdentificationAlgorithm configured for SslContextFactory@506f2969[provider=null,keyStore=null,trustStore=null]
   [junit4]   2> 3091340 WARN  (jetty-launcher-78946-thread-2) [    ] o.a.s.c.s.i.Http2SolrClient Create Http2SolrClient with HTTP/1.1 transport since Java 8 or lower versions does not support SSL + HTTP/2
   [junit4]   2> 3091341 INFO  (jetty-launcher-78946-thread-3) [n:127.0.0.1:41689_solr    ] o.a.s.c.s.i.ZkClientClusterStateProvider Cluster at 127.0.0.1:43353/solr ready
   [junit4]   2> 3091341 WARN  (jetty-launcher-78946-thread-2) [    ] o.e.j.u.s.S.config No Client EndPointIdentificationAlgorithm configured for SslContextFactory@5b06d8a4[provider=null,keyStore=null,trustStore=null]
   [junit4]   2> 3091342 INFO  (OverseerStateUpdate-73225058207203337-127.0.0.1:41689_solr-n_0000000000) [n:127.0.0.1:41689_solr    ] o.a.s.c.Overseer Starting to work on the main queue : 127.0.0.1:41689_solr
   [junit4]   2> 3091342 INFO  (jetty-launcher-78946-thread-2) [    ] o.a.s.c.ZkContainer Zookeeper client=127.0.0.1:43353/solr
   [junit4]   2> 3091344 INFO  (jetty-launcher-78946-thread-3) [n:127.0.0.1:41689_solr    ] o.a.s.c.ZkController Register node as live in ZooKeeper:/live_nodes/127.0.0.1:41689_solr
   [junit4]   2> 3091345 INFO  (zkConnectionManagerCallback-78986-thread-1) [    ] o.a.s.c.c.ConnectionManager zkClient has connected
   [junit4]   2> 3091348 INFO  (zkCallback-78972-thread-1) [    ] o.a.s.c.c.ZkStateReader Updated live nodes from ZooKeeper... (0) -> (1)
   [junit4]   2> 3091348 WARN  (NIOServerCxn.Factory:0.0.0.0/0.0.0.0:0) [    ] o.a.z.s.NIOServerCnxn Unable to read additional data from client sessionid 0x10425cd6f19000b, likely client has closed socket
   [junit4]   2> 3091348 INFO  (zkCallback-78979-thread-1) [    ] o.a.s.c.c.ZkStateReader Updated live nodes from ZooKeeper... (0) -> (1)
   [junit4]   2> 3091350 INFO  (zkConnectionManagerCallback-78988-thread-1) [    ] o.a.s.c.c.ConnectionManager zkClient has connected
   [junit4]   2> 3091359 INFO  (jetty-launcher-78946-thread-2) [n:127.0.0.1:32784_solr    ] o.a.s.c.c.ZkStateReader Updated live nodes from ZooKeeper... (0) -> (1)
   [junit4]   2> 3091367 INFO  (jetty-launcher-78946-thread-2) [n:127.0.0.1:32784_solr    ] o.a.s.c.ZkController Publish node=127.0.0.1:32784_solr as DOWN
   [junit4]   2> 3091373 INFO  (jetty-launcher-78946-thread-2) [n:127.0.0.1:32784_solr    ] o.a.s.c.TransientSolrCoreCacheDefault Allocating transient cache for 4 transient cores
   [junit4]   2> 3091373 INFO  (jetty-launcher-78946-thread-2) [n:127.0.0.1:32784_solr    ] o.a.s.c.ZkController Register node as live in ZooKeeper:/live_nodes/127.0.0.1:32784_solr
   [junit4]   2> 3091375 INFO  (zkCallback-78979-thread-1) [    ] o.a.s.c.c.ZkStateReader Updated live nodes from ZooKeeper... (1) -> (2)
   [junit4]   2> 3091375 INFO  (zkCallback-78972-thread-1) [    ] o.a.s.c.c.ZkStateReader Updated live nodes from ZooKeeper... (1) -> (2)
   [junit4]   2> 3091377 INFO  (zkCallback-78987-thread-1) [    ] o.a.s.c.c.ZkStateReader Updated live nodes from ZooKeeper... (1) -> (2)
   [junit4]   2> 3091380 INFO  (jetty-launcher-78946-thread-3) [n:127.0.0.1:41689_solr    ] o.a.s.h.a.MetricsHistoryHandler No .system collection, keeping metrics history in memory.
   [junit4]   2> 3091391 INFO  (jetty-launcher-78946-thread-1) [n:127.0.0.1:41163_solr    ] o.a.s.c.c.ZkStateReader Updated live nodes from ZooKeeper... (0) -> (2)
   [junit4]   2> 3091396 INFO  (jetty-launcher-78946-thread-1) [n:127.0.0.1:41163_solr    ] o.a.s.c.ZkController Publish node=127.0.0.1:41163_solr as DOWN
   [junit4]   2> 3091397 INFO  (jetty-launcher-78946-thread-1) [n:127.0.0.1:41163_solr    ] o.a.s.c.TransientSolrCoreCacheDefault Allocating transient cache for 4 transient cores
   [junit4]   2> 3091397 INFO  (jetty-launcher-78946-thread-1) [n:127.0.0.1:41163_solr    ] o.a.s.c.ZkController Register node as live in ZooKeeper:/live_nodes/127.0.0.1:41163_solr
   [junit4]   2> 3091398 INFO  (zkCallback-78972-thread-1) [    ] o.a.s.c.c.ZkStateReader Updated live nodes from ZooKeeper... (2) -> (3)
   [junit4]   2> 3091399 INFO  (zkCallback-78979-thread-1) [    ] o.a.s.c.c.ZkStateReader Updated live nodes from ZooKeeper... (2) -> (3)
   [junit4]   2> 3091399 INFO  (zkCallback-78987-thread-1) [    ] o.a.s.c.c.ZkStateReader Updated live nodes from ZooKeeper... (2) -> (3)
   [junit4]   2> 3091400 INFO  (zkCallback-78962-thread-1) [    ] o.a.s.c.c.ZkStateReader Updated live nodes from ZooKeeper... (2) -> (3)
   [junit4]   2> 3091416 INFO  (jetty-launcher-78946-thread-3) [n:127.0.0.1:41689_solr    ] o.a.s.m.r.SolrJmxReporter JMX monitoring for 'solr.node' (registry 'solr.node') enabled at server: com.sun.jmx.mbeanserver.JmxMBeanServer@3259d7d8
   [junit4]   2> 3091417 INFO  (zkConnectionManagerCallback-78996-thread-1) [    ] o.a.s.c.c.ConnectionManager zkClient has connected
   [junit4]   2> 3091418 INFO  (jetty-launcher-78946-thread-2) [n:127.0.0.1:32784_solr    ] o.a.s.c.c.ZkStateReader Updated live nodes from ZooKeeper... (0) -> (3)
   [junit4]   2> 3091420 INFO  (jetty-launcher-78946-thread-2) [n:127.0.0.1:32784_solr    ] o.a.s.c.s.i.ZkClientClusterStateProvider Cluster at 127.0.0.1:43353/solr ready
   [junit4]   2> 3091420 INFO  (jetty-launcher-78946-thread-2) [n:127.0.0.1:32784_solr    ] o.a.s.h.a.MetricsHistoryHandler No .system collection, keeping metrics history in memory.
   [junit4]   2> 3091430 INFO  (jetty-launcher-78946-thread-3) [n:127.0.0.1:41689_solr    ] o.a.s.m.r.SolrJmxReporter JMX monitoring for 'solr.jvm' (registry 'solr.jvm') enabled at server: com.sun.jmx.mbeanserver.JmxMBeanServer@3259d7d8
   [junit4]   2> 3091430 INFO  (jetty-launcher-78946-thread-3) [n:127.0.0.1:41689_solr    ] o.a.s.m.r.SolrJmxReporter JMX monitoring for 'solr.jetty' (registry 'solr.jetty') enabled at server: com.sun.jmx.mbeanserver.JmxMBeanServer@3259d7d8
   [junit4]   2> 3091432 INFO  (jetty-launcher-78946-thread-3) [n:127.0.0.1:41689_solr    ] o.a.s.c.CorePropertiesLocator Found 0 core definitions underneath /x1/jenkins/jenkins-slave/workspace/Lucene-Solr-NightlyTests-8.x/checkout/solr/build/solr-core/test/J0/temp/solr.cloud.autoscaling.HdfsAutoAddReplicasIntegrationTest_5F9892CFEB306221-001/tempDir-002/node3/.
   [junit4]   2> 3091446 INFO  (zkConnectionManagerCallback-79002-thread-1) [    ] o.a.s.c.c.ConnectionManager zkClient has connected
   [junit4]   2> 3091448 INFO  (jetty-launcher-78946-thread-1) [n:127.0.0.1:41163_solr    ] o.a.s.c.c.ZkStateReader Updated live nodes from ZooKeeper... (0) -> (3)
   [junit4]   2> 3091450 INFO  (jetty-launcher-78946-thread-1) [n:127.0.0.1:41163_solr    ] o.a.s.c.s.i.ZkClientClusterStateProvider Cluster at 127.0.0.1:43353/solr ready
   [junit4]   2> 3091450 INFO  (jetty-launcher-78946-thread-1) [n:127.0.0.1:41163_solr    ] o.a.s.h.a.MetricsHistoryHandler No .system collection, keeping metrics history in memory.
   [junit4]   2> 3091451 INFO  (jetty-launcher-78946-thread-2) [n:127.0.0.1:32784_solr    ] o.a.s.m.r.SolrJmxReporter JMX monitoring for 'solr.node' (registry 'solr.node') enabled at server: com.sun.jmx.mbeanserver.JmxMBeanServer@3259d7d8
   [junit4]   2> 3091461 WARN  (jetty-launcher-78946-thread-2) [n:127.0.0.1:32784_solr    ] o.a.s.m.r.j.JmxMetricsReporter Unable to register gauge
   [junit4]   2>           => javax.management.InstanceNotFoundException: solr:dom1=jvm,name0=memory,name1=non-heap,name=committed
   [junit4]   2> 	at com.sun.jmx.interceptor.DefaultMBeanServerInterceptor.getMBean(DefaultMBeanServerInterceptor.java:1095)
   [junit4]   2> javax.management.InstanceNotFoundException: solr:dom1=jvm,name0=memory,name1=non-heap,name=committed
   [junit4]   2> 	at com.sun.jmx.interceptor.DefaultMBeanServerInterceptor.getMBean(DefaultMBeanServerInterceptor.java:1095) ~[?:1.8.0_191]
   [junit4]   2> 	at com.sun.jmx.interceptor.DefaultMBeanServerInterceptor.exclusiveUnregisterMBean(DefaultMBeanServerInterceptor.java:427) ~[?:1.8.0_191]
   [junit4]   2> 	at com.sun.jmx.interceptor.DefaultMBeanServerInterceptor.unregisterMBean(DefaultMBeanServerInterceptor.java:415) ~[?:1.8.0_191]
   [junit4]   2> 	at com.sun.jmx.mbeanserver.JmxMBeanServer.unregisterMBean(JmxMBeanServer.java:546) ~[?:1.8.0_191]
   [junit4]   2> 	at org.apache.solr.metrics.reporters.jmx.JmxMetricsReporter$JmxListener.registerMBean(JmxMetricsReporter.java:531) ~[java/:?]
   [junit4]   2> 	at org.apache.solr.metrics.reporters.jmx.JmxMetricsReporter$JmxListener.onGaugeAdded(JmxMetricsReporter.java:569) ~[java/:?]
   [junit4]   2> 	at org.apache.solr.metrics.reporters.jmx.JmxMetricsReporter.lambda$start$0(JmxMetricsReporter.java:742) ~[java/:?]
   [junit4]   2> 	at java.util.HashMap.forEach(HashMap.java:1289) ~[?:1.8.0_191]
   [junit4]   2> 	at org.apache.solr.metrics.reporters.jmx.JmxMetricsReporter.start(JmxMetricsReporter.java:732) ~[java/:?]
   [junit4]   2> 	at org.apache.solr.metrics.reporters.SolrJmxReporter.doInit(SolrJmxReporter.java:109) ~[java/:?]
   [junit4]   2> 	at org.apache.solr.metrics.SolrMetricReporter.init(SolrMetricReporter.java:70) ~[java/:?]
   [junit4]   2> 	at org.apache.solr.metrics.SolrMetricManager.loadReporter(SolrMetricManager.java:916) ~[java/:?]
   [junit4]   2> 	at org.apache.solr.metrics.SolrMetricManager.loadReporters(SolrMetricManager.java:843) ~[java/:?]
   [junit4]   2> 	at org.apache.solr.core.CoreContainer.load(CoreContainer.java:655) ~[java/:?]
   [junit4]   2> 	at org.apache.solr.servlet.SolrDispatchFilter.createCoreContainer(SolrDispatchFilter.java:255) ~[java/:?]
   [junit4]   2> 	at org.apache.solr.servlet.SolrDispatchFilter.init(SolrDispatchFilter.java:175) ~[java/:?]
   [junit4]   2> 	at org.eclipse.jetty.servlet.FilterHolder.initialize(FilterHolder.java:136) ~[jetty-servlet-9.4.14.v20181114.jar:9.4.14.v20181114]
   [junit4]   2> 	at org.eclipse.jetty.servlet.ServletHandler.lambda$initialize$0(ServletHandler.java:750) ~[jetty-servlet-9.4.14.v20181114.jar:9.4.14.v20181114]
   [junit4]   2> 	at java.util.Spliterators$ArraySpliterator.forEachRemaining(Spliterators.java:948) ~[?:1.8.0_191]
   [junit4]   2> 	at java.util.stream.Streams$ConcatSpliterator.forEachRemaining(Streams.java:742) ~[?:1.8.0_191]
   [junit4]   2> 	at java.util.stream.Streams$ConcatSpliterator.forEachRemaining(Streams.java:742) ~[?:1.8.0_191]
   [junit4]   2> 	at java.util.stream.ReferencePipeline$Head.forEach(ReferencePipeline.java:580) ~[?:1.8.0_191]
   [junit4]   2> 	at org.eclipse.jetty.servlet.ServletHandler.initialize(ServletHandler.java:744) ~[jetty-servlet-9.4.14.v20181114.jar:9.4.14.v20181114]
   [junit4]   2> 	at org.eclipse.jetty.servlet.ServletHandler.updateMappings(ServletHandler.java:1449) ~[jetty-servlet-9.4.14.v20181114.jar:9.4.14.v20181114]
   [junit4]   2> 	at org.eclipse.jetty.servlet.ServletHandler.setFilterMappings(ServletHandler.java:1513) ~[jetty-servlet-9.4.14.v20181114.jar:9.4.14.v20181114]
   [junit4]   2> 	at org.eclipse.jetty.servlet.ServletHandler.addFilterMapping(ServletHandler.java:1158) ~[jetty-servlet-9.4.14.v20181114.jar:9.4.14.v20181114]
   [junit4]   2> 	at org.eclipse.jetty.servlet.ServletHandler.addFilterWithMapping(ServletHandler.java:995) ~[jetty-servlet-9.4.14.v20181114.jar:9.4.14.v20181114]
   [junit4]   2> 	at org.eclipse.jetty.servlet.ServletContextHandler.addFilter(ServletContextHandler.java:467) ~[jetty-servlet-9.4.14.v20181114.jar:9.4.14.v20181114]
   [junit4]   2> 	at org.apache.solr.client.solrj.embedded.JettySolrRunner$1.lifeCycleStarted(JettySolrRunner.java:384) ~[java/:?]
   [junit4]   2> 	at org.eclipse.jetty.util.component.AbstractLifeCycle.setStarted(AbstractLifeCycle.java:179) ~[jetty-util-9.4.14.v20181114.jar:9.4.14.v20181114]
   [junit4]   2> 	at org.eclipse.jetty.util.component.AbstractLifeCycle.start(AbstractLifeCycle.java:69) ~[jetty-util-9.4.14.v20181114.jar:9.4.14.v20181114]
   [junit4]   2> 	at org.apache.solr.client.solrj.embedded.JettySolrRunner.retryOnPortBindFailure(JettySolrRunner.java:558) ~[java/:?]
   [junit4]   2> 	at org.apache.solr.client.solrj.embedded.JettySolrRunner.start(JettySolrRunner.java:497) ~[java/:?]
   [junit4]   2> 	at org.apache.solr.client.solrj.embedded.JettySolrRunner.start(JettySolrRunner.java:465) ~[java/:?]
   [junit4]   2> 	at org.apache.solr.cloud.MiniSolrCloudCluster.startJettySolrRunner(MiniSolrCloudCluster.java:467) ~[java/:?]
   [junit4]   2> 	at org.apache.solr.cloud.MiniSolrCloudCluster.lambda$new$0(MiniSolrCloudCluster.java:300) ~[java/:?]
   [junit4]   2> 	at java.util.concurrent.FutureTask.run(FutureTask.java:266) ~[?:1.8.0_191]
   [junit4]   2> 	at org.apache.solr.common.util.ExecutorUtil$MDCAwareThreadPoolExecutor.lambda$execute$0(ExecutorUtil.java:209) ~[java/:?]
   [junit4]   2> 	at java.util.concurrent.ThreadPoolExecutor.runWorker(ThreadPoolExecutor.java:1149) ~[?:1.8.0_191]
   [junit4]   2> 	at java.util.concurrent.ThreadPoolExecutor$Worker.run(ThreadPoolExecutor.java:624) ~[?:1.8.0_191]
   [junit4]   2> 	at java.lang.Thread.run(Thread.java:748) [?:1.8.0_191]
   [junit4]   2> 3091477 INFO  (jetty-launcher-78946-thread-2) [n:127.0.0.1:32784_solr    ] o.a.s.m.r.SolrJmxReporter JMX monitoring for 'solr.jvm' (registry 'solr.jvm') enabled at server: com.sun.jmx.mbeanserver.JmxMBeanServer@3259d7d8
   [junit4]   2> 3091477 INFO  (jetty-launcher-78946-thread-2) [n:127.0.0.1:32784_solr    ] o.a.s.m.r.SolrJmxReporter JMX monitoring for 'solr.jetty' (registry 'solr.jetty') enabled at server: com.sun.jmx.mbeanserver.JmxMBeanServer@3259d7d8
   [junit4]   2> 3091479 INFO  (jetty-launcher-78946-thread-2) [n:127.0.0.1:32784_solr    ] o.a.s.c.CorePropertiesLocator Found 0 core definitions underneath /x1/jenkins/jenkins-slave/workspace/Lucene-Solr-NightlyTests-8.x/checkout/solr/build/solr-core/test/J0/temp/solr.cloud.autoscaling.HdfsAutoAddReplicasIntegrationTest_5F9892CFEB306221-001/tempDir-002/node2/.
   [junit4]   2> 3091493 INFO  (jetty-launcher-78946-thread-1) [n:127.0.0.1:41163_solr    ] o.a.s.m.r.SolrJmxReporter JMX monitoring for 'solr.node' (registry 'solr.node') enabled at server: com.sun.jmx.mbeanserver.JmxMBeanServer@3259d7d8
   [junit4]   2> 3091502 WARN  (jetty-launcher-78946-thread-2) [n:127.0.0.1:32784_solr    ] o.a.s.m.r.j.JmxMetricsReporter Unable to register gauge
   [junit4]   2>           => javax.management.InstanceNotFoundException: solr:dom1=jvm,name0=memory,name1=pools,name2=Metaspace,name=usage
   [junit4]   2> 	at com.sun.jmx.interceptor.DefaultMBeanServerInterceptor.getMBean(DefaultMBeanServerInterceptor.java:1095)
   [junit4]   2> javax.management.InstanceNotFoundException: solr:dom1=jvm,name0=memory,name1=pools,name2=Metaspace,name=usage
   [junit4]   2> 	at com.sun.jmx.interceptor.DefaultMBeanServerInterceptor.getMBean(DefaultMBeanServerInterceptor.java:1095) ~[?:1.8.0_191]
   [junit4]   2> 	at com.sun.jmx.interceptor.DefaultMBeanServerInterceptor.exclusiveUnregisterMBean(DefaultMBeanServerInterceptor.java:427) ~[?:1.8.0_191]
   [junit4]   2> 	at com.sun.jmx.interceptor.DefaultMBeanServerInterceptor.unregisterMBean(DefaultMBeanServerInterceptor.java:415) ~[?:1.8.0_191]
   [junit4]   2> 	at com.sun.jmx.mbeanserver.JmxMBeanServer.unregisterMBean(JmxMBeanServer.java:546) ~[?:1.8.0_191]
   [junit4]   2> 	at org.apache.solr.metrics.reporters.jmx.JmxMetricsReporter$JmxListener.registerMBean(JmxMetricsReporter.java:531) ~[java/:?]
   [junit4]   2> 	at org.apache.solr.metrics.reporters.jmx.JmxMetricsReporter$JmxListener.onGaugeAdded(JmxMetricsReporter.java:569) ~[java/:?]
   [junit4]   2> 	at com.codahale.metrics.MetricRegistry.notifyListenerOfAddedMetric(MetricRegistry.java:468) ~[metrics-core-4.0.5.jar:4.0.5]
   [junit4]   2> 	at com.codahale.metrics.MetricRegistry.onMetricAdded(MetricRegistry.java:462) ~[metrics-core-4.0.5.jar:4.0.5]
   [junit4]   2> 	at com.codahale.metrics.MetricRegistry.register(MetricRegistry.java:95) ~[metrics-core-4.0.5.jar:4.0.5]
   [junit4]   2> 	at org.apache.solr.metrics.SolrMetricManager.registerAll(SolrMetricManager.java:521) ~[java/:?]
   [junit4]   2> 	at org.apache.solr.servlet.SolrDispatchFilter.setupJvmMetrics(SolrDispatchFilter.java:206) ~[java/:?]
   [junit4]   2> 	at org.apache.solr.servlet.SolrDispatchFilter.init(SolrDispatchFilter.java:178) ~[java/:?]
   [junit4]   2> 	at org.eclipse.jetty.servlet.FilterHolder.initialize(FilterHolder.java:136) ~[jetty-servlet-9.4.14.v20181114.jar:9.4.14.v20181114]
   [junit4]   2> 	at org.eclipse.jetty.servlet.ServletHandler.lambda$initialize$0(ServletHandler.java:750) ~[jetty-servlet-9.4.14.v20181114.jar:9.4.14.v20181114]
   [junit4]   2> 	at java.util.Spliterators$ArraySpliterator.forEachRemaining(Spliterators.java:948) ~[?:1.8.0_191]
   [junit4]   2> 	at java.util.stream.Streams$ConcatSpliterator.forEachRemaining(Streams.java:742) ~[?:1.8.0_191]
   [junit4]   2> 	at java.util.stream.Streams$ConcatSpliterator.forEachRemaining(Streams.java:742) ~[?:1.8.0_191]
   [junit4]   2> 	at java.util.stream.ReferencePipeline$Head.forEach(ReferencePipeline.java:580) ~[?:1.8.0_191]
   [junit4]   2> 	at org.eclipse.jetty.servlet.ServletHandler.initialize(ServletHandler.java:744) ~[jetty-servlet-9.4.14.v20181114.jar:9.4.14.v20181114]
   [junit4]   2> 	at org.eclipse.jetty.servlet.ServletHandler.updateMappings(ServletHandler.java:1449) ~[jetty-servlet-9.4.14.v20181114.jar:9.4.14.v20181114]
   [junit4]   2> 	at org.eclipse.jetty.servlet.ServletHandler.setFilterMappings(ServletHandler.java:1513) ~[jetty-servlet-9.4.14.v20181114.jar:9.4.14.v20181114]
   [junit4]   2> 	at org.eclipse.jetty.servlet.ServletHandler.addFilterMapping(ServletHandler.java:1158) ~[jetty-servlet-9.4.14.v20181114.jar:9.4.14.v20181114]
   [junit4]   2> 	at org.eclipse.jetty.servlet.ServletHandler.addFilterWithMapping(ServletHandler.java:995) ~[jetty-servlet-9.4.14.v20181114.jar:9.4.14.v20181114]
   [junit4]   2> 	at org.eclipse.jetty.servlet.ServletContextHandler.addFilter(ServletContextHandler.java:467) ~[jetty-servlet-9.4.14.v20181114.jar:9.4.14.v20181114]
   [junit4]   2> 	at org.apache.solr.client.solrj.embedded.JettySolrRunner$1.lifeCycleStarted(JettySolrRunner.java:384) ~[java/:?]
   [junit4]   2> 	at org.eclipse.jetty.util.component.AbstractLifeCycle.setStarted(AbstractLifeCycle.java:179) ~[jetty-util-9.4.14.v20181114.jar:9.4.14.v20181114]
   [junit4]   2> 	at org.eclipse.jetty.util.component.AbstractLifeCycle.start(AbstractLifeCycle.java:69) ~[jetty-util-9.4.14.v20181114.jar:9.4.14.v20181114]
   [junit4]   2> 	at org.apache.solr.client.solrj.embedded.JettySolrRunner.retryOnPortBindFailure(JettySolrRunner.java:558) ~[java/:?]
   [junit4]   2> 	at org.apache.solr.client.solrj.embedded.JettySolrRunner.start(JettySolrRunner.java:497) ~[java/:?]
   [junit4]   2> 	at org.apache.solr.client.solrj.embedded.JettySolrRunner.start(JettySolrRunner.java:465) ~[java/:?]
   [junit4]   2> 	at org.apache.solr.cloud.MiniSolrCloudCluster.startJettySolrRunner(MiniSolrCloudCluster.java:467) ~[java/:?]
   [junit4]   2> 	at org.apache.solr.cloud.MiniSolrCloudCluster.lambda$new$0(MiniSolrCloudCluster.java:300) ~[java/:?]
   [junit4]   2> 	at java.util.concurrent.FutureTask.run(FutureTask.java:266) ~[?:1.8.0_191]
   [junit4]   2> 	at org.apache.solr.common.util.ExecutorUtil$MDCAwareThreadPoolExecutor.lambda$execute$0(ExecutorUtil.java:209) ~[java/:?]
   [junit4]   2> 	at java.util.concurrent.ThreadPoolExecutor.runWorker(ThreadPoolExecutor.java:1149) ~[?:1.8.0_191]
   [junit4]   2> 	at java.util.concurrent.ThreadPoolExecutor$Worker.run(ThreadPoolExecutor.java:624) ~[?:1.8.0_191]
   [junit4]   2> 	at java.lang.Thread.run(Thread.java:748) [?:1.8.0_191]
   [junit4]   2> 3091514 INFO  (jetty-launcher-78946-thread-1) [n:127.0.0.1:41163_solr    ] o.a.s.m.r.SolrJmxReporter JMX monitoring for 'solr.jvm' (registry 'solr.jvm') enabled at server: com.sun.jmx.mbeanserver.JmxMBeanServer@3259d7d8
   [junit4]   2> 3091514 INFO  (jetty-launcher-78946-thread-1) [n:127.0.0.1:41163_solr    ] o.a.s.m.r.SolrJmxReporter JMX monitoring for 'solr.jetty' (registry 'solr.jetty') enabled at server: com.sun.jmx.mbeanserver.JmxMBeanServer@3259d7d8
   [junit4]   2> 3091516 INFO  (jetty-launcher-78946-thread-1) [n:127.0.0.1:41163_solr    ] o.a.s.c.CorePropertiesLocator Found 0 core definitions underneath /x1/jenkins/jenkins-slave/workspace/Lucene-Solr-NightlyTests-8.x/checkout/solr/build/solr-core/test/J0/temp/solr.cloud.autoscaling.HdfsAutoAddReplicasIntegrationTest_5F9892CFEB306221-001/tempDir-002/node1/.
   [junit4]   2> 3091576 INFO  (zkConnectionManagerCallback-79008-thread-1) [    ] o.a.s.c.c.ConnectionManager zkClient has connected
   [junit4]   2> 3091577 INFO  (TEST-HdfsAutoAddReplicasIntegrationTest.testSimple-seed#[5F9892CFEB306221]) [    ] o.a.s.c.c.ZkStateReader Updated live nodes from ZooKeeper... (0) -> (3)
   [junit4]   2> 3091578 INFO  (TEST-HdfsAutoAddReplicasIntegrationTest.testSimple-seed#[5F9892CFEB306221]) [    ] o.a.s.c.s.i.ZkClientClusterStateProvider Cluster at 127.0.0.1:43353/solr ready
   [junit4]   2> 3091600 INFO  (qtp731164189-156847) [n:127.0.0.1:41689_solr    ] o.a.s.s.HttpSolrCall [admin] webapp=null path=/cluster params={wt=javabin&version=2} status=0 QTime=3
   [junit4]   2> 3091618 INFO  (qtp593421307-156834) [n:127.0.0.1:41163_solr    ] o.a.s.h.a.CollectionsHandler Invoked Collection Action :create with params collection.configName=conf&maxShardsPerNode=2&autoAddReplicas=true&name=testSimple1&nrtReplicas=2&action=CREATE&numShards=2&createNodeSet=127.0.0.1:41689_solr,127.0.0.1:32784_solr&wt=javabin&version=2 and sendToOCPQueue=true
   [junit4]   2> 3091621 INFO  (OverseerThreadFactory-16025-thread-1-processing-n:127.0.0.1:41689_solr) [n:127.0.0.1:41689_solr    ] o.a.s.c.a.c.CreateCollectionCmd Create collection testSimple1
   [junit4]   2> 3091732 INFO  (OverseerStateUpdate-73225058207203337-127.0.0.1:41689_solr-n_0000000000) [n:127.0.0.1:41689_solr    ] o.a.s.c.o.SliceMutator createReplica() {
   [junit4]   2>   "operation":"ADDREPLICA",
   [junit4]   2>   "collection":"testSimple1",
   [junit4]   2>   "shard":"shard1",
   [junit4]   2>   "core":"testSimple1_shard1_replica_n1",
   [junit4]   2>   "state":"down",
   [junit4]   2>   "base_url":"https://127.0.0.1:41689/solr",
   [junit4]   2>   "type":"NRT",
   [junit4]   2>   "waitForFinalState":"false"} 
   [junit4]   2> 3091744 INFO  (OverseerStateUpdate-73225058207203337-127.0.0.1:41689_solr-n_0000000000) [n:127.0.0.1:41689_solr    ] o.a.s.c.o.SliceMutator createReplica() {
   [junit4]   2>   "operation":"ADDREPLICA",
   [junit4]   2>   "collection":"testSimple1",
   [junit4]   2>   "shard":"shard1",
   [junit4]   2>   "core":"testSimple1_shard1_replica_n3",
   [junit4]   2>   "state":"down",
   [junit4]   2>   "base_url":"https://127.0.0.1:32784/solr",
   [junit4]   2>   "type":"NRT",
   [junit4]   2>   "waitForFinalState":"false"} 
   [junit4]   2> 3091748 INFO  (OverseerStateUpdate-73225058207203337-127.0.0.1:41689_solr-n_0000000000) [n:127.0.0.1:41689_solr    ] o.a.s.c.o.SliceMutator createReplica() {
   [junit4]   2>   "operation":"ADDREPLICA",
   [junit4]   2>   "collection":"testSimple1",
   [junit4]   2>   "shard":"shard2",
   [junit4]   2>   "core":"testSimple1_shard2_replica_n4",
   [junit4]   2>   "state":"down",
   [junit4]   2>   "base_url":"https://127.0.0.1:41689/solr",
   [junit4]   2>   "type":"NRT",
   [junit4]   2>   "waitForFinalState":"false"} 
   [junit4]   2> 3091752 INFO  (OverseerStateUpdate-73225058207203337-127.0.0.1:41689_solr-n_0000000000) [n:127.0.0.1:41689_solr    ] o.a.s.c.o.SliceMutator createReplica() {
   [junit4]   2>   "operation":"ADDREPLICA",
   [junit4]   2>   "collection":"testSimple1",
   [junit4]   2>   "shard":"shard2",
   [junit4]   2>   "core":"testSimple1_shard2_replica_n5",
   [junit4]   2>   "state":"down",
   [junit4]   2>   "base_url":"https://127.0.0.1:32784/solr",
   [junit4]   2>   "type":"NRT",
   [junit4]   2>   "waitForFinalState":"false"} 
   [junit4]   2> 3091953 INFO  (qtp731164189-156846) [n:127.0.0.1:41689_solr    x:testSimple1_shard1_replica_n1] o.a.s.h.a.CoreAdminOperation core create command qt=/admin/cores&coreNodeName=core_node2&collection.configName=conf&newCollection=true&name=testSimple1_shard1_replica_n1&action=CREATE&numShards=2&collection=testSimple1&shard=shard1&wt=javabin&version=2&replicaType=NRT
   [junit4]   2> 3091953 INFO  (qtp731164189-156846) [n:127.0.0.1:41689_solr    x:testSimple1_shard1_replica_n1] o.a.s.c.TransientSolrCoreCacheDefault Allocating transient cache for 4 transient cores
   [junit4]   2> 3091960 INFO  (qtp731164189-156845) [n:127.0.0.1:41689_solr    x:testSimple1_shard2_replica_n4] o.a.s.h.a.CoreAdminOperation core create command qt=/admin/cores&coreNodeName=core_node7&collection.configName=conf&newCollection=true&name=testSimple1_shard2_replica_n4&action=CREATE&numShards=2&collection=testSimple1&shard=shard2&wt=javabin&version=2&replicaType=NRT
   [junit4]   2> 3091979 INFO  (qtp1210816829-156838) [n:127.0.0.1:32784_solr    x:testSimple1_shard2_replica_n5] o.a.s.h.a.CoreAdminOperation core create command qt=/admin/cores&coreNodeName=core_node8&collection.configName=conf&newCollection=true&name=testSimple1_shard2_replica_n5&action=CREATE&numShards=2&collection=testSimple1&shard=shard2&wt=javabin&version=2&replicaType=NRT
   [junit4]   2> 3091986 INFO  (qtp1210816829-156840) [n:127.0.0.1:32784_solr    x:testSimple1_shard1_replica_n3] o.a.s.h.a.CoreAdminOperation core create command qt=/admin/cores&coreNodeName=core_node6&collection.configName=conf&newCollection=true&name=testSimple1_shard1_replica_n3&action=CREATE&numShards=2&collection=testSimple1&shard=shard1&wt=javabin&version=2&replicaType=NRT
   [junit4]   2> 3092968 INFO  (qtp731164189-156846) [n:127.0.0.1:41689_solr c:testSimple1 s:shard1 r:core_node2 x:testSimple1_shard1_replica_n1] o.a.s.c.SolrConfig Using Lucene MatchVersion: 8.1.0
   [junit4]   2> 3092996 INFO  (qtp731164189-156846) [n:127.0.0.1:41689_solr c:testSimple1 s:shard1 r:core_node2 x:testSimple1_shard1_replica_n1] o.a.s.s.IndexSchema [testSimple1_shard1_replica_n1] Schema name=minimal
   [junit4]   2> 3092999 INFO  (qtp1210816829-156838) [n:127.0.0.1:32784_solr c:testSimple1 s:shard2 r:core_node8 x:testSimple1_shard2_replica_n5] o.a.s.c.SolrConfig Using Lucene MatchVersion: 8.1.0
   [junit4]   2> 3092999 INFO  (qtp731164189-156846) [n:127.0.0.1:41689_solr c:testSimple1 s:shard1 r:core_node2 x:testSimple1_shard1_replica_n1] o.a.s.s.IndexSchema Loaded schema minimal/1.1 with uniqueid field id
   [junit4]   2> 3092999 INFO  (qtp731164189-156846) [n:127.0.0.1:41689_solr c:testSimple1 s:shard1 r:core_node2 x:testSimple1_shard1_replica_n1] o.a.s.c.CoreContainer Creating SolrCore 'testSimple1_shard1_replica_n1' using configuration from collection testSimple1, trusted=true
   [junit4]   2> 3093000 INFO  (qtp1210816829-156840) [n:127.0.0.1:32784_solr c:testSimple1 s:shard1 r:core_node6 x:testSimple1_shard1_replica_n3] o.a.s.c.SolrConfig Using Lucene MatchVersion: 8.1.0
   [junit4]   2> 3093000 INFO  (qtp731164189-156846) [n:127.0.0.1:41689_solr c:testSimple1 s:shard1 r:core_node2 x:testSimple1_shard1_replica_n1] o.a.s.m.r.SolrJmxReporter JMX monitoring for 'solr.core.testSimple1.shard1.replica_n1' (registry 'solr.core.testSimple1.shard1.replica_n1') enabled at server: com.sun.jmx.mbeanserver.JmxMBeanServer@3259d7d8
   [junit4]   2> 3093000 INFO  (qtp731164189-156846) [n:127.0.0.1:41689_solr c:testSimple1 s:shard1 r:core_node2 x:testSimple1_shard1_replica_n1] o.a.s.c.HdfsDirectoryFactory solr.hdfs.home=hdfs://localhost:44141/solr_hdfs_home
   [junit4]   2> 3093000 INFO  (qtp731164189-156846) [n:127.0.0.1:41689_solr c:testSimple1 s:shard1 r:core_node2 x:testSimple1_shard1_replica_n1] o.a.s.c.HdfsDirectoryFactory Solr Kerberos Authentication disabled
   [junit4]   2> 3093000 INFO  (qtp731164189-156846) [n:127.0.0.1:41689_solr c:testSimple1 s:shard1 r:core_node2 x:testSimple1_shard1_replica_n1] o.a.s.c.SolrCore [[testSimple1_shard1_replica_n1] ] Opening new SolrCore at [/x1/jenkins/jenkins-slave/workspace/Lucene-Solr-NightlyTests-8.x/checkout/solr/build/solr-core/test/J0/temp/solr.cloud.autoscaling.HdfsAutoAddReplicasIntegrationTest_5F9892CFEB306221-001/tempDir-002/node3/testSimple1_shard1_replica_n1], dataDir=[hdfs://localhost:44141/solr_hdfs_home/testSimple1/core_node2/data/]
   [junit4]   2> 3093001 INFO  (qtp731164189-156845) [n:127.0.0.1:41689_solr c:testSimple1 s:shard2 r:core_node7 x:testSimple1_shard2_replica_n4] o.a.s.c.SolrConfig Using Lucene MatchVersion: 8.1.0
   [junit4]   2> 3093002 INFO  (qtp731164189-156846) [n:127.0.0.1:41689_solr c:testSimple1 s:shard1 r:core_node2 x:testSimple1_shard1_replica_n1] o.a.s.c.HdfsDirectoryFactory creating directory factory for path hdfs://localhost:44141/solr_hdfs_home/testSimple1/core_node2/data/snapshot_metadata
   [junit4]   2> 3093011 INFO  (qtp731164189-156846) [n:127.0.0.1:41689_solr c:testSimple1 s:shard1 r:core_node2 x:testSimple1_shard1_replica_n1] o.a.s.c.HdfsDirectoryFactory Number of slabs of block cache [1] with direct memory allocation set to [tr

[...truncated too long message...]

porter@74f82b95: rootName = null, domain = solr.core.collection1, service url = null, agent id = null] for registry solr.core.collection1 / com.codahale.metrics.MetricRegistry@9d114fc
   [junit4]   2> 4904254 INFO  (SUITE-TestInPlaceUpdatesDistrib-seed#[5F9892CFEB306221]-worker) [    ] o.a.s.m.SolrMetricManager Closing metric reporters for registry=solr.node, tag=null
   [junit4]   2> 4904254 INFO  (SUITE-TestInPlaceUpdatesDistrib-seed#[5F9892CFEB306221]-worker) [    ] o.a.s.m.r.SolrJmxReporter Closing reporter [org.apache.solr.metrics.reporters.SolrJmxReporter@7dececae: rootName = null, domain = solr.node, service url = null, agent id = null] for registry solr.node / com.codahale.metrics.MetricRegistry@721db670
   [junit4]   2> 4904255 INFO  (SUITE-TestInPlaceUpdatesDistrib-seed#[5F9892CFEB306221]-worker) [    ] o.a.s.m.SolrMetricManager Closing metric reporters for registry=solr.jvm, tag=null
   [junit4]   2> 4904255 INFO  (SUITE-TestInPlaceUpdatesDistrib-seed#[5F9892CFEB306221]-worker) [    ] o.a.s.m.r.SolrJmxReporter Closing reporter [org.apache.solr.metrics.reporters.SolrJmxReporter@2c4839fc: rootName = null, domain = solr.jvm, service url = null, agent id = null] for registry solr.jvm / com.codahale.metrics.MetricRegistry@4e1f9f65
   [junit4]   2> 4904256 INFO  (SUITE-TestInPlaceUpdatesDistrib-seed#[5F9892CFEB306221]-worker) [    ] o.a.s.m.SolrMetricManager Closing metric reporters for registry=solr.jetty, tag=null
   [junit4]   2> 4904256 INFO  (SUITE-TestInPlaceUpdatesDistrib-seed#[5F9892CFEB306221]-worker) [    ] o.a.s.m.r.SolrJmxReporter Closing reporter [org.apache.solr.metrics.reporters.SolrJmxReporter@758e8afa: rootName = null, domain = solr.jetty, service url = null, agent id = null] for registry solr.jetty / com.codahale.metrics.MetricRegistry@65744bf6
   [junit4]   2> NOTE: leaving temporary files on disk at: /x1/jenkins/jenkins-slave/workspace/Lucene-Solr-NightlyTests-8.x/checkout/solr/build/solr-core/test/J1/temp/solr.update.TestInPlaceUpdatesDistrib_5F9892CFEB306221-001
   [junit4]   2> May 01, 2019 3:25:51 AM com.carrotsearch.randomizedtesting.ThreadLeakControl checkThreadLeaks
   [junit4]   2> WARNING: Will linger awaiting termination of 1 leaked thread(s).
   [junit4]   2> NOTE: test params are: codec=FastDecompressionCompressingStoredFields(storedFieldsFormat=CompressingStoredFieldsFormat(compressionMode=FAST_DECOMPRESSION, chunkSize=7, maxDocsPerChunk=6, blockSize=680), termVectorsFormat=CompressingTermVectorsFormat(compressionMode=FAST_DECOMPRESSION, chunkSize=7, blockSize=680)), sim=Asserting(org.apache.lucene.search.similarities.AssertingSimilarity@1ecbb74d), locale=es-MX, timezone=Africa/Bissau
   [junit4]   2> NOTE: Linux 4.4.0-137-generic amd64/Oracle Corporation 1.8.0_191 (64-bit)/cpus=4,threads=1,free=86254272,total=492306432
   [junit4]   2> NOTE: All tests run in this JVM: [TestRandomRequestDistribution, TestEmbeddedSolrServerConstructors, TestUseDocValuesAsStored2, DirectUpdateHandlerTest, TestFastLRUCache, CdcrReplicationHandlerTest, Tagger2Test, JSONWriterTest, ChaosMonkeyNothingIsSafeWithPullReplicasTest, WrapperMergePolicyFactoryTest, SolrCoreTest, TestObjectReleaseTracker, NodeAddedTriggerIntegrationTest, DocValuesMultiTest, SpatialRPTFieldTypeTest, QueryResultKeyTest, TestManagedStopFilterFactory, TestDFRSimilarityFactory, FullSolrCloudDistribCmdsTest, SuggesterWFSTTest, TestChildDocTransformerHierarchy, BlockCacheTest, TestDocTermOrdsUninvertLimit, TolerantUpdateProcessorTest, UniqFieldsUpdateProcessorFactoryTest, TestNamedUpdateProcessors, ConfigSetsAPITest, TestLegacyFieldReuse, TestSimpleTextCodec, SecurityConfHandlerTest, RegexBytesRefFilterTest, SignificantTermsQParserPluginTest, IgnoreLargeDocumentProcessorFactoryTest, AssignTest, StatelessScriptUpdateProcessorFactoryTest, HdfsRestartWhileUpdatingTest, StatsComponentTest, TestDownShardTolerantSearch, TestAuthorizationFramework, LoggingHandlerTest, TestCollectionAPIs, TestReload, MigrateRouteKeyTest, DistributedSuggestComponentTest, TestRealTimeGet, TestFieldCacheSort, FullHLLTest, MultiThreadedOCPTest, PreAnalyzedFieldTest, TestSSLRandomization, TransactionLogTest, TestNumericTokenStream, TestPushWriter, TestCollectionsAPIViaSolrCloudCluster, TestNestedDocsSort, MoveReplicaHDFSTest, ConcurrentDeleteAndCreateCollectionTest, TestCSVLoader, TestSolrCLIRunExample, ConnectionReuseTest, SparseHLLTest, MinimalSchemaTest, TestCloudPseudoReturnFields, TestSubQueryTransformerDistrib, SortByFunctionTest, ShardSplitTest, TestSolrFieldCacheBean, TestWriterPerf, TestComplexPhraseQParserPlugin, TestInitParams, InfixSuggestersTest, TestFieldResource, SolrIndexMetricsTest, DistributedExpandComponentTest, TestLuceneMatchVersion, HttpPartitionTest, TestHashQParserPlugin, DirectSolrSpellCheckerTest, TermVectorComponentDistributedTest, ConfigureRecoveryStrategyTest, ResponseBuilderTest, ZkCLITest, ResourceLoaderTest, TestAddFieldRealTimeGet, DistribJoinFromCollectionTest, TestSort, TestConfigSetsAPIExclusivity, TestXIncludeConfig, CollectionTooManyReplicasTest, TestSimExecutePlanAction, BadCopyFieldTest, DistanceUnitsTest, LeaderElectionIntegrationTest, TestTolerantUpdateProcessorCloud, AuditLoggerIntegrationTest, TestCodecSupport, TestBlendedInfixSuggestions, SSLMigrationTest, TestMaxScoreQueryParser, CircularListTest, ScriptEngineTest, IndexSizeTriggerTest, SuggesterFSTTest, SolrInfoBeanTest, VersionInfoTest, CustomTermsComponentTest, TestFuzzyAnalyzedSuggestions, ManagedSchemaRoundRobinCloudTest, BJQParserTest, TestCollationField, CollectionStateFormat2Test, AliasIntegrationTest, RemoteQueryErrorTest, HdfsTlogReplayBufferedWhileIndexingTest, TestReplicaProperties, TestCloudInspectUtil, DateFieldTest, BasicAuthStandaloneTest, TestPolicyCloud, TestRandomCollapseQParserPlugin, TestRemoteStreaming, DocExpirationUpdateProcessorFactoryTest, V2StandaloneTest, TestReplicationHandlerDiskOverFlow, TestNumericTerms64, TestRandomFaceting, TestCursorMarkWithoutUniqueKey, NodeLostTriggerTest, DisMaxRequestHandlerTest, TestOmitPositions, TestExactSharedStatsCache, TestSearcherReuse, TriLevelCompositeIdRoutingTest, TestAuthenticationFramework, TestCloudSearcherWarming, TestSolrDeletionPolicy2, OverseerTaskQueueTest, TestMiniSolrCloudClusterSSL, DirectSolrConnectionTest, TestGraphMLResponseWriter, DeleteLastCustomShardedReplicaTest, DeleteReplicaTest, DocValuesNotIndexedTest, ForceLeaderTest, LeaderFailureAfterFreshStartTest, OverseerModifyCollectionTest, PeerSyncReplicationTest, ShardRoutingCustomTest, ShardRoutingTest, SolrCloudExampleTest, SyncSliceTest, TestShortCircuitedRequests, TestSizeLimitedDistributedMap, TestStressCloudBlindAtomicUpdates, TestZkChroot, ZkFailoverTest, ZkNodePropsTest, ZkShardTermsTest, AutoAddReplicasIntegrationTest, ExecutePlanActionTest, RestoreTriggerStateTest, ScheduledMaintenanceTriggerTest, ScheduledTriggerIntegrationTest, SearchRateTriggerTest, TriggerEventQueueTest, TriggerIntegrationTest, CdcrVersionReplicationTest, CdcrWithNodesRestartsTest, HdfsNNFailoverTest, HdfsRecoverLeaseTest, StressHdfsTest, TestReplicationHandler, DistributedQueryComponentCustomSortTest, DistributedQueryElevationComponentTest, ReplicaListTransformerTest, ResponseLogComponentTest, SearchHandlerTest, TestDistributedStatsComponentCardinality, TestExpandComponent, TestPivotHelperCode, TestExportWriter, JavabinLoaderTest, EmbeddedSolrNoSerializeTest, TaggingAttributeTest, XmlInterpolationTest, HighlighterConfigTest, HighlighterMaxOffsetTest, TestPostingsSolrHighlighter, TestUnifiedSolrHighlighter, TestMultiValuedNumericRangeQuery, JvmMetricsTest, MetricsConfigTest, SolrCoreMetricManagerTest, SolrGraphiteReporterTest, SolrSlf4jReporterTest, SolrShardReporterTest, TestRetrieveFieldsOptimizer, TestRestManager, TestBulkSchemaAPI, BooleanFieldTest, CopyFieldTest, ExternalFileFieldSortTest, NumericFieldsTest, RequiredFieldsTest, SchemaApiFailureTest, TestCloudManagedSchema, TestHalfAndHalfDocValues, TestManagedSchema, AnalyticsMergeStrategyTest, LargeFieldTest, MergeStrategyTest, TestDocSet, TestElisionMultitermQuery, TestFoldingMultitermQuery, TestInitQParser, TestLFUCache, SpatialHeatmapFacetsTest, TestCloudJSONFacetSKG, TestJsonFacetsStatsParsing, TestMinMaxOnMultiValuedField, TestOrdValues, TestSortByMinMaxFunction, BlockJoinFacetRandomTest, BlockJoinFacetSimpleTest, GraphQueryTest, TestScoreJoinQPScore, TestJsonRequest, CloudMLTQParserTest, SimpleMLTQParserTest, TestBM25SimilarityFactory, TestClassicSimilarityFactory, TestLMDirichletSimilarityFactory, TestLMJelinekMercerSimilarityFactory, TestLegacyBM25SimilarityFactory, TestNonDefinedSimilarityFactory, TestPerFieldSimilarity, TestPerFieldSimilarityWithDefaultOverride, JWTAuthPluginTest, TestRuleBasedAuthorizationPlugin, TestSha256AuthenticationProvider, TestDelegationWithHadoopAuth, TestSolrCloudWithHadoopAuthPlugin, SpellCheckCollatorTest, SpellingQueryConverterTest, BufferStoreTest, HdfsLockFactoryTest, TestFieldCacheVsDocValues, TestLegacyFieldCache, AddBlockUpdateTest, AnalysisErrorHandlingTest, CdcrUpdateLogTest, MaxSizeAutoCommitTest, PeerSyncWithBufferUpdatesTest, PeerSyncWithIndexFingerprintCachingTest, PeerSyncWithLeaderAndIndexFingerprintCachingTest, PeerSyncWithLeaderTest, SolrCmdDistributorTest, TestAtomicUpdateErrorCases, TestExceedMaxTermLength, TestHdfsUpdateLog, TestInPlaceUpdateWithRouteField, TestInPlaceUpdatesDistrib]
   [junit4] Completed [821/855 (4!)] on J1 in 117.78s, 1 test, 1 failure <<< FAILURES!

[...truncated 9082 lines...]
BUILD FAILED
/x1/jenkins/jenkins-slave/workspace/Lucene-Solr-NightlyTests-8.x/checkout/build.xml:652: The following error occurred while executing this line:
/x1/jenkins/jenkins-slave/workspace/Lucene-Solr-NightlyTests-8.x/checkout/build.xml:128: Found 1 violations in source files (File uses Mockito but has no assumeWorkingMockito() call).

Total time: 289 minutes 10 seconds
Build step 'Invoke Ant' marked build as failure
Archiving artifacts
Recording test results
Email was triggered for: Failure - Any
Sending email for trigger: Failure - Any

Mime
View raw message