lucene-dev mailing list archives

Site index · List index
Message view « Date » · « Thread »
Top « Date » · « Thread »
From Policeman Jenkins Server <jenk...@thetaphi.de>
Subject [JENKINS] Lucene-Solr-8.x-Linux (64bit/jdk1.8.0_201) - Build # 495 - Still Failing!
Date Wed, 01 May 2019 13:53:49 GMT
Build: https://jenkins.thetaphi.de/job/Lucene-Solr-8.x-Linux/495/
Java: 64bit/jdk1.8.0_201 -XX:+UseCompressedOops -XX:+UseSerialGC

2 tests failed.
FAILED:  org.apache.solr.update.PeerSyncTest.test

Error Message:
Unexpected exception type, expected SolrException but got org.apache.solr.client.solrj.SolrServerException: Timeout occurred while waiting response from server at: http://127.0.0.1:45939/_/mc/collection1

Stack Trace:
junit.framework.AssertionFailedError: Unexpected exception type, expected SolrException but got org.apache.solr.client.solrj.SolrServerException: Timeout occurred while waiting response from server at: http://127.0.0.1:45939/_/mc/collection1
	at __randomizedtesting.SeedInfo.seed([12CF0620F945B50E:9A9B39FA57B9D8F6]:0)
	at org.apache.lucene.util.LuceneTestCase.expectThrows(LuceneTestCase.java:2700)
	at org.apache.lucene.util.LuceneTestCase.expectThrows(LuceneTestCase.java:2689)
	at org.apache.solr.update.PeerSyncTest.test(PeerSyncTest.java:279)
	at sun.reflect.NativeMethodAccessorImpl.invoke0(Native Method)
	at sun.reflect.NativeMethodAccessorImpl.invoke(NativeMethodAccessorImpl.java:62)
	at sun.reflect.DelegatingMethodAccessorImpl.invoke(DelegatingMethodAccessorImpl.java:43)
	at java.lang.reflect.Method.invoke(Method.java:498)
	at com.carrotsearch.randomizedtesting.RandomizedRunner.invoke(RandomizedRunner.java:1750)
	at com.carrotsearch.randomizedtesting.RandomizedRunner$8.evaluate(RandomizedRunner.java:938)
	at com.carrotsearch.randomizedtesting.RandomizedRunner$9.evaluate(RandomizedRunner.java:974)
	at com.carrotsearch.randomizedtesting.RandomizedRunner$10.evaluate(RandomizedRunner.java:988)
	at org.apache.solr.BaseDistributedSearchTestCase$ShardsRepeatRule$ShardsFixedStatement.callStatement(BaseDistributedSearchTestCase.java:1082)
	at org.apache.solr.BaseDistributedSearchTestCase$ShardsRepeatRule$ShardsStatement.evaluate(BaseDistributedSearchTestCase.java:1054)
	at com.carrotsearch.randomizedtesting.rules.SystemPropertiesRestoreRule$1.evaluate(SystemPropertiesRestoreRule.java:57)
	at org.apache.lucene.util.TestRuleSetupTeardownChained$1.evaluate(TestRuleSetupTeardownChained.java:49)
	at org.apache.lucene.util.AbstractBeforeAfterRule$1.evaluate(AbstractBeforeAfterRule.java:45)
	at org.apache.lucene.util.TestRuleThreadAndTestName$1.evaluate(TestRuleThreadAndTestName.java:48)
	at org.apache.lucene.util.TestRuleIgnoreAfterMaxFailures$1.evaluate(TestRuleIgnoreAfterMaxFailures.java:64)
	at org.apache.lucene.util.TestRuleMarkFailure$1.evaluate(TestRuleMarkFailure.java:47)
	at com.carrotsearch.randomizedtesting.rules.StatementAdapter.evaluate(StatementAdapter.java:36)
	at com.carrotsearch.randomizedtesting.ThreadLeakControl$StatementRunner.run(ThreadLeakControl.java:368)
	at com.carrotsearch.randomizedtesting.ThreadLeakControl.forkTimeoutingTask(ThreadLeakControl.java:817)
	at com.carrotsearch.randomizedtesting.ThreadLeakControl$3.evaluate(ThreadLeakControl.java:468)
	at com.carrotsearch.randomizedtesting.RandomizedRunner.runSingleTest(RandomizedRunner.java:947)
	at com.carrotsearch.randomizedtesting.RandomizedRunner$5.evaluate(RandomizedRunner.java:832)
	at com.carrotsearch.randomizedtesting.RandomizedRunner$6.evaluate(RandomizedRunner.java:883)
	at com.carrotsearch.randomizedtesting.RandomizedRunner$7.evaluate(RandomizedRunner.java:894)
	at com.carrotsearch.randomizedtesting.rules.StatementAdapter.evaluate(StatementAdapter.java:36)
	at com.carrotsearch.randomizedtesting.rules.SystemPropertiesRestoreRule$1.evaluate(SystemPropertiesRestoreRule.java:57)
	at org.apache.lucene.util.AbstractBeforeAfterRule$1.evaluate(AbstractBeforeAfterRule.java:45)
	at com.carrotsearch.randomizedtesting.rules.StatementAdapter.evaluate(StatementAdapter.java:36)
	at org.apache.lucene.util.TestRuleStoreClassName$1.evaluate(TestRuleStoreClassName.java:41)
	at com.carrotsearch.randomizedtesting.rules.NoShadowingOrOverridesOnMethodsRule$1.evaluate(NoShadowingOrOverridesOnMethodsRule.java:40)
	at com.carrotsearch.randomizedtesting.rules.NoShadowingOrOverridesOnMethodsRule$1.evaluate(NoShadowingOrOverridesOnMethodsRule.java:40)
	at com.carrotsearch.randomizedtesting.rules.StatementAdapter.evaluate(StatementAdapter.java:36)
	at com.carrotsearch.randomizedtesting.rules.StatementAdapter.evaluate(StatementAdapter.java:36)
	at com.carrotsearch.randomizedtesting.rules.StatementAdapter.evaluate(StatementAdapter.java:36)
	at org.apache.lucene.util.TestRuleAssertionsRequired$1.evaluate(TestRuleAssertionsRequired.java:53)
	at org.apache.lucene.util.TestRuleMarkFailure$1.evaluate(TestRuleMarkFailure.java:47)
	at org.apache.lucene.util.TestRuleIgnoreAfterMaxFailures$1.evaluate(TestRuleIgnoreAfterMaxFailures.java:64)
	at org.apache.lucene.util.TestRuleIgnoreTestSuites$1.evaluate(TestRuleIgnoreTestSuites.java:54)
	at com.carrotsearch.randomizedtesting.rules.StatementAdapter.evaluate(StatementAdapter.java:36)
	at com.carrotsearch.randomizedtesting.ThreadLeakControl$StatementRunner.run(ThreadLeakControl.java:368)
	at java.lang.Thread.run(Thread.java:748)
Caused by: org.apache.solr.client.solrj.SolrServerException: Timeout occurred while waiting response from server at: http://127.0.0.1:45939/_/mc/collection1
	at org.apache.solr.client.solrj.impl.HttpSolrClient.executeMethod(HttpSolrClient.java:660)
	at org.apache.solr.client.solrj.impl.HttpSolrClient.request(HttpSolrClient.java:255)
	at org.apache.solr.client.solrj.impl.HttpSolrClient.request(HttpSolrClient.java:244)
	at org.apache.solr.client.solrj.SolrRequest.process(SolrRequest.java:207)
	at org.apache.solr.client.solrj.SolrRequest.process(SolrRequest.java:224)
	at org.apache.solr.BaseDistributedSearchTestCase.add(BaseDistributedSearchTestCase.java:576)
	at org.apache.solr.update.PeerSyncTest.lambda$test$0(PeerSyncTest.java:281)
	at org.apache.lucene.util.LuceneTestCase.expectThrows(LuceneTestCase.java:2695)
	... 43 more
Caused by: java.net.SocketTimeoutException: Read timed out
	at java.net.SocketInputStream.socketRead0(Native Method)
	at java.net.SocketInputStream.socketRead(SocketInputStream.java:116)
	at java.net.SocketInputStream.read(SocketInputStream.java:171)
	at java.net.SocketInputStream.read(SocketInputStream.java:141)
	at org.apache.http.impl.io.SessionInputBufferImpl.streamRead(SessionInputBufferImpl.java:137)
	at org.apache.http.impl.io.SessionInputBufferImpl.fillBuffer(SessionInputBufferImpl.java:153)
	at org.apache.http.impl.io.SessionInputBufferImpl.readLine(SessionInputBufferImpl.java:282)
	at org.apache.http.impl.conn.DefaultHttpResponseParser.parseHead(DefaultHttpResponseParser.java:138)
	at org.apache.http.impl.conn.DefaultHttpResponseParser.parseHead(DefaultHttpResponseParser.java:56)
	at org.apache.http.impl.io.AbstractMessageParser.parse(AbstractMessageParser.java:259)
	at org.apache.http.impl.DefaultBHttpClientConnection.receiveResponseHeader(DefaultBHttpClientConnection.java:163)
	at org.apache.http.impl.conn.CPoolProxy.receiveResponseHeader(CPoolProxy.java:165)
	at org.apache.http.protocol.HttpRequestExecutor.doReceiveResponse(HttpRequestExecutor.java:273)
	at org.apache.http.protocol.HttpRequestExecutor.execute(HttpRequestExecutor.java:125)
	at org.apache.http.impl.execchain.MainClientExec.execute(MainClientExec.java:272)
	at org.apache.http.impl.execchain.ProtocolExec.execute(ProtocolExec.java:185)
	at org.apache.http.impl.execchain.RetryExec.execute(RetryExec.java:89)
	at org.apache.http.impl.execchain.RedirectExec.execute(RedirectExec.java:110)
	at org.apache.http.impl.client.InternalHttpClient.doExecute(InternalHttpClient.java:185)
	at org.apache.http.impl.client.CloseableHttpClient.execute(CloseableHttpClient.java:83)
	at org.apache.http.impl.client.CloseableHttpClient.execute(CloseableHttpClient.java:56)
	at org.apache.solr.client.solrj.impl.HttpSolrClient.executeMethod(HttpSolrClient.java:548)
	... 50 more


FAILED:  org.apache.solr.update.PeerSyncWithLeaderTest.test

Error Message:
Unexpected exception type, expected SolrException but got org.apache.solr.client.solrj.SolrServerException: Timeout occurred while waiting response from server at: http://127.0.0.1:39349/collection1

Stack Trace:
junit.framework.AssertionFailedError: Unexpected exception type, expected SolrException but got org.apache.solr.client.solrj.SolrServerException: Timeout occurred while waiting response from server at: http://127.0.0.1:39349/collection1
	at __randomizedtesting.SeedInfo.seed([12CF0620F945B50E:9A9B39FA57B9D8F6]:0)
	at org.apache.lucene.util.LuceneTestCase.expectThrows(LuceneTestCase.java:2700)
	at org.apache.lucene.util.LuceneTestCase.expectThrows(LuceneTestCase.java:2689)
	at org.apache.solr.update.PeerSyncTest.test(PeerSyncTest.java:279)
	at sun.reflect.NativeMethodAccessorImpl.invoke0(Native Method)
	at sun.reflect.NativeMethodAccessorImpl.invoke(NativeMethodAccessorImpl.java:62)
	at sun.reflect.DelegatingMethodAccessorImpl.invoke(DelegatingMethodAccessorImpl.java:43)
	at java.lang.reflect.Method.invoke(Method.java:498)
	at com.carrotsearch.randomizedtesting.RandomizedRunner.invoke(RandomizedRunner.java:1750)
	at com.carrotsearch.randomizedtesting.RandomizedRunner$8.evaluate(RandomizedRunner.java:938)
	at com.carrotsearch.randomizedtesting.RandomizedRunner$9.evaluate(RandomizedRunner.java:974)
	at com.carrotsearch.randomizedtesting.RandomizedRunner$10.evaluate(RandomizedRunner.java:988)
	at org.apache.solr.BaseDistributedSearchTestCase$ShardsRepeatRule$ShardsFixedStatement.callStatement(BaseDistributedSearchTestCase.java:1082)
	at org.apache.solr.BaseDistributedSearchTestCase$ShardsRepeatRule$ShardsStatement.evaluate(BaseDistributedSearchTestCase.java:1054)
	at com.carrotsearch.randomizedtesting.rules.SystemPropertiesRestoreRule$1.evaluate(SystemPropertiesRestoreRule.java:57)
	at org.apache.lucene.util.TestRuleSetupTeardownChained$1.evaluate(TestRuleSetupTeardownChained.java:49)
	at org.apache.lucene.util.AbstractBeforeAfterRule$1.evaluate(AbstractBeforeAfterRule.java:45)
	at org.apache.lucene.util.TestRuleThreadAndTestName$1.evaluate(TestRuleThreadAndTestName.java:48)
	at org.apache.lucene.util.TestRuleIgnoreAfterMaxFailures$1.evaluate(TestRuleIgnoreAfterMaxFailures.java:64)
	at org.apache.lucene.util.TestRuleMarkFailure$1.evaluate(TestRuleMarkFailure.java:47)
	at com.carrotsearch.randomizedtesting.rules.StatementAdapter.evaluate(StatementAdapter.java:36)
	at com.carrotsearch.randomizedtesting.ThreadLeakControl$StatementRunner.run(ThreadLeakControl.java:368)
	at com.carrotsearch.randomizedtesting.ThreadLeakControl.forkTimeoutingTask(ThreadLeakControl.java:817)
	at com.carrotsearch.randomizedtesting.ThreadLeakControl$3.evaluate(ThreadLeakControl.java:468)
	at com.carrotsearch.randomizedtesting.RandomizedRunner.runSingleTest(RandomizedRunner.java:947)
	at com.carrotsearch.randomizedtesting.RandomizedRunner$5.evaluate(RandomizedRunner.java:832)
	at com.carrotsearch.randomizedtesting.RandomizedRunner$6.evaluate(RandomizedRunner.java:883)
	at com.carrotsearch.randomizedtesting.RandomizedRunner$7.evaluate(RandomizedRunner.java:894)
	at com.carrotsearch.randomizedtesting.rules.StatementAdapter.evaluate(StatementAdapter.java:36)
	at com.carrotsearch.randomizedtesting.rules.SystemPropertiesRestoreRule$1.evaluate(SystemPropertiesRestoreRule.java:57)
	at org.apache.lucene.util.AbstractBeforeAfterRule$1.evaluate(AbstractBeforeAfterRule.java:45)
	at com.carrotsearch.randomizedtesting.rules.StatementAdapter.evaluate(StatementAdapter.java:36)
	at org.apache.lucene.util.TestRuleStoreClassName$1.evaluate(TestRuleStoreClassName.java:41)
	at com.carrotsearch.randomizedtesting.rules.NoShadowingOrOverridesOnMethodsRule$1.evaluate(NoShadowingOrOverridesOnMethodsRule.java:40)
	at com.carrotsearch.randomizedtesting.rules.NoShadowingOrOverridesOnMethodsRule$1.evaluate(NoShadowingOrOverridesOnMethodsRule.java:40)
	at com.carrotsearch.randomizedtesting.rules.StatementAdapter.evaluate(StatementAdapter.java:36)
	at com.carrotsearch.randomizedtesting.rules.StatementAdapter.evaluate(StatementAdapter.java:36)
	at com.carrotsearch.randomizedtesting.rules.StatementAdapter.evaluate(StatementAdapter.java:36)
	at org.apache.lucene.util.TestRuleAssertionsRequired$1.evaluate(TestRuleAssertionsRequired.java:53)
	at org.apache.lucene.util.TestRuleMarkFailure$1.evaluate(TestRuleMarkFailure.java:47)
	at org.apache.lucene.util.TestRuleIgnoreAfterMaxFailures$1.evaluate(TestRuleIgnoreAfterMaxFailures.java:64)
	at org.apache.lucene.util.TestRuleIgnoreTestSuites$1.evaluate(TestRuleIgnoreTestSuites.java:54)
	at com.carrotsearch.randomizedtesting.rules.StatementAdapter.evaluate(StatementAdapter.java:36)
	at com.carrotsearch.randomizedtesting.ThreadLeakControl$StatementRunner.run(ThreadLeakControl.java:368)
	at java.lang.Thread.run(Thread.java:748)
Caused by: org.apache.solr.client.solrj.SolrServerException: Timeout occurred while waiting response from server at: http://127.0.0.1:39349/collection1
	at org.apache.solr.client.solrj.impl.HttpSolrClient.executeMethod(HttpSolrClient.java:660)
	at org.apache.solr.client.solrj.impl.HttpSolrClient.request(HttpSolrClient.java:255)
	at org.apache.solr.client.solrj.impl.HttpSolrClient.request(HttpSolrClient.java:244)
	at org.apache.solr.client.solrj.SolrRequest.process(SolrRequest.java:207)
	at org.apache.solr.client.solrj.SolrRequest.process(SolrRequest.java:224)
	at org.apache.solr.BaseDistributedSearchTestCase.add(BaseDistributedSearchTestCase.java:576)
	at org.apache.solr.update.PeerSyncTest.lambda$test$0(PeerSyncTest.java:281)
	at org.apache.lucene.util.LuceneTestCase.expectThrows(LuceneTestCase.java:2695)
	... 43 more
Caused by: java.net.SocketTimeoutException: Read timed out
	at java.net.SocketInputStream.socketRead0(Native Method)
	at java.net.SocketInputStream.socketRead(SocketInputStream.java:116)
	at java.net.SocketInputStream.read(SocketInputStream.java:171)
	at java.net.SocketInputStream.read(SocketInputStream.java:141)
	at org.apache.http.impl.io.SessionInputBufferImpl.streamRead(SessionInputBufferImpl.java:137)
	at org.apache.http.impl.io.SessionInputBufferImpl.fillBuffer(SessionInputBufferImpl.java:153)
	at org.apache.http.impl.io.SessionInputBufferImpl.readLine(SessionInputBufferImpl.java:282)
	at org.apache.http.impl.conn.DefaultHttpResponseParser.parseHead(DefaultHttpResponseParser.java:138)
	at org.apache.http.impl.conn.DefaultHttpResponseParser.parseHead(DefaultHttpResponseParser.java:56)
	at org.apache.http.impl.io.AbstractMessageParser.parse(AbstractMessageParser.java:259)
	at org.apache.http.impl.DefaultBHttpClientConnection.receiveResponseHeader(DefaultBHttpClientConnection.java:163)
	at org.apache.http.impl.conn.CPoolProxy.receiveResponseHeader(CPoolProxy.java:165)
	at org.apache.http.protocol.HttpRequestExecutor.doReceiveResponse(HttpRequestExecutor.java:273)
	at org.apache.http.protocol.HttpRequestExecutor.execute(HttpRequestExecutor.java:125)
	at org.apache.http.impl.execchain.MainClientExec.execute(MainClientExec.java:272)
	at org.apache.http.impl.execchain.ProtocolExec.execute(ProtocolExec.java:185)
	at org.apache.http.impl.execchain.RetryExec.execute(RetryExec.java:89)
	at org.apache.http.impl.execchain.RedirectExec.execute(RedirectExec.java:110)
	at org.apache.http.impl.client.InternalHttpClient.doExecute(InternalHttpClient.java:185)
	at org.apache.http.impl.client.CloseableHttpClient.execute(CloseableHttpClient.java:83)
	at org.apache.http.impl.client.CloseableHttpClient.execute(CloseableHttpClient.java:56)
	at org.apache.solr.client.solrj.impl.HttpSolrClient.executeMethod(HttpSolrClient.java:548)
	... 50 more




Build Log:
[...truncated 15747 lines...]
   [junit4] Suite: org.apache.solr.update.PeerSyncTest
   [junit4]   2> Creating dataDir: /home/jenkins/workspace/Lucene-Solr-8.x-Linux/solr/build/solr-core/test/J0/temp/solr.update.PeerSyncTest_12CF0620F945B50E-001/init-core-data-001
   [junit4]   2> 2021863 WARN  (SUITE-PeerSyncTest-seed#[12CF0620F945B50E]-worker) [    ] o.a.s.SolrTestCaseJ4 startTrackingSearchers: numOpens=24 numCloses=24
   [junit4]   2> 2021863 INFO  (SUITE-PeerSyncTest-seed#[12CF0620F945B50E]-worker) [    ] o.a.s.SolrTestCaseJ4 Using TrieFields (NUMERIC_POINTS_SYSPROP=false) w/NUMERIC_DOCVALUES_SYSPROP=false
   [junit4]   2> 2021865 INFO  (SUITE-PeerSyncTest-seed#[12CF0620F945B50E]-worker) [    ] o.a.s.SolrTestCaseJ4 Randomized ssl (false) and clientAuth (false) via: @org.apache.solr.SolrTestCaseJ4$SuppressSSL(bugUrl=https://issues.apache.org/jira/browse/SOLR-5776)
   [junit4]   2> 2021865 INFO  (SUITE-PeerSyncTest-seed#[12CF0620F945B50E]-worker) [    ] o.a.s.SolrTestCaseJ4 SecureRandom sanity checks: test.solr.allowed.securerandom=null & java.security.egd=file:/dev/./urandom
   [junit4]   2> 2021865 INFO  (SUITE-PeerSyncTest-seed#[12CF0620F945B50E]-worker) [    ] o.a.s.BaseDistributedSearchTestCase Setting hostContext system property: /_/mc
   [junit4]   2> 2021865 INFO  (TEST-PeerSyncTest.test-seed#[12CF0620F945B50E]) [    ] o.a.s.SolrTestCaseJ4 ####initCore
   [junit4]   2> 2021866 INFO  (TEST-PeerSyncTest.test-seed#[12CF0620F945B50E]) [    ] o.a.s.c.SolrResourceLoader [null] Added 2 libs to classloader, from paths: [/home/jenkins/workspace/Lucene-Solr-8.x-Linux/solr/core/src/test-files/solr/collection1/lib, /home/jenkins/workspace/Lucene-Solr-8.x-Linux/solr/core/src/test-files/solr/collection1/lib/classes]
   [junit4]   2> 2021884 INFO  (TEST-PeerSyncTest.test-seed#[12CF0620F945B50E]) [    ] o.a.s.c.SolrConfig Using Lucene MatchVersion: 8.2.0
   [junit4]   2> 2021899 INFO  (TEST-PeerSyncTest.test-seed#[12CF0620F945B50E]) [    ] o.a.s.s.IndexSchema [null] Schema name=test
   [junit4]   2> 2022048 INFO  (TEST-PeerSyncTest.test-seed#[12CF0620F945B50E]) [    ] o.a.s.s.IndexSchema Loaded schema test/1.0 with uniqueid field id
   [junit4]   2> 2022168 INFO  (TEST-PeerSyncTest.test-seed#[12CF0620F945B50E]) [    ] o.a.s.h.c.HttpShardHandlerFactory Host whitelist initialized: WhitelistHostChecker [whitelistHosts=null, whitelistHostCheckingEnabled=false]
   [junit4]   2> 2022178 WARN  (TEST-PeerSyncTest.test-seed#[12CF0620F945B50E]) [    ] o.e.j.u.s.S.config No Client EndPointIdentificationAlgorithm configured for SslContextFactory@71b65771[provider=null,keyStore=null,trustStore=null]
   [junit4]   2> 2022190 WARN  (TEST-PeerSyncTest.test-seed#[12CF0620F945B50E]) [    ] o.e.j.u.s.S.config No Client EndPointIdentificationAlgorithm configured for SslContextFactory@4234943e[provider=null,keyStore=null,trustStore=null]
   [junit4]   2> 2022217 INFO  (TEST-PeerSyncTest.test-seed#[12CF0620F945B50E]) [    ] o.a.s.c.TransientSolrCoreCacheDefault Allocating transient cache for 2147483647 transient cores
   [junit4]   2> 2022217 INFO  (TEST-PeerSyncTest.test-seed#[12CF0620F945B50E]) [    ] o.a.s.h.a.MetricsHistoryHandler No .system collection, keeping metrics history in memory.
   [junit4]   2> 2022231 INFO  (TEST-PeerSyncTest.test-seed#[12CF0620F945B50E]) [    ] o.a.s.m.r.SolrJmxReporter JMX monitoring for 'solr.node' (registry 'solr.node') enabled at server: com.sun.jmx.mbeanserver.JmxMBeanServer@21d8414c
   [junit4]   2> 2022237 INFO  (TEST-PeerSyncTest.test-seed#[12CF0620F945B50E]) [    ] o.a.s.m.r.SolrJmxReporter JMX monitoring for 'solr.jvm' (registry 'solr.jvm') enabled at server: com.sun.jmx.mbeanserver.JmxMBeanServer@21d8414c
   [junit4]   2> 2022237 INFO  (TEST-PeerSyncTest.test-seed#[12CF0620F945B50E]) [    ] o.a.s.m.r.SolrJmxReporter JMX monitoring for 'solr.jetty' (registry 'solr.jetty') enabled at server: com.sun.jmx.mbeanserver.JmxMBeanServer@21d8414c
   [junit4]   2> 2022245 INFO  (coreLoadExecutor-13475-thread-1) [    x:collection1] o.a.s.c.SolrResourceLoader [null] Added 2 libs to classloader, from paths: [/home/jenkins/workspace/Lucene-Solr-8.x-Linux/solr/core/src/test-files/solr/collection1/lib, /home/jenkins/workspace/Lucene-Solr-8.x-Linux/solr/core/src/test-files/solr/collection1/lib/classes]
   [junit4]   2> 2022266 INFO  (coreLoadExecutor-13475-thread-1) [    x:collection1] o.a.s.c.SolrConfig Using Lucene MatchVersion: 8.2.0
   [junit4]   2> 2022291 INFO  (coreLoadExecutor-13475-thread-1) [    x:collection1] o.a.s.s.IndexSchema [collection1] Schema name=test
   [junit4]   2> 2022396 INFO  (coreLoadExecutor-13475-thread-1) [    x:collection1] o.a.s.s.IndexSchema Loaded schema test/1.0 with uniqueid field id
   [junit4]   2> 2022403 INFO  (coreLoadExecutor-13475-thread-1) [    x:collection1] o.a.s.c.CoreContainer Creating SolrCore 'collection1' using configuration from instancedir /home/jenkins/workspace/Lucene-Solr-8.x-Linux/solr/core/src/test-files/solr/collection1, trusted=true
   [junit4]   2> 2022403 INFO  (coreLoadExecutor-13475-thread-1) [    x:collection1] o.a.s.m.r.SolrJmxReporter JMX monitoring for 'solr.core.collection1' (registry 'solr.core.collection1') enabled at server: com.sun.jmx.mbeanserver.JmxMBeanServer@21d8414c
   [junit4]   2> 2022404 INFO  (coreLoadExecutor-13475-thread-1) [    x:collection1] o.a.s.c.SolrCore [[collection1] ] Opening new SolrCore at [/home/jenkins/workspace/Lucene-Solr-8.x-Linux/solr/core/src/test-files/solr/collection1], dataDir=[/home/jenkins/workspace/Lucene-Solr-8.x-Linux/solr/build/solr-core/test/J0/temp/solr.update.PeerSyncTest_12CF0620F945B50E-001/init-core-data-001/]
   [junit4]   2> 2022405 INFO  (coreLoadExecutor-13475-thread-1) [    x:collection1] o.a.s.u.RandomMergePolicy RandomMergePolicy wrapping class org.apache.lucene.index.AlcoholicMergePolicy: [AlcoholicMergePolicy: minMergeSize=0, mergeFactor=10, maxMergeSize=2055925415, maxMergeSizeForForcedMerge=9223372036854775807, calibrateSizeByDeletes=true, maxMergeDocs=2147483647, maxCFSSegmentSizeMB=8.796093022207999E12, noCFSRatio=0.1]
   [junit4]   2> 2022410 WARN  (coreLoadExecutor-13475-thread-1) [    x:collection1] o.a.s.c.RequestHandlers INVALID paramSet a in requestHandler {type = requestHandler,name = /dump,class = DumpRequestHandler,attributes = {initParams=a, name=/dump, class=DumpRequestHandler},args = {defaults={a=A,b=B}}}
   [junit4]   2> 2022445 INFO  (coreLoadExecutor-13475-thread-1) [    x:collection1] o.a.s.u.UpdateHandler Using UpdateLog implementation: org.apache.solr.update.UpdateLog
   [junit4]   2> 2022445 INFO  (coreLoadExecutor-13475-thread-1) [    x:collection1] o.a.s.u.UpdateLog Initializing UpdateLog: dataDir= defaultSyncLevel=FLUSH numRecordsToKeep=100 maxNumLogsToKeep=10 numVersionBuckets=65536
   [junit4]   2> 2022446 INFO  (coreLoadExecutor-13475-thread-1) [    x:collection1] o.a.s.u.CommitTracker Hard AutoCommit: disabled
   [junit4]   2> 2022446 INFO  (coreLoadExecutor-13475-thread-1) [    x:collection1] o.a.s.u.CommitTracker Soft AutoCommit: disabled
   [junit4]   2> 2022447 INFO  (coreLoadExecutor-13475-thread-1) [    x:collection1] o.a.s.u.RandomMergePolicy RandomMergePolicy wrapping class org.apache.lucene.index.TieredMergePolicy: [TieredMergePolicy: maxMergeAtOnce=10, maxMergeAtOnceExplicit=19, maxMergedSegmentMB=1.3662109375, floorSegmentMB=2.0751953125, forceMergeDeletesPctAllowed=2.574303009794362, segmentsPerTier=18.0, maxCFSSegmentSizeMB=8.796093022207999E12, noCFSRatio=0.5339246864930585, deletesPctAllowed=29.842330219846595
   [junit4]   2> 2022447 INFO  (coreLoadExecutor-13475-thread-1) [    x:collection1] o.a.s.s.SolrIndexSearcher Opening [Searcher@dcea29c[collection1] main]
   [junit4]   2> 2022447 WARN  (coreLoadExecutor-13475-thread-1) [    x:collection1] o.a.s.r.ManagedResourceStorage Cannot write to config directory /home/jenkins/workspace/Lucene-Solr-8.x-Linux/solr/core/src/test-files/solr/collection1/conf; switching to use InMemory storage instead.
   [junit4]   2> 2022448 INFO  (coreLoadExecutor-13475-thread-1) [    x:collection1] o.a.s.h.ReplicationHandler Commits will be reserved for 10000ms.
   [junit4]   2> 2022448 INFO  (coreLoadExecutor-13475-thread-1) [    x:collection1] o.a.s.u.UpdateLog Could not find max version in index or recent updates, using new clock 1632337240529043456
   [junit4]   2> 2022450 INFO  (searcherExecutor-13476-thread-1-processing-x:collection1) [    x:collection1] o.a.s.c.SolrCore [collection1] Registered new searcher Searcher@dcea29c[collection1] main{ExitableDirectoryReader(UninvertingDirectoryReader())}
   [junit4]   2> 2022451 INFO  (TEST-PeerSyncTest.test-seed#[12CF0620F945B50E]) [    ] o.a.s.SolrTestCaseJ4 ####initCore end
   [junit4]   2> 2022572 INFO  (TEST-PeerSyncTest.test-seed#[12CF0620F945B50E]) [    ] o.a.s.SolrTestCaseJ4 Writing core.properties file to /home/jenkins/workspace/Lucene-Solr-8.x-Linux/solr/build/solr-core/test/J0/temp/solr.update.PeerSyncTest_12CF0620F945B50E-001/tempDir-001/control/cores/collection1
   [junit4]   2> 2022573 WARN  (TEST-PeerSyncTest.test-seed#[12CF0620F945B50E]) [    ] o.e.j.s.AbstractConnector Ignoring deprecated socket close linger time
   [junit4]   2> 2022573 INFO  (TEST-PeerSyncTest.test-seed#[12CF0620F945B50E]) [    ] o.a.s.c.s.e.JettySolrRunner Start Jetty (original configured port=0)
   [junit4]   2> 2022573 INFO  (TEST-PeerSyncTest.test-seed#[12CF0620F945B50E]) [    ] o.a.s.c.s.e.JettySolrRunner Trying to start Jetty on port 0 try number 1 ...
   [junit4]   2> 2022573 INFO  (TEST-PeerSyncTest.test-seed#[12CF0620F945B50E]) [    ] o.e.j.s.Server jetty-9.4.14.v20181114; built: 2018-11-14T21:20:31.478Z; git: c4550056e785fb5665914545889f21dc136ad9e6; jvm 1.8.0_201-b09
   [junit4]   2> 2022603 INFO  (TEST-PeerSyncTest.test-seed#[12CF0620F945B50E]) [    ] o.e.j.s.session DefaultSessionIdManager workerName=node0
   [junit4]   2> 2022603 INFO  (TEST-PeerSyncTest.test-seed#[12CF0620F945B50E]) [    ] o.e.j.s.session No SessionScavenger set, using defaults
   [junit4]   2> 2022603 INFO  (TEST-PeerSyncTest.test-seed#[12CF0620F945B50E]) [    ] o.e.j.s.session node0 Scavenging every 600000ms
   [junit4]   2> 2022604 INFO  (TEST-PeerSyncTest.test-seed#[12CF0620F945B50E]) [    ] o.e.j.s.h.ContextHandler Started o.e.j.s.ServletContextHandler@31f3d110{/_/mc,null,AVAILABLE}
   [junit4]   2> 2022605 INFO  (TEST-PeerSyncTest.test-seed#[12CF0620F945B50E]) [    ] o.e.j.s.AbstractConnector Started ServerConnector@7fc74db3{HTTP/1.1,[http/1.1, h2c]}{127.0.0.1:33623}
   [junit4]   2> 2022605 INFO  (TEST-PeerSyncTest.test-seed#[12CF0620F945B50E]) [    ] o.e.j.s.Server Started @2022639ms
   [junit4]   2> 2022605 INFO  (TEST-PeerSyncTest.test-seed#[12CF0620F945B50E]) [    ] o.a.s.c.s.e.JettySolrRunner Jetty properties: {schema=schema.xml, solrconfig=solrconfig-tlog.xml, hostContext=/_/mc, hostPort=33623, coreRootDirectory=/home/jenkins/workspace/Lucene-Solr-8.x-Linux/solr/build/solr-core/test/J0/temp/solr.update.PeerSyncTest_12CF0620F945B50E-001/tempDir-001/control/cores}
   [junit4]   2> 2022605 ERROR (TEST-PeerSyncTest.test-seed#[12CF0620F945B50E]) [    ] o.a.s.u.StartupLoggingUtils Missing Java Option solr.log.dir. Logging may be missing or incomplete.
   [junit4]   2> 2022605 INFO  (TEST-PeerSyncTest.test-seed#[12CF0620F945B50E]) [    ] o.a.s.s.SolrDispatchFilter Using logger factory org.apache.logging.slf4j.Log4jLoggerFactory
   [junit4]   2> 2022605 INFO  (TEST-PeerSyncTest.test-seed#[12CF0620F945B50E]) [    ] o.a.s.s.SolrDispatchFilter  ___      _       Welcome to Apache Solr? version 8.2.0
   [junit4]   2> 2022605 INFO  (TEST-PeerSyncTest.test-seed#[12CF0620F945B50E]) [    ] o.a.s.s.SolrDispatchFilter / __| ___| |_ _   Starting in standalone mode on port null
   [junit4]   2> 2022605 INFO  (TEST-PeerSyncTest.test-seed#[12CF0620F945B50E]) [    ] o.a.s.s.SolrDispatchFilter \__ \/ _ \ | '_|  Install dir: null
   [junit4]   2> 2022605 INFO  (TEST-PeerSyncTest.test-seed#[12CF0620F945B50E]) [    ] o.a.s.s.SolrDispatchFilter |___/\___/_|_|    Start time: 2019-05-01T13:41:42.163Z
   [junit4]   2> 2022605 INFO  (TEST-PeerSyncTest.test-seed#[12CF0620F945B50E]) [    ] o.a.s.c.SolrXmlConfig Loading container configuration from /home/jenkins/workspace/Lucene-Solr-8.x-Linux/solr/build/solr-core/test/J0/temp/solr.update.PeerSyncTest_12CF0620F945B50E-001/tempDir-001/control/solr.xml
   [junit4]   2> 2022607 INFO  (TEST-PeerSyncTest.test-seed#[12CF0620F945B50E]) [    ] o.a.s.c.SolrXmlConfig Configuration parameter autoReplicaFailoverWorkLoopDelay is ignored
   [junit4]   2> 2022607 INFO  (TEST-PeerSyncTest.test-seed#[12CF0620F945B50E]) [    ] o.a.s.c.SolrXmlConfig Configuration parameter autoReplicaFailoverBadNodeExpiration is ignored
   [junit4]   2> 2022608 INFO  (TEST-PeerSyncTest.test-seed#[12CF0620F945B50E]) [    ] o.a.s.c.SolrXmlConfig MBean server found: com.sun.jmx.mbeanserver.JmxMBeanServer@21d8414c, but no JMX reporters were configured - adding default JMX reporter.
   [junit4]   2> 2022704 INFO  (TEST-PeerSyncTest.test-seed#[12CF0620F945B50E]) [    ] o.a.s.h.c.HttpShardHandlerFactory Host whitelist initialized: WhitelistHostChecker [whitelistHosts=null, whitelistHostCheckingEnabled=false]
   [junit4]   2> 2022718 WARN  (TEST-PeerSyncTest.test-seed#[12CF0620F945B50E]) [    ] o.e.j.u.s.S.config No Client EndPointIdentificationAlgorithm configured for SslContextFactory@31d93fe9[provider=null,keyStore=null,trustStore=null]
   [junit4]   2> 2022746 WARN  (TEST-PeerSyncTest.test-seed#[12CF0620F945B50E]) [    ] o.e.j.u.s.S.config No Client EndPointIdentificationAlgorithm configured for SslContextFactory@772d0ae3[provider=null,keyStore=null,trustStore=null]
   [junit4]   2> 2022765 INFO  (TEST-PeerSyncTest.test-seed#[12CF0620F945B50E]) [    ] o.a.s.c.TransientSolrCoreCacheDefault Allocating transient cache for 4 transient cores
   [junit4]   2> 2022765 INFO  (TEST-PeerSyncTest.test-seed#[12CF0620F945B50E]) [    ] o.a.s.h.a.MetricsHistoryHandler No .system collection, keeping metrics history in memory.
   [junit4]   2> 2022783 INFO  (TEST-PeerSyncTest.test-seed#[12CF0620F945B50E]) [    ] o.a.s.m.r.SolrJmxReporter JMX monitoring for 'solr.node' (registry 'solr.node') enabled at server: com.sun.jmx.mbeanserver.JmxMBeanServer@21d8414c
   [junit4]   2> 2022791 INFO  (TEST-PeerSyncTest.test-seed#[12CF0620F945B50E]) [    ] o.a.s.m.r.SolrJmxReporter JMX monitoring for 'solr.jvm' (registry 'solr.jvm') enabled at server: com.sun.jmx.mbeanserver.JmxMBeanServer@21d8414c
   [junit4]   2> 2022791 INFO  (TEST-PeerSyncTest.test-seed#[12CF0620F945B50E]) [    ] o.a.s.m.r.SolrJmxReporter JMX monitoring for 'solr.jetty' (registry 'solr.jetty') enabled at server: com.sun.jmx.mbeanserver.JmxMBeanServer@21d8414c
   [junit4]   2> 2022792 INFO  (TEST-PeerSyncTest.test-seed#[12CF0620F945B50E]) [    ] o.a.s.c.CorePropertiesLocator Found 1 core definitions underneath /home/jenkins/workspace/Lucene-Solr-8.x-Linux/solr/build/solr-core/test/J0/temp/solr.update.PeerSyncTest_12CF0620F945B50E-001/tempDir-001/control/cores
   [junit4]   2> 2022792 INFO  (TEST-PeerSyncTest.test-seed#[12CF0620F945B50E]) [    ] o.a.s.c.CorePropertiesLocator Cores are: [collection1]
   [junit4]   2> 2022793 INFO  (coreLoadExecutor-13489-thread-1) [    x:collection1] o.a.s.c.SolrResourceLoader [null] Added 2 libs to classloader, from paths: [/home/jenkins/workspace/Lucene-Solr-8.x-Linux/solr/core/src/test-files/solr/collection1/lib, /home/jenkins/workspace/Lucene-Solr-8.x-Linux/solr/core/src/test-files/solr/collection1/lib/classes]
   [junit4]   2> 2022813 INFO  (coreLoadExecutor-13489-thread-1) [    x:collection1] o.a.s.c.SolrConfig Using Lucene MatchVersion: 8.2.0
   [junit4]   2> 2022828 INFO  (coreLoadExecutor-13489-thread-1) [    x:collection1] o.a.s.s.IndexSchema [collection1] Schema name=test
   [junit4]   2> 2022949 INFO  (coreLoadExecutor-13489-thread-1) [    x:collection1] o.a.s.s.IndexSchema Loaded schema test/1.0 with uniqueid field id
   [junit4]   2> 2022955 INFO  (coreLoadExecutor-13489-thread-1) [    x:collection1] o.a.s.c.CoreContainer Creating SolrCore 'collection1' using configuration from configset /home/jenkins/workspace/Lucene-Solr-8.x-Linux/solr/core/src/test-files/solr/collection1, trusted=true
   [junit4]   2> 2022956 INFO  (coreLoadExecutor-13489-thread-1) [    x:collection1] o.a.s.m.r.SolrJmxReporter JMX monitoring for 'solr.core.collection1' (registry 'solr.core.collection1') enabled at server: com.sun.jmx.mbeanserver.JmxMBeanServer@21d8414c
   [junit4]   2> 2022956 INFO  (coreLoadExecutor-13489-thread-1) [    x:collection1] o.a.s.c.SolrCore [[collection1] ] Opening new SolrCore at [/home/jenkins/workspace/Lucene-Solr-8.x-Linux/solr/core/src/test-files/solr/collection1], dataDir=[/home/jenkins/workspace/Lucene-Solr-8.x-Linux/solr/build/solr-core/test/J0/temp/solr.update.PeerSyncTest_12CF0620F945B50E-001/tempDir-001/control/cores/collection1/data/]
   [junit4]   2> 2022958 INFO  (coreLoadExecutor-13489-thread-1) [    x:collection1] o.a.s.u.RandomMergePolicy RandomMergePolicy wrapping class org.apache.lucene.index.AlcoholicMergePolicy: [AlcoholicMergePolicy: minMergeSize=0, mergeFactor=10, maxMergeSize=2055925415, maxMergeSizeForForcedMerge=9223372036854775807, calibrateSizeByDeletes=true, maxMergeDocs=2147483647, maxCFSSegmentSizeMB=8.796093022207999E12, noCFSRatio=0.1]
   [junit4]   2> 2022959 WARN  (coreLoadExecutor-13489-thread-1) [    x:collection1] o.a.s.c.RequestHandlers INVALID paramSet a in requestHandler {type = requestHandler,name = /dump,class = DumpRequestHandler,attributes = {initParams=a, name=/dump, class=DumpRequestHandler},args = {defaults={a=A,b=B}}}
   [junit4]   2> 2022991 INFO  (coreLoadExecutor-13489-thread-1) [    x:collection1] o.a.s.u.UpdateHandler Using UpdateLog implementation: org.apache.solr.update.UpdateLog
   [junit4]   2> 2022991 INFO  (coreLoadExecutor-13489-thread-1) [    x:collection1] o.a.s.u.UpdateLog Initializing UpdateLog: dataDir= defaultSyncLevel=FLUSH numRecordsToKeep=100 maxNumLogsToKeep=10 numVersionBuckets=65536
   [junit4]   2> 2022992 INFO  (coreLoadExecutor-13489-thread-1) [    x:collection1] o.a.s.u.CommitTracker Hard AutoCommit: disabled
   [junit4]   2> 2022992 INFO  (coreLoadExecutor-13489-thread-1) [    x:collection1] o.a.s.u.CommitTracker Soft AutoCommit: disabled
   [junit4]   2> 2022993 INFO  (coreLoadExecutor-13489-thread-1) [    x:collection1] o.a.s.u.RandomMergePolicy RandomMergePolicy wrapping class org.apache.lucene.index.TieredMergePolicy: [TieredMergePolicy: maxMergeAtOnce=10, maxMergeAtOnceExplicit=19, maxMergedSegmentMB=1.3662109375, floorSegmentMB=2.0751953125, forceMergeDeletesPctAllowed=2.574303009794362, segmentsPerTier=18.0, maxCFSSegmentSizeMB=8.796093022207999E12, noCFSRatio=0.5339246864930585, deletesPctAllowed=29.842330219846595
   [junit4]   2> 2022993 INFO  (coreLoadExecutor-13489-thread-1) [    x:collection1] o.a.s.s.SolrIndexSearcher Opening [Searcher@167d94f1[collection1] main]
   [junit4]   2> 2022993 WARN  (coreLoadExecutor-13489-thread-1) [    x:collection1] o.a.s.r.ManagedResourceStorage Cannot write to config directory /home/jenkins/workspace/Lucene-Solr-8.x-Linux/solr/core/src/test-files/solr/collection1/conf; switching to use InMemory storage instead.
   [junit4]   2> 2022993 INFO  (coreLoadExecutor-13489-thread-1) [    x:collection1] o.a.s.h.ReplicationHandler Commits will be reserved for 10000ms.
   [junit4]   2> 2022994 INFO  (coreLoadExecutor-13489-thread-1) [    x:collection1] o.a.s.u.UpdateLog Could not find max version in index or recent updates, using new clock 1632337241101565952
   [junit4]   2> 2022995 INFO  (searcherExecutor-13490-thread-1-processing-x:collection1) [    x:collection1] o.a.s.c.SolrCore [collection1] Registered new searcher Searcher@167d94f1[collection1] main{ExitableDirectoryReader(UninvertingDirectoryReader())}
   [junit4]   2> 2023087 INFO  (TEST-PeerSyncTest.test-seed#[12CF0620F945B50E]) [    ] o.a.s.SolrTestCaseJ4 Writing core.properties file to /home/jenkins/workspace/Lucene-Solr-8.x-Linux/solr/build/solr-core/test/J0/temp/solr.update.PeerSyncTest_12CF0620F945B50E-001/tempDir-001/shard0/cores/collection1
   [junit4]   2> 2023088 WARN  (TEST-PeerSyncTest.test-seed#[12CF0620F945B50E]) [    ] o.e.j.s.AbstractConnector Ignoring deprecated socket close linger time
   [junit4]   2> 2023088 INFO  (TEST-PeerSyncTest.test-seed#[12CF0620F945B50E]) [    ] o.a.s.c.s.e.JettySolrRunner Start Jetty (original configured port=0)
   [junit4]   2> 2023088 INFO  (TEST-PeerSyncTest.test-seed#[12CF0620F945B50E]) [    ] o.a.s.c.s.e.JettySolrRunner Trying to start Jetty on port 0 try number 1 ...
   [junit4]   2> 2023088 INFO  (TEST-PeerSyncTest.test-seed#[12CF0620F945B50E]) [    ] o.e.j.s.Server jetty-9.4.14.v20181114; built: 2018-11-14T21:20:31.478Z; git: c4550056e785fb5665914545889f21dc136ad9e6; jvm 1.8.0_201-b09
   [junit4]   2> 2023097 INFO  (TEST-PeerSyncTest.test-seed#[12CF0620F945B50E]) [    ] o.e.j.s.session DefaultSessionIdManager workerName=node0
   [junit4]   2> 2023097 INFO  (TEST-PeerSyncTest.test-seed#[12CF0620F945B50E]) [    ] o.e.j.s.session No SessionScavenger set, using defaults
   [junit4]   2> 2023097 INFO  (TEST-PeerSyncTest.test-seed#[12CF0620F945B50E]) [    ] o.e.j.s.session node0 Scavenging every 600000ms
   [junit4]   2> 2023097 INFO  (TEST-PeerSyncTest.test-seed#[12CF0620F945B50E]) [    ] o.e.j.s.h.ContextHandler Started o.e.j.s.ServletContextHandler@43f3f22d{/_/mc,null,AVAILABLE}
   [junit4]   2> 2023098 INFO  (TEST-PeerSyncTest.test-seed#[12CF0620F945B50E]) [    ] o.e.j.s.AbstractConnector Started ServerConnector@78f61bc0{HTTP/1.1,[http/1.1, h2c]}{127.0.0.1:45939}
   [junit4]   2> 2023098 INFO  (TEST-PeerSyncTest.test-seed#[12CF0620F945B50E]) [    ] o.e.j.s.Server Started @2023132ms
   [junit4]   2> 2023098 INFO  (TEST-PeerSyncTest.test-seed#[12CF0620F945B50E]) [    ] o.a.s.c.s.e.JettySolrRunner Jetty properties: {schema=schema.xml, solrconfig=solrconfig-tlog.xml, hostContext=/_/mc, hostPort=45939, coreRootDirectory=/home/jenkins/workspace/Lucene-Solr-8.x-Linux/solr/build/solr-core/test/J0/temp/solr.update.PeerSyncTest_12CF0620F945B50E-001/tempDir-001/shard0/cores}
   [junit4]   2> 2023098 ERROR (TEST-PeerSyncTest.test-seed#[12CF0620F945B50E]) [    ] o.a.s.u.StartupLoggingUtils Missing Java Option solr.log.dir. Logging may be missing or incomplete.
   [junit4]   2> 2023098 INFO  (TEST-PeerSyncTest.test-seed#[12CF0620F945B50E]) [    ] o.a.s.s.SolrDispatchFilter Using logger factory org.apache.logging.slf4j.Log4jLoggerFactory
   [junit4]   2> 2023098 INFO  (TEST-PeerSyncTest.test-seed#[12CF0620F945B50E]) [    ] o.a.s.s.SolrDispatchFilter  ___      _       Welcome to Apache Solr? version 8.2.0
   [junit4]   2> 2023098 INFO  (TEST-PeerSyncTest.test-seed#[12CF0620F945B50E]) [    ] o.a.s.s.SolrDispatchFilter / __| ___| |_ _   Starting in standalone mode on port null
   [junit4]   2> 2023098 INFO  (TEST-PeerSyncTest.test-seed#[12CF0620F945B50E]) [    ] o.a.s.s.SolrDispatchFilter \__ \/ _ \ | '_|  Install dir: null
   [junit4]   2> 2023098 INFO  (TEST-PeerSyncTest.test-seed#[12CF0620F945B50E]) [    ] o.a.s.s.SolrDispatchFilter |___/\___/_|_|    Start time: 2019-05-01T13:41:42.656Z
   [junit4]   2> 2023098 INFO  (TEST-PeerSyncTest.test-seed#[12CF0620F945B50E]) [    ] o.a.s.c.SolrXmlConfig Loading container configuration from /home/jenkins/workspace/Lucene-Solr-8.x-Linux/solr/build/solr-core/test/J0/temp/solr.update.PeerSyncTest_12CF0620F945B50E-001/tempDir-001/shard0/solr.xml
   [junit4]   2> 2023101 INFO  (TEST-PeerSyncTest.test-seed#[12CF0620F945B50E]) [    ] o.a.s.c.SolrXmlConfig Configuration parameter autoReplicaFailoverWorkLoopDelay is ignored
   [junit4]   2> 2023101 INFO  (TEST-PeerSyncTest.test-seed#[12CF0620F945B50E]) [    ] o.a.s.c.SolrXmlConfig Configuration parameter autoReplicaFailoverBadNodeExpiration is ignored
   [junit4]   2> 2023102 INFO  (TEST-PeerSyncTest.test-seed#[12CF0620F945B50E]) [    ] o.a.s.c.SolrXmlConfig MBean server found: com.sun.jmx.mbeanserver.JmxMBeanServer@21d8414c, but no JMX reporters were configured - adding default JMX reporter.
   [junit4]   2> 2023174 INFO  (TEST-PeerSyncTest.test-seed#[12CF0620F945B50E]) [    ] o.a.s.h.c.HttpShardHandlerFactory Host whitelist initialized: WhitelistHostChecker [whitelistHosts=null, whitelistHostCheckingEnabled=false]
   [junit4]   2> 2023175 WARN  (TEST-PeerSyncTest.test-seed#[12CF0620F945B50E]) [    ] o.e.j.u.s.S.config No Client EndPointIdentificationAlgorithm configured for SslContextFactory@72a377bf[provider=null,keyStore=null,trustStore=null]
   [junit4]   2> 2023183 WARN  (TEST-PeerSyncTest.test-seed#[12CF0620F945B50E]) [    ] o.e.j.u.s.S.config No Client EndPointIdentificationAlgorithm configured for SslContextFactory@42a71de4[provider=null,keyStore=null,trustStore=null]
   [junit4]   2> 2023209 INFO  (TEST-PeerSyncTest.test-seed#[12CF0620F945B50E]) [    ] o.a.s.c.TransientSolrCoreCacheDefault Allocating transient cache for 4 transient cores
   [junit4]   2> 2023209 INFO  (TEST-PeerSyncTest.test-seed#[12CF0620F945B50E]) [    ] o.a.s.h.a.MetricsHistoryHandler No .system collection, keeping metrics history in memory.
   [junit4]   2> 2023227 INFO  (TEST-PeerSyncTest.test-seed#[12CF0620F945B50E]) [    ] o.a.s.m.r.SolrJmxReporter JMX monitoring for 'solr.node' (registry 'solr.node') enabled at server: com.sun.jmx.mbeanserver.JmxMBeanServer@21d8414c
   [junit4]   2> 2023234 INFO  (TEST-PeerSyncTest.test-seed#[12CF0620F945B50E]) [    ] o.a.s.m.r.SolrJmxReporter JMX monitoring for 'solr.jvm' (registry 'solr.jvm') enabled at server: com.sun.jmx.mbeanserver.JmxMBeanServer@21d8414c
   [junit4]   2> 2023234 INFO  (TEST-PeerSyncTest.test-seed#[12CF0620F945B50E]) [    ] o.a.s.m.r.SolrJmxReporter JMX monitoring for 'solr.jetty' (registry 'solr.jetty') enabled at server: com.sun.jmx.mbeanserver.JmxMBeanServer@21d8414c
   [junit4]   2> 2023235 INFO  (TEST-PeerSyncTest.test-seed#[12CF0620F945B50E]) [    ] o.a.s.c.CorePropertiesLocator Found 1 core definitions underneath /home/jenkins/workspace/Lucene-Solr-8.x-Linux/solr/build/solr-core/test/J0/temp/solr.update.PeerSyncTest_12CF0620F945B50E-001/tempDir-001/shard0/cores
   [junit4]   2> 2023235 INFO  (TEST-PeerSyncTest.test-seed#[12CF0620F945B50E]) [    ] o.a.s.c.CorePropertiesLocator Cores are: [collection1]
   [junit4]   2> 2023235 INFO  (coreLoadExecutor-13503-thread-1) [    x:collection1] o.a.s.c.SolrResourceLoader [null] Added 2 libs to classloader, from paths: [/home/jenkins/workspace/Lucene-Solr-8.x-Linux/solr/core/src/test-files/solr/collection1/lib, /home/jenkins/workspace/Lucene-Solr-8.x-Linux/solr/core/src/test-files/solr/collection1/lib/classes]
   [junit4]   2> 2023249 INFO  (coreLoadExecutor-13503-thread-1) [    x:collection1] o.a.s.c.SolrConfig Using Lucene MatchVersion: 8.2.0
   [junit4]   2> 2023260 INFO  (coreLoadExecutor-13503-thread-1) [    x:collection1] o.a.s.s.IndexSchema [collection1] Schema name=test
   [junit4]   2> 2023352 INFO  (coreLoadExecutor-13503-thread-1) [    x:collection1] o.a.s.s.IndexSchema Loaded schema test/1.0 with uniqueid field id
   [junit4]   2> 2023356 INFO  (coreLoadExecutor-13503-thread-1) [    x:collection1] o.a.s.c.CoreContainer Creating SolrCore 'collection1' using configuration from configset /home/jenkins/workspace/Lucene-Solr-8.x-Linux/solr/core/src/test-files/solr/collection1, trusted=true
   [junit4]   2> 2023356 INFO  (coreLoadExecutor-13503-thread-1) [    x:collection1] o.a.s.m.r.SolrJmxReporter JMX monitoring for 'solr.core.collection1' (registry 'solr.core.collection1') enabled at server: com.sun.jmx.mbeanserver.JmxMBeanServer@21d8414c
   [junit4]   2> 2023356 INFO  (coreLoadExecutor-13503-thread-1) [    x:collection1] o.a.s.c.SolrCore [[collection1] ] Opening new SolrCore at [/home/jenkins/workspace/Lucene-Solr-8.x-Linux/solr/core/src/test-files/solr/collection1], dataDir=[/home/jenkins/workspace/Lucene-Solr-8.x-Linux/solr/build/solr-core/test/J0/temp/solr.update.PeerSyncTest_12CF0620F945B50E-001/tempDir-001/shard0/cores/collection1/data/]
   [junit4]   2> 2023357 INFO  (coreLoadExecutor-13503-thread-1) [    x:collection1] o.a.s.u.RandomMergePolicy RandomMergePolicy wrapping class org.apache.lucene.index.AlcoholicMergePolicy: [AlcoholicMergePolicy: minMergeSize=0, mergeFactor=10, maxMergeSize=2055925415, maxMergeSizeForForcedMerge=9223372036854775807, calibrateSizeByDeletes=true, maxMergeDocs=2147483647, maxCFSSegmentSizeMB=8.796093022207999E12, noCFSRatio=0.1]
   [junit4]   2> 2023357 WARN  (coreLoadExecutor-13503-thread-1) [    x:collection1] o.a.s.c.RequestHandlers INVALID paramSet a in requestHandler {type = requestHandler,name = /dump,class = DumpRequestHandler,attributes = {initParams=a, name=/dump, class=DumpRequestHandler},args = {defaults={a=A,b=B}}}
   [junit4]   2> 2023379 INFO  (coreLoadExecutor-13503-thread-1) [    x:collection1] o.a.s.u.UpdateHandler Using UpdateLog implementation: org.apache.solr.update.UpdateLog
   [junit4]   2> 2023379 INFO  (coreLoadExecutor-13503-thread-1) [    x:collection1] o.a.s.u.UpdateLog Initializing UpdateLog: dataDir= defaultSyncLevel=FLUSH numRecordsToKeep=100 maxNumLogsToKeep=10 numVersionBuckets=65536
   [junit4]   2> 2023379 INFO  (coreLoadExecutor-13503-thread-1) [    x:collection1] o.a.s.u.CommitTracker Hard AutoCommit: disabled
   [junit4]   2> 2023379 INFO  (coreLoadExecutor-13503-thread-1) [    x:collection1] o.a.s.u.CommitTracker Soft AutoCommit: disabled
   [junit4]   2> 2023380 INFO  (coreLoadExecutor-13503-thread-1) [    x:collection1] o.a.s.u.RandomMergePolicy RandomMergePolicy wrapping class org.apache.lucene.index.TieredMergePolicy: [TieredMergePolicy: maxMergeAtOnce=10, maxMergeAtOnceExplicit=19, maxMergedSegmentMB=1.3662109375, floorSegmentMB=2.0751953125, forceMergeDeletesPctAllowed=2.574303009794362, segmentsPerTier=18.0, maxCFSSegmentSizeMB=8.796093022207999E12, noCFSRatio=0.5339246864930585, deletesPctAllowed=29.842330219846595
   [junit4]   2> 2023380 INFO  (coreLoadExecutor-13503-thread-1) [    x:collection1] o.a.s.s.SolrIndexSearcher Opening [Searcher@537e7c7e[collection1] main]
   [junit4]   2> 2023380 WARN  (coreLoadExecutor-13503-thread-1) [    x:collection1] o.a.s.r.ManagedResourceStorage Cannot write to config directory /home/jenkins/workspace/Lucene-Solr-8.x-Linux/solr/core/src/test-files/solr/collection1/conf; switching to use InMemory storage instead.
   [junit4]   2> 2023380 INFO  (coreLoadExecutor-13503-thread-1) [    x:collection1] o.a.s.h.ReplicationHandler Commits will be reserved for 10000ms.
   [junit4]   2> 2023380 INFO  (coreLoadExecutor-13503-thread-1) [    x:collection1] o.a.s.u.UpdateLog Could not find max version in index or recent updates, using new clock 1632337241506316288
   [junit4]   2> 2023382 INFO  (searcherExecutor-13504-thread-1-processing-x:collection1) [    x:collection1] o.a.s.c.SolrCore [collection1] Registered new searcher Searcher@537e7c7e[collection1] main{ExitableDirectoryReader(UninvertingDirectoryReader())}
   [junit4]   2> 2023451 INFO  (TEST-PeerSyncTest.test-seed#[12CF0620F945B50E]) [    ] o.a.s.SolrTestCaseJ4 Writing core.properties file to /home/jenkins/workspace/Lucene-Solr-8.x-Linux/solr/build/solr-core/test/J0/temp/solr.update.PeerSyncTest_12CF0620F945B50E-001/tempDir-001/shard1/cores/collection1
   [junit4]   2> 2023451 WARN  (TEST-PeerSyncTest.test-seed#[12CF0620F945B50E]) [    ] o.e.j.s.AbstractConnector Ignoring deprecated socket close linger time
   [junit4]   2> 2023452 INFO  (TEST-PeerSyncTest.test-seed#[12CF0620F945B50E]) [    ] o.a.s.c.s.e.JettySolrRunner Start Jetty (original configured port=0)
   [junit4]   2> 2023452 INFO  (TEST-PeerSyncTest.test-seed#[12CF0620F945B50E]) [    ] o.a.s.c.s.e.JettySolrRunner Trying to start Jetty on port 0 try number 1 ...
   [junit4]   2> 2023452 INFO  (TEST-PeerSyncTest.test-seed#[12CF0620F945B50E]) [    ] o.e.j.s.Server jetty-9.4.14.v20181114; built: 2018-11-14T21:20:31.478Z; git: c4550056e785fb5665914545889f21dc136ad9e6; jvm 1.8.0_201-b09
   [junit4]   2> 2023456 INFO  (TEST-PeerSyncTest.test-seed#[12CF0620F945B50E]) [    ] o.e.j.s.session DefaultSessionIdManager workerName=node0
   [junit4]   2> 2023456 INFO  (TEST-PeerSyncTest.test-seed#[12CF0620F945B50E]) [    ] o.e.j.s.session No SessionScavenger set, using defaults
   [junit4]   2> 2023456 INFO  (TEST-PeerSyncTest.test-seed#[12CF0620F945B50E]) [    ] o.e.j.s.session node0 Scavenging every 660000ms
   [junit4]   2> 2023456 INFO  (TEST-PeerSyncTest.test-seed#[12CF0620F945B50E]) [    ] o.e.j.s.h.ContextHandler Started o.e.j.s.ServletContextHandler@5857324a{/_/mc,null,AVAILABLE}
   [junit4]   2> 2023456 INFO  (TEST-PeerSyncTest.test-seed#[12CF0620F945B50E]) [    ] o.e.j.s.AbstractConnector Started ServerConnector@7e23e5b6{HTTP/1.1,[http/1.1, h2c]}{127.0.0.1:36731}
   [junit4]   2> 2023456 INFO  (TEST-PeerSyncTest.test-seed#[12CF0620F945B50E]) [    ] o.e.j.s.Server Started @2023491ms
   [junit4]   2> 2023456 INFO  (TEST-PeerSyncTest.test-seed#[12CF0620F945B50E]) [    ] o.a.s.c.s.e.JettySolrRunner Jetty properties: {schema=schema.xml, solrconfig=solrconfig-tlog.xml, hostContext=/_/mc, hostPort=36731, coreRootDirectory=/home/jenkins/workspace/Lucene-Solr-8.x-Linux/solr/build/solr-core/test/J0/temp/solr.update.PeerSyncTest_12CF0620F945B50E-001/tempDir-001/shard1/cores}
   [junit4]   2> 2023457 ERROR (TEST-PeerSyncTest.test-seed#[12CF0620F945B50E]) [    ] o.a.s.u.StartupLoggingUtils Missing Java Option solr.log.dir. Logging may be missing or incomplete.
   [junit4]   2> 2023457 INFO  (TEST-PeerSyncTest.test-seed#[12CF0620F945B50E]) [    ] o.a.s.s.SolrDispatchFilter Using logger factory org.apache.logging.slf4j.Log4jLoggerFactory
   [junit4]   2> 2023457 INFO  (TEST-PeerSyncTest.test-seed#[12CF0620F945B50E]) [    ] o.a.s.s.SolrDispatchFilter  ___      _       Welcome to Apache Solr? version 8.2.0
   [junit4]   2> 2023457 INFO  (TEST-PeerSyncTest.test-seed#[12CF0620F945B50E]) [    ] o.a.s.s.SolrDispatchFilter / __| ___| |_ _   Starting in standalone mode on port null
   [junit4]   2> 2023457 INFO  (TEST-PeerSyncTest.test-seed#[12CF0620F945B50E]) [    ] o.a.s.s.SolrDispatchFilter \__ \/ _ \ | '_|  Install dir: null
   [junit4]   2> 2023457 INFO  (TEST-PeerSyncTest.test-seed#[12CF0620F945B50E]) [    ] o.a.s.s.SolrDispatchFilter |___/\___/_|_|    Start time: 2019-05-01T13:41:43.015Z
   [junit4]   2> 2023457 INFO  (TEST-PeerSyncTest.test-seed#[12CF0620F945B50E]) [    ] o.a.s.c.SolrXmlConfig Loading container configuration from /home/jenkins/workspace/Lucene-Solr-8.x-Linux/solr/build/solr-core/test/J0/temp/solr.update.PeerSyncTest_12CF0620F945B50E-001/tempDir-001/shard1/solr.xml
   [junit4]   2> 2023460 INFO  (TEST-PeerSyncTest.test-seed#[12CF0620F945B50E]) [    ] o.a.s.c.SolrXmlConfig Configuration parameter autoReplicaFailoverWorkLoopDelay is ignored
   [junit4]   2> 2023460 INFO  (TEST-PeerSyncTest.test-seed#[12CF0620F945B50E]) [    ] o.a.s.c.SolrXmlConfig Configuration parameter autoReplicaFailoverBadNodeExpiration is ignored
   [junit4]   2> 2023461 INFO  (TEST-PeerSyncTest.test-seed#[12CF0620F945B50E]) [    ] o.a.s.c.SolrXmlConfig MBean server found: com.sun.jmx.mbeanserver.JmxMBeanServer@21d8414c, but no JMX reporters were configured - adding default JMX reporter.
   [junit4]   2> 2023705 INFO  (TEST-PeerSyncTest.test-seed#[12CF0620F945B50E]) [    ] o.a.s.h.c.HttpShardHandlerFactory Host whitelist initialized: WhitelistHostChecker [whitelistHosts=null, whitelistHostCheckingEnabled=false]
   [junit4]   2> 2023707 WARN  (TEST-PeerSyncTest.test-seed#[12CF0620F945B50E]) [    ] o.e.j.u.s.S.config No Client EndPointIdentificationAlgorithm configured for SslContextFactory@31fccde4[provider=null,keyStore=null,trustStore=null]
   [junit4]   2> 2023709 WARN  (TEST-PeerSyncTest.test-seed#[12CF0620F945B50E]) [    ] o.e.j.u.s.S.config No Client EndPointIdentificationAlgorithm configured for SslContextFactory@3cb49f49[provider=null,keyStore=null,trustStore=null]
   [junit4]   2> 2023723 INFO  (TEST-PeerSyncTest.test-seed#[12CF0620F945B50E]) [    ] o.a.s.c.TransientSolrCoreCacheDefault Allocating transient cache for 4 transient cores
   [junit4]   2> 2023723 INFO  (TEST-PeerSyncTest.test-seed#[12CF0620F945B50E]) [    ] o.a.s.h.a.MetricsHistoryHandler No .system collection, keeping metrics history in memory.
   [junit4]   2> 2023737 INFO  (TEST-PeerSyncTest.test-seed#[12CF0620F945B50E]) [    ] o.a.s.m.r.SolrJmxReporter JMX monitoring for 'solr.node' (registry 'solr.node') enabled at server: com.sun.jmx.mbeanserver.JmxMBeanServer@21d8414c
   [junit4]   2> 2023746 INFO  (TEST-PeerSyncTest.test-seed#[12CF0620F945B50E]) [    ] o.a.s.m.r.SolrJmxReporter JMX monitoring for 'solr.jvm' (registry 'solr.jvm') enabled at server: com.sun.jmx.mbeanserver.JmxMBeanServer@21d8414c
   [junit4]   2> 2023746 INFO  (TEST-PeerSyncTest.test-seed#[12CF0620F945B50E]) [    ] o.a.s.m.r.SolrJmxReporter JMX monitoring for 'solr.jetty' (registry 'solr.jetty') enabled at server: com.sun.jmx.mbeanserver.JmxMBeanServer@21d8414c
   [junit4]   2> 2023748 INFO  (TEST-PeerSyncTest.test-seed#[12CF0620F945B50E]) [    ] o.a.s.c.CorePropertiesLocator Found 1 core definitions underneath /home/jenkins/workspace/Lucene-Solr-8.x-Linux/solr/build/solr-core/test/J0/temp/solr.update.PeerSyncTest_12CF0620F945B50E-001/tempDir-001/shard1/cores
   [junit4]   2> 2023748 INFO  (TEST-PeerSyncTest.test-seed#[12CF0620F945B50E]) [    ] o.a.s.c.CorePropertiesLocator Cores are: [collection1]
   [junit4]   2> 2023748 INFO  (coreLoadExecutor-13517-thread-1) [    x:collection1] o.a.s.c.SolrResourceLoader [null] Added 2 libs to classloader, from paths: [/home/jenkins/workspace/Lucene-Solr-8.x-Linux/solr/core/src/test-files/solr/collection1/lib, /home/jenkins/workspace/Lucene-Solr-8.x-Linux/solr/core/src/test-files/solr/collection1/lib/classes]
   [junit4]   2> 2023764 INFO  (coreLoadExecutor-13517-thread-1) [    x:collection1] o.a.s.c.SolrConfig Using Lucene MatchVersion: 8.2.0
   [junit4]   2> 2023776 INFO  (coreLoadExecutor-13517-thread-1) [    x:collection1] o.a.s.s.IndexSchema [collection1] Schema name=test
   [junit4]   2> 2023885 INFO  (coreLoadExecutor-13517-thread-1) [    x:collection1] o.a.s.s.IndexSchema Loaded schema test/1.0 with uniqueid field id
   [junit4]   2> 2023889 INFO  (coreLoadExecutor-13517-thread-1) [    x:collection1] o.a.s.c.CoreContainer Creating SolrCore 'collection1' using configuration from configset /home/jenkins/workspace/Lucene-Solr-8.x-Linux/solr/core/src/test-files/solr/collection1, trusted=true
   [junit4]   2> 2023890 INFO  (coreLoadExecutor-13517-thread-1) [    x:collection1] o.a.s.m.r.SolrJmxReporter JMX monitoring for 'solr.core.collection1' (registry 'solr.core.collection1') enabled at server: com.sun.jmx.mbeanserver.JmxMBeanServer@21d8414c
   [junit4]   2> 2023890 INFO  (coreLoadExecutor-13517-thread-1) [    x:collection1] o.a.s.c.SolrCore [[collection1] ] Opening new SolrCore at [/home/jenkins/workspace/Lucene-Solr-8.x-Linux/solr/core/src/test-files/solr/collection1], dataDir=[/home/jenkins/workspace/Lucene-Solr-8.x-Linux/solr/build/solr-core/test/J0/temp/solr.update.PeerSyncTest_12CF0620F945B50E-001/tempDir-001/shard1/cores/collection1/data/]
   [junit4]   2> 2023890 INFO  (coreLoadExecutor-13517-thread-1) [    x:collection1] o.a.s.u.RandomMergePolicy RandomMergePolicy wrapping class org.apache.lucene.index.AlcoholicMergePolicy: [AlcoholicMergePolicy: minMergeSize=0, mergeFactor=10, maxMergeSize=2055925415, maxMergeSizeForForcedMerge=9223372036854775807, calibrateSizeByDeletes=true, maxMergeDocs=2147483647, maxCFSSegmentSizeMB=8.796093022207999E12, noCFSRatio=0.1]
   [junit4]   2> 2023893 WARN  (coreLoadExecutor-13517-thread-1) [    x:collection1] o.a.s.c.RequestHandlers INVALID paramSet a in requestHandler {type = requestHandler,name = /dump,class = DumpRequestHandler,attributes = {initParams=a, name=/dump, class=DumpRequestHandler},args = {defaults={a=A,b=B}}}
   [junit4]   2> 2023915 INFO  (coreLoadExecutor-13517-thread-1) [    x:collection1] o.a.s.u.UpdateHandler Using UpdateLog implementation: org.apache.solr.update.UpdateLog
   [junit4]   2> 2023915 INFO  (coreLoadExecutor-13517-thread-1) [    x:collection1] o.a.s.u.UpdateLog Initializing UpdateLog: dataDir= defaultSyncLevel=FLUSH numRecordsToKeep=100 maxNumLogsToKeep=10 numVersionBuckets=65536
   [junit4]   2> 2023916 INFO  (coreLoadExecutor-13517-thread-1) [    x:collection1] o.a.s.u.CommitTracker Hard AutoCommit: disabled
   [junit4]   2> 2023916 INFO  (coreLoadExecutor-13517-thread-1) [    x:collection1] o.a.s.u.CommitTracker Soft AutoCommit: disabled
   [junit4]   2> 2023917 INFO  (coreLoadExecutor-13517-thread-1) [    x:collection1] o.a.s.u.RandomMergePolicy RandomMergePolicy wrapping class org.apache.lucene.index.TieredMergePolicy: [TieredMergePolicy: maxMergeAtOnce=10, maxMergeAtOnceExplicit=19, maxMergedSegmentMB=1.3662109375, floorSegmentMB=2.0751953125, forceMergeDeletesPctAllowed=2.574303009794362, segmentsPerTier=18.0, maxCFSSegmentSizeMB=8.796093022207999E12, noCFSRatio=0.5339246864930585, deletesPctAllowed=29.842330219846595
   [junit4]   2> 2023917 INFO  (coreLoadExecutor-13517-thread-1) [    x:collection1] o.a.s.s.SolrIndexSearcher Opening [Searcher@51e00bab[collection1] main]
   [junit4]   2> 2023917 WARN  (coreLoadExecutor-13517-thread-1) [    x:collection1] o.a.s.r.ManagedResourceStorage Cannot write to config directory /home/jenkins/workspace/Lucene-Solr-8.x-Linux/solr/core/src/test-files/solr/collection1/conf; switching to use InMemory storage instead.
   [junit4]   2> 2023917 INFO  (coreLoadExecutor-13517-thread-1) [    x:collection1] o.a.s.h.ReplicationHandler Commits will be reserved for 10000ms.
   [junit4]   2> 2023917 INFO  (coreLoadExecutor-13517-thread-1) [    x:collection1] o.a.s.u.UpdateLog Could not find max version in index or recent updates, using new clock 1632337242069401600
   [junit4]   2> 2023919 INFO  (searcherExecutor-13518-thread-1-processing-x:collection1) [    x:collection1] o.a.s.c.SolrCore [collection1] Registered new searcher Searcher@51e00bab[collection1] main{ExitableDirectoryReader(UninvertingDirectoryReader())}
   [junit4]   2> 2023992 INFO  (TEST-PeerSyncTest.test-seed#[12CF0620F945B50E]) [    ] o.a.s.SolrTestCaseJ4 Writing core.properties file to /home/jenkins/workspace/Lucene-Solr-8.x-Linux/solr/build/solr-core/test/J0/temp/solr.update.PeerSyncTest_12CF0620F945B50E-001/tempDir-001/shard2/cores/collection1
   [junit4]   2> 2023992 WARN  (TEST-PeerSyncTest.test-seed#[12CF0620F945B50E]) [    ] o.e.j.s.AbstractConnector Ignoring deprecated socket close linger time
   [junit4]   2> 2023992 INFO  (TEST-PeerSyncTest.test-seed#[12CF0620F945B50E]) [    ] o.a.s.c.s.e.JettySolrRunner Start Jetty (original configured port=0)
   [junit4]   2> 2023992 INFO  (TEST-PeerSyncTest.test-seed#[12CF0620F945B50E]) [    ] o.a.s.c.s.e.JettySolrRunner Trying to start Jetty on port 0 try number 1 ...
   [junit4]   2> 2023992 INFO  (TEST-PeerSyncTest.test-seed#[12CF0620F945B50E]) [    ] o.e.j.s.Server jetty-9.4.14.v20181114; built: 2018-11-14T21:20:31.478Z; git: c4550056e785fb5665914545889f21dc136ad9e6; jvm 1.8.0_201-b09
   [junit4]   2> 2023995 INFO  (TEST-PeerSyncTest.test-seed#[12CF0620F945B50E]) [    ] o.e.j.s.session DefaultSessionIdManager workerName=node0
   [junit4]   2> 2023995 INFO  (TEST-PeerSyncTest.test-seed#[12CF0620F945B50E]) [    ] o.e.j.s.session No SessionScavenger set, using defaults
   [junit4]   2> 2023995 INFO  (TEST-PeerSyncTest.test-seed#[12CF0620F945B50E]) [    ] o.e.j.s.session node0 Scavenging every 600000ms
   [junit4]   2> 2023996 INFO  (TEST-PeerSyncTest.test-seed#[12CF0620F945B50E]) [    ] o.e.j.s.h.ContextHandler Started o.e.j.s.ServletContextHandler@2ad6bb1c{/_/mc,null,AVAILABLE}
   [junit4]   2> 2023996 INFO  (TEST-PeerSyncTest.test-seed#[12CF0620F945B50E]) [    ] o.e.j.s.AbstractConnector Started ServerConnector@338bc742{HTTP/1.1,[http/1.1, h2c]}{127.0.0.1:46657}
   [junit4]   2> 2023996 INFO  (TEST-PeerSyncTest.test-seed#[12CF0620F945B50E]) [    ] o.e.j.s.Server Started @2024030ms
   [junit4]   2> 2023996 INFO  (TEST-PeerSyncTest.test-seed#[12CF0620F945B50E]) [    ] o.a.s.c.s.e.JettySolrRunner Jetty properties: {schema=schema.xml, solrconfig=solrconfig-tlog.xml, hostContext=/_/mc, hostPort=46657, coreRootDirectory=/home/jenkins/workspace/Lucene-Solr-8.x-Linux/solr/build/solr-core/test/J0/temp/solr.update.PeerSyncTest_12CF0620F945B50E-001/tempDir-001/shard2/cores}
   [junit4]   2> 2023996 ERROR (TEST-PeerSyncTest.test-seed#[12CF0620F945B50E]) [    ] o.a.s.u.StartupLoggingUtils Missing Java Option solr.log.dir. Logging may be missing or incomplete.
   [junit4]   2> 2023996 INFO  (TEST-PeerSyncTest.test-seed#[12CF0620F945B50E]) [    ] o.a.s.s.SolrDispatchFilter Using logger factory org.apache.logging.slf4j.Log4jLoggerFactory
   [junit4]   2> 2023996 INFO  (TEST-PeerSyncTest.test-seed#[12CF0620F945B50E]) [    ] o.a.s.s.SolrDispatchFilter  ___      _       Welcome to Apache Solr? version 8.2.0
   [junit4]   2> 2023996 INFO  (TEST-PeerSyncTest.test-seed#[12CF0620F945B50E]) [    ] o.a.s.s.SolrDispatchFilter / __| ___| |_ _   Starting in standalone mode on port null
   [junit4]   2> 2023996 INFO  (TEST-PeerSyncTest.test-seed#[12CF0620F945B50E]) [    ] o.a.s.s.SolrDispatchFilter \__ \/ _ \ | '_|  Install dir: null
   [junit4]   2> 2023996 INFO  (TEST-PeerSyncTest.test-seed#[12CF0620F945B50E]) [    ] o.a.s.s.SolrDispatchFilter |___/\___/_|_|    Start time: 2019-05-01T13:41:43.554Z
   [junit4]   2> 2023997 INFO  (TEST-PeerSyncTest.test-seed#[12CF0620F945B50E]) [    ] o.a.s.c.SolrXmlConfig Loading container configuration from /home/jenkins/workspace/Lucene-Solr-8.x-Linux/solr/build/solr-core/test/J0/temp/solr.update.PeerSyncTest_12CF0620F945B50E-001/tempDir-001/shard2/solr.xml
   [junit4]   2> 2024000 INFO  (TEST-PeerSyncTest.test-seed#[12CF0620F945B50E]) [    ] o.a.s.c.SolrXmlConfig Configuration parameter autoReplicaFailoverWorkLoopDelay is ignored
   [junit4]   2> 2024000 INFO  (TEST-PeerSyncTest.test-seed#[12CF0620F945B50E]) [    ] o.a.s.c.SolrXmlConfig Configuration parameter autoReplicaFailoverBadNodeExpiration is ignored
   [junit4]   2> 2024001 INFO  (TEST-PeerSyncTest.test-seed#[12CF0620F945B50E]) [    ] o.a.s.c.SolrXmlConfig MBean server found: com.sun.jmx.mbeanserver.JmxMBeanServer@21d8414c, but no JMX reporters were configured - adding default JMX reporter.
   [junit4]   2> 2024042 INFO  (TEST-PeerSyncTest.test-seed#[12CF0620F945B50E]) [    ] o.a.s.h.c.HttpShardHandlerFactory Host whitelist initialized: WhitelistHostChecker [whitelistHosts=null, whitelistHostCheckingEnabled=false]
   [junit4]   2> 2024043 WARN  (TEST-PeerSyncTest.test-seed#[12CF0620F945B50E]) [    ] o.e.j.u.s.S.config No Client EndPointIdentificationAlgorithm configured for SslContextFactory@7d93ad6c[provider=null,keyStore=null,trustStore=null]
   [junit4]   2> 2024050 WARN  (TEST-PeerSyncTest.test-seed#[12CF0620F945B50E]) [    ] o.e.j.u.s.S.config No Client EndPointIdentificationAlgorithm configured for SslContextFactory@5fd6b203[provider=null,keyStore=null,trustStore=null]
   [junit4]   2> 2024068 INFO  (TEST-PeerSyncTest.test-seed#[12CF0620F945B50E]) [    ] o.a.s.c.TransientSolrCoreCacheDefault Allocating transient cache for 4 transient cores
   [junit4]   2> 2024068 INFO  (TEST-PeerSyncTest.test-seed#[12CF0620F945B50E]) [    ] o.a.s.h.a.MetricsHistoryHandler No .system collection, keeping metrics history in memory.
   [junit4]   2> 2024080 INFO  (TEST-PeerSyncTest.test-seed#[12CF0620F945B50E]) [    ] o.a.s.m.r.SolrJmxReporter JMX monitoring for 'solr.node' (registry 'solr.node') enabled at server: com.sun.jmx.mbeanserver.JmxMBeanServer@21d8414c
   [junit4]   2> 2024090 INFO  (TEST-PeerSyncTest.test-seed#[12CF0620F945B50E]) [    ] o.a.s.m.r.SolrJmxReporter JMX monitoring for 'solr.jvm' (registry 'solr.jvm') enabled at server: com.sun.jmx.mbeanserver.JmxMBeanServer@21d8414c
   [junit4]   2> 2024090 INFO  (TEST-PeerSyncTest.test-seed#[12CF0620F945B50E]) [    ] o.a.s.m.r.SolrJmxReporter JMX monitoring for 'solr.jetty' (registry 'solr.jetty') enabled at server: com.sun.jmx.mbeanserver.JmxMBeanServer@21d8414c
   [junit4]   2> 2024091 INFO  (TEST-PeerSyncTest.test-seed#[12CF0620F945B50E]) [    ] o.a.s.c.CorePropertiesLocator Found 1 core definitions underneath /home/jenkins/workspace/Lucene-Solr-8.x-Linux/solr/build/solr-core/test/J0/temp/solr.update.PeerSyncTest_12CF0620F945B50E-001/tempDir-001/shard2/cores
   [junit4]   2> 2024091 INFO  (TEST-PeerSyncTest.test-seed#[12CF0620F945B50E]) [    ] o.a.s.c.CorePropertiesLocator Cores are: [collection1]
   [junit4]   2> 2024092 INFO  (coreLoadExecutor-13531-thread-1) [    x:collection1] o.a.s.c.SolrResourceLoader [null] Added 2 libs to classloader, from paths: [/home/jenkins/workspace/Lucene-Solr-8.x-Linux/solr/core/src/test-files/solr/collection1/lib, /home/jenkins/workspace/Lucene-Solr-8.x-Linux/solr/core/src/test-files/solr/collection1/lib/classes]
   [junit4]   2> 2024110 INFO  (coreLoadExecutor-13531-thread-1) [    x:collection1] o.a.s.c.SolrConfig Using Lucene MatchVersion: 8.2.0
   [junit4]   2> 2024122 INFO  (coreLoadExecutor-13531-thread-1) [    x:collection1] o.a.s.s.IndexSchema [collection1] Schema name=test
   [junit4]   2> 2024231 INFO  (coreLoadExecutor-13531-thread-1) [    x:collection1] o.a.s.s.IndexSchema Loaded schema test/1.0 with uniqueid field id
   [junit4]   2> 2024236 INFO  (coreLoadExecutor-13531-thread-1) [    x:collection1] o.a.s.c.CoreContainer Creating SolrCore 'collection1' using configuration from configset /home/jenkins/workspace/Lucene-Solr-8.x-Linux/solr/core/src/test-files/solr/collection1, trusted=true
   [junit4]   2> 2024236 INFO  (coreLoadExecutor-13531-thread-1) [    x:collection1] o.a.s.m.r.SolrJmxReporter JMX monitoring for 'solr.core.collection1' (registry 'solr.core.collection1') enabled at server: com.sun.jmx.mbeanserver.JmxMBeanServer@21d8414c
   [junit4]   2> 2024236 INFO  (coreLoadExecutor-13531-thread-1) [    x:collection1] o.a.s.c.SolrCore [[collection1] ] Opening new SolrCore at [/home/jenkins/workspace/Lucene-Solr-8.x-Linux/solr/core/src/test-files/solr/collection1], dataDir=[/home/jenkins/workspace/Lucene-Solr-8.x-Linux/solr/build/solr-core/test/J0/temp/solr.update.PeerSyncTest_12CF0620F945B50E-001/tempDir-001/shard2/cores/collection1/data/]
   [junit4]   2> 2024237 INFO  (coreLoadExecutor-13531-thread-1) [    x:collection1] o.a.s.u.RandomMergePolicy RandomMergePolicy wrapping class org.apache.lucene.index.AlcoholicMergePolicy: [AlcoholicMergePolicy: minMergeSize=0, mergeFactor=10, maxMergeSize=2055925415, maxMergeSizeForForcedMerge=9223372036854775807, calibrateSizeByDeletes=true, maxMergeDocs=2147483647, maxCFSSegmentSizeMB=8.796093022207999E12, noCFSRatio=0.1]
   [junit4]   2> 2024245 WARN  (coreLoadExecutor-13531-thread-1) [    x:collection1] o.a.s.c.RequestHandlers INVALID paramSet a in requestHandler {type = requestHandler,name = /dump,class = DumpRequestHandler,attributes = {initParams=a, name=/dump, class=DumpRequestHandler},args = {defaults={a=A,b=B}}}
   [junit4]   2> 2024277 INFO  (coreLoadExecutor-13531-thread-1) [    x:collection1] o.a.s.u.UpdateHandler Using UpdateLog implementation: org.apache.solr.update.UpdateLog
   [junit4]   2> 2024277 INFO  (coreLoadExecutor-13531-thread-1) [    x:collection1] o.a.s.u.UpdateLog Initializing UpdateLog: dataDir= defaultSyncLevel=FLUSH numRecordsToKeep=100 maxNumLogsToKeep=10 numVersionBuckets=65536
   [junit4]   2> 2024278 INFO  (coreLoadExecutor-13531-thread-1) [    x:collection1] o.a.s.u.CommitTracker Hard AutoCommit: disabled
   [junit4]   2> 2024278 INFO  (coreLoadExecutor-13531-thread-1) [    x:collection1] o.a.s.u.CommitTracker Soft AutoCommit: disabled
   [junit4]   2> 2024279 INFO  (coreLoadExecutor-13531-thread-1) [    x:collection1] o.a.s.u.RandomMergePolicy RandomMergePolicy wrapping class org.apache.lucene.index.TieredMergePolicy: [TieredMergePolicy: maxMergeAtOnce=10, maxMergeAtOnceExplicit=19, maxMergedSegmentMB=1.3662109375, floorSegmentMB=2.0751953125, forceMergeDeletesPctAllowed=2.574303009794362, segmentsPerTier=18.0, maxCFSSegmentSizeMB=8.796093022207999E12, noCFSRatio=0.5339246864930585, deletesPctAllowed=29.842330219846595
   [junit4]   2> 2024279 INFO  (coreLoadExecutor-13531-thread-1) [    x:collection1] o.a.s.s.SolrIndexSearcher Opening [Searcher@19c061e6[collection1] main]
   [junit4]   2> 2024279 WARN  (coreLoadExecutor-13531-thread-1) [    x:collection1] o.a.s.r.ManagedResourceStorage Cannot write to config directory /home/jenkins/workspace/Lucene-Solr-8.x-Linux/solr/core/src/test-files/solr/collection1/conf; switching to use InMemory storage instead.
   [junit4]   2> 2024279 INFO  (coreLoadExecutor-13531-thread-1) [    x:collection1] o.a.s.h.ReplicationHandler Commits will be reserved for 10000ms.
   [junit4]   2> 2024280 INFO  (coreLoadExecutor-13531-thread-1) [    x:collection1] o.a.s.u.UpdateLog Could not find max version in index or recent updates, using new clock 1632337242450034688
   [junit4]   2> 2024282 INFO  (searcherExecutor-13532-thread-1-processing-x:collection1) [    x:collection1] o.a.s.c.SolrCore [collection1] Registered new searcher Searcher@19c061e6[collection1] main{ExitableDirectoryReader(UninvertingDirectoryReader())}
   [junit4]   2> 2024282 INFO  (TEST-PeerSyncTest.test-seed#[12CF0620F945B50E]) [    ] o.a.s.SolrTestCaseJ4 ###Starting test
   [junit4]   2> 2024284 INFO  (qtp32550655-45060) [    x:collection1] o.a.s.u.p.LogUpdateProcessorFactory [collection1]  webapp=/_/mc path=/update params={update.distrib=FROMLEADER&wt=javabin&version=2}{add=[1 (1)]} 0 0
   [junit4]   2> 2024285 INFO  (qtp1731790107-45081) [    x:collection1] o.a.s.u.PeerSync PeerSync: core=collection1 url= START replicas=[http://127.0.0.1:45939/_/mc/collection1] nUpdates=100
   [junit4]   2> 2024292 INFO  (qtp32550655-45059) [    x:collection1] o.a.s.s.SolrIndexSearcher Opening [Searcher@4605c231[collection1] realtime]
   [junit4]   2> 2024292 INFO  (qtp32550655-45059) [    x:collection1] o.a.s.u.IndexFingerprint IndexFingerprint millis:2.0 result:{maxVersionSpecified=9223372036854775807, maxVersionEncountered=1, maxInHash=1, versionsHash=-5451962507482445012, numVersions=1, numDocs=1, maxDoc=1}
   [junit4]   2> 2024292 INFO  (qtp32550655-45059) [    x:collection1] o.a.s.c.S.Request [collection1]  webapp=/_/mc path=/get params={distrib=false&qt=/get&getFingerprint=9223372036854775807&wt=javabin&version=2} status=0 QTime=2
   [junit4]   2> 2024292 INFO  (qtp1731790107-45081) [    x:collection1] o.a.s.u.IndexFingerprint IndexFingerprint millis:0.0 result:{maxVersionSpecified=9223372036854775807, maxVersionEncountered=0, maxInHash=0, versionsHash=0, numVersions=0, numDocs=0, maxDoc=0}
   [junit4]   2> 2024292 INFO  (qtp1731790107-45081) [    x:collection1] o.a.s.u.PeerSync PeerSync: core=collection1 url= DONE.  We have no versions.  sync failed.
   [junit4]   2> 2024293 INFO  (qtp32550655-45060) [    x:collection1] o.a.s.u.IndexFingerprint IndexFingerprint millis:0.0 result:{maxVersionSpecified=9223372036854775807, maxVersionEncountered=1, maxInHash=1, versionsHash=-5451962507482445012, numVersions=1, numDocs=1, maxDoc=1}
   [junit4]   2> 2024293 INFO  (qtp32550655-45060) [    x:collection1] o.a.s.c.S.Request [collection1]  webapp=/_/mc path=/get params={distrib=false&qt=/get&fingerprint=true&getVersions=100&wt=javabin&version=2} status=0 QTime=0
   [junit4]   2> 2024293 INFO  (qtp1731790107-45081) [    x:collection1] o.a.s.c.S.Request [collection1]  webapp=/_/mc path=/get params={qt=/get&getVersions=100&sync=http://127.0.0.1:45939/_/mc/collection1&wt=javabin&version=2} status=0 QTime=8
   [junit4]   2> 2024294 INFO  (qtp1731790107-45082) [    x:collection1] o.a.s.u.p.LogUpdateProcessorFactory [collection1]  webapp=/_/mc path=/update params={update.distrib=FROMLEADER&wt=javabin&version=2}{add=[1 (1)]} 0 0
   [junit4]   2> 2024295 INFO  (qtp1731790107-45080) [    x:collection1] o.a.s.u.PeerSync PeerSync: core=collection1 url= START replicas=[http://127.0.0.1:45939/_/mc/collection1] nUpdates=100
   [junit4]   2> 2024295 INFO  (qtp32550655-45061) [    x:collection1] o.a.s.u.IndexFingerprint IndexFingerprint millis:0.0 result:{maxVersionSpecified=9223372036854775807, maxVersionEncountered=1, maxInHash=1, versionsHash=-5451962507482445012, numVersions=1, numDocs=1, maxDoc=1}
   [junit4]   2> 2024295 INFO  (qtp32550655-45061) [    x:collection1] o.a.s.c.S.Request [collection1]  webapp=/_/mc path=/get params={distrib=false&qt=/get&getFingerprint=9223372036854775807&wt=javabin&version=2} status=0 QTime=0
   [junit4]   2> 2024297 INFO  (qtp1731790107-45080) [    x:collection1] o.a.s.s.SolrIndexSearcher Opening [Searcher@19c8a674[collection1] realtime]
   [junit4]   2> 2024298 INFO  (qtp1731790107-45080) [    x:collection1] o.a.s.u.IndexFingerprint IndexFingerprint millis:1.0 result:{maxVersionSpecified=9223372036854775807, maxVersionEncountered=1, maxInHash=1, versionsHash=-5451962507482445012, numVersions=1, numDocs=1, maxDoc=1}
   [junit4]   2> 2024298 INFO  (qtp1731790107-45080) [    x:collection1] o.a.s.u.PeerSync We are already in sync. No need to do a PeerSync 
   [junit4]   2> 2024298 INFO  (qtp1731790107-45080) [    x:collection1] o.a.s.c.S.Request [collection1]  webapp=/_/mc path=/get params={qt=/get&getVersions=100&sync=http://127.0.0.1:45939/_/mc/collection1&wt=javabin&version=2} status=0 QTime=2
   [junit4]   2> 2024298 INFO  (qtp32550655-45059) [    x:collection1] o.a.s.u.DirectUpdateHandler2 start commit{_version_=1632337242468909056,optimize=false,openSearcher=true,waitSearcher=true,expungeDeletes=false,softCommit=false,prepareCommit=false}
   [junit4]   2> 2024298 INFO  (qtp32550655-45059) [    x:collection1] o.a.s.u.SolrIndexWriter Calling setCommitData with IW:org.apache.solr.update.SolrIndexWriter@2495c859 commitCommandVersion:1632337242468909056
   [junit4]   2> 2024301 INFO  (qtp32550655-45059) [    x:collection1] o.a.s.s.SolrIndexSearcher Opening [Searcher@2f5abec[collection1] main]
   [junit4]   2> 2024301 INFO  (qtp32550655-45059) [    x:collection1] o.a.s.u.DirectUpdateHandler2 end_commit_flush
   [junit4]   2> 2024303 INFO  (searcherExecutor-13504-thread-1-processing-x:collection1) [    x:collection1] o.a.s.c.SolrCore [collection1] Registered new searcher Searcher@2f5abec[collection1] main{ExitableDirectoryReader(UninvertingDirectoryReader(Uninverting(_0(8.2.0):C1:[diagnostics={os=Linux, java.vendor=Oracle Corporation, java.version=1.8.0_201, java.vm.version=25.201-b09, lucene.version=8.2.0, os.arch=amd64, java.runtime.version=1.8.0_201-b09, source=flush, os.version=4.18.0-17-generic, timestamp=1556718103849}]:[attributes={Lucene50StoredFieldsFormat.mode=BEST_SPEED}])))}
   [junit4]   2> 2024303 INFO  (qtp32550655-45059) [    x:collection1] o.a.s.u.p.LogUpdateProcessorFactory [collection1]  webapp=/_/mc path=/update params={waitSearcher=true&commit=true&softCommit=false&wt=javabin&version=2}{commit=} 0 4
   [junit4]   2> 2024303 INFO  (qtp1731790107-45081) [    x:collection1] o.a.s.u.DirectUpdateHandler2 start commit{_version_=1632337242474151936,optimize=false,openSearcher=true,waitSearcher=true,expungeDeletes=false,softCommit=false,prepareCommit=false}
   [junit4]   2> 2024303 INFO  (qtp1731790107-45081) [    x:collection1] o.a.s.u.SolrIndexWriter Calling setCommitData with IW:org.apache.solr.update.SolrIndexWriter@584e0e4f commitCommandVersion:1632337242474151936
   [junit4]   2> 2024306 INFO  (qtp1731790107-45081) [    x:collection1] o.a.s.s.SolrIndexSearcher Opening [Searcher@53432a70[collection1] main]
   [junit4]   2> 2024306 INFO  (qtp1731790107-45081) [    x:collection1] o.a.s.u.DirectUpdateHandler2 end_commit_flush
   [junit4]   2> 2024314 INFO  (searcherExecutor-13518-thread-1-processing-x:collection1) [    x:collection1] o.a.s.c.SolrCore [collection1] Registered new searcher Searcher@53432a70[collection1] main{ExitableDirectoryReader(UninvertingDirectoryReader(Uninverting(_0(8.2.0):C1:[diagnostics={os=Linux, java.vendor=Oracle Corporation, java.version=1.8.0_201, java.vm.version=25.201-b09, lucene.version=8.2.0, os.arch=amd64, java.runtime.version=1.8.0_201-b09, source=flush, os.version=4.18.0-17-generic, timestamp=1556718103855}]:[attributes={Lucene50StoredFieldsFormat.mode=BEST_SPEED}])))}
   [junit4]   2> 2024314 INFO  (qtp1731790107-45081) [    x:collection1] o.a.s.u.p.LogUpdateProcessorFactory [collection1]  webapp=/_/mc path=/update params={waitSearcher=true&commit=true&softCommit=false&wt=javabin&version=2}{commit=} 0 11
   [junit4]   2> 2024315 INFO  (qtp32550655-45060) [    x:collection1] o.a.s.c.S.Request [collection1]  webapp=/_/mc path=/select params={q=*:*&wt=javabin&version=2} hits=1 status=0 QTime=0
   [junit4]   2> 2024315 INFO  (qtp1731790107-45082) [    x:collection1] o.a.s.c.S.Request [collection1]  webapp=/_/mc path=/select params={q=*:*&wt=javabin&version=2} hits=1 status=0 QTime=0
   [junit4]   2> 2024318 INFO  (qtp32550655-45061) [    x:collection1] o.a.s.u.p.LogUpdateProcessorFactory [collection1]  webapp=/_/mc path=/update params={update.distrib=FROMLEADER&wt=javabin&version=2}{add=[2 (2)]} 0 1
   [junit4]   2> 2024318 INFO  (qtp1731790107-45080) [    x:collection1] o.a.s.u.PeerSync PeerSync: core=collection1 url= START replicas=[http://127.0.0.1:45939/_/mc/collection1] nUpdates=100
   [junit4]   2> 2024324 INFO  (qtp32550655-45059) [    x:collection1] o.a.s.s.SolrIndexSearcher Opening [Searcher@11bb118f[collection1] realtime]
   [junit4]   2> 2024324 INFO  (qtp32550655-45059) [    x:collection1] o.a.s.u.IndexFingerprint IndexFingerprint millis:2.0 result:{maxVersionSpecified=9223372036854775807, maxVersionEncountered=2, maxInHash=2, versionsHash=-1218814014108643565, numVersions=2, numDocs=2, maxDoc=1}
   [junit4]   2> 2024324 INFO  (qtp32550655-45059) [    x:collection1] o.a.s.c.S.Request [collection1]  webapp=/_/mc path=/get params={distrib=false&qt=/get&getFingerprint=9223372036854775807&wt=javabin&version=2} status=0 QTime=2
   [junit4]   2> 2024324 INFO  (qtp1731790107-45080) [    x:collection1] o.a.s.u.IndexFingerprint IndexFingerprint millis:0.0 result:{maxVersionSpecified=9223372036854775807, maxVersionEncountered=1, maxInHash=1, versionsHash=-5451962507482445012, numVersions=1, numDocs=1, maxDoc=1}
   [junit4]   2> 2024325 INFO  (qtp32550655-45060) [    x:collection1] o.a.s.u.IndexFingerprint IndexFingerprint millis:0.0 result:{maxVersionSpecified=9223372036854775807, maxVersionEncountered=2, maxInHash=2, versionsHash=-1218814014108643565, numVersions=2, numDocs=2, maxDoc=1}
   [junit4]   2> 2024325 INFO  (qtp32550655-45060) [    x:collection1] o.a.s.c.S.Request [collection1]  webapp=/_/mc path=/get params={distrib=false&qt=/get&fingerprint=true&getVersions=100&wt=javabin&version=2} status=0 QTime=0
   [junit4]   2> 2024325 INFO  (qtp1731790107-45080) [    x:collection1] o.a.s.u.PeerSync PeerSync: core=collection1 url=  Received 2 versions from http://127.0.0.1:45939/_/mc/collection1 fingerprint:{maxVersionSpecified=9223372036854775807, maxVersionEncountered=2, maxInHash=2, versionsHash=-1218814014108643565, numVersions=2, numDocs=2, maxDoc=1}
   [junit4]   2> 2024325 INFO  (qtp1731790107-45080) [    x:collection1] o.a.s.u.PeerSync PeerSync: core=collection1 url= Requesting updates from http://127.0.0.1:45939/_/mc/collection1n=1 versions=2
   [junit4]   2> 2024326 INFO  (qtp32550655-45061) [    x:collection1] o.a.s.u.IndexFingerprint IndexFingerprint millis:0.0 result:{maxVersionSpecified=2, maxVersionEncountered=2, maxInHash=2, versionsHash=-1218814014108643565, numVersions=2, numDocs=2, maxDoc=1}
   [junit4]   2> 2024326 INFO  (qtp32550655-45061) [    x:collection1] o.a.s.c.S.Request [collection1]  webapp=/_/mc path=/get params={getUpdates=2&distrib=false&qt=/get&fingerprint=true&onlyIfActive=false&wt=javabin&version=2} status=0 QTime=0
   [junit4]   2> 2024333 INFO  (qtp1731790107-45080) [    x:collection1] o.a.s.u.p.LogUpdateProcessorFactory [collection1] {add=[2 (2)]} 0 6
   [junit4]   2> 2024335 INFO  (qtp1731790107-45080) [    x:collection1] o.a.s.s.SolrIndexSearcher Opening [Searcher@71179cd5[collection1] realtime]
   [junit4]   2> 2024336 INFO  (qtp1731790107-45080) [    x:collection1] o.a.s.u.IndexFingerprint IndexFingerprint millis:2.0 result:{maxVersionSpecified=2, maxVersionEncountered=2, maxInHash=2, versionsHash=-1218814014108643565, numVersions=2, numDocs=2, maxDoc=1}
   [junit4]   2> 2024336 INFO  (qtp1731790107-45080) [    x:collection1] o.a.s.u.PeerSync Fingerprint comparison: 0
   [junit4]   2> 2024336 INFO  (qtp1731790107-45080) [    x:collection1] o.a.s.u.PeerSync PeerSync: core=collection1 url= DONE. sync succeeded
   [junit4]   2> 2024336 INFO  (qtp1731790107-45080) [    x:collection1] o.a.s.c.S.Request [collection1]  webapp=/_/mc path=/get params={qt=/get&getVersions=100&sync=http://127.0.0.1:45939/_/mc/collection1&wt=javabin&version=2} status=0 QTime=17
   [junit4]   2> 2024336 INFO  (qtp32550655-45059) [    x:collection1] o.a.s.u.DirectUpdateHandler2 start commit{_version_=1632337242508754944,optimize=false,openSearcher=true,waitSearcher=true,expungeDeletes=false,softCommit=false,prepareCommit=false}
   [junit4]   2> 2024336 INFO  (qtp32550655-45059) [    x:collection1] o.a.s.u.SolrIndexWriter Calling setCommitData with IW:org.apache.solr.update.SolrIndexWriter@2495c859 commitCommandVersion:1632337242508754944
   [junit4]   2> 2024337 INFO  (qtp32550655-45059) [    x:collection1] o.a.s.s.SolrIndexSearcher Opening [Searcher@147e0d63[collection1] main]
   [junit4]   2> 2024337 INFO  (qtp32550655-45059) [    x:collection1] o.a.s.u.DirectUpdateHandler2 end_commit_flush
   [junit4]   2> 2024339 INFO  (searcherExecutor-13504-thread-1-processing-x:collection1) [    x:collection1] o.a.s.c.SolrCore [collection1] Registered new searcher Searcher@147e0d63[collection1] main{ExitableDirectoryReader(UninvertingDirectoryReader(Uninverting(_0(8.2.0):C1:[diagnostics={os=Linux, java.vendor=Oracle Corporation, java.version=1.8.0_201, java.vm.version=25.201-b09, lucene.version=8.2.0, os.arch=amd64, java.runtime.version=1.8.0_201-b09, source=flush, os.version=4.18.0-17-generic, timestamp=1556718103849}]:[attributes={Lucene50StoredFieldsFormat.mode=BEST_SPEED}]) Uninverting(_1(8.2.0):C1:[diagnostics={os=Linux, java.vendor=Oracle Corporation, java.version=1.8.0_201, java.vm.version=25.201-b09, lucene.version=8.2.0, os.arch=amd64, java.runtime.version=1.8.0_201-b09, source=flush, os.version=4.18.0-17-generic, timestamp=1556718103881}]:[attributes={Lucene50StoredFieldsFormat.mode=BEST_SPEED}])))}
   [junit4]   2> 2024339 INFO  (qtp32550655-45059) [    x:collection1] o.a.s.u.p.LogUpdateProcessorFactory [collection1]  webapp=/_/mc path=/update params={waitSearcher=true&commit=true&softCommit=false&wt=javabin&version=2}{commit=} 0 2
   [junit4]   2> 2024339 INFO  (qtp1731790107-45081) [    x:collection1] o.a.s.u.DirectUpdateHandler2 start commit{_version_=1632337242511900672,optimize=false,openSearcher=true,waitSearcher=true,expungeDeletes=false,softCommit=false,prepareCommit=false}
   [junit4]   2> 2024339 INFO  (qtp1731790107-45081) [    x:collection1] o.a.s.u.SolrIndexWriter Calling setCommitData with IW:org.apache.solr.update.SolrIndexWriter@584e0e4f commitCommandVersion:1632337242511900672
   [junit4]   2> 2024340 INFO  (qtp1731790107-45081) [    x:collection1] o.a.s.s.SolrIndexSearcher Opening [Searcher@3a034def[collection1] main]
   [junit4]   2> 2024341 INFO  (qtp1731790107-45081) [    x:collection1] o.a.s.u.DirectUpdateHandler2 end_commit_flush
   [junit4]   2> 2024342 INFO  (searcherExecutor-13518-thread-1-processing-x:collection1) [    x:collection1] o.a.s.c.SolrCore [collection1] Registered new searcher Searcher@3a034def[collection1] main{ExitableDirectoryReader(UninvertingDirectoryReader(Uninverting(_0(8.2.0):C1:[diagnostics={os=Linux, java.vendor=Oracle Corporation, java.version=1.8.0_201, java.vm.version=25.201-b09, lucene.version=8.2.0, os.arch=amd64, java.runtime.version=1.8.0_201-b09, source=flush, os.version=4.18.0-17-generic, timestamp=1556718103855}]:[attributes={Lucene50StoredFieldsFormat.mode=BEST_SPEED}]) Uninverting(_1(8.2.0):C1:[diagnostics={os=Linux, java.vendor=Oracle Corporation, java.version=1.8.0_201, java.vm.version=25.201-b09, lucene.version=8.2.0, os.arch=amd64, java.runtime.version=1.8.0_201-b09, source=flush, os.version=4.18.0-17-generic, timestamp=1556718103892}]:[attributes={Lucene50StoredFieldsFormat.mode=BEST_SPEED}])))}
   [junit4]   2> 2024342 INFO  (qtp1731790107-45081) [    x:collection1] o.a.s.u.p.LogUpdateProcessorFactory [collection1]  webapp=/_/mc path=/update params={waitSearcher=true&commit=true&softCommit=false&wt=javabin&version=2}{commit=} 0 2
   [junit4]   2> 2024342 INFO  (qtp32550655-45060) [    x:collection1] o.a.s.c.S.Request [collection1]  webapp=/_/mc path=/select params={q=*:*&wt=javabin&version=2} hits=2 status=0 QTime=0
   [junit4]   2> 2024343 INFO  (qtp1731790107-45082) [    x:collection1] o.a.s.c.S.Request [collection1]  webapp=/_/mc path=/select params={q=*:*&wt=javabin&version=2} hits=2 status=0 QTime=0
   [junit4]   2> 2024345 INFO  (qtp32550655-45061) [    x:collection1] o.a.s.u.p.LogUpdateProcessorFactory [collection1]  webapp=/_/mc path=/update params={update.distrib=FROMLEADER&wt=javabin&version=2}{add=[3 (3)]} 0 1
   [junit4]   2> 2024346 INFO  (qtp32550655-45059) [    x:collection1] o.a.s.u.p.LogUpdateProcessorFactory [collection1]  webapp=/_/mc path=/update params={update.distrib=FROMLEADER&wt=javabin&version=2}{add=[4 (4)]} 0 0
   [junit4]   2> 2024347 INFO  (qtp32550655-45060) [    x:collection1] o.a.s.u.p.LogUpdateProcessorFactory [collection1]  webapp=/_/mc path=/update params={update.distrib=FROMLEADER&wt=javabin&version=2}{add=[5 (5)]} 0 0
   [junit4]   2> 2024347 INFO  (qtp32550655-45061) [    x:collection1] o.a.s.u.p.LogUpdateProcessorFactory [collection1]  webapp=/_/mc path=/update params={update.distrib=FROMLEADER&wt=javabin&version=2}{add=[6 (6)]} 0 0
   [junit4]   2> 2024348 INFO  (qtp32550655-45059) [    x:collection1] o.a.s.u.p.LogUpdateProcessorFactory [collection1]  webapp=/_/mc path=/update params={update.distrib=FROMLEADER&wt=javabin&version=2}{add=[7 (7)]} 0 0
   [junit4]   2> 2024348 INFO  (qtp32550655-45060) [    x:collection1] o.a.s.u.p.LogUpdateProcessorFactory [collection1]  webapp=/_/mc path=/update params={update.distrib=FROMLEADER&wt=javabin&version=2}{add=[8 (8)]} 0 0
   [junit4]   2> 2024349 INFO  (qtp32550655-45061) [    x:collection1] o.a.s.u.p.LogUpdateProcessorFactory [collection1]  webapp=/_/mc path=/update params={update.distrib=FROMLEADER&wt=javabin&version=2}{add=[9 (9)]} 0 0
   [junit4]   2> 2024349 INFO  (qtp32550655-45059) [    x:collection1] o.a.s.u.p.LogUpdateProcessorFactory [collection1]  webapp=/_/mc path=/update params={update.distrib=FROMLEADER&wt=javabin&version=2}{add=[10 (10)]} 0 0
   [junit4]   2> 2024350 INFO  (qtp1731790107-45080) [    x:collection1] o.a.s.u.PeerSync PeerSync: core=collection1 url= START replicas=[http://127.0.0.1:45939/_/mc/collection1] nUpdates=100
   [junit4]   2> 2024354 INFO  (qtp32550655-45060) [    x:collection1] o.a.s.s.SolrIndexSearcher Opening [Searcher@297d1885[collection1] realtime]
   [junit4]   2> 2024354 INFO  (qtp32550655-45060) [    x:collection1] o.a.s.u.IndexFingerprint IndexFingerprint millis:3.0 result:{maxVersionSpecified=9223372036854775807, maxVersionEncountered=10, maxInHash=10, versionsHash=-5671163287542876028, numVersions=10, numDocs=10, maxDoc=8}
   [junit4]   2> 2024354 INFO  (qtp32550655-45060) [    x:collection1] o.a.s.c.S.Request [collection1]  webapp=/_/mc path=/get params={distrib=false&qt=/get&getFingerprint=9223372036854775807&wt=javabin&version=2} status=0 QTime=4
   [junit4]   2> 2024354 INFO  (qtp1731790107-45080) [    x:collection1] o.a.s.u.IndexFingerprint IndexFingerprint millis:0.0 result:{maxVersionSpecified=9223372036854775807, maxVersionEncountered=2, maxInHash=2, versionsHash=-1218814014108643565, numVersions=2, numDocs=2, maxDoc=1}
   [junit4]   2> 2024355 INFO  (qtp32550655-45061) [    x:collection1] o.a.s.u.IndexFingerprint IndexFingerprint millis:0.0 result:{maxVersionSpecified=9223372036854775807, maxVersionEncountered=10, maxInHash=10, versionsHash=-5671163287542876028, numVersions=10, numDocs=10, maxDoc=8}
   [junit4]   2> 2024355 INFO  (qtp32550655-45061) [    x:collection1] o.a.s.c.S.Request [collection1]  webapp=/_/mc path=/get params={distrib=false&qt=/get&fingerprint=true&getVersions=100&wt=javabin&version=2} status=0 QTime=0
   [junit4]   2> 2024355 INFO  (qtp1731790107-45080) [    x:collection1] o.a.s.u.PeerSync PeerSync: core=collection1 url=  Received 10 versions from http://127.0.0.1:45939/_/mc/collection1 fingerprint:{maxVersionSpecified=9223372036854775807, maxVersionEncountered=10, maxInHash=10, versionsHash=-5671163287542876028, numVersions=10, numDocs=10, maxDoc=8}
   [junit4]   2> 2024355 INFO  (qtp1731790107-45080) [    x:collection1] o.a.s.u.PeerSync PeerSync: core=collection1 url= Requesting updates from http://127.0.0.1:45939/_/mc/collection1n=8 versions=10,9,8,7,6,5,4,3
   [junit4]   2> 2024356 INFO  (qtp32550655-45059) [    x:collection1] o.a.s.u.IndexFingerprint IndexFingerprint millis:0.0 result:{maxVersionSpecified=10, maxVersionEncountered=10, maxInHash=10, versionsHash=-5671163287542876028, numVersions=10, numDocs=10, maxDoc=8}
   [junit4]   2> 2024356 INFO  (qtp32550655-45059) [    x:collection1] o.a.s.c.S.Request [collection1]  webapp=/_/mc path=/get params={getUpdates=10,9,8,7,6,5,4,3&distrib=false&qt=/get&fingerprint=true&onlyIfActive=false&wt=javabin&version=2} status=0 QTime=0
   [junit4]   2> 2024359 INFO  (qtp1731790107-45080) [    x:collection1] o.a.s.u.p.LogUpdateProcessorFactory [collection1] {add=[3 (3), 4 (4), 5 (5), 6 (6), 7 (7), 8 (8), 9 (9), 10 (10)]} 0 2
   [junit4]   2> 2024362 INFO  (qtp1731790107-45080) [    x:collection1] o.a.s.s.SolrIndexSearcher Opening [Searcher@44b83b8f[collection1] realtime]
   [junit4]   2> 2024362 INFO  (qtp1731790107-45080) [    x:collection1] o.a.s.u.IndexFingerprint IndexFingerprint millis:3.0 result:{maxVersionSpecified=10, maxVersionEncountered=10, maxInHash=10, versionsHash=-5671163287542876028, numVersions=10, numDocs=10, maxDoc=8}
   [junit4]   2> 2024362 INFO  (qtp1731790107-45080) [    x:collection1] o.a.s.u.PeerSync Fingerprint comparison: 0
   [junit4]   2> 2024362 INFO  (qtp1731790107-45080) [    x:collection1] o.a.s.u.PeerSync PeerSync: core=collection1 url= DONE. sync succeeded
   [junit4]   2> 2024362 INFO  (qtp1731790107-45080) [    x:collection1] o.a.s.c.S.Request [collection1]  webapp=/_/mc path=/get params={qt=/get&getVersions=100&sync=http://127.0.0.1:45939/_/mc/collection1&wt=javabin&version=2} status=0 QTime=1

[...truncated too long message...]

] o.a.s.m.r.SolrJmxReporter Closing reporter [org.apache.solr.metrics.reporters.SolrJmxReporter@5164659a: rootName = null, domain = solr.node, service url = null, agent id = null] for registry solr.node / com.codahale.metrics.MetricRegistry@7bfc7b26
   [junit4]   2> 2164494 INFO  (SUITE-PeerSyncWithLeaderTest-seed#[12CF0620F945B50E]-worker) [    ] o.a.s.m.SolrMetricManager Closing metric reporters for registry=solr.jvm, tag=null
   [junit4]   2> 2164494 INFO  (SUITE-PeerSyncWithLeaderTest-seed#[12CF0620F945B50E]-worker) [    ] o.a.s.m.r.SolrJmxReporter Closing reporter [org.apache.solr.metrics.reporters.SolrJmxReporter@6cb11545: rootName = null, domain = solr.jvm, service url = null, agent id = null] for registry solr.jvm / com.codahale.metrics.MetricRegistry@4c957b8d
   [junit4]   2> 2164494 INFO  (SUITE-PeerSyncWithLeaderTest-seed#[12CF0620F945B50E]-worker) [    ] o.a.s.m.SolrMetricManager Closing metric reporters for registry=solr.jetty, tag=null
   [junit4]   2> 2164494 INFO  (SUITE-PeerSyncWithLeaderTest-seed#[12CF0620F945B50E]-worker) [    ] o.a.s.m.r.SolrJmxReporter Closing reporter [org.apache.solr.metrics.reporters.SolrJmxReporter@2c23afa5: rootName = null, domain = solr.jetty, service url = null, agent id = null] for registry solr.jetty / com.codahale.metrics.MetricRegistry@77947aa8
   [junit4]   2> NOTE: leaving temporary files on disk at: /home/jenkins/workspace/Lucene-Solr-8.x-Linux/solr/build/solr-core/test/J1/temp/solr.update.PeerSyncWithLeaderTest_12CF0620F945B50E-001
   [junit4]   2> NOTE: test params are: codec=CheapBastard, sim=Asserting(org.apache.lucene.search.similarities.AssertingSimilarity@5f066fff), locale=ro-RO, timezone=Pacific/Truk
   [junit4]   2> NOTE: Linux 4.18.0-17-generic amd64/Oracle Corporation 1.8.0_201 (64-bit)/cpus=8,threads=1,free=205662288,total=518979584
   [junit4]   2> NOTE: All tests run in this JVM: [TestTolerantSearch, TermVectorComponentDistributedTest, ShardsWhitelistTest, TestSearcherReuse, ManagedSchemaRoundRobinCloudTest, DisMaxRequestHandlerTest, TestStressVersions, TestConfigSetsAPIExclusivity, TestUtils, TestSchemaVersionResource, TestFieldResource, NodeLostTriggerTest, AdminHandlersProxyTest, BJQParserTest, TestMergePolicyConfig, TestReload, LoggingHandlerTest, HttpPartitionTest, UniqFieldsUpdateProcessorFactoryTest, TestPushWriter, StatsComponentTest, SparseHLLTest, TestMultiValuedNumericRangeQuery, ResponseBuilderTest, TestStressRecovery, AnalysisErrorHandlingTest, ChangedSchemaMergeTest, TestCloudInspectUtil, CustomTermsComponentTest, TestSolrCloudWithKerberosAlt, TestValueSourceCache, ShardRoutingTest, TestInPlaceUpdatesDistrib, BigEndianAscendingWordSerializerTest, TestSchemaNameResource, TestDynamicURP, TestDownShardTolerantSearch, TestFiltering, DistanceUnitsTest, WrapperMergePolicyFactoryTest, V2StandaloneTest, TestFieldCacheSort, MoreLikeThisHandlerTest, OpenExchangeRatesOrgProviderTest, TestSolrConfigHandlerConcurrent, SecurityConfHandlerTest, TestDistributedSearch, TestBM25SimilarityFactory, TestEmbeddedSolrServerConstructors, TestFacetMethods, SolrCoreTest, TestSSLRandomization, TestSimExecutePlanAction, TestSQLHandler, BasicFunctionalityTest, SpellCheckCollatorTest, HighlighterMaxOffsetTest, LeaderElectionIntegrationTest, TestPerFieldSimilarity, BadCopyFieldTest, TestCloudPseudoReturnFields, TestAddFieldRealTimeGet, StatelessScriptUpdateProcessorFactoryTest, TestManagedSchema, TestRandomFaceting, MoveReplicaHDFSTest, DistributedExpandComponentTest, DistribJoinFromCollectionTest, RegexBytesRefFilterTest, TestSimPolicyCloud, SuggesterWFSTTest, DistributedQueryComponentOptimizationTest, TestFuzzyAnalyzedSuggestions, TestDocTermOrdsUninvertLimit, TestManagedStopFilterFactory, TestRemoteStreaming, ConfigureRecoveryStrategyTest, CdcrBidirectionalTest, TestJsonRequest, DistributedFacetPivotWhiteBoxTest, MigrateRouteKeyTest, TestLuceneMatchVersion, TestReplicationHandlerDiskOverFlow, DocValuesNotIndexedTest, SolrCloudReportersTest, AssignTest, AliasIntegrationTest, TestSimpleTextCodec, BasicDistributedZkTest, TestBlendedInfixSuggestions, SolrIndexMetricsTest, TestSolrDeletionPolicy2, TestRealTimeGet, RulesTest, ConfigSetsAPITest, Tagger2Test, TestDeleteCollectionOnDownNodes, HdfsTlogReplayBufferedWhileIndexingTest, TestUseDocValuesAsStored2, TestQuerySenderNoQuery, DirectSolrConnectionTest, TestObjectReleaseTracker, TestSha256AuthenticationProvider, TestSolrCLIRunExample, TestInitParams, TestBulkSchemaConcurrent, OrderedExecutorTest, TestSizeLimitedDistributedMap, ExecutePlanActionTest, FullHLLTest, StressHdfsTest, TestRestManager, HdfsDirectoryTest, TestCollectionsAPIViaSolrCloudCluster, TestDynamicFieldCollectionResource, IndexSizeTriggerTest, InfixSuggestersTest, LeaderFailureAfterFreshStartTest, TestXIncludeConfig, TestCustomStream, SplitShardTest, IgnoreLargeDocumentProcessorFactoryTest, TestCloudJSONFacetJoinDomain, ConcurrentDeleteAndCreateCollectionTest, AnalyticsQueryTest, TestUnifiedSolrHighlighter, SpellingQueryConverterTest, TestJsonFacets, ExitableDirectoryReaderTest, PreAnalyzedUpdateProcessorTest, TestNestedDocsSort, ZkNodePropsTest, TestQueryTypes, DistributedFacetPivotLongTailTest, TestMiniSolrCloudClusterSSL, SchemaApiFailureTest, TestCollationField, SignificantTermsQParserPluginTest, TestHashQParserPlugin, ChaosMonkeySafeLeaderTest, ChaosMonkeySafeLeaderWithPullReplicasTest, CreateCollectionCleanupTest, DeleteInactiveReplicaTest, DeleteReplicaTest, MetricsHistoryIntegrationTest, MultiSolrCloudTestCaseTest, NodeMutatorTest, OutOfBoxZkACLAndCredentialsProvidersTest, OverriddenZkACLAndCredentialsProvidersTest, OverseerCollectionConfigSetProcessorTest, OverseerRolesTest, OverseerTest, RecoveryZkTest, ReindexCollectionTest, SSLMigrationTest, SaslZkACLProviderTest, SliceStateTest, SolrCLIZkUtilsTest, SolrCloudExampleTest, TestCloudRecovery2, TestClusterProperties, TestHashPartitioner, TestLeaderElectionZkExpiry, TestPrepRecovery, TestRandomRequestDistribution, TestStressInPlaceUpdates, TestStressLiveNodes, TestUtilizeNode, TestWithCollection, SimpleCollectionCreateDeleteTest, TestLocalFSCloudBackupRestore, TestReplicaProperties, TestRequestStatusCollectionAPI, AutoAddReplicasPlanActionTest, AutoScalingHandlerTest, MetricTriggerTest, NodeAddedTriggerIntegrationTest, RestoreTriggerStateTest, ScheduledTriggerTest, SystemLogListenerTest, TriggerCooldownIntegrationTest, TriggerEventQueueTest, TriggerIntegrationTest, HdfsBasicDistributedZk2Test, HdfsBasicDistributedZkTest, HdfsChaosMonkeyNothingIsSafeTest, HdfsChaosMonkeySafeLeaderTest, HdfsNNFailoverTest, HdfsRecoverLeaseTest, BlobRepositoryCloudTest, TestConfigOverlay, TestConfigSetProperties, TestCoreContainer, TestSolrCoreSnapshots, TestCSVLoader, TestConfigReload, CoreAdminCreateDiscoverTest, CoreAdminHandlerTest, CoreAdminOperationTest, CoreAdminRequestStatusTest, CoreMergeIndexesAdminHandlerTest, DaemonStreamApiTest, MetricsHandlerTest, MetricsHistoryHandlerTest, ShowFileRequestHandlerTest, StatsReloadRaceTest, DistributedSuggestComponentTest, ReplicaListTransformerTest, ResponseLogComponentTest, TestDistributedStatsComponentCardinality, TestExpandComponent, TestHttpShardHandlerFactory, TestPivotHelperCode, TestTrackingShardHandlerFactory, MetricsConfigTest, SolrCoreMetricManagerTest, SolrGraphiteReporterTest, SolrJmxReporterTest, SmileWriterTest, TestCustomDocTransformer, TestGraphMLResponseWriter, TestChildDocTransformer, TestSubQueryTransformerDistrib, PreAnalyzedFieldTest, PrimitiveFieldTypeTest, SpatialRPTFieldTypeTest, LargeFieldTest, QueryEqualityTest, QueryParsingTest, RankQueryTest, TestComplexPhraseLeadingWildcard, TestComponentsName, TestDocSet, TestExtendedDismaxParser, TestInitQParser, TestLegacyNumericRangeQueryBuilder, TestMinHashQParser, TestMultiWordSynonyms, TestNoOpRegenerator, TestPayloadCheckQParserPlugin, TestRTGBase, TestRangeQuery, TestSolr4Spatial2, TestSolrFieldCacheBean, TestSolrQueryParser, TestStandardQParsers, TestXmlQParserPlugin, DistributedFacetSimpleRefinementLongTailTest, TestMinMaxOnMultiValuedField, BlockJoinFacetSimpleTest, TestDFISimilarityFactory, TestDFRSimilarityFactory, TestLMDirichletSimilarityFactory, TestLegacyBM25SimilarityFactory, TestDefaultStatsCache, TestLRUStatsCache, AuditLoggerPluginTest, BasicAuthIntegrationTest, MultiDestinationAuditLoggerTest, SolrLogAuditLoggerPluginTest, TestPKIAuthenticationPlugin, TestImpersonationWithHadoopAuth, TestZkAclsWithHadoopAuth, NoCacheHeaderTest, ResponseHeaderTest, SolrRequestParserTest, ConjunctionSolrSpellCheckerTest, DirectSolrSpellCheckerTest, SuggesterTSTTest, BlockDirectoryTest, TestNumericTerms64, PeerSyncWithIndexFingerprintCachingTest, PeerSyncWithLeaderTest]
   [junit4] Completed [821/855 (2!)] on J1 in 138.59s, 1 test, 1 failure <<< FAILURES!

[...truncated 9103 lines...]
BUILD FAILED
/home/jenkins/workspace/Lucene-Solr-8.x-Linux/build.xml:634: The following error occurred while executing this line:
/home/jenkins/workspace/Lucene-Solr-8.x-Linux/build.xml:128: Found 1 violations in source files (File uses Mockito but has no assumeWorkingMockito() call).

Total time: 79 minutes 3 seconds
Build step 'Invoke Ant' marked build as failure
Archiving artifacts
Setting ANT_1_8_2_HOME=/home/jenkins/tools/hudson.tasks.Ant_AntInstallation/ANT_1.8.2
[WARNINGS] Skipping publisher since build result is FAILURE
Recording test results
Setting ANT_1_8_2_HOME=/home/jenkins/tools/hudson.tasks.Ant_AntInstallation/ANT_1.8.2
Email was triggered for: Failure - Any
Sending email for trigger: Failure - Any
Setting ANT_1_8_2_HOME=/home/jenkins/tools/hudson.tasks.Ant_AntInstallation/ANT_1.8.2
Setting ANT_1_8_2_HOME=/home/jenkins/tools/hudson.tasks.Ant_AntInstallation/ANT_1.8.2
Setting ANT_1_8_2_HOME=/home/jenkins/tools/hudson.tasks.Ant_AntInstallation/ANT_1.8.2
Setting ANT_1_8_2_HOME=/home/jenkins/tools/hudson.tasks.Ant_AntInstallation/ANT_1.8.2
Setting ANT_1_8_2_HOME=/home/jenkins/tools/hudson.tasks.Ant_AntInstallation/ANT_1.8.2
Setting ANT_1_8_2_HOME=/home/jenkins/tools/hudson.tasks.Ant_AntInstallation/ANT_1.8.2

Mime
View raw message