lucene-dev mailing list archives

Site index · List index
Message view « Date » · « Thread »
Top « Date » · « Thread »
From Apache Jenkins Server <jenk...@builds.apache.org>
Subject [JENKINS] Lucene-Solr-BadApples-Tests-8.x - Build # 100 - Unstable
Date Mon, 13 May 2019 21:44:56 GMT
Build: https://builds.apache.org/job/Lucene-Solr-BadApples-Tests-8.x/100/

1 tests failed.
FAILED:  org.apache.solr.handler.component.TestDistributedStatsComponentCardinality.test

Error Message:
.responseHeader.status:200!=0

Stack Trace:
junit.framework.AssertionFailedError: .responseHeader.status:200!=0
	at __randomizedtesting.SeedInfo.seed([10B9C8F15AE1699B:98EDF72BF41D0463]:0)
	at junit.framework.Assert.fail(Assert.java:57)
	at org.apache.solr.BaseDistributedSearchTestCase.compareSolrResponses(BaseDistributedSearchTestCase.java:999)
	at org.apache.solr.BaseDistributedSearchTestCase.compareResponses(BaseDistributedSearchTestCase.java:1026)
	at org.apache.solr.BaseDistributedSearchTestCase.query(BaseDistributedSearchTestCase.java:680)
	at org.apache.solr.BaseDistributedSearchTestCase.query(BaseDistributedSearchTestCase.java:643)
	at org.apache.solr.handler.component.TestDistributedStatsComponentCardinality.test(TestDistributedStatsComponentCardinality.java:143)
	at sun.reflect.NativeMethodAccessorImpl.invoke0(Native Method)
	at sun.reflect.NativeMethodAccessorImpl.invoke(NativeMethodAccessorImpl.java:62)
	at sun.reflect.DelegatingMethodAccessorImpl.invoke(DelegatingMethodAccessorImpl.java:43)
	at java.lang.reflect.Method.invoke(Method.java:498)
	at com.carrotsearch.randomizedtesting.RandomizedRunner.invoke(RandomizedRunner.java:1750)
	at com.carrotsearch.randomizedtesting.RandomizedRunner$8.evaluate(RandomizedRunner.java:938)
	at com.carrotsearch.randomizedtesting.RandomizedRunner$9.evaluate(RandomizedRunner.java:974)
	at com.carrotsearch.randomizedtesting.RandomizedRunner$10.evaluate(RandomizedRunner.java:988)
	at org.apache.solr.BaseDistributedSearchTestCase$ShardsRepeatRule$ShardsFixedStatement.callStatement(BaseDistributedSearchTestCase.java:1082)
	at org.apache.solr.BaseDistributedSearchTestCase$ShardsRepeatRule$ShardsStatement.evaluate(BaseDistributedSearchTestCase.java:1054)
	at com.carrotsearch.randomizedtesting.rules.SystemPropertiesRestoreRule$1.evaluate(SystemPropertiesRestoreRule.java:57)
	at org.apache.lucene.util.TestRuleSetupTeardownChained$1.evaluate(TestRuleSetupTeardownChained.java:49)
	at org.apache.lucene.util.AbstractBeforeAfterRule$1.evaluate(AbstractBeforeAfterRule.java:45)
	at org.apache.lucene.util.TestRuleThreadAndTestName$1.evaluate(TestRuleThreadAndTestName.java:48)
	at org.apache.lucene.util.TestRuleIgnoreAfterMaxFailures$1.evaluate(TestRuleIgnoreAfterMaxFailures.java:64)
	at org.apache.lucene.util.TestRuleMarkFailure$1.evaluate(TestRuleMarkFailure.java:47)
	at com.carrotsearch.randomizedtesting.rules.StatementAdapter.evaluate(StatementAdapter.java:36)
	at com.carrotsearch.randomizedtesting.ThreadLeakControl$StatementRunner.run(ThreadLeakControl.java:368)
	at com.carrotsearch.randomizedtesting.ThreadLeakControl.forkTimeoutingTask(ThreadLeakControl.java:817)
	at com.carrotsearch.randomizedtesting.ThreadLeakControl$3.evaluate(ThreadLeakControl.java:468)
	at com.carrotsearch.randomizedtesting.RandomizedRunner.runSingleTest(RandomizedRunner.java:947)
	at com.carrotsearch.randomizedtesting.RandomizedRunner$5.evaluate(RandomizedRunner.java:832)
	at com.carrotsearch.randomizedtesting.RandomizedRunner$6.evaluate(RandomizedRunner.java:883)
	at com.carrotsearch.randomizedtesting.RandomizedRunner$7.evaluate(RandomizedRunner.java:894)
	at com.carrotsearch.randomizedtesting.rules.StatementAdapter.evaluate(StatementAdapter.java:36)
	at com.carrotsearch.randomizedtesting.rules.SystemPropertiesRestoreRule$1.evaluate(SystemPropertiesRestoreRule.java:57)
	at org.apache.lucene.util.AbstractBeforeAfterRule$1.evaluate(AbstractBeforeAfterRule.java:45)
	at com.carrotsearch.randomizedtesting.rules.StatementAdapter.evaluate(StatementAdapter.java:36)
	at org.apache.lucene.util.TestRuleStoreClassName$1.evaluate(TestRuleStoreClassName.java:41)
	at com.carrotsearch.randomizedtesting.rules.NoShadowingOrOverridesOnMethodsRule$1.evaluate(NoShadowingOrOverridesOnMethodsRule.java:40)
	at com.carrotsearch.randomizedtesting.rules.NoShadowingOrOverridesOnMethodsRule$1.evaluate(NoShadowingOrOverridesOnMethodsRule.java:40)
	at com.carrotsearch.randomizedtesting.rules.StatementAdapter.evaluate(StatementAdapter.java:36)
	at com.carrotsearch.randomizedtesting.rules.StatementAdapter.evaluate(StatementAdapter.java:36)
	at com.carrotsearch.randomizedtesting.rules.StatementAdapter.evaluate(StatementAdapter.java:36)
	at org.apache.lucene.util.TestRuleAssertionsRequired$1.evaluate(TestRuleAssertionsRequired.java:53)
	at org.apache.lucene.util.TestRuleMarkFailure$1.evaluate(TestRuleMarkFailure.java:47)
	at org.apache.lucene.util.TestRuleIgnoreAfterMaxFailures$1.evaluate(TestRuleIgnoreAfterMaxFailures.java:64)
	at org.apache.lucene.util.TestRuleIgnoreTestSuites$1.evaluate(TestRuleIgnoreTestSuites.java:54)
	at com.carrotsearch.randomizedtesting.rules.StatementAdapter.evaluate(StatementAdapter.java:36)
	at com.carrotsearch.randomizedtesting.ThreadLeakControl$StatementRunner.run(ThreadLeakControl.java:368)
	at java.lang.Thread.run(Thread.java:748)




Build Log:
[...truncated 14172 lines...]
   [junit4] Suite: org.apache.solr.handler.component.TestDistributedStatsComponentCardinality
   [junit4]   2> Creating dataDir: /x1/jenkins/jenkins-slave/workspace/Lucene-Solr-BadApples-Tests-8.x/solr/build/solr-core/test/J0/temp/solr.handler.component.TestDistributedStatsComponentCardinality_10B9C8F15AE1699B-001/init-core-data-001
   [junit4]   2> 1184354 WARN  (SUITE-TestDistributedStatsComponentCardinality-seed#[10B9C8F15AE1699B]-worker) [    ] o.a.s.SolrTestCaseJ4 startTrackingSearchers: numOpens=23 numCloses=23
   [junit4]   2> 1184354 INFO  (SUITE-TestDistributedStatsComponentCardinality-seed#[10B9C8F15AE1699B]-worker) [    ] o.a.s.SolrTestCaseJ4 Using PointFields (NUMERIC_POINTS_SYSPROP=true) w/NUMERIC_DOCVALUES_SYSPROP=true
   [junit4]   2> 1184356 INFO  (SUITE-TestDistributedStatsComponentCardinality-seed#[10B9C8F15AE1699B]-worker) [    ] o.a.s.SolrTestCaseJ4 Randomized ssl (false) and clientAuth (false) via: @org.apache.solr.SolrTestCaseJ4$SuppressSSL(bugUrl=https://issues.apache.org/jira/browse/SOLR-9062)
   [junit4]   2> 1184356 INFO  (SUITE-TestDistributedStatsComponentCardinality-seed#[10B9C8F15AE1699B]-worker) [    ] o.a.s.SolrTestCaseJ4 SecureRandom sanity checks: test.solr.allowed.securerandom=null & java.security.egd=file:/dev/./urandom
   [junit4]   2> 1184356 INFO  (SUITE-TestDistributedStatsComponentCardinality-seed#[10B9C8F15AE1699B]-worker) [    ] o.a.s.BaseDistributedSearchTestCase Setting hostContext system property: /_uil/he
   [junit4]   2> 1184543 INFO  (TEST-TestDistributedStatsComponentCardinality.test-seed#[10B9C8F15AE1699B]) [    ] o.a.s.SolrTestCaseJ4 Writing core.properties file to /x1/jenkins/jenkins-slave/workspace/Lucene-Solr-BadApples-Tests-8.x/solr/build/solr-core/test/J0/temp/solr.handler.component.TestDistributedStatsComponentCardinality_10B9C8F15AE1699B-001/tempDir-001/control/cores/collection1
   [junit4]   2> 1184545 WARN  (TEST-TestDistributedStatsComponentCardinality.test-seed#[10B9C8F15AE1699B]) [    ] o.e.j.s.AbstractConnector Ignoring deprecated socket close linger time
   [junit4]   2> 1184545 INFO  (TEST-TestDistributedStatsComponentCardinality.test-seed#[10B9C8F15AE1699B]) [    ] o.a.s.c.s.e.JettySolrRunner Start Jetty (original configured port=0)
   [junit4]   2> 1184545 INFO  (TEST-TestDistributedStatsComponentCardinality.test-seed#[10B9C8F15AE1699B]) [    ] o.a.s.c.s.e.JettySolrRunner Trying to start Jetty on port 0 try number 1 ...
   [junit4]   2> 1184545 INFO  (TEST-TestDistributedStatsComponentCardinality.test-seed#[10B9C8F15AE1699B]) [    ] o.e.j.s.Server jetty-9.4.14.v20181114; built: 2018-11-14T21:20:31.478Z; git: c4550056e785fb5665914545889f21dc136ad9e6; jvm 1.8.0_191-b12
   [junit4]   2> 1184546 INFO  (TEST-TestDistributedStatsComponentCardinality.test-seed#[10B9C8F15AE1699B]) [    ] o.e.j.s.session DefaultSessionIdManager workerName=node0
   [junit4]   2> 1184546 INFO  (TEST-TestDistributedStatsComponentCardinality.test-seed#[10B9C8F15AE1699B]) [    ] o.e.j.s.session No SessionScavenger set, using defaults
   [junit4]   2> 1184546 INFO  (TEST-TestDistributedStatsComponentCardinality.test-seed#[10B9C8F15AE1699B]) [    ] o.e.j.s.session node0 Scavenging every 600000ms
   [junit4]   2> 1184548 INFO  (TEST-TestDistributedStatsComponentCardinality.test-seed#[10B9C8F15AE1699B]) [    ] o.e.j.s.h.ContextHandler Started o.e.j.s.ServletContextHandler@77727bb5{/_uil/he,null,AVAILABLE}
   [junit4]   2> 1184549 INFO  (TEST-TestDistributedStatsComponentCardinality.test-seed#[10B9C8F15AE1699B]) [    ] o.e.j.s.AbstractConnector Started ServerConnector@390e9af7{HTTP/1.1,[http/1.1, h2c]}{127.0.0.1:44683}
   [junit4]   2> 1184549 INFO  (TEST-TestDistributedStatsComponentCardinality.test-seed#[10B9C8F15AE1699B]) [    ] o.e.j.s.Server Started @1184624ms
   [junit4]   2> 1184550 INFO  (TEST-TestDistributedStatsComponentCardinality.test-seed#[10B9C8F15AE1699B]) [    ] o.a.s.c.s.e.JettySolrRunner Jetty properties: {hostContext=/_uil/he, hostPort=44683, coreRootDirectory=/x1/jenkins/jenkins-slave/workspace/Lucene-Solr-BadApples-Tests-8.x/solr/build/solr-core/test/J0/temp/solr.handler.component.TestDistributedStatsComponentCardinality_10B9C8F15AE1699B-001/tempDir-001/control/cores}
   [junit4]   2> 1184550 ERROR (TEST-TestDistributedStatsComponentCardinality.test-seed#[10B9C8F15AE1699B]) [    ] o.a.s.u.StartupLoggingUtils Missing Java Option solr.log.dir. Logging may be missing or incomplete.
   [junit4]   2> 1184550 INFO  (TEST-TestDistributedStatsComponentCardinality.test-seed#[10B9C8F15AE1699B]) [    ] o.a.s.s.SolrDispatchFilter Using logger factory org.apache.logging.slf4j.Log4jLoggerFactory
   [junit4]   2> 1184550 INFO  (TEST-TestDistributedStatsComponentCardinality.test-seed#[10B9C8F15AE1699B]) [    ] o.a.s.s.SolrDispatchFilter  ___      _       Welcome to Apache Solr? version 8.2.0
   [junit4]   2> 1184550 INFO  (TEST-TestDistributedStatsComponentCardinality.test-seed#[10B9C8F15AE1699B]) [    ] o.a.s.s.SolrDispatchFilter / __| ___| |_ _   Starting in standalone mode on port null
   [junit4]   2> 1184550 INFO  (TEST-TestDistributedStatsComponentCardinality.test-seed#[10B9C8F15AE1699B]) [    ] o.a.s.s.SolrDispatchFilter \__ \/ _ \ | '_|  Install dir: null
   [junit4]   2> 1184550 INFO  (TEST-TestDistributedStatsComponentCardinality.test-seed#[10B9C8F15AE1699B]) [    ] o.a.s.s.SolrDispatchFilter |___/\___/_|_|    Start time: 2019-05-13T20:53:17.875Z
   [junit4]   2> 1184550 INFO  (TEST-TestDistributedStatsComponentCardinality.test-seed#[10B9C8F15AE1699B]) [    ] o.a.s.c.SolrXmlConfig Loading container configuration from /x1/jenkins/jenkins-slave/workspace/Lucene-Solr-BadApples-Tests-8.x/solr/build/solr-core/test/J0/temp/solr.handler.component.TestDistributedStatsComponentCardinality_10B9C8F15AE1699B-001/tempDir-001/control/solr.xml
   [junit4]   2> 1184556 INFO  (TEST-TestDistributedStatsComponentCardinality.test-seed#[10B9C8F15AE1699B]) [    ] o.a.s.c.SolrXmlConfig Configuration parameter autoReplicaFailoverWorkLoopDelay is ignored
   [junit4]   2> 1184556 INFO  (TEST-TestDistributedStatsComponentCardinality.test-seed#[10B9C8F15AE1699B]) [    ] o.a.s.c.SolrXmlConfig Configuration parameter autoReplicaFailoverBadNodeExpiration is ignored
   [junit4]   2> 1184558 INFO  (TEST-TestDistributedStatsComponentCardinality.test-seed#[10B9C8F15AE1699B]) [    ] o.a.s.c.SolrXmlConfig MBean server found: com.sun.jmx.mbeanserver.JmxMBeanServer@18f1ee62, but no JMX reporters were configured - adding default JMX reporter.
   [junit4]   2> 1184614 INFO  (TEST-TestDistributedStatsComponentCardinality.test-seed#[10B9C8F15AE1699B]) [    ] o.a.s.h.c.HttpShardHandlerFactory Host whitelist initialized: WhitelistHostChecker [whitelistHosts=null, whitelistHostCheckingEnabled=false]
   [junit4]   2> 1184616 WARN  (TEST-TestDistributedStatsComponentCardinality.test-seed#[10B9C8F15AE1699B]) [    ] o.e.j.u.s.S.config No Client EndPointIdentificationAlgorithm configured for SslContextFactory@f71c37a[provider=null,keyStore=null,trustStore=null]
   [junit4]   2> 1184621 WARN  (TEST-TestDistributedStatsComponentCardinality.test-seed#[10B9C8F15AE1699B]) [    ] o.e.j.u.s.S.config No Client EndPointIdentificationAlgorithm configured for SslContextFactory@2aaf2a4d[provider=null,keyStore=null,trustStore=null]
   [junit4]   2> 1184647 INFO  (TEST-TestDistributedStatsComponentCardinality.test-seed#[10B9C8F15AE1699B]) [    ] o.a.s.c.TransientSolrCoreCacheDefault Allocating transient cache for 4 transient cores
   [junit4]   2> 1184647 INFO  (TEST-TestDistributedStatsComponentCardinality.test-seed#[10B9C8F15AE1699B]) [    ] o.a.s.h.a.MetricsHistoryHandler No .system collection, keeping metrics history in memory.
   [junit4]   2> 1184674 INFO  (TEST-TestDistributedStatsComponentCardinality.test-seed#[10B9C8F15AE1699B]) [    ] o.a.s.m.r.SolrJmxReporter JMX monitoring for 'solr.node' (registry 'solr.node') enabled at server: com.sun.jmx.mbeanserver.JmxMBeanServer@18f1ee62
   [junit4]   2> 1184692 INFO  (TEST-TestDistributedStatsComponentCardinality.test-seed#[10B9C8F15AE1699B]) [    ] o.a.s.m.r.SolrJmxReporter JMX monitoring for 'solr.jvm' (registry 'solr.jvm') enabled at server: com.sun.jmx.mbeanserver.JmxMBeanServer@18f1ee62
   [junit4]   2> 1184692 INFO  (TEST-TestDistributedStatsComponentCardinality.test-seed#[10B9C8F15AE1699B]) [    ] o.a.s.m.r.SolrJmxReporter JMX monitoring for 'solr.jetty' (registry 'solr.jetty') enabled at server: com.sun.jmx.mbeanserver.JmxMBeanServer@18f1ee62
   [junit4]   2> 1184696 INFO  (TEST-TestDistributedStatsComponentCardinality.test-seed#[10B9C8F15AE1699B]) [    ] o.a.s.c.CorePropertiesLocator Found 1 core definitions underneath /x1/jenkins/jenkins-slave/workspace/Lucene-Solr-BadApples-Tests-8.x/solr/build/solr-core/test/J0/temp/solr.handler.component.TestDistributedStatsComponentCardinality_10B9C8F15AE1699B-001/tempDir-001/control/cores
   [junit4]   2> 1184696 INFO  (TEST-TestDistributedStatsComponentCardinality.test-seed#[10B9C8F15AE1699B]) [    ] o.a.s.c.CorePropertiesLocator Cores are: [collection1]
   [junit4]   2> 1184697 INFO  (coreLoadExecutor-7078-thread-1) [    x:collection1] o.a.s.c.SolrResourceLoader [null] Added 2 libs to classloader, from paths: [/x1/jenkins/jenkins-slave/workspace/Lucene-Solr-BadApples-Tests-8.x/solr/core/src/test-files/solr/collection1/lib, /x1/jenkins/jenkins-slave/workspace/Lucene-Solr-BadApples-Tests-8.x/solr/core/src/test-files/solr/collection1/lib/classes]
   [junit4]   2> 1184731 INFO  (coreLoadExecutor-7078-thread-1) [    x:collection1] o.a.s.c.SolrConfig Using Lucene MatchVersion: 8.2.0
   [junit4]   2> 1184769 INFO  (coreLoadExecutor-7078-thread-1) [    x:collection1] o.a.s.s.IndexSchema [collection1] Schema name=test
   [junit4]   2> 1184904 INFO  (coreLoadExecutor-7078-thread-1) [    x:collection1] o.a.s.s.IndexSchema Loaded schema test/1.0 with uniqueid field id
   [junit4]   2> 1184915 INFO  (coreLoadExecutor-7078-thread-1) [    x:collection1] o.a.s.c.CoreContainer Creating SolrCore 'collection1' using configuration from configset /x1/jenkins/jenkins-slave/workspace/Lucene-Solr-BadApples-Tests-8.x/solr/core/src/test-files/solr/collection1, trusted=true
   [junit4]   2> 1184915 INFO  (coreLoadExecutor-7078-thread-1) [    x:collection1] o.a.s.m.r.SolrJmxReporter JMX monitoring for 'solr.core.collection1' (registry 'solr.core.collection1') enabled at server: com.sun.jmx.mbeanserver.JmxMBeanServer@18f1ee62
   [junit4]   2> 1184916 INFO  (coreLoadExecutor-7078-thread-1) [    x:collection1] o.a.s.c.SolrCore [[collection1] ] Opening new SolrCore at [/x1/jenkins/jenkins-slave/workspace/Lucene-Solr-BadApples-Tests-8.x/solr/core/src/test-files/solr/collection1], dataDir=[/x1/jenkins/jenkins-slave/workspace/Lucene-Solr-BadApples-Tests-8.x/solr/build/solr-core/test/J0/temp/solr.handler.component.TestDistributedStatsComponentCardinality_10B9C8F15AE1699B-001/tempDir-001/control/cores/collection1/data/]
   [junit4]   2> 1184918 INFO  (coreLoadExecutor-7078-thread-1) [    x:collection1] o.a.s.u.RandomMergePolicy RandomMergePolicy wrapping class org.apache.lucene.index.LogDocMergePolicy: [LogDocMergePolicy: minMergeSize=1000, mergeFactor=15, maxMergeSize=9223372036854775807, maxMergeSizeForForcedMerge=9223372036854775807, calibrateSizeByDeletes=false, maxMergeDocs=2147483647, maxCFSSegmentSizeMB=8.796093022207999E12, noCFSRatio=0.19881999681685808]
   [junit4]   2> 1185001 INFO  (coreLoadExecutor-7078-thread-1) [    x:collection1] o.a.s.u.UpdateHandler Using UpdateLog implementation: org.apache.solr.update.UpdateLog
   [junit4]   2> 1185001 INFO  (coreLoadExecutor-7078-thread-1) [    x:collection1] o.a.s.u.UpdateLog Initializing UpdateLog: dataDir= defaultSyncLevel=FLUSH numRecordsToKeep=100 maxNumLogsToKeep=10 numVersionBuckets=65536
   [junit4]   2> 1185003 INFO  (coreLoadExecutor-7078-thread-1) [    x:collection1] o.a.s.u.CommitTracker Hard AutoCommit: disabled
   [junit4]   2> 1185003 INFO  (coreLoadExecutor-7078-thread-1) [    x:collection1] o.a.s.u.CommitTracker Soft AutoCommit: disabled
   [junit4]   2> 1185004 INFO  (coreLoadExecutor-7078-thread-1) [    x:collection1] o.a.s.u.RandomMergePolicy RandomMergePolicy wrapping class org.apache.lucene.index.TieredMergePolicy: [TieredMergePolicy: maxMergeAtOnce=33, maxMergeAtOnceExplicit=23, maxMergedSegmentMB=87.576171875, floorSegmentMB=2.0966796875, forceMergeDeletesPctAllowed=22.89310348920088, segmentsPerTier=36.0, maxCFSSegmentSizeMB=8.796093022207999E12, noCFSRatio=1.0, deletesPctAllowed=20.041499036871762
   [junit4]   2> 1185019 INFO  (coreLoadExecutor-7078-thread-1) [    x:collection1] o.a.s.s.SolrIndexSearcher Opening [Searcher@250df8f5[collection1] main]
   [junit4]   2> 1185020 INFO  (coreLoadExecutor-7078-thread-1) [    x:collection1] o.a.s.h.c.SpellCheckComponent Initializing spell checkers
   [junit4]   2> 1185033 INFO  (coreLoadExecutor-7078-thread-1) [    x:collection1] o.a.s.s.DirectSolrSpellChecker init: {name=direct,classname=DirectSolrSpellChecker,field=lowerfilt,minQueryLength=3}
   [junit4]   2> 1185070 INFO  (coreLoadExecutor-7078-thread-1) [    x:collection1] o.a.s.h.ReplicationHandler Commits will be reserved for 10000ms.
   [junit4]   2> 1185070 INFO  (coreLoadExecutor-7078-thread-1) [    x:collection1] o.a.s.u.UpdateLog Could not find max version in index or recent updates, using new clock 1633451558457835520
   [junit4]   2> 1185072 INFO  (searcherExecutor-7079-thread-1-processing-x:collection1) [    x:collection1] o.a.s.h.c.SpellCheckComponent Loading spell index for spellchecker: default
   [junit4]   2> 1185073 INFO  (searcherExecutor-7079-thread-1-processing-x:collection1) [    x:collection1] o.a.s.h.c.SpellCheckComponent Loading spell index for spellchecker: direct
   [junit4]   2> 1185073 INFO  (searcherExecutor-7079-thread-1-processing-x:collection1) [    x:collection1] o.a.s.h.c.SpellCheckComponent Loading spell index for spellchecker: wordbreak
   [junit4]   2> 1185073 INFO  (searcherExecutor-7079-thread-1-processing-x:collection1) [    x:collection1] o.a.s.h.c.SpellCheckComponent Loading spell index for spellchecker: multipleFields
   [junit4]   2> 1185073 INFO  (searcherExecutor-7079-thread-1-processing-x:collection1) [    x:collection1] o.a.s.h.c.SpellCheckComponent Loading spell index for spellchecker: jarowinkler
   [junit4]   2> 1185074 INFO  (searcherExecutor-7079-thread-1-processing-x:collection1) [    x:collection1] o.a.s.h.c.SpellCheckComponent Loading spell index for spellchecker: external
   [junit4]   2> 1185074 INFO  (searcherExecutor-7079-thread-1-processing-x:collection1) [    x:collection1] o.a.s.h.c.SpellCheckComponent Loading spell index for spellchecker: freq
   [junit4]   2> 1185074 INFO  (searcherExecutor-7079-thread-1-processing-x:collection1) [    x:collection1] o.a.s.h.c.SpellCheckComponent Loading spell index for spellchecker: fqcn
   [junit4]   2> 1185075 INFO  (searcherExecutor-7079-thread-1-processing-x:collection1) [    x:collection1] o.a.s.h.c.SpellCheckComponent Loading spell index for spellchecker: perDict
   [junit4]   2> 1185076 INFO  (searcherExecutor-7079-thread-1-processing-x:collection1) [    x:collection1] o.a.s.c.SolrCore [collection1] Registered new searcher Searcher@250df8f5[collection1] main{ExitableDirectoryReader(UninvertingDirectoryReader())}
   [junit4]   2> 1185788 INFO  (TEST-TestDistributedStatsComponentCardinality.test-seed#[10B9C8F15AE1699B]) [    ] o.a.s.SolrTestCaseJ4 Writing core.properties file to /x1/jenkins/jenkins-slave/workspace/Lucene-Solr-BadApples-Tests-8.x/solr/build/solr-core/test/J0/temp/solr.handler.component.TestDistributedStatsComponentCardinality_10B9C8F15AE1699B-001/tempDir-001/shard0/cores/collection1
   [junit4]   2> 1185789 WARN  (TEST-TestDistributedStatsComponentCardinality.test-seed#[10B9C8F15AE1699B]) [    ] o.e.j.s.AbstractConnector Ignoring deprecated socket close linger time
   [junit4]   2> 1185790 INFO  (TEST-TestDistributedStatsComponentCardinality.test-seed#[10B9C8F15AE1699B]) [    ] o.a.s.c.s.e.JettySolrRunner Start Jetty (original configured port=0)
   [junit4]   2> 1185790 INFO  (TEST-TestDistributedStatsComponentCardinality.test-seed#[10B9C8F15AE1699B]) [    ] o.a.s.c.s.e.JettySolrRunner Trying to start Jetty on port 0 try number 1 ...
   [junit4]   2> 1185790 INFO  (TEST-TestDistributedStatsComponentCardinality.test-seed#[10B9C8F15AE1699B]) [    ] o.e.j.s.Server jetty-9.4.14.v20181114; built: 2018-11-14T21:20:31.478Z; git: c4550056e785fb5665914545889f21dc136ad9e6; jvm 1.8.0_191-b12
   [junit4]   2> 1185791 INFO  (TEST-TestDistributedStatsComponentCardinality.test-seed#[10B9C8F15AE1699B]) [    ] o.e.j.s.session DefaultSessionIdManager workerName=node0
   [junit4]   2> 1185791 INFO  (TEST-TestDistributedStatsComponentCardinality.test-seed#[10B9C8F15AE1699B]) [    ] o.e.j.s.session No SessionScavenger set, using defaults
   [junit4]   2> 1185791 INFO  (TEST-TestDistributedStatsComponentCardinality.test-seed#[10B9C8F15AE1699B]) [    ] o.e.j.s.session node0 Scavenging every 660000ms
   [junit4]   2> 1185792 INFO  (TEST-TestDistributedStatsComponentCardinality.test-seed#[10B9C8F15AE1699B]) [    ] o.e.j.s.h.ContextHandler Started o.e.j.s.ServletContextHandler@e3bc14f{/_uil/he,null,AVAILABLE}
   [junit4]   2> 1185792 INFO  (TEST-TestDistributedStatsComponentCardinality.test-seed#[10B9C8F15AE1699B]) [    ] o.e.j.s.AbstractConnector Started ServerConnector@bde3c91{HTTP/1.1,[http/1.1, h2c]}{127.0.0.1:41265}
   [junit4]   2> 1185792 INFO  (TEST-TestDistributedStatsComponentCardinality.test-seed#[10B9C8F15AE1699B]) [    ] o.e.j.s.Server Started @1185867ms
   [junit4]   2> 1185792 INFO  (TEST-TestDistributedStatsComponentCardinality.test-seed#[10B9C8F15AE1699B]) [    ] o.a.s.c.s.e.JettySolrRunner Jetty properties: {hostContext=/_uil/he, hostPort=41265, coreRootDirectory=/x1/jenkins/jenkins-slave/workspace/Lucene-Solr-BadApples-Tests-8.x/solr/build/solr-core/test/J0/temp/solr.handler.component.TestDistributedStatsComponentCardinality_10B9C8F15AE1699B-001/tempDir-001/shard0/cores}
   [junit4]   2> 1185793 ERROR (TEST-TestDistributedStatsComponentCardinality.test-seed#[10B9C8F15AE1699B]) [    ] o.a.s.u.StartupLoggingUtils Missing Java Option solr.log.dir. Logging may be missing or incomplete.
   [junit4]   2> 1185793 INFO  (TEST-TestDistributedStatsComponentCardinality.test-seed#[10B9C8F15AE1699B]) [    ] o.a.s.s.SolrDispatchFilter Using logger factory org.apache.logging.slf4j.Log4jLoggerFactory
   [junit4]   2> 1185793 INFO  (TEST-TestDistributedStatsComponentCardinality.test-seed#[10B9C8F15AE1699B]) [    ] o.a.s.s.SolrDispatchFilter  ___      _       Welcome to Apache Solr? version 8.2.0
   [junit4]   2> 1185793 INFO  (TEST-TestDistributedStatsComponentCardinality.test-seed#[10B9C8F15AE1699B]) [    ] o.a.s.s.SolrDispatchFilter / __| ___| |_ _   Starting in standalone mode on port null
   [junit4]   2> 1185793 INFO  (TEST-TestDistributedStatsComponentCardinality.test-seed#[10B9C8F15AE1699B]) [    ] o.a.s.s.SolrDispatchFilter \__ \/ _ \ | '_|  Install dir: null
   [junit4]   2> 1185793 INFO  (TEST-TestDistributedStatsComponentCardinality.test-seed#[10B9C8F15AE1699B]) [    ] o.a.s.s.SolrDispatchFilter |___/\___/_|_|    Start time: 2019-05-13T20:53:19.118Z
   [junit4]   2> 1185793 INFO  (TEST-TestDistributedStatsComponentCardinality.test-seed#[10B9C8F15AE1699B]) [    ] o.a.s.c.SolrXmlConfig Loading container configuration from /x1/jenkins/jenkins-slave/workspace/Lucene-Solr-BadApples-Tests-8.x/solr/build/solr-core/test/J0/temp/solr.handler.component.TestDistributedStatsComponentCardinality_10B9C8F15AE1699B-001/tempDir-001/shard0/solr.xml
   [junit4]   2> 1185799 INFO  (TEST-TestDistributedStatsComponentCardinality.test-seed#[10B9C8F15AE1699B]) [    ] o.a.s.c.SolrXmlConfig Configuration parameter autoReplicaFailoverWorkLoopDelay is ignored
   [junit4]   2> 1185799 INFO  (TEST-TestDistributedStatsComponentCardinality.test-seed#[10B9C8F15AE1699B]) [    ] o.a.s.c.SolrXmlConfig Configuration parameter autoReplicaFailoverBadNodeExpiration is ignored
   [junit4]   2> 1185802 INFO  (TEST-TestDistributedStatsComponentCardinality.test-seed#[10B9C8F15AE1699B]) [    ] o.a.s.c.SolrXmlConfig MBean server found: com.sun.jmx.mbeanserver.JmxMBeanServer@18f1ee62, but no JMX reporters were configured - adding default JMX reporter.
   [junit4]   2> 1185888 INFO  (TEST-TestDistributedStatsComponentCardinality.test-seed#[10B9C8F15AE1699B]) [    ] o.a.s.h.c.HttpShardHandlerFactory Host whitelist initialized: WhitelistHostChecker [whitelistHosts=null, whitelistHostCheckingEnabled=false]
   [junit4]   2> 1185890 WARN  (TEST-TestDistributedStatsComponentCardinality.test-seed#[10B9C8F15AE1699B]) [    ] o.e.j.u.s.S.config No Client EndPointIdentificationAlgorithm configured for SslContextFactory@5d102df4[provider=null,keyStore=null,trustStore=null]
   [junit4]   2> 1185894 WARN  (TEST-TestDistributedStatsComponentCardinality.test-seed#[10B9C8F15AE1699B]) [    ] o.e.j.u.s.S.config No Client EndPointIdentificationAlgorithm configured for SslContextFactory@6760057c[provider=null,keyStore=null,trustStore=null]
   [junit4]   2> 1185919 INFO  (TEST-TestDistributedStatsComponentCardinality.test-seed#[10B9C8F15AE1699B]) [    ] o.a.s.c.TransientSolrCoreCacheDefault Allocating transient cache for 4 transient cores
   [junit4]   2> 1185919 INFO  (TEST-TestDistributedStatsComponentCardinality.test-seed#[10B9C8F15AE1699B]) [    ] o.a.s.h.a.MetricsHistoryHandler No .system collection, keeping metrics history in memory.
   [junit4]   2> 1185949 INFO  (TEST-TestDistributedStatsComponentCardinality.test-seed#[10B9C8F15AE1699B]) [    ] o.a.s.m.r.SolrJmxReporter JMX monitoring for 'solr.node' (registry 'solr.node') enabled at server: com.sun.jmx.mbeanserver.JmxMBeanServer@18f1ee62
   [junit4]   2> 1185967 INFO  (TEST-TestDistributedStatsComponentCardinality.test-seed#[10B9C8F15AE1699B]) [    ] o.a.s.m.r.SolrJmxReporter JMX monitoring for 'solr.jvm' (registry 'solr.jvm') enabled at server: com.sun.jmx.mbeanserver.JmxMBeanServer@18f1ee62
   [junit4]   2> 1185968 INFO  (TEST-TestDistributedStatsComponentCardinality.test-seed#[10B9C8F15AE1699B]) [    ] o.a.s.m.r.SolrJmxReporter JMX monitoring for 'solr.jetty' (registry 'solr.jetty') enabled at server: com.sun.jmx.mbeanserver.JmxMBeanServer@18f1ee62
   [junit4]   2> 1185970 INFO  (TEST-TestDistributedStatsComponentCardinality.test-seed#[10B9C8F15AE1699B]) [    ] o.a.s.c.CorePropertiesLocator Found 1 core definitions underneath /x1/jenkins/jenkins-slave/workspace/Lucene-Solr-BadApples-Tests-8.x/solr/build/solr-core/test/J0/temp/solr.handler.component.TestDistributedStatsComponentCardinality_10B9C8F15AE1699B-001/tempDir-001/shard0/cores
   [junit4]   2> 1185970 INFO  (TEST-TestDistributedStatsComponentCardinality.test-seed#[10B9C8F15AE1699B]) [    ] o.a.s.c.CorePropertiesLocator Cores are: [collection1]
   [junit4]   2> 1185971 INFO  (coreLoadExecutor-7092-thread-1) [    x:collection1] o.a.s.c.SolrResourceLoader [null] Added 2 libs to classloader, from paths: [/x1/jenkins/jenkins-slave/workspace/Lucene-Solr-BadApples-Tests-8.x/solr/core/src/test-files/solr/collection1/lib, /x1/jenkins/jenkins-slave/workspace/Lucene-Solr-BadApples-Tests-8.x/solr/core/src/test-files/solr/collection1/lib/classes]
   [junit4]   2> 1186006 INFO  (coreLoadExecutor-7092-thread-1) [    x:collection1] o.a.s.c.SolrConfig Using Lucene MatchVersion: 8.2.0
   [junit4]   2> 1186043 INFO  (coreLoadExecutor-7092-thread-1) [    x:collection1] o.a.s.s.IndexSchema [collection1] Schema name=test
   [junit4]   2> 1186177 INFO  (coreLoadExecutor-7092-thread-1) [    x:collection1] o.a.s.s.IndexSchema Loaded schema test/1.0 with uniqueid field id
   [junit4]   2> 1186186 INFO  (coreLoadExecutor-7092-thread-1) [    x:collection1] o.a.s.c.CoreContainer Creating SolrCore 'collection1' using configuration from configset /x1/jenkins/jenkins-slave/workspace/Lucene-Solr-BadApples-Tests-8.x/solr/core/src/test-files/solr/collection1, trusted=true
   [junit4]   2> 1186186 INFO  (coreLoadExecutor-7092-thread-1) [    x:collection1] o.a.s.m.r.SolrJmxReporter JMX monitoring for 'solr.core.collection1' (registry 'solr.core.collection1') enabled at server: com.sun.jmx.mbeanserver.JmxMBeanServer@18f1ee62
   [junit4]   2> 1186187 INFO  (coreLoadExecutor-7092-thread-1) [    x:collection1] o.a.s.c.SolrCore [[collection1] ] Opening new SolrCore at [/x1/jenkins/jenkins-slave/workspace/Lucene-Solr-BadApples-Tests-8.x/solr/core/src/test-files/solr/collection1], dataDir=[/x1/jenkins/jenkins-slave/workspace/Lucene-Solr-BadApples-Tests-8.x/solr/build/solr-core/test/J0/temp/solr.handler.component.TestDistributedStatsComponentCardinality_10B9C8F15AE1699B-001/tempDir-001/shard0/cores/collection1/data/]
   [junit4]   2> 1186188 INFO  (coreLoadExecutor-7092-thread-1) [    x:collection1] o.a.s.u.RandomMergePolicy RandomMergePolicy wrapping class org.apache.lucene.index.LogDocMergePolicy: [LogDocMergePolicy: minMergeSize=1000, mergeFactor=15, maxMergeSize=9223372036854775807, maxMergeSizeForForcedMerge=9223372036854775807, calibrateSizeByDeletes=false, maxMergeDocs=2147483647, maxCFSSegmentSizeMB=8.796093022207999E12, noCFSRatio=0.19881999681685808]
   [junit4]   2> 1186268 INFO  (coreLoadExecutor-7092-thread-1) [    x:collection1] o.a.s.u.UpdateHandler Using UpdateLog implementation: org.apache.solr.update.UpdateLog
   [junit4]   2> 1186268 INFO  (coreLoadExecutor-7092-thread-1) [    x:collection1] o.a.s.u.UpdateLog Initializing UpdateLog: dataDir= defaultSyncLevel=FLUSH numRecordsToKeep=100 maxNumLogsToKeep=10 numVersionBuckets=65536
   [junit4]   2> 1186270 INFO  (coreLoadExecutor-7092-thread-1) [    x:collection1] o.a.s.u.CommitTracker Hard AutoCommit: disabled
   [junit4]   2> 1186270 INFO  (coreLoadExecutor-7092-thread-1) [    x:collection1] o.a.s.u.CommitTracker Soft AutoCommit: disabled
   [junit4]   2> 1186271 INFO  (coreLoadExecutor-7092-thread-1) [    x:collection1] o.a.s.u.RandomMergePolicy RandomMergePolicy wrapping class org.apache.lucene.index.TieredMergePolicy: [TieredMergePolicy: maxMergeAtOnce=33, maxMergeAtOnceExplicit=23, maxMergedSegmentMB=87.576171875, floorSegmentMB=2.0966796875, forceMergeDeletesPctAllowed=22.89310348920088, segmentsPerTier=36.0, maxCFSSegmentSizeMB=8.796093022207999E12, noCFSRatio=1.0, deletesPctAllowed=20.041499036871762
   [junit4]   2> 1186272 INFO  (coreLoadExecutor-7092-thread-1) [    x:collection1] o.a.s.s.SolrIndexSearcher Opening [Searcher@6803ee03[collection1] main]
   [junit4]   2> 1186273 INFO  (coreLoadExecutor-7092-thread-1) [    x:collection1] o.a.s.h.c.SpellCheckComponent Initializing spell checkers
   [junit4]   2> 1186282 INFO  (coreLoadExecutor-7092-thread-1) [    x:collection1] o.a.s.s.DirectSolrSpellChecker init: {name=direct,classname=DirectSolrSpellChecker,field=lowerfilt,minQueryLength=3}
   [junit4]   2> 1186315 INFO  (coreLoadExecutor-7092-thread-1) [    x:collection1] o.a.s.h.ReplicationHandler Commits will be reserved for 10000ms.
   [junit4]   2> 1186315 INFO  (coreLoadExecutor-7092-thread-1) [    x:collection1] o.a.s.u.UpdateLog Could not find max version in index or recent updates, using new clock 1633451559763312640
   [junit4]   2> 1186317 INFO  (searcherExecutor-7093-thread-1-processing-x:collection1) [    x:collection1] o.a.s.h.c.SpellCheckComponent Loading spell index for spellchecker: default
   [junit4]   2> 1186317 INFO  (searcherExecutor-7093-thread-1-processing-x:collection1) [    x:collection1] o.a.s.h.c.SpellCheckComponent Loading spell index for spellchecker: direct
   [junit4]   2> 1186318 INFO  (searcherExecutor-7093-thread-1-processing-x:collection1) [    x:collection1] o.a.s.h.c.SpellCheckComponent Loading spell index for spellchecker: wordbreak
   [junit4]   2> 1186318 INFO  (searcherExecutor-7093-thread-1-processing-x:collection1) [    x:collection1] o.a.s.h.c.SpellCheckComponent Loading spell index for spellchecker: multipleFields
   [junit4]   2> 1186318 INFO  (searcherExecutor-7093-thread-1-processing-x:collection1) [    x:collection1] o.a.s.h.c.SpellCheckComponent Loading spell index for spellchecker: jarowinkler
   [junit4]   2> 1186318 INFO  (searcherExecutor-7093-thread-1-processing-x:collection1) [    x:collection1] o.a.s.h.c.SpellCheckComponent Loading spell index for spellchecker: external
   [junit4]   2> 1186319 INFO  (searcherExecutor-7093-thread-1-processing-x:collection1) [    x:collection1] o.a.s.h.c.SpellCheckComponent Loading spell index for spellchecker: freq
   [junit4]   2> 1186319 INFO  (searcherExecutor-7093-thread-1-processing-x:collection1) [    x:collection1] o.a.s.h.c.SpellCheckComponent Loading spell index for spellchecker: fqcn
   [junit4]   2> 1186319 INFO  (searcherExecutor-7093-thread-1-processing-x:collection1) [    x:collection1] o.a.s.h.c.SpellCheckComponent Loading spell index for spellchecker: perDict
   [junit4]   2> 1186321 INFO  (searcherExecutor-7093-thread-1-processing-x:collection1) [    x:collection1] o.a.s.c.SolrCore [collection1] Registered new searcher Searcher@6803ee03[collection1] main{ExitableDirectoryReader(UninvertingDirectoryReader())}
   [junit4]   2> 1186504 INFO  (TEST-TestDistributedStatsComponentCardinality.test-seed#[10B9C8F15AE1699B]) [    ] o.a.s.SolrTestCaseJ4 Writing core.properties file to /x1/jenkins/jenkins-slave/workspace/Lucene-Solr-BadApples-Tests-8.x/solr/build/solr-core/test/J0/temp/solr.handler.component.TestDistributedStatsComponentCardinality_10B9C8F15AE1699B-001/tempDir-001/shard1/cores/collection1
   [junit4]   2> 1186505 WARN  (TEST-TestDistributedStatsComponentCardinality.test-seed#[10B9C8F15AE1699B]) [    ] o.e.j.s.AbstractConnector Ignoring deprecated socket close linger time
   [junit4]   2> 1186506 INFO  (TEST-TestDistributedStatsComponentCardinality.test-seed#[10B9C8F15AE1699B]) [    ] o.a.s.c.s.e.JettySolrRunner Start Jetty (original configured port=0)
   [junit4]   2> 1186506 INFO  (TEST-TestDistributedStatsComponentCardinality.test-seed#[10B9C8F15AE1699B]) [    ] o.a.s.c.s.e.JettySolrRunner Trying to start Jetty on port 0 try number 1 ...
   [junit4]   2> 1186506 INFO  (TEST-TestDistributedStatsComponentCardinality.test-seed#[10B9C8F15AE1699B]) [    ] o.e.j.s.Server jetty-9.4.14.v20181114; built: 2018-11-14T21:20:31.478Z; git: c4550056e785fb5665914545889f21dc136ad9e6; jvm 1.8.0_191-b12
   [junit4]   2> 1186507 INFO  (TEST-TestDistributedStatsComponentCardinality.test-seed#[10B9C8F15AE1699B]) [    ] o.e.j.s.session DefaultSessionIdManager workerName=node0
   [junit4]   2> 1186507 INFO  (TEST-TestDistributedStatsComponentCardinality.test-seed#[10B9C8F15AE1699B]) [    ] o.e.j.s.session No SessionScavenger set, using defaults
   [junit4]   2> 1186507 INFO  (TEST-TestDistributedStatsComponentCardinality.test-seed#[10B9C8F15AE1699B]) [    ] o.e.j.s.session node0 Scavenging every 660000ms
   [junit4]   2> 1186508 INFO  (TEST-TestDistributedStatsComponentCardinality.test-seed#[10B9C8F15AE1699B]) [    ] o.e.j.s.h.ContextHandler Started o.e.j.s.ServletContextHandler@422f46a6{/_uil/he,null,AVAILABLE}
   [junit4]   2> 1186508 INFO  (TEST-TestDistributedStatsComponentCardinality.test-seed#[10B9C8F15AE1699B]) [    ] o.e.j.s.AbstractConnector Started ServerConnector@68967e3c{HTTP/1.1,[http/1.1, h2c]}{127.0.0.1:45791}
   [junit4]   2> 1186508 INFO  (TEST-TestDistributedStatsComponentCardinality.test-seed#[10B9C8F15AE1699B]) [    ] o.e.j.s.Server Started @1186583ms
   [junit4]   2> 1186508 INFO  (TEST-TestDistributedStatsComponentCardinality.test-seed#[10B9C8F15AE1699B]) [    ] o.a.s.c.s.e.JettySolrRunner Jetty properties: {hostContext=/_uil/he, hostPort=45791, coreRootDirectory=/x1/jenkins/jenkins-slave/workspace/Lucene-Solr-BadApples-Tests-8.x/solr/build/solr-core/test/J0/temp/solr.handler.component.TestDistributedStatsComponentCardinality_10B9C8F15AE1699B-001/tempDir-001/shard1/cores}
   [junit4]   2> 1186509 ERROR (TEST-TestDistributedStatsComponentCardinality.test-seed#[10B9C8F15AE1699B]) [    ] o.a.s.u.StartupLoggingUtils Missing Java Option solr.log.dir. Logging may be missing or incomplete.
   [junit4]   2> 1186509 INFO  (TEST-TestDistributedStatsComponentCardinality.test-seed#[10B9C8F15AE1699B]) [    ] o.a.s.s.SolrDispatchFilter Using logger factory org.apache.logging.slf4j.Log4jLoggerFactory
   [junit4]   2> 1186509 INFO  (TEST-TestDistributedStatsComponentCardinality.test-seed#[10B9C8F15AE1699B]) [    ] o.a.s.s.SolrDispatchFilter  ___      _       Welcome to Apache Solr? version 8.2.0
   [junit4]   2> 1186509 INFO  (TEST-TestDistributedStatsComponentCardinality.test-seed#[10B9C8F15AE1699B]) [    ] o.a.s.s.SolrDispatchFilter / __| ___| |_ _   Starting in standalone mode on port null
   [junit4]   2> 1186509 INFO  (TEST-TestDistributedStatsComponentCardinality.test-seed#[10B9C8F15AE1699B]) [    ] o.a.s.s.SolrDispatchFilter \__ \/ _ \ | '_|  Install dir: null
   [junit4]   2> 1186509 INFO  (TEST-TestDistributedStatsComponentCardinality.test-seed#[10B9C8F15AE1699B]) [    ] o.a.s.s.SolrDispatchFilter |___/\___/_|_|    Start time: 2019-05-13T20:53:19.834Z
   [junit4]   2> 1186509 INFO  (TEST-TestDistributedStatsComponentCardinality.test-seed#[10B9C8F15AE1699B]) [    ] o.a.s.c.SolrXmlConfig Loading container configuration from /x1/jenkins/jenkins-slave/workspace/Lucene-Solr-BadApples-Tests-8.x/solr/build/solr-core/test/J0/temp/solr.handler.component.TestDistributedStatsComponentCardinality_10B9C8F15AE1699B-001/tempDir-001/shard1/solr.xml
   [junit4]   2> 1186514 INFO  (TEST-TestDistributedStatsComponentCardinality.test-seed#[10B9C8F15AE1699B]) [    ] o.a.s.c.SolrXmlConfig Configuration parameter autoReplicaFailoverWorkLoopDelay is ignored
   [junit4]   2> 1186514 INFO  (TEST-TestDistributedStatsComponentCardinality.test-seed#[10B9C8F15AE1699B]) [    ] o.a.s.c.SolrXmlConfig Configuration parameter autoReplicaFailoverBadNodeExpiration is ignored
   [junit4]   2> 1186516 INFO  (TEST-TestDistributedStatsComponentCardinality.test-seed#[10B9C8F15AE1699B]) [    ] o.a.s.c.SolrXmlConfig MBean server found: com.sun.jmx.mbeanserver.JmxMBeanServer@18f1ee62, but no JMX reporters were configured - adding default JMX reporter.
   [junit4]   2> 1186648 INFO  (TEST-TestDistributedStatsComponentCardinality.test-seed#[10B9C8F15AE1699B]) [    ] o.a.s.h.c.HttpShardHandlerFactory Host whitelist initialized: WhitelistHostChecker [whitelistHosts=null, whitelistHostCheckingEnabled=false]
   [junit4]   2> 1186650 WARN  (TEST-TestDistributedStatsComponentCardinality.test-seed#[10B9C8F15AE1699B]) [    ] o.e.j.u.s.S.config No Client EndPointIdentificationAlgorithm configured for SslContextFactory@73f3dc75[provider=null,keyStore=null,trustStore=null]
   [junit4]   2> 1186654 WARN  (TEST-TestDistributedStatsComponentCardinality.test-seed#[10B9C8F15AE1699B]) [    ] o.e.j.u.s.S.config No Client EndPointIdentificationAlgorithm configured for SslContextFactory@4987c6f9[provider=null,keyStore=null,trustStore=null]
   [junit4]   2> 1186682 INFO  (TEST-TestDistributedStatsComponentCardinality.test-seed#[10B9C8F15AE1699B]) [    ] o.a.s.c.TransientSolrCoreCacheDefault Allocating transient cache for 4 transient cores
   [junit4]   2> 1186682 INFO  (TEST-TestDistributedStatsComponentCardinality.test-seed#[10B9C8F15AE1699B]) [    ] o.a.s.h.a.MetricsHistoryHandler No .system collection, keeping metrics history in memory.
   [junit4]   2> 1186712 INFO  (TEST-TestDistributedStatsComponentCardinality.test-seed#[10B9C8F15AE1699B]) [    ] o.a.s.m.r.SolrJmxReporter JMX monitoring for 'solr.node' (registry 'solr.node') enabled at server: com.sun.jmx.mbeanserver.JmxMBeanServer@18f1ee62
   [junit4]   2> 1186731 INFO  (TEST-TestDistributedStatsComponentCardinality.test-seed#[10B9C8F15AE1699B]) [    ] o.a.s.m.r.SolrJmxReporter JMX monitoring for 'solr.jvm' (registry 'solr.jvm') enabled at server: com.sun.jmx.mbeanserver.JmxMBeanServer@18f1ee62
   [junit4]   2> 1186731 INFO  (TEST-TestDistributedStatsComponentCardinality.test-seed#[10B9C8F15AE1699B]) [    ] o.a.s.m.r.SolrJmxReporter JMX monitoring for 'solr.jetty' (registry 'solr.jetty') enabled at server: com.sun.jmx.mbeanserver.JmxMBeanServer@18f1ee62
   [junit4]   2> 1186734 INFO  (TEST-TestDistributedStatsComponentCardinality.test-seed#[10B9C8F15AE1699B]) [    ] o.a.s.c.CorePropertiesLocator Found 1 core definitions underneath /x1/jenkins/jenkins-slave/workspace/Lucene-Solr-BadApples-Tests-8.x/solr/build/solr-core/test/J0/temp/solr.handler.component.TestDistributedStatsComponentCardinality_10B9C8F15AE1699B-001/tempDir-001/shard1/cores
   [junit4]   2> 1186734 INFO  (TEST-TestDistributedStatsComponentCardinality.test-seed#[10B9C8F15AE1699B]) [    ] o.a.s.c.CorePropertiesLocator Cores are: [collection1]
   [junit4]   2> 1186735 INFO  (coreLoadExecutor-7106-thread-1) [    x:collection1] o.a.s.c.SolrResourceLoader [null] Added 2 libs to classloader, from paths: [/x1/jenkins/jenkins-slave/workspace/Lucene-Solr-BadApples-Tests-8.x/solr/core/src/test-files/solr/collection1/lib, /x1/jenkins/jenkins-slave/workspace/Lucene-Solr-BadApples-Tests-8.x/solr/core/src/test-files/solr/collection1/lib/classes]
   [junit4]   2> 1186770 INFO  (coreLoadExecutor-7106-thread-1) [    x:collection1] o.a.s.c.SolrConfig Using Lucene MatchVersion: 8.2.0
   [junit4]   2> 1186809 INFO  (coreLoadExecutor-7106-thread-1) [    x:collection1] o.a.s.s.IndexSchema [collection1] Schema name=test
   [junit4]   2> 1186936 INFO  (coreLoadExecutor-7106-thread-1) [    x:collection1] o.a.s.s.IndexSchema Loaded schema test/1.0 with uniqueid field id
   [junit4]   2> 1186946 INFO  (coreLoadExecutor-7106-thread-1) [    x:collection1] o.a.s.c.CoreContainer Creating SolrCore 'collection1' using configuration from configset /x1/jenkins/jenkins-slave/workspace/Lucene-Solr-BadApples-Tests-8.x/solr/core/src/test-files/solr/collection1, trusted=true
   [junit4]   2> 1186946 INFO  (coreLoadExecutor-7106-thread-1) [    x:collection1] o.a.s.m.r.SolrJmxReporter JMX monitoring for 'solr.core.collection1' (registry 'solr.core.collection1') enabled at server: com.sun.jmx.mbeanserver.JmxMBeanServer@18f1ee62
   [junit4]   2> 1186946 INFO  (coreLoadExecutor-7106-thread-1) [    x:collection1] o.a.s.c.SolrCore [[collection1] ] Opening new SolrCore at [/x1/jenkins/jenkins-slave/workspace/Lucene-Solr-BadApples-Tests-8.x/solr/core/src/test-files/solr/collection1], dataDir=[/x1/jenkins/jenkins-slave/workspace/Lucene-Solr-BadApples-Tests-8.x/solr/build/solr-core/test/J0/temp/solr.handler.component.TestDistributedStatsComponentCardinality_10B9C8F15AE1699B-001/tempDir-001/shard1/cores/collection1/data/]
   [junit4]   2> 1186948 INFO  (coreLoadExecutor-7106-thread-1) [    x:collection1] o.a.s.u.RandomMergePolicy RandomMergePolicy wrapping class org.apache.lucene.index.LogDocMergePolicy: [LogDocMergePolicy: minMergeSize=1000, mergeFactor=15, maxMergeSize=9223372036854775807, maxMergeSizeForForcedMerge=9223372036854775807, calibrateSizeByDeletes=false, maxMergeDocs=2147483647, maxCFSSegmentSizeMB=8.796093022207999E12, noCFSRatio=0.19881999681685808]
   [junit4]   2> 1187037 INFO  (coreLoadExecutor-7106-thread-1) [    x:collection1] o.a.s.u.UpdateHandler Using UpdateLog implementation: org.apache.solr.update.UpdateLog
   [junit4]   2> 1187037 INFO  (coreLoadExecutor-7106-thread-1) [    x:collection1] o.a.s.u.UpdateLog Initializing UpdateLog: dataDir= defaultSyncLevel=FLUSH numRecordsToKeep=100 maxNumLogsToKeep=10 numVersionBuckets=65536
   [junit4]   2> 1187039 INFO  (coreLoadExecutor-7106-thread-1) [    x:collection1] o.a.s.u.CommitTracker Hard AutoCommit: disabled
   [junit4]   2> 1187039 INFO  (coreLoadExecutor-7106-thread-1) [    x:collection1] o.a.s.u.CommitTracker Soft AutoCommit: disabled
   [junit4]   2> 1187040 INFO  (coreLoadExecutor-7106-thread-1) [    x:collection1] o.a.s.u.RandomMergePolicy RandomMergePolicy wrapping class org.apache.lucene.index.TieredMergePolicy: [TieredMergePolicy: maxMergeAtOnce=33, maxMergeAtOnceExplicit=23, maxMergedSegmentMB=87.576171875, floorSegmentMB=2.0966796875, forceMergeDeletesPctAllowed=22.89310348920088, segmentsPerTier=36.0, maxCFSSegmentSizeMB=8.796093022207999E12, noCFSRatio=1.0, deletesPctAllowed=20.041499036871762
   [junit4]   2> 1187041 INFO  (coreLoadExecutor-7106-thread-1) [    x:collection1] o.a.s.s.SolrIndexSearcher Opening [Searcher@63371537[collection1] main]
   [junit4]   2> 1187042 INFO  (coreLoadExecutor-7106-thread-1) [    x:collection1] o.a.s.h.c.SpellCheckComponent Initializing spell checkers
   [junit4]   2> 1187051 INFO  (coreLoadExecutor-7106-thread-1) [    x:collection1] o.a.s.s.DirectSolrSpellChecker init: {name=direct,classname=DirectSolrSpellChecker,field=lowerfilt,minQueryLength=3}
   [junit4]   2> 1187094 INFO  (coreLoadExecutor-7106-thread-1) [    x:collection1] o.a.s.h.ReplicationHandler Commits will be reserved for 10000ms.
   [junit4]   2> 1187094 INFO  (coreLoadExecutor-7106-thread-1) [    x:collection1] o.a.s.u.UpdateLog Could not find max version in index or recent updates, using new clock 1633451560580153344
   [junit4]   2> 1187096 INFO  (searcherExecutor-7107-thread-1-processing-x:collection1) [    x:collection1] o.a.s.h.c.SpellCheckComponent Loading spell index for spellchecker: default
   [junit4]   2> 1187098 INFO  (searcherExecutor-7107-thread-1-processing-x:collection1) [    x:collection1] o.a.s.h.c.SpellCheckComponent Loading spell index for spellchecker: direct
   [junit4]   2> 1187098 INFO  (searcherExecutor-7107-thread-1-processing-x:collection1) [    x:collection1] o.a.s.h.c.SpellCheckComponent Loading spell index for spellchecker: wordbreak
   [junit4]   2> 1187098 INFO  (searcherExecutor-7107-thread-1-processing-x:collection1) [    x:collection1] o.a.s.h.c.SpellCheckComponent Loading spell index for spellchecker: multipleFields
   [junit4]   2> 1187103 INFO  (searcherExecutor-7107-thread-1-processing-x:collection1) [    x:collection1] o.a.s.h.c.SpellCheckComponent Loading spell index for spellchecker: jarowinkler
   [junit4]   2> 1187104 INFO  (searcherExecutor-7107-thread-1-processing-x:collection1) [    x:collection1] o.a.s.h.c.SpellCheckComponent Loading spell index for spellchecker: external
   [junit4]   2> 1187104 INFO  (searcherExecutor-7107-thread-1-processing-x:collection1) [    x:collection1] o.a.s.h.c.SpellCheckComponent Loading spell index for spellchecker: freq
   [junit4]   2> 1187104 INFO  (searcherExecutor-7107-thread-1-processing-x:collection1) [    x:collection1] o.a.s.h.c.SpellCheckComponent Loading spell index for spellchecker: fqcn
   [junit4]   2> 1187105 INFO  (searcherExecutor-7107-thread-1-processing-x:collection1) [    x:collection1] o.a.s.h.c.SpellCheckComponent Loading spell index for spellchecker: perDict
   [junit4]   2> 1187106 INFO  (searcherExecutor-7107-thread-1-processing-x:collection1) [    x:collection1] o.a.s.c.SolrCore [collection1] Registered new searcher Searcher@63371537[collection1] main{ExitableDirectoryReader(UninvertingDirectoryReader())}
   [junit4]   2> 1187306 INFO  (TEST-TestDistributedStatsComponentCardinality.test-seed#[10B9C8F15AE1699B]) [    ] o.a.s.SolrTestCaseJ4 Writing core.properties file to /x1/jenkins/jenkins-slave/workspace/Lucene-Solr-BadApples-Tests-8.x/solr/build/solr-core/test/J0/temp/solr.handler.component.TestDistributedStatsComponentCardinality_10B9C8F15AE1699B-001/tempDir-001/shard2/cores/collection1
   [junit4]   2> 1187313 WARN  (TEST-TestDistributedStatsComponentCardinality.test-seed#[10B9C8F15AE1699B]) [    ] o.e.j.s.AbstractConnector Ignoring deprecated socket close linger time
   [junit4]   2> 1187313 INFO  (TEST-TestDistributedStatsComponentCardinality.test-seed#[10B9C8F15AE1699B]) [    ] o.a.s.c.s.e.JettySolrRunner Start Jetty (original configured port=0)
   [junit4]   2> 1187313 INFO  (TEST-TestDistributedStatsComponentCardinality.test-seed#[10B9C8F15AE1699B]) [    ] o.a.s.c.s.e.JettySolrRunner Trying to start Jetty on port 0 try number 1 ...
   [junit4]   2> 1187313 INFO  (TEST-TestDistributedStatsComponentCardinality.test-seed#[10B9C8F15AE1699B]) [    ] o.e.j.s.Server jetty-9.4.14.v20181114; built: 2018-11-14T21:20:31.478Z; git: c4550056e785fb5665914545889f21dc136ad9e6; jvm 1.8.0_191-b12
   [junit4]   2> 1187315 INFO  (TEST-TestDistributedStatsComponentCardinality.test-seed#[10B9C8F15AE1699B]) [    ] o.e.j.s.session DefaultSessionIdManager workerName=node0
   [junit4]   2> 1187315 INFO  (TEST-TestDistributedStatsComponentCardinality.test-seed#[10B9C8F15AE1699B]) [    ] o.e.j.s.session No SessionScavenger set, using defaults
   [junit4]   2> 1187315 INFO  (TEST-TestDistributedStatsComponentCardinality.test-seed#[10B9C8F15AE1699B]) [    ] o.e.j.s.session node0 Scavenging every 660000ms
   [junit4]   2> 1187315 INFO  (TEST-TestDistributedStatsComponentCardinality.test-seed#[10B9C8F15AE1699B]) [    ] o.e.j.s.h.ContextHandler Started o.e.j.s.ServletContextHandler@5c29f97d{/_uil/he,null,AVAILABLE}
   [junit4]   2> 1187316 INFO  (TEST-TestDistributedStatsComponentCardinality.test-seed#[10B9C8F15AE1699B]) [    ] o.e.j.s.AbstractConnector Started ServerConnector@146d11cf{HTTP/1.1,[http/1.1, h2c]}{127.0.0.1:34398}
   [junit4]   2> 1187316 INFO  (TEST-TestDistributedStatsComponentCardinality.test-seed#[10B9C8F15AE1699B]) [    ] o.e.j.s.Server Started @1187391ms
   [junit4]   2> 1187316 INFO  (TEST-TestDistributedStatsComponentCardinality.test-seed#[10B9C8F15AE1699B]) [    ] o.a.s.c.s.e.JettySolrRunner Jetty properties: {hostContext=/_uil/he, hostPort=34398, coreRootDirectory=/x1/jenkins/jenkins-slave/workspace/Lucene-Solr-BadApples-Tests-8.x/solr/build/solr-core/test/J0/temp/solr.handler.component.TestDistributedStatsComponentCardinality_10B9C8F15AE1699B-001/tempDir-001/shard2/cores}
   [junit4]   2> 1187316 ERROR (TEST-TestDistributedStatsComponentCardinality.test-seed#[10B9C8F15AE1699B]) [    ] o.a.s.u.StartupLoggingUtils Missing Java Option solr.log.dir. Logging may be missing or incomplete.
   [junit4]   2> 1187316 INFO  (TEST-TestDistributedStatsComponentCardinality.test-seed#[10B9C8F15AE1699B]) [    ] o.a.s.s.SolrDispatchFilter Using logger factory org.apache.logging.slf4j.Log4jLoggerFactory
   [junit4]   2> 1187316 INFO  (TEST-TestDistributedStatsComponentCardinality.test-seed#[10B9C8F15AE1699B]) [    ] o.a.s.s.SolrDispatchFilter  ___      _       Welcome to Apache Solr? version 8.2.0
   [junit4]   2> 1187316 INFO  (TEST-TestDistributedStatsComponentCardinality.test-seed#[10B9C8F15AE1699B]) [    ] o.a.s.s.SolrDispatchFilter / __| ___| |_ _   Starting in standalone mode on port null
   [junit4]   2> 1187316 INFO  (TEST-TestDistributedStatsComponentCardinality.test-seed#[10B9C8F15AE1699B]) [    ] o.a.s.s.SolrDispatchFilter \__ \/ _ \ | '_|  Install dir: null
   [junit4]   2> 1187316 INFO  (TEST-TestDistributedStatsComponentCardinality.test-seed#[10B9C8F15AE1699B]) [    ] o.a.s.s.SolrDispatchFilter |___/\___/_|_|    Start time: 2019-05-13T20:53:20.641Z
   [junit4]   2> 1187317 INFO  (TEST-TestDistributedStatsComponentCardinality.test-seed#[10B9C8F15AE1699B]) [    ] o.a.s.c.SolrXmlConfig Loading container configuration from /x1/jenkins/jenkins-slave/workspace/Lucene-Solr-BadApples-Tests-8.x/solr/build/solr-core/test/J0/temp/solr.handler.component.TestDistributedStatsComponentCardinality_10B9C8F15AE1699B-001/tempDir-001/shard2/solr.xml
   [junit4]   2> 1187321 INFO  (TEST-TestDistributedStatsComponentCardinality.test-seed#[10B9C8F15AE1699B]) [    ] o.a.s.c.SolrXmlConfig Configuration parameter autoReplicaFailoverWorkLoopDelay is ignored
   [junit4]   2> 1187321 INFO  (TEST-TestDistributedStatsComponentCardinality.test-seed#[10B9C8F15AE1699B]) [    ] o.a.s.c.SolrXmlConfig Configuration parameter autoReplicaFailoverBadNodeExpiration is ignored
   [junit4]   2> 1187323 INFO  (TEST-TestDistributedStatsComponentCardinality.test-seed#[10B9C8F15AE1699B]) [    ] o.a.s.c.SolrXmlConfig MBean server found: com.sun.jmx.mbeanserver.JmxMBeanServer@18f1ee62, but no JMX reporters were configured - adding default JMX reporter.
   [junit4]   2> 1187387 INFO  (TEST-TestDistributedStatsComponentCardinality.test-seed#[10B9C8F15AE1699B]) [    ] o.a.s.h.c.HttpShardHandlerFactory Host whitelist initialized: WhitelistHostChecker [whitelistHosts=null, whitelistHostCheckingEnabled=false]
   [junit4]   2> 1187389 WARN  (TEST-TestDistributedStatsComponentCardinality.test-seed#[10B9C8F15AE1699B]) [    ] o.e.j.u.s.S.config No Client EndPointIdentificationAlgorithm configured for SslContextFactory@47b90340[provider=null,keyStore=null,trustStore=null]
   [junit4]   2> 1187394 WARN  (TEST-TestDistributedStatsComponentCardinality.test-seed#[10B9C8F15AE1699B]) [    ] o.e.j.u.s.S.config No Client EndPointIdentificationAlgorithm configured for SslContextFactory@1cf1554f[provider=null,keyStore=null,trustStore=null]
   [junit4]   2> 1187421 INFO  (TEST-TestDistributedStatsComponentCardinality.test-seed#[10B9C8F15AE1699B]) [    ] o.a.s.c.TransientSolrCoreCacheDefault Allocating transient cache for 4 transient cores
   [junit4]   2> 1187421 INFO  (TEST-TestDistributedStatsComponentCardinality.test-seed#[10B9C8F15AE1699B]) [    ] o.a.s.h.a.MetricsHistoryHandler No .system collection, keeping metrics history in memory.
   [junit4]   2> 1187452 INFO  (TEST-TestDistributedStatsComponentCardinality.test-seed#[10B9C8F15AE1699B]) [    ] o.a.s.m.r.SolrJmxReporter JMX monitoring for 'solr.node' (registry 'solr.node') enabled at server: com.sun.jmx.mbeanserver.JmxMBeanServer@18f1ee62
   [junit4]   2> 1187472 INFO  (TEST-TestDistributedStatsComponentCardinality.test-seed#[10B9C8F15AE1699B]) [    ] o.a.s.m.r.SolrJmxReporter JMX monitoring for 'solr.jvm' (registry 'solr.jvm') enabled at server: com.sun.jmx.mbeanserver.JmxMBeanServer@18f1ee62
   [junit4]   2> 1187472 INFO  (TEST-TestDistributedStatsComponentCardinality.test-seed#[10B9C8F15AE1699B]) [    ] o.a.s.m.r.SolrJmxReporter JMX monitoring for 'solr.jetty' (registry 'solr.jetty') enabled at server: com.sun.jmx.mbeanserver.JmxMBeanServer@18f1ee62
   [junit4]   2> 1187475 INFO  (TEST-TestDistributedStatsComponentCardinality.test-seed#[10B9C8F15AE1699B]) [    ] o.a.s.c.CorePropertiesLocator Found 1 core definitions underneath /x1/jenkins/jenkins-slave/workspace/Lucene-Solr-BadApples-Tests-8.x/solr/build/solr-core/test/J0/temp/solr.handler.component.TestDistributedStatsComponentCardinality_10B9C8F15AE1699B-001/tempDir-001/shard2/cores
   [junit4]   2> 1187475 INFO  (TEST-TestDistributedStatsComponentCardinality.test-seed#[10B9C8F15AE1699B]) [    ] o.a.s.c.CorePropertiesLocator Cores are: [collection1]
   [junit4]   2> 1187477 INFO  (coreLoadExecutor-7120-thread-1) [    x:collection1] o.a.s.c.SolrResourceLoader [null] Added 2 libs to classloader, from paths: [/x1/jenkins/jenkins-slave/workspace/Lucene-Solr-BadApples-Tests-8.x/solr/core/src/test-files/solr/collection1/lib, /x1/jenkins/jenkins-slave/workspace/Lucene-Solr-BadApples-Tests-8.x/solr/core/src/test-files/solr/collection1/lib/classes]
   [junit4]   2> 1187524 INFO  (coreLoadExecutor-7120-thread-1) [    x:collection1] o.a.s.c.SolrConfig Using Lucene MatchVersion: 8.2.0
   [junit4]   2> 1187558 INFO  (coreLoadExecutor-7120-thread-1) [    x:collection1] o.a.s.s.IndexSchema [collection1] Schema name=test
   [junit4]   2> 1187677 INFO  (coreLoadExecutor-7120-thread-1) [    x:collection1] o.a.s.s.IndexSchema Loaded schema test/1.0 with uniqueid field id
   [junit4]   2> 1187686 INFO  (coreLoadExecutor-7120-thread-1) [    x:collection1] o.a.s.c.CoreContainer Creating SolrCore 'collection1' using configuration from configset /x1/jenkins/jenkins-slave/workspace/Lucene-Solr-BadApples-Tests-8.x/solr/core/src/test-files/solr/collection1, trusted=true
   [junit4]   2> 1187686 INFO  (coreLoadExecutor-7120-thread-1) [    x:collection1] o.a.s.m.r.SolrJmxReporter JMX monitoring for 'solr.core.collection1' (registry 'solr.core.collection1') enabled at server: com.sun.jmx.mbeanserver.JmxMBeanServer@18f1ee62
   [junit4]   2> 1187687 INFO  (coreLoadExecutor-7120-thread-1) [    x:collection1] o.a.s.c.SolrCore [[collection1] ] Opening new SolrCore at [/x1/jenkins/jenkins-slave/workspace/Lucene-Solr-BadApples-Tests-8.x/solr/core/src/test-files/solr/collection1], dataDir=[/x1/jenkins/jenkins-slave/workspace/Lucene-Solr-BadApples-Tests-8.x/solr/build/solr-core/test/J0/temp/solr.handler.component.TestDistributedStatsComponentCardinality_10B9C8F15AE1699B-001/tempDir-001/shard2/cores/collection1/data/]
   [junit4]   2> 1187689 INFO  (coreLoadExecutor-7120-thread-1) [    x:collection1] o.a.s.u.RandomMergePolicy RandomMergePolicy wrapping class org.apache.lucene.index.LogDocMergePolicy: [LogDocMergePolicy: minMergeSize=1000, mergeFactor=15, maxMergeSize=9223372036854775807, maxMergeSizeForForcedMerge=9223372036854775807, calibrateSizeByDeletes=false, maxMergeDocs=2147483647, maxCFSSegmentSizeMB=8.796093022207999E12, noCFSRatio=0.19881999681685808]
   [junit4]   2> 1187771 INFO  (coreLoadExecutor-7120-thread-1) [    x:collection1] o.a.s.u.UpdateHandler Using UpdateLog implementation: org.apache.solr.update.UpdateLog
   [junit4]   2> 1187771 INFO  (coreLoadExecutor-7120-thread-1) [    x:collection1] o.a.s.u.UpdateLog Initializing UpdateLog: dataDir= defaultSyncLevel=FLUSH numRecordsToKeep=100 maxNumLogsToKeep=10 numVersionBuckets=65536
   [junit4]   2> 1187773 INFO  (coreLoadExecutor-7120-thread-1) [    x:collection1] o.a.s.u.CommitTracker Hard AutoCommit: disabled
   [junit4]   2> 1187773 INFO  (coreLoadExecutor-7120-thread-1) [    x:collection1] o.a.s.u.CommitTracker Soft AutoCommit: disabled
   [junit4]   2> 1187775 INFO  (coreLoadExecutor-7120-thread-1) [    x:collection1] o.a.s.u.RandomMergePolicy RandomMergePolicy wrapping class org.apache.lucene.index.TieredMergePolicy: [TieredMergePolicy: maxMergeAtOnce=33, maxMergeAtOnceExplicit=23, maxMergedSegmentMB=87.576171875, floorSegmentMB=2.0966796875, forceMergeDeletesPctAllowed=22.89310348920088, segmentsPerTier=36.0, maxCFSSegmentSizeMB=8.796093022207999E12, noCFSRatio=1.0, deletesPctAllowed=20.041499036871762
   [junit4]   2> 1187775 INFO  (coreLoadExecutor-7120-thread-1) [    x:collection1] o.a.s.s.SolrIndexSearcher Opening [Searcher@499d4ea5[collection1] main]
   [junit4]   2> 1187776 INFO  (coreLoadExecutor-7120-thread-1) [    x:collection1] o.a.s.h.c.SpellCheckComponent Initializing spell checkers
   [junit4]   2> 1187786 INFO  (coreLoadExecutor-7120-thread-1) [    x:collection1] o.a.s.s.DirectSolrSpellChecker init: {name=direct,classname=DirectSolrSpellChecker,field=lowerfilt,minQueryLength=3}
   [junit4]   2> 1187820 INFO  (coreLoadExecutor-7120-thread-1) [    x:collection1] o.a.s.h.ReplicationHandler Commits will be reserved for 10000ms.
   [junit4]   2> 1187821 INFO  (coreLoadExecutor-7120-thread-1) [    x:collection1] o.a.s.u.UpdateLog Could not find max version in index or recent updates, using new clock 1633451561342468096
   [junit4]   2> 1187823 INFO  (searcherExecutor-7121-thread-1-processing-x:collection1) [    x:collection1] o.a.s.h.c.SpellCheckComponent Loading spell index for spellchecker: default
   [junit4]   2> 1187823 INFO  (searcherExecutor-7121-thread-1-processing-x:collection1) [    x:collection1] o.a.s.h.c.SpellCheckComponent Loading spell index for spellchecker: direct
   [junit4]   2> 1187823 INFO  (searcherExecutor-7121-thread-1-processing-x:collection1) [    x:collection1] o.a.s.h.c.SpellCheckComponent Loading spell index for spellchecker: wordbreak
   [junit4]   2> 1187823 INFO  (searcherExecutor-7121-thread-1-processing-x:collection1) [    x:collection1] o.a.s.h.c.SpellCheckComponent Loading spell index for spellchecker: multipleFields
   [junit4]   2> 1187824 INFO  (searcherExecutor-7121-thread-1-processing-x:collection1) [    x:collection1] o.a.s.h.c.SpellCheckComponent Loading spell index for spellchecker: jarowinkler
   [junit4]   2> 1187824 INFO  (searcherExecutor-7121-thread-1-processing-x:collection1) [    x:collection1] o.a.s.h.c.SpellCheckComponent Loading spell index for spellchecker: external
   [junit4]   2> 1187825 INFO  (searcherExecutor-7121-thread-1-processing-x:collection1) [    x:collection1] o.a.s.h.c.SpellCheckComponent Loading spell index for spellchecker: freq
   [junit4]   2> 1187825 INFO  (searcherExecutor-7121-thread-1-processing-x:collection1) [    x:collection1] o.a.s.h.c.SpellCheckComponent Loading spell index for spellchecker: fqcn
   [junit4]   2> 1187825 INFO  (searcherExecutor-7121-thread-1-processing-x:collection1) [    x:collection1] o.a.s.h.c.SpellCheckComponent Loading spell index for spellchecker: perDict
   [junit4]   2> 1187827 INFO  (searcherExecutor-7121-thread-1-processing-x:collection1) [    x:collection1] o.a.s.c.SolrCore [collection1] Registered new searcher Searcher@499d4ea5[collection1] main{ExitableDirectoryReader(UninvertingDirectoryReader())}
   [junit4]   2> 1187827 INFO  (TEST-TestDistributedStatsComponentCardinality.test-seed#[10B9C8F15AE1699B]) [    ] o.a.s.SolrTestCaseJ4 ###Starting test
   [junit4]   2> 1187827 INFO  (TEST-TestDistributedStatsComponentCardinality.test-seed#[10B9C8F15AE1699B]) [    ] o.a.s.h.c.TestDistributedStatsComponentCardinality Building an index of 11291 docs
   [junit4]   2> 1187832 INFO  (qtp454587589-23398) [    x:collection1] o.a.s.u.p.LogUpdateProcessorFactory [collection1]  webapp=/_uil/he path=/update params={wt=javabin&version=2}{add=[1 (1633451561351905280)]} 0 2
   [junit4]   2> 1187835 INFO  (qtp866558426-23419) [    x:collection1] o.a.s.u.p.LogUpdateProcessorFactory [collection1]  webapp=/_uil/he path=/update params={wt=javabin&version=2}{add=[1 (1633451561355051008)]} 0 1
   [junit4]   2> 1187836 INFO  (qtp454587589-23399) [    x:collection1] o.a.s.u.p.LogUpdateProcessorFactory [collection1]  webapp=/_uil/he path=/update params={wt=javabin&version=2}{add=[2 (1633451561358196736)]} 0 0
   [junit4]   2> 1187839 INFO  (qtp601737110-23440) [    x:collection1] o.a.s.u.p.LogUpdateProcessorFactory [collection1]  webapp=/_uil/he path=/update params={wt=javabin&version=2}{add=[2 (1633451561359245312)]} 0 1
   [junit4]   2> 1187840 INFO  (qtp454587589-23400) [    x:collection1] o.a.s.u.p.LogUpdateProcessorFactory [collection1]  webapp=/_uil/he path=/update params={wt=javabin&version=2}{add=[3 (1633451561362391040)]} 0 0
   [junit4]   2> 1187843 INFO  (qtp1139353562-23461) [    x:collection1] o.a.s.u.p.LogUpdateProcessorFactory [collection1]  webapp=/_uil/he path=/update params={wt=javabin&version=2}{add=[3 (1633451561363439616)]} 0 1
   [junit4]   2> 1187844 INFO  (qtp454587589-23401) [    x:collection1] o.a.s.u.p.LogUpdateProcessorFactory [collection1]  webapp=/_uil/he path=/update params={wt=javabin&version=2}{add=[4 (1633451561365536768)]} 0 0
   [junit4]   2> 1187844 INFO  (qtp866558426-23420) [    x:collection1] o.a.s.u.p.LogUpdateProcessorFactory [collection1]  webapp=/_uil/he path=/update params={wt=javabin&version=2}{add=[4 (1633451561366585344)]} 0 0
   [junit4]   2> 1187845 INFO  (qtp454587589-23397) [    x:collection1] o.a.s.u.p.LogUpdateProcessorFactory [collection1]  webapp=/_uil/he path=/update params={wt=javabin&version=2}{add=[5 (1633451561367633920)]} 0 0
   [junit4]   2> 1187846 INFO  (qtp601737110-23441) [    x:collection1] o.a.s.u.p.LogUpdateProcessorFactory [collection1]  webapp=/_uil/he path=/update params={wt=javabin&version=2}{add=[5 (1633451561368682496)]} 0 0
   [junit4]   2> 1187847 INFO  (qtp454587589-23398) [    x:collection1] o.a.s.u.p.LogUpdateProcessorFactory [collection1]  webapp=/_uil/he path=/update params={wt=javabin&version=2}{add=[6 (1633451561369731072)]} 0 0
   [junit4]   2> 1187848 INFO  (qtp1139353562-23462) [    x:collection1] o.a.s.u.p.LogUpdateProcessorFactory [collection1]  webapp=/_uil/he path=/update params={wt=javabin&version=2}{add=[6 (1633451561369731072)]} 0 0
   [junit4]   2> 1187848 INFO  (qtp454587589-23399) [    x:collection1] o.a.s.u.p.LogUpdateProcessorFactory [collection1]  webapp=/_uil/he path=/update params={wt=javabin&version=2}{add=[7 (1633451561370779648)]} 0 0
   [junit4]   2> 1187849 INFO  (qtp866558426-23421) [    x:collection1] o.a.s.u.p.LogUpdateProcessorFactory [collection1]  webapp=/_uil/he path=/update params={wt=javabin&version=2}{add=[7 (1633451561371828224)]} 0 0
   [junit4]   2> 1187850 INFO  (qtp454587589-23400) [    x:collection1] o.a.s.u.p.LogUpdateProcessorFactory [collection1]  webapp=/_uil/he path=/update params={wt=javabin&version=2}{add=[8 (1633451561372876800)]} 0 0
   [junit4]   2> 1187851 INFO  (qtp601737110-23442) [    x:collection1] o.a.s.u.p.LogUpdateProcessorFactory [collection1]  webapp=/_uil/he path=/update params={wt=javabin&version=2}{add=[8 (1633451561373925376)]} 0 0
   [junit4]   2> 1187852 INFO  (qtp454587589-23401) [    x:collection1] o.a.s.u.p.LogUpdateProcessorFactory [collection1]  webapp=/_uil/he path=/update params={wt=javabin&version=2}{add=[9 (1633451561373925376)]} 0 0
   [junit4]   2> 1187852 INFO  (qtp1139353562-23463) [    x:collection1] o.a.s.u.p.LogUpdateProcessorFactory [collection1]  webapp=/_uil/he path=/update params={wt=javabin&version=2}{add=[9 (1633451561374973952)]} 0 0
   [junit4]   2> 1187853 INFO  (qtp454587589-23397) [    x:collection1] o.a.s.u.p.LogUpdateProcessorFactory [collection1]  webapp=/_uil/he path=/update params={wt=javabin&version=2}{add=[10 (1633451561376022528)]} 0 0
   [junit4]   2> 1187854 INFO  (qtp866558426-23422) [    x:collection1] o.a.s.u.p.LogUpdateProcessorFactory [collection1]  webapp=/_uil/he path=/update params={wt=javabin&version=2}{add=[10 (1633451561377071104)]} 0 0
   [junit4]   2> 1187854 INFO  (qtp454587589-23398) [    x:collection1] o.a.s.u.p.LogUpdateProcessorFactory [collection1]  webapp=/_uil/he path=/update params={wt=javabin&version=2}{add=[11 (1633451561377071104)]} 0 0
   [junit4]   2> 1187855 INFO  (qtp601737110-23443) [    x:collection1] o.a.s.u.p.LogUpdateProcessorFactory [collection1]  webapp=/_uil/he path=/update params={wt=javabin&version=2}{add=[11 (1633451561378119680)]} 0 0
   [junit4]   2> 1187856 INFO  (qtp454587589-23399) [    x:collection1] o.a.s.u.p.LogUpdateProcessorFactory [collection1]  webapp=/_uil/he path=/update params={wt=javabin&version=2}{add=[12 (1633451561379168256)]} 0 0
   [junit4]   2> 1187857 INFO  (qtp1139353562-23464) [    x:collection1] o.a.s.u.p.LogUpdateProcessorFactory [collection1]  webapp=/_uil/he path=/update params={wt=javabin&version=2}{add=[12 (1633451561380216832)]} 0 0
   [junit4]   2> 1187858 INFO  (qtp454587589-23400) [    x:collection1] o.a.s.u.p.LogUpdateProcessorFactory [collection1]  webapp=/_uil/he path=/update params={wt=javabin&version=2}{add=[13 (1633451561381265408)]} 0 0
   [junit4]   2> 1187859 INFO  (qtp866558426-23418) [    x:collection1] o.a.s.u.p.LogUpdateProcessorFactory [collection1]  webapp=/_uil/he path=/update params={wt=javabin&version=2}{add=[13 (1633451561381265408)]} 0 0
   [junit4]   2> 1187859 INFO  (qtp454587589-23401) [    x:collection1] o.a.s.u.p.LogUpdateProcessorFactory [collection1]  webapp=/_uil/he path=/update params={wt=javabin&version=2}{add=[14 (1633451561382313984)]} 0 0
   [junit4]   2> 1187860 INFO  (qtp601737110-23439) [    x:collection1] o.a.s.u.p.LogUpdateProcessorFactory [collection1]  webapp=/_uil/he path=/update params={wt=javabin&version=2}{add=[14 (1633451561383362560)]} 0 0
   [junit4]   2> 1187861 INFO  (qtp454587589-23397) [    x:collection1] o.a.s.u.p.LogUpdateProcessorFactory [collection1]  webapp=/_uil/he path=/update params={wt=javabin&version=2}{add=[15 (1633451561384411136)]} 0 0
   [junit4]   2> 1187862 INFO  (qtp1139353562-23460) [    x:collection1] o.a.s.u.p.LogUpdateProcessorFactory [collection1]  webapp=/_uil/he path=/update params={wt=javabin&version=2}{add=[15 (1633451561384411136)]} 0 0
   [junit4]   2> 1187862 INFO  (qtp454587589-23398) [    x:collection1] o.a.s.u.p.LogUpdateProcessorFactory [collection1]  webapp=/_uil/he path=/update params={wt=javabin&version=2}{add=[16 (1633451561385459712)]} 0 0
   [junit4]   2> 1187863 INFO  (qtp866558426-23419) [    x:collection1] o.a.s.u.p.LogUpdateProcessorFactory [collection1]  webapp=/_uil/he path=/update params={wt=javabin&version=2}{add=[16 (1633451561386508288)]} 0 0
   [junit4]   2> 1187866 INFO  (qtp454587589-23399) [    x:collection1] o.a.s.u.p.LogUpdateProcessorFactory [collection1]  webapp=/_uil/he path=/update params={wt=javabin&version=2}{add=[17 (1633451561389654016)]} 0 0
   [junit4]   2> 1187867 INFO  (qtp601737110-23440) [    x:collection1] o.a.s.u.p.LogUpdateProcessorFactory [collection1]  webapp=/_uil/he path=/update params={wt=javabin&version=2}{add=[17 (1633451561389654016)]} 0 0
   [junit4]   2> 1187867 INFO  (qtp454587589-23400) [    x:collection1] o.a.s.u.p.LogUpdateProcessorFactory [collection1]  webapp=/_uil/he path=/update params={wt=javabin&version=2}{add=[18 (1633451561390702592)]} 0 0
   [junit4]   2> 1187868 INFO  (qtp1139353562-23461) [    x:collection1] o.a.s.u.p.LogUpdateProcessorFactory [collection1]  webapp=/_uil/he path=/update params={wt=javabin&version=2}{add=[18 (1633451561391751168)]} 0 0
   [junit4]   2> 1187869 INFO  (qtp454587589-23401) [    x:collection1] o.a.s.u.p.LogUpdateProcessorFactory [collection1]  webapp=/_uil/he path=/update params={wt=javabin&version=2}{add=[19 (1633451561392799744)]} 0 0
   [junit4]   2> 1187869 INFO  (qtp866558426-23420) [    x:collection1] o.a.s.u.p.LogUpdateProcessorFactory [collection1]  webapp=/_uil/he path=/update params={wt=javabin&version=2}{add=[19 (1633451561392799744)]} 0 0
   [junit4]   2> 1187870 INFO  (qtp454587589-23397) [    x:collection1] o.a.s.u.p.LogUpdateProcessorFactory [collection1]  webapp=/_uil/he path=/update params={wt=javabin&version=2}{add=[20 (1633451561393848320)]} 0 0
   [junit4]   2> 1187871 INFO  (qtp601737110-23441) [    x:collection1] o.a.s.u.p.LogUpdateProcessorFactory [collection1]  webapp=/_uil/he path=/update params={wt=javabin&version=2}{add=[20 (1633451561394896896)]} 0 0
   [junit4]   2> 1187872 INFO  (qtp454587589-23398) [    x:collection1] o.a.s.u.p.LogUpdateProcessorFactory [collection1]  webapp=/_uil/he path=/update params={wt=javabin&version=2}{add=[21 (1633451561394896896)]} 0 0
   [junit4]   2> 1187872 INFO  (qtp1139353562-23462) [    x:collection1] o.a.s.u.p.LogUpdateProcessorFactory [collection1]  webapp=/_uil/he path=/update params={wt=javabin&version=2}{add=[21 (1633451561395945472)]} 0 0
   [junit4]   2> 1187873 INFO  (qtp454587589-23399) [    x:collection1] o.a.s.u.p.LogUpdateProcessorFactory [collection1]  webapp=/_uil/he path=/update params={wt=javabin&version=2}{add=[22 (1633451561396994048)]} 0 0
   [junit4]   2> 1187874 INFO  (qtp866558426-23421) [    x:collection1] o.a.s.u.p.LogUpdateProcessorFactory [collection1]  webapp=/_uil/he path=/update params={wt=javabin&version=2}{add=[22 (1633451561396994048)]} 0 0
   [junit4]   2> 1187874 INFO  (qtp454587589-23400) [    x:collection1] o.a.s.u.p.LogUpdateProcessorFactory [collection1]  webapp=/_uil/he path=/update params={wt=javabin&version=2}{add=[23 (1633451561398042624)]} 0 0
   [junit4]   2> 1187875 INFO  (qtp601737110-23442) [    x:collection1] o.a.s.u.p.LogUpdateProcessorFactory [collection1]  webapp=/_uil/he path=/update params={wt=javabin&version=2}{add=[23 (1633451561399091200)]} 0 0
   [junit4]   2> 1187876 INFO  (qtp454587589-23401) [    x:collection1] o.a.s.u.p.LogUpdateProcessorFactory [collection1]  webapp=/_uil/he path=/update params={wt=javabin&version=2}{add=[24 (1633451561400139776)]} 0 0
   [junit4]   2> 1187876 INFO  (qtp1139353562-23463) [    x:collection1] o.a.s.u.p.LogUpdateProcessorFactory [collection1]  webapp=/_uil/he path=/update params={wt=javabin&version=2}{add=[24 (1633451561400139776)]} 0 0
   [junit4]   2> 1187877 INFO  (qtp454587589-23397) [    x:collection1] o.a.s.u.p.LogUpdateProcessorFactory [collection1]  webapp=/_uil/he path=/update params={wt=javabin&version=2}{add=[25 (1633451561401188352)]} 0 0
   [junit4]   2> 1187878 INFO  (qtp866558426-23422) [    x:collection1] o.a.s.u.p.LogUpdateProcessorFactory [collection1]  webapp=/_uil/he path=/update params={wt=javabin&version=2}{add=[25 (1633451561402236928)]} 0 0
   [junit4]   2> 1187878 INFO  (qtp454587589-23398) [    x:collection1] o.a.s.u.p.LogUpdateProcessorFactory [collection1]  webapp=/_uil/he path=/update params={wt=javabin&version=2}{add=[26 (1633451561402236928)]} 0 0
   [junit4]   2> 1187879 INFO  (qtp601737110-23443) [    x:collection1] o.a.s.u.p.LogUpdateProcessorFactory [collection1]  webapp=/_uil/he path=/update params={wt=javabin&version=2}{add=[26 (1633451561403285504)]} 0 0
   [junit4]   2> 1187880 INFO  (qtp454587589-23399) [    x:collection1] o.a.s.u.p.LogUpdateProcessorFactory [collection1]  webapp=/_uil/he path=/update params={wt=javabin&version=2}{add=[27 (1633451561404334080)]} 0 0
   [junit4]   2> 1187881 INFO  (qtp1139353562-23464) [    x:collection1] o.a.s.u.p.LogUpdateProcessorFactory [collection1]  webapp=/_uil/he path=/update params={wt=javabin&version=2}{add=[27 (1633451561404334080)]} 0 0
   [junit4]   2> 1187881 INFO  (qtp454587589-23400) [    x:collection1] o.a.s.u.p.LogUpdateProcessorFactory [collection1]  webapp=/_uil/he path=/update params={wt=javabin&version=2}{add=[28 (1633451561405382656)]} 0 0
   [junit4]   2> 1187882 INFO  (qtp866558426-23418) [    x:collection1] o.a.s.u.p.LogUpdateProcessorFactory [collection1]  webapp=/_uil/he path=/update params={wt=javabin&version=2}{add=[28 (1633451561406431232)]} 0 0
   [junit4]   2> 1187883 INFO  (qtp454587589-23401) [    x:collection1] o.a.s.u.p.LogUpdateProcessorFactory [collection1]  webapp=/_uil/he path=/update params={wt=javabin&version=2}{add=[29 (1633451561406431232)]} 0 0
   [junit4]   2> 1187883 INFO  (qtp601737110-23439) [    x:collection1] o.a.s.u.p.LogUpdateProcessorFactory [collection1]  webapp=/_uil/he path=/update params={wt=javabin&version=2}{add=[29 (1633451561407479808)]} 0 0
   [junit4]   2> 1187884 INFO  (qtp454587589-23397) [    x:collection1] o.a.s.u.p.LogUpdateProcessorFactory [collection1]  webapp=/_uil/he path=/update params={wt=javabin&version=2}{add=[30 (1633451561408528384)]} 0 0
   [junit4]   2> 1187885 INFO  (qtp1139353562-23460) [    x:collection1] o.a.s.u.p.LogUpdateProcessorFactory [collection1]  webapp=/_uil/he path=/update params={wt=javabin&version=2}{add=[30 (1633451561409576960)]} 0 0
   [junit4]   2> 1187885 INFO  (qtp454587589-23398) [    x:collection1] o.a.s.u.p.LogUpdateProcessorFactory [collection1]  webapp=/_uil/he path=/update params={wt=javabin&version=2}{add=[31 (1633451561409576960)]} 0 0
   [junit4]   2> 1187886 INFO  (qtp866558426-23419) [    x:collection1] o.a.s.u.p.LogUpdateProcessorFactory [collection1]  webapp=/_uil/he path=/update params={wt=javabin&version=2}{add=[31 (1633451561410625536)]} 0 0
   [junit4]   2> 1187887 INFO  (qtp454587589-23399) [    x:collection1] o.a.s.u.p.LogUpdateProcessorFactory [collection1]  webapp=/_uil/he path=/update params={wt=javabin&version=2}{add=[32 (1633451561411674112)]} 0 0
   [junit4]   2> 1187887 INFO  (qtp601737110-23440) [    x:collection1] o.a.s.u.p.LogUpdateProcessorFactory [collection1]  webapp=/_uil/he path=/update params={wt=javabin&version=2}{add=[32 (1633451561411674112)]} 0 0
   [junit4]   2> 1187888 INFO  (qtp454587589-23400) [    x:collection1] o.a.s.u.p.LogUpdateProcessorFactory [collection1]  webapp=/_uil/he path=/update params={wt=javabin&version=2}{add=[33 (1633451561412722688)]} 0 0
   [junit4]   2> 1187889 INFO  (qtp1139353562-23461) [    x:collection1] o.a.s.u.p.LogUpdateProcessorFactory [collection1]  webapp=/_uil/he path=/update params={wt=javabin&version=2}{add=[33 (1633451561413771264)]} 0 0
   [junit4]   2> 1187889 INFO  (qtp454587589-23401) [    x:collection1] o.a.s.u.p.LogUpdateProcessorFactory [collection1]  webapp=/_uil/he path=/update params={wt=javabin&version=2}{add=[34 (1633451561413771264)]} 0 0
   [junit4]   2> 1187890 INFO  (qtp866558426-23420) [    x:collection1] o.a.s.u.p.LogUpdateProcessorFactory [collection1]  webapp=/_uil/he path=/update params={wt=javabin&version=2}{add=[34 (1633451561414819840)]} 0 0
   [junit4]   2> 1187891 INFO  (qtp454587589-23397) [    x:collection1] o.a.s.u.p.LogUpdateProcessorFactory [collection1]  webapp=/_uil/he path=/update params={wt=javabin&version=2}{add=[35 (1633451561415868416)]} 0 0
   [junit4]   2> 1187891 INFO  (qtp601737110-23441) [    x:collection1] o.a.s.u.p.LogUpdateProcessorFactory [collection1]  webapp=/_uil/he path=/update params={wt=javabin&version=2}{add=[35 (1633451561415868416)]} 0 0
   [junit4]   2> 1187892 INFO  (qtp454587589-23398) [    x:collection1] o.a.s.u.p.LogUpdateProcessorFactory [collection1]  webapp=/_uil/he path=/update params={wt=javabin&version=2}{add=[36 (1633451561416916992)]} 0 0
   [junit4]   2> 1187893 INFO  (qtp1139353562-23462) [    x:collection1] o.a.s.u.p.LogUpdateProcessorFactory [collection1]  webapp=/_uil/he path=/update params={wt=javabin&version=2}{add=[36 (1633451561417965568)]} 0 0
   [junit4]   2> 1187894 INFO  (qtp454587589-23399) [    x:collection1] o.a.s.u.p.LogUpdateProcessorFactory [collection1]  webapp=/_uil/he path=/update params={wt=javabin&version=2}{add=[37 (1633451561417965568)]} 0 0
   [junit4]   2> 1187894 INFO  (qtp866558426-23421) [    x:collection1] o.a.s.u.p.LogUpdateProcessorFactory [collection1]  webapp=/_uil/he path=/update params={wt=javabin&version=2}{add=[37 (1633451561419014144)]} 0 0
   [junit4]   2> 1187895 INFO  (qtp454587589-23400) [    x:collection1] o.a.s.u.p.LogUpdateProcessorFactory [collection1]  webapp=/_uil/he path=/update params={wt=javabin&version=2}{add=[38 (1633451561420062720)]} 0 0
   [junit4]   2> 1187896 INFO  (qtp601737110-23442) [    x:collection1] o.a.s.u.p.LogUpdateProcessorFactory [collection1]  webapp=/_uil/he path=/update params={wt=javabin&version=2}{add=[38 (1633451561420062720)]} 0 0
   [junit4]   2> 1187896 INFO  (qtp454587589-23401) [    x:collection1] o.a.s.u.p.LogUpdateProcessorFactory [collection1]  webapp=/_uil/he path=/update params={wt=javabin&version=2}{add=[39 (1633451561421111296)]} 0 0
   [junit4]   2> 1187897 INFO  (qtp1139353562-23463) [    x:collection1] o.a.s.u.p.LogUpdateProcessorFactory [collection1]  webapp=/_uil/he path=/update params={wt=javabin&version=2}{add=[39 (1633451561422159872)]} 0 0
   [junit4]   2> 1187898 INFO  (qtp454587589-23397) [    x:collection1] o.a.s.u.p.LogUpdateProcessorFactory [collection1]  webapp=/_uil/he path=/update params={wt=javabin&version=2}{add=[40 (1633451561423208448)]} 0 0
   [junit4]   2> 1187899 INFO  (qtp866558426-23422) [    x:collection1] o.a.s.u.p.LogUpdateProcessorFactory [collection1]  webapp=/_uil/he path=/update params={wt=javabin&version=2}{add=[40 (1633451561423208448)]} 0 0
   [junit4]   2> 1187899 INFO  (qtp454587589-23398) [    x:collection1] o.a.s.u.p.LogUpdateProcessorFactory [collection1]  webapp=/_uil/he path=/update params={wt=javabin&version=2}{add=[41 (1633451561424257024)]} 0 0
   [junit4]   2> 1187900 INFO  (qtp601737110-23443) [    x:collection1] o.a.s.u.p.LogUpdateProcessorFactory [collection1]  webapp=/_uil/he path=/update params={wt=javabin&version=2}{add=[41 (1633451561425305600)]} 0 0
   [junit4]   2> 1187901 INFO  (qtp454587589-23399) [    x:collection1] o.a.s.u.p.LogUpdateProcessorFactory [collection1]  webapp=/_uil/he path=/update params={wt=javabin&version=2}{add=[42 (1633451561425305600)]} 0 0
   [junit4]   2> 1187901 INFO  (qtp1139353562-23464) [    x:collection1] o.a.s.u.p.LogUpdateProcessorFactory [collection1]  webapp=/_uil/he path=/update params={wt=javabin&version=2}{add=[42 (1633451561426354176)]} 0 0
   [junit4]   2> 1187902 INFO  (qtp454587589-23400) [    x:collection1] o.a.s.u.p.LogUpdateProcessorFactory [collection1]  webapp=/_uil/he path=/update params={wt=javabin&version=2}{add=[43 (1633451561427402752)]} 0 0
   [junit4]   2> 1187903 INFO  (qtp866558426-23418) [    x:collection1] o.a.s.u.p.LogUpdateProcessorFactory [collection1]  webapp=/_uil/he path=/update params={wt=javabin&version=2}{add=[43 (1633451561427402752)]} 0 0
   [junit4]   2> 1187903 INFO  (qtp454587589-23401) [    x:collection1] o.a.s.u.p.LogUpdateProcessorFactory [collection1]  webapp=/_uil/he path=/update params={wt=javabin&version=2}{add=[44 (1633451561428451328)]} 0 0
   [junit4]   2> 1187904 INFO  (qtp601737110-23439) [    x:collection1] o.a.s.u.p.LogUpdateProcessorFactory [collection1]  webapp=/_uil/he path=/update params={wt=javabin&version=2}{add=[44 (1633451561429499904)]} 0 0
   [junit4]   2> 1187906 INFO  (qtp454587589-23397) [    x:collection1] o.a.s.u.p.LogUpdateProcessorFactory [collection1]  webapp=/_uil/he path=/update params={wt=javabin&version=2}{add=[45 (1633451561431597056)]} 0 0
   [junit4]   2> 1187907 INFO  (qtp1139353562-23460) [    x:collection1] o.a.s.u.p.LogUpdateProcessorFactory [collection1]  webapp=/_uil/he path=/update params={wt=javabin&version=2}{add=[45 (1633451561432645632)]} 0 0
   [junit4]   2> 1187908 INFO  (qtp454587589-23398) [    x:collection1] o.a.s.u.p.LogUpdateProcessorFactory [collection1]  webapp=/_uil/he path=/update params={wt=javabin&version=2}{add=[46 (1633451561433694208)]} 0 0
   [junit4]   2> 1187909 INFO  (qtp866558426-23419) [    x:collection1] o.a.s.u.p.LogUpdateProcessorFactory [collection1]  webapp=/_uil/he path=/update params={wt=javabin&version=2}{add=[46 (1633451561434742784)]} 0 0
   [junit4]   2> 1187909 INFO  (qtp454587589-23399) [    x:collection1] o.a.s.u.p.LogUpdateProcessorFactory [collection1]  webapp=/_uil/he path=/update params={wt=javabin&version=2}{add=[47 (1633451561434742784)]} 0 0
   [junit4]   2> 1187910 INFO  (qtp601737110-23440) [    x:collection1] o.a.s.u.p.LogUpdateProcessorFactory [collection1]  webapp=/_uil/he path=/update params={wt=javabin&version=2}{add=[47 (1633451561435791360)]} 0 0
   [junit4]   2> 1187911 INFO  (qtp454587589-23400) [    x:collection1] o.a.s.u.p.LogUpdateProcessorFactory [collection1]  webapp=/_uil/he path=/update params={wt=javabin&version=2}{add=[48 (1633451561436839936)]} 0 0
   [junit4]   2> 1187911 INFO  (qtp1139353562-23461) [    x:collection1] o.a.s.u.p.LogUpdateProcessorFactory [collection1]  webapp=/_uil/he path=/update params={wt=javabin&version=2}{add=[48 (1633451561436839936)]} 0 0
   [junit4]   2> 1187912 INFO  (qtp454587589-23401) [    x:collection1] o.a.s.u.p.LogUpdateProcessorFactory [collection1]  webapp=/_uil/he path=/update params={wt=javabin&version=2}{add=[49 (1633451561437888512)]} 0 0
   [junit4]   2> 1187913 INFO  (qtp866558426-23420) [    x:collection1] o.a.s.u.p.LogUpdateProcessorFactory [collection1]  webapp=/_uil/he path=/update params={wt=javabin&version=2}{add=[49 (1633451561438937088)]} 0 0
   [junit4]   2> 1187913 INFO  (qtp454587589-23397) [    x:collection1] o.a.s.u.p.LogUpdateProcessorFactory [collection1]  webapp=/_uil/he path=/update params={wt=javabin&version=2}{add=[50 (1633451561438937088)]} 0 0
   [junit4]   2> 1187914 INFO  (qtp601737110-23441) [    x:collection1] o.a.s.u.p.LogUpdateProcessorFactory [collection1]  webapp=/_uil/he path=/update params={wt=javabin&version=2}{add=[50 (1633451561439985664)]} 0 0
   [junit4]   2> 1187915 INFO  (qtp454587589-23398) [    x:collection1] o.a.s.u.p.LogUpdateProcessorFactory [collection1]  webapp=/_uil/he path=/update params={wt=javabin&version=2}{add=[51 (1633451561441034240)]} 0 0
   [junit4]   2> 1187916 INFO  (qtp1139353562-23462) [    x:collection1] o.a.s.u.p.LogUpdateProcessorFactory [collection1]  webapp=/_uil/he path=/update params={wt=javabin&version=2}{add=[51 (1633451561441034240)]} 0 0
   [junit4]   2> 1187916 INFO  (qtp454587589-23399) [    x:collection1] o.a.s.u.p.LogUpdateProcessorFactory [collection1]  webapp=/_uil/he path=/update params={wt=javabin&version=2}{add=[52 (1633451561442082816)]} 0 0
   [junit4]   2> 1187917 INFO  (qtp866558426-23421) [    x:collection1] o.a.s.u.p.LogUpdateProcessorFactory [collection1]  webapp=/_uil/he path=/update params={wt=javabin&version=2}{add=[52 (1633451561443131392)]} 0 0
   [junit4]   2> 1187918 INFO  (qtp454587589-23400) [    x:collection1] o.a.s.u.p.LogUpdateProcessorFactory [collection1]  webapp=/_uil/he path=/update params={wt=javabin&version=2}{add=[53 (1633451561444179968)]} 0 0
   [junit4]   2> 1187918 INFO  (qtp601737110-23442) [    x:collection1] o.a.s.u.p.LogUpdateProcessorFactory [collection1]  webapp=/_uil/he path=/update params={wt=javabin&version=2}{add=[53 (1633451561444179968)]} 0 0
   [junit4]   2> 1187919 INFO  (qtp454587589-23401) [    x:collection1] o.a.s.u.p.LogUpdateProcessorFactory [collection1]  webapp=/_uil/he path=/update params={wt=javabin&version=2}{add=[54 (1633451561445228544)]} 0 0
   [junit4]   2> 1187920 INFO  (qtp1139353562-23463) [    x:collection1] o.a.s.u.p.LogUpdateProcessorFactory [collection1]  webapp=/_uil/he path=/update params={wt=javabin&version=2}{add=[54 (1633451561446277120)]} 0 0
   [junit4]   2> 1187920 INFO  (qtp454587589-23397) [    x:collection1] o.a.s.u.p.LogUpdateProcessorFactory [collection1]  webapp=/_uil/he path=/update params={wt=javabin&version=2}{add=[55 (1633451561446277120)]} 0 0
   [junit4]   2> 1187921 INFO  (qtp866558426-23422) [    x:collection1] o.a.s.u.p.LogUpdateProcessorFactory [collection1]  webapp=/_uil/he path=/update params={wt=javabin&version=2}{add=[55 (1633451561447325696)]} 0 0
   [junit4]   2> 1187922 INFO  (qtp454587589-23398) [    x:collection1] o.a.s.u.p.LogUpdateProcessorFactory [collection1]  webapp=/_uil/he path=/update params={wt=javabin&version=2}{add=[56 (1633451561448374272)]} 0 0
   [junit4]   2> 1187922 INFO  (qtp601737110-23443) [    x:collection1] o.a.s.u.p.LogUpdateProcessorFactory [collection1]  webapp=/_uil/he path=/update params={wt=javabin&version=2}{add=[56 (1633451561448374272)]} 0 0
   [junit4]   2> 1187923 INFO  (qtp454587589-23399) [    x:collection1] o.a.s.u.p.LogUpdateProcessorFactory [collection1]  webapp=/_uil/he path=/update params={wt=javabin&version=2}{add=[57 (1633451561449422848)]} 0 0
   [junit4]   2> 1187924 INFO  (qtp1139353562-23464) [    x:collection1] o.a.s.u.p.LogUpdateProcessorFactory [collection1]  webapp=/_uil/he path=/update params={wt=javabin&version=2}{add=[57 (1633451561450471424)]} 0 0
   [junit4]   2> 1187924 INFO  (qtp454587589-23400) [    x:collection1] o.a.s.u.p.LogUpdateProcessorFactory [collection1]  webapp=/_uil/he path=/update params={wt=javabin&version=2}{add=[58 (1633451561450471424)]} 0 0
   [junit4]   2> 1187925 INFO  (qtp866558426-23418) [    x:collection1] o.a.s.u.p.LogUpdateProcessorFactory [collection1]  webapp=/_uil/he path=/update params={wt=javabin&version=2}{add=[58 (1633451561451520000)]} 0 0
   [junit4]   2> 1187926 INFO  (qtp454587589-23401) [    x:collection1] o.a.s.u.p.LogUpdateProcessorFactory [collection1]  webapp=/_uil/he path=/update params={wt=javabin&version=2}{add=[59 (1633451561452568576)]} 0 0
   [junit4]   2> 1187926 INFO  (qtp601737110-23439) [    x:collection1] o.a.s.u.p.LogUpdateProcessorFactory [collection1]  webapp=/_uil/he path=/update params={wt=javabin&version=2}{add=[59 (1633451561452568576)]} 0 0
   [junit4]   2> 1187927 INFO  (qtp454587589-23397) [    x:collection1] o.a.s.u.p.LogUpdateProcessorFactory [collection1]  webapp=/_uil/he path=/update params={wt=javabin&version=2}{add=[60 (1633451561453617152)]} 0 0
   [junit4]   2> 1187928 INFO  (qtp1139353562-23460) [    x:collection1] o.a.s.u.p.LogUpdateProcessorFactory [collection1]  webapp=/_uil/he path=/update params={wt=javabin&version=2}{add=[60 (1633451561454665728)]} 0 0
   [junit4]   2> 1187929 INFO  (qtp454587589-23398) [    x:collection1] o.a.s.u.p.LogUpdateProcessorFactory [collection1]  webapp=/_uil/he path=/update params={wt=javabin&version=2}{add=[61 (1633451561454665728)]} 0 0
   [junit4]   2> 1187929 INFO  (qtp866558426-23419) [    x:collection1] o.a.s.u.p.LogUpdateProcessorFactory [collection1]  webapp=/_uil/he path=/update params={wt=javabin&version=2}{add=[61 (1633451561455714304)]} 0 0
   [junit4]   2> 1187930 INFO  (qtp454587589-23399) [    x:collection1] o.a.s.u.p.LogUpdateProcessorFactory [collection1]  webapp=/_uil/he path=/update params={wt=javabin&version=2}{add=[62 (1633451561456762880)]} 0 0
   [junit4]   2> 1187930 INFO  (qtp601737110-23440) [    x:collection1] o.a.s.u.p.LogUpdateProcessorFactory [collection1]  webapp=/_uil/he path=/update params={wt=javabin&version=2}{add=[62 (1633451561456762880)]} 0 0
   [junit4]   2> 1187931 INFO  (qtp454587589-23400) [    x:collection1] o.a.s.u.p.LogUpdateProcessorFactory [collection1]  webapp=/_uil/he path=/update params={wt=javabin&version=2}{add=[63 (1633451561457811456)]} 0 0
   [junit4]   2> 1187932 INFO  (qtp1139353562-23461) [    x:collection1] o.a.s.u.p.LogUpdateProcessorFactory [collection1]  webapp=/_uil/he path=/update params={wt=javabin&version=2}{add=[63 (1633451561458860032)]} 0 0
   [junit4]   2> 1187933 INFO  (qtp454587589-23401) [    x:collection1] o.a.s.u.p.LogUpdateProcessorFactory [collection1]  webapp=/_uil/he path=/update params={wt=javabin&version=2}{add=[64 (1633451561458860032)]} 0 0
   [junit4]   2> 1187933 INFO  (qtp866558426-23420) [    x:collection1] o.a.s.u.p.LogUpdateProcessorFactory [collection1]  webapp=/_uil/he path=/update params={wt=javabin&version=2}{add=[64 (1633451561459908608)]} 0 0
   [junit4]   2> 1187934 INFO  (qtp454587589-23397) [    x:collection1] o.a.s.u.p.LogUpdateProcessorFactory [collection1]  webapp=/_uil/he path=/update params={wt=javabin&version=2}{

[...truncated too long message...]

-availability-check:
[loadresource] Do not set property disallowed.ivy.jars.list as its length is 0.

-ivy-fail-disallowed-ivy-version:

ivy-fail:

ivy-fail:

ivy-configure:
[ivy:configure] :: loading settings :: file = /x1/jenkins/jenkins-slave/workspace/Lucene-Solr-BadApples-Tests-8.x/lucene/top-level-ivy-settings.xml

resolve:

ivy-availability-check:
[loadresource] Do not set property disallowed.ivy.jars.list as its length is 0.

-ivy-fail-disallowed-ivy-version:

ivy-fail:

ivy-configure:
[ivy:configure] :: loading settings :: file = /x1/jenkins/jenkins-slave/workspace/Lucene-Solr-BadApples-Tests-8.x/lucene/top-level-ivy-settings.xml

resolve:

ivy-availability-check:
[loadresource] Do not set property disallowed.ivy.jars.list as its length is 0.

-ivy-fail-disallowed-ivy-version:

ivy-fail:

ivy-fail:

ivy-configure:
[ivy:configure] :: loading settings :: file = /x1/jenkins/jenkins-slave/workspace/Lucene-Solr-BadApples-Tests-8.x/lucene/top-level-ivy-settings.xml

resolve:

ivy-availability-check:
[loadresource] Do not set property disallowed.ivy.jars.list as its length is 0.

-ivy-fail-disallowed-ivy-version:

ivy-fail:

ivy-configure:
[ivy:configure] :: loading settings :: file = /x1/jenkins/jenkins-slave/workspace/Lucene-Solr-BadApples-Tests-8.x/lucene/top-level-ivy-settings.xml

resolve:

ivy-availability-check:
[loadresource] Do not set property disallowed.ivy.jars.list as its length is 0.

-ivy-fail-disallowed-ivy-version:

ivy-fail:

ivy-fail:

ivy-configure:
[ivy:configure] :: loading settings :: file = /x1/jenkins/jenkins-slave/workspace/Lucene-Solr-BadApples-Tests-8.x/lucene/top-level-ivy-settings.xml

resolve:

ivy-availability-check:
[loadresource] Do not set property disallowed.ivy.jars.list as its length is 0.

-ivy-fail-disallowed-ivy-version:

ivy-fail:

ivy-fail:

ivy-configure:
[ivy:configure] :: loading settings :: file = /x1/jenkins/jenkins-slave/workspace/Lucene-Solr-BadApples-Tests-8.x/lucene/top-level-ivy-settings.xml

resolve:

ivy-availability-check:
[loadresource] Do not set property disallowed.ivy.jars.list as its length is 0.

-ivy-fail-disallowed-ivy-version:

ivy-fail:

ivy-fail:

ivy-configure:
[ivy:configure] :: loading settings :: file = /x1/jenkins/jenkins-slave/workspace/Lucene-Solr-BadApples-Tests-8.x/lucene/top-level-ivy-settings.xml

resolve:

ivy-availability-check:
[loadresource] Do not set property disallowed.ivy.jars.list as its length is 0.

-ivy-fail-disallowed-ivy-version:

ivy-fail:

ivy-fail:

ivy-configure:
[ivy:configure] :: loading settings :: file = /x1/jenkins/jenkins-slave/workspace/Lucene-Solr-BadApples-Tests-8.x/lucene/top-level-ivy-settings.xml

resolve:

ivy-availability-check:
[loadresource] Do not set property disallowed.ivy.jars.list as its length is 0.

-ivy-fail-disallowed-ivy-version:

ivy-fail:

ivy-fail:

ivy-configure:
[ivy:configure] :: loading settings :: file = /x1/jenkins/jenkins-slave/workspace/Lucene-Solr-BadApples-Tests-8.x/lucene/top-level-ivy-settings.xml

resolve:

ivy-availability-check:
[loadresource] Do not set property disallowed.ivy.jars.list as its length is 0.

-ivy-fail-disallowed-ivy-version:

ivy-fail:

ivy-fail:

ivy-configure:
[ivy:configure] :: loading settings :: file = /x1/jenkins/jenkins-slave/workspace/Lucene-Solr-BadApples-Tests-8.x/lucene/top-level-ivy-settings.xml

resolve:

ivy-availability-check:
[loadresource] Do not set property disallowed.ivy.jars.list as its length is 0.

-ivy-fail-disallowed-ivy-version:

ivy-fail:

ivy-fail:

ivy-configure:
[ivy:configure] :: loading settings :: file = /x1/jenkins/jenkins-slave/workspace/Lucene-Solr-BadApples-Tests-8.x/lucene/top-level-ivy-settings.xml

resolve:

ivy-availability-check:
[loadresource] Do not set property disallowed.ivy.jars.list as its length is 0.

-ivy-fail-disallowed-ivy-version:

ivy-fail:

ivy-fail:

ivy-configure:
[ivy:configure] :: loading settings :: file = /x1/jenkins/jenkins-slave/workspace/Lucene-Solr-BadApples-Tests-8.x/lucene/top-level-ivy-settings.xml

resolve:

ivy-availability-check:
[loadresource] Do not set property disallowed.ivy.jars.list as its length is 0.

-ivy-fail-disallowed-ivy-version:

ivy-fail:

ivy-fail:

ivy-configure:
[ivy:configure] :: loading settings :: file = /x1/jenkins/jenkins-slave/workspace/Lucene-Solr-BadApples-Tests-8.x/lucene/top-level-ivy-settings.xml

resolve:

ivy-availability-check:
[loadresource] Do not set property disallowed.ivy.jars.list as its length is 0.

-ivy-fail-disallowed-ivy-version:

ivy-fail:

ivy-fail:

ivy-configure:
[ivy:configure] :: loading settings :: file = /x1/jenkins/jenkins-slave/workspace/Lucene-Solr-BadApples-Tests-8.x/lucene/top-level-ivy-settings.xml

resolve:

jar-checksums:
    [mkdir] Created dir: /x1/jenkins/jenkins-slave/workspace/Lucene-Solr-BadApples-Tests-8.x/solr/null170945213
     [copy] Copying 239 files to /x1/jenkins/jenkins-slave/workspace/Lucene-Solr-BadApples-Tests-8.x/solr/null170945213
   [delete] Deleting directory /x1/jenkins/jenkins-slave/workspace/Lucene-Solr-BadApples-Tests-8.x/solr/null170945213

check-working-copy:
[ivy:cachepath] :: resolving dependencies :: #;working@lucene1-us-west
[ivy:cachepath] 	confs: [default]
[ivy:cachepath] 	found org.eclipse.jgit#org.eclipse.jgit;5.3.0.201903130848-r in public
[ivy:cachepath] 	found com.jcraft#jsch;0.1.54 in public
[ivy:cachepath] 	found com.jcraft#jzlib;1.1.1 in public
[ivy:cachepath] 	found com.googlecode.javaewah#JavaEWAH;1.1.6 in public
[ivy:cachepath] 	found org.slf4j#slf4j-api;1.7.2 in public
[ivy:cachepath] 	found org.bouncycastle#bcpg-jdk15on;1.60 in public
[ivy:cachepath] 	found org.bouncycastle#bcprov-jdk15on;1.60 in public
[ivy:cachepath] 	found org.bouncycastle#bcpkix-jdk15on;1.60 in public
[ivy:cachepath] 	found org.slf4j#slf4j-nop;1.7.2 in public
[ivy:cachepath] :: resolution report :: resolve 62ms :: artifacts dl 6ms
	---------------------------------------------------------------------
	|                  |            modules            ||   artifacts   |
	|       conf       | number| search|dwnlded|evicted|| number|dwnlded|
	---------------------------------------------------------------------
	|      default     |   9   |   0   |   0   |   0   ||   9   |   0   |
	---------------------------------------------------------------------
[wc-checker] Initializing working copy...
[wc-checker] Checking working copy status...

-jenkins-base:

BUILD SUCCESSFUL
Total time: 113 minutes 30 seconds
Archiving artifacts
java.lang.InterruptedException: no matches found within 10000
	at hudson.FilePath$ValidateAntFileMask.hasMatch(FilePath.java:2847)
	at hudson.FilePath$ValidateAntFileMask.invoke(FilePath.java:2726)
	at hudson.FilePath$ValidateAntFileMask.invoke(FilePath.java:2707)
	at hudson.FilePath$FileCallableWrapper.call(FilePath.java:3086)
Also:   hudson.remoting.Channel$CallSiteStackTrace: Remote call to lucene
		at hudson.remoting.Channel.attachCallSiteStackTrace(Channel.java:1741)
		at hudson.remoting.UserRequest$ExceptionResponse.retrieve(UserRequest.java:357)
		at hudson.remoting.Channel.call(Channel.java:955)
		at hudson.FilePath.act(FilePath.java:1072)
		at hudson.FilePath.act(FilePath.java:1061)
		at hudson.FilePath.validateAntFileMask(FilePath.java:2705)
		at hudson.tasks.ArtifactArchiver.perform(ArtifactArchiver.java:243)
		at hudson.tasks.BuildStepCompatibilityLayer.perform(BuildStepCompatibilityLayer.java:81)
		at hudson.tasks.BuildStepMonitor$1.perform(BuildStepMonitor.java:20)
		at hudson.model.AbstractBuild$AbstractBuildExecution.perform(AbstractBuild.java:744)
		at hudson.model.AbstractBuild$AbstractBuildExecution.performAllBuildSteps(AbstractBuild.java:690)
		at hudson.model.Build$BuildExecution.post2(Build.java:186)
		at hudson.model.AbstractBuild$AbstractBuildExecution.post(AbstractBuild.java:635)
		at hudson.model.Run.execute(Run.java:1835)
		at hudson.model.FreeStyleBuild.run(FreeStyleBuild.java:43)
		at hudson.model.ResourceController.execute(ResourceController.java:97)
		at hudson.model.Executor.run(Executor.java:429)
Caused: hudson.FilePath$TunneledInterruptedException
	at hudson.FilePath$FileCallableWrapper.call(FilePath.java:3088)
	at hudson.remoting.UserRequest.perform(UserRequest.java:212)
	at hudson.remoting.UserRequest.perform(UserRequest.java:54)
	at hudson.remoting.Request$2.run(Request.java:369)
	at hudson.remoting.InterceptingExecutorService$1.call(InterceptingExecutorService.java:72)
	at java.util.concurrent.FutureTask.run(FutureTask.java:266)
	at java.util.concurrent.ThreadPoolExecutor.runWorker(ThreadPoolExecutor.java:1142)
	at java.util.concurrent.ThreadPoolExecutor$Worker.run(ThreadPoolExecutor.java:617)
	at java.lang.Thread.run(Thread.java:748)
Caused: java.lang.InterruptedException: java.lang.InterruptedException: no matches found within 10000
	at hudson.FilePath.act(FilePath.java:1074)
	at hudson.FilePath.act(FilePath.java:1061)
	at hudson.FilePath.validateAntFileMask(FilePath.java:2705)
	at hudson.tasks.ArtifactArchiver.perform(ArtifactArchiver.java:243)
	at hudson.tasks.BuildStepCompatibilityLayer.perform(BuildStepCompatibilityLayer.java:81)
	at hudson.tasks.BuildStepMonitor$1.perform(BuildStepMonitor.java:20)
	at hudson.model.AbstractBuild$AbstractBuildExecution.perform(AbstractBuild.java:744)
	at hudson.model.AbstractBuild$AbstractBuildExecution.performAllBuildSteps(AbstractBuild.java:690)
	at hudson.model.Build$BuildExecution.post2(Build.java:186)
	at hudson.model.AbstractBuild$AbstractBuildExecution.post(AbstractBuild.java:635)
	at hudson.model.Run.execute(Run.java:1835)
	at hudson.model.FreeStyleBuild.run(FreeStyleBuild.java:43)
	at hudson.model.ResourceController.execute(ResourceController.java:97)
	at hudson.model.Executor.run(Executor.java:429)
No artifacts found that match the file pattern "**/*.events,heapdumps/**,**/hs_err_pid*". Configuration error?
Recording test results
Build step 'Publish JUnit test result report' changed build result to UNSTABLE
Email was triggered for: Unstable (Test Failures)
Sending email for trigger: Unstable (Test Failures)

Mime
View raw message