lucene-dev mailing list archives

Site index · List index
Message view « Date » · « Thread »
Top « Date » · « Thread »
From Apache Jenkins Server <jenk...@builds.apache.org>
Subject [JENKINS] Lucene-Solr-Tests-master - Build # 3342 - Still Failing
Date Fri, 17 May 2019 05:05:49 GMT
Build: https://builds.apache.org/job/Lucene-Solr-Tests-master/3342/

1 tests failed.
FAILED:  org.apache.solr.cloud.AliasIntegrationTest.testClusterStateProviderAPI

Error Message:
{} expected:<2> but was:<0>

Stack Trace:
java.lang.AssertionError: {} expected:<2> but was:<0>
	at __randomizedtesting.SeedInfo.seed([579AAEF77EB9E494:484D32DB0DB21DDF]:0)
	at org.junit.Assert.fail(Assert.java:88)
	at org.junit.Assert.failNotEquals(Assert.java:834)
	at org.junit.Assert.assertEquals(Assert.java:645)
	at org.apache.solr.cloud.AliasIntegrationTest.testClusterStateProviderAPI(AliasIntegrationTest.java:293)
	at java.base/jdk.internal.reflect.NativeMethodAccessorImpl.invoke0(Native Method)
	at java.base/jdk.internal.reflect.NativeMethodAccessorImpl.invoke(NativeMethodAccessorImpl.java:62)
	at java.base/jdk.internal.reflect.DelegatingMethodAccessorImpl.invoke(DelegatingMethodAccessorImpl.java:43)
	at java.base/java.lang.reflect.Method.invoke(Method.java:566)
	at com.carrotsearch.randomizedtesting.RandomizedRunner.invoke(RandomizedRunner.java:1750)
	at com.carrotsearch.randomizedtesting.RandomizedRunner$8.evaluate(RandomizedRunner.java:938)
	at com.carrotsearch.randomizedtesting.RandomizedRunner$9.evaluate(RandomizedRunner.java:974)
	at com.carrotsearch.randomizedtesting.RandomizedRunner$10.evaluate(RandomizedRunner.java:988)
	at com.carrotsearch.randomizedtesting.rules.SystemPropertiesRestoreRule$1.evaluate(SystemPropertiesRestoreRule.java:57)
	at org.apache.lucene.util.TestRuleSetupTeardownChained$1.evaluate(TestRuleSetupTeardownChained.java:49)
	at org.apache.lucene.util.AbstractBeforeAfterRule$1.evaluate(AbstractBeforeAfterRule.java:45)
	at org.apache.lucene.util.TestRuleThreadAndTestName$1.evaluate(TestRuleThreadAndTestName.java:48)
	at org.apache.lucene.util.TestRuleIgnoreAfterMaxFailures$1.evaluate(TestRuleIgnoreAfterMaxFailures.java:64)
	at org.apache.lucene.util.TestRuleMarkFailure$1.evaluate(TestRuleMarkFailure.java:47)
	at com.carrotsearch.randomizedtesting.rules.StatementAdapter.evaluate(StatementAdapter.java:36)
	at com.carrotsearch.randomizedtesting.ThreadLeakControl$StatementRunner.run(ThreadLeakControl.java:368)
	at com.carrotsearch.randomizedtesting.ThreadLeakControl.forkTimeoutingTask(ThreadLeakControl.java:817)
	at com.carrotsearch.randomizedtesting.ThreadLeakControl$3.evaluate(ThreadLeakControl.java:468)
	at com.carrotsearch.randomizedtesting.RandomizedRunner.runSingleTest(RandomizedRunner.java:947)
	at com.carrotsearch.randomizedtesting.RandomizedRunner$5.evaluate(RandomizedRunner.java:832)
	at com.carrotsearch.randomizedtesting.RandomizedRunner$6.evaluate(RandomizedRunner.java:883)
	at com.carrotsearch.randomizedtesting.RandomizedRunner$7.evaluate(RandomizedRunner.java:894)
	at com.carrotsearch.randomizedtesting.rules.StatementAdapter.evaluate(StatementAdapter.java:36)
	at com.carrotsearch.randomizedtesting.rules.SystemPropertiesRestoreRule$1.evaluate(SystemPropertiesRestoreRule.java:57)
	at org.apache.lucene.util.AbstractBeforeAfterRule$1.evaluate(AbstractBeforeAfterRule.java:45)
	at com.carrotsearch.randomizedtesting.rules.StatementAdapter.evaluate(StatementAdapter.java:36)
	at org.apache.lucene.util.TestRuleStoreClassName$1.evaluate(TestRuleStoreClassName.java:41)
	at com.carrotsearch.randomizedtesting.rules.NoShadowingOrOverridesOnMethodsRule$1.evaluate(NoShadowingOrOverridesOnMethodsRule.java:40)
	at com.carrotsearch.randomizedtesting.rules.NoShadowingOrOverridesOnMethodsRule$1.evaluate(NoShadowingOrOverridesOnMethodsRule.java:40)
	at com.carrotsearch.randomizedtesting.rules.StatementAdapter.evaluate(StatementAdapter.java:36)
	at com.carrotsearch.randomizedtesting.rules.StatementAdapter.evaluate(StatementAdapter.java:36)
	at org.apache.lucene.util.TestRuleAssertionsRequired$1.evaluate(TestRuleAssertionsRequired.java:53)
	at org.apache.lucene.util.TestRuleMarkFailure$1.evaluate(TestRuleMarkFailure.java:47)
	at org.apache.lucene.util.TestRuleIgnoreAfterMaxFailures$1.evaluate(TestRuleIgnoreAfterMaxFailures.java:64)
	at org.apache.lucene.util.TestRuleIgnoreTestSuites$1.evaluate(TestRuleIgnoreTestSuites.java:54)
	at com.carrotsearch.randomizedtesting.rules.StatementAdapter.evaluate(StatementAdapter.java:36)
	at com.carrotsearch.randomizedtesting.ThreadLeakControl$StatementRunner.run(ThreadLeakControl.java:368)
	at java.base/java.lang.Thread.run(Thread.java:834)




Build Log:
[...truncated 14003 lines...]
   [junit4] Suite: org.apache.solr.cloud.AliasIntegrationTest
   [junit4]   2> Creating dataDir: /home/jenkins/jenkins-slave/workspace/Lucene-Solr-Tests-master/solr/build/solr-core/test/J2/temp/solr.cloud.AliasIntegrationTest_579AAEF77EB9E494-001/init-core-data-001
   [junit4]   2> 3237481 INFO  (SUITE-AliasIntegrationTest-seed#[579AAEF77EB9E494]-worker) [    ] o.a.s.SolrTestCaseJ4 SecureRandom sanity checks: test.solr.allowed.securerandom=null & java.security.egd=file:/dev/./urandom
   [junit4]   2> 3237482 WARN  (SUITE-AliasIntegrationTest-seed#[579AAEF77EB9E494]-worker) [    ] o.a.s.SolrTestCaseJ4 startTrackingSearchers: numOpens=1 numCloses=1
   [junit4]   2> 3237482 INFO  (SUITE-AliasIntegrationTest-seed#[579AAEF77EB9E494]-worker) [    ] o.a.s.SolrTestCaseJ4 Using TrieFields (NUMERIC_POINTS_SYSPROP=false) w/NUMERIC_DOCVALUES_SYSPROP=true
   [junit4]   2> 3237483 INFO  (SUITE-AliasIntegrationTest-seed#[579AAEF77EB9E494]-worker) [    ] o.a.s.SolrTestCaseJ4 Randomized ssl (false) and clientAuth (true) via: @org.apache.solr.util.RandomizeSSL(reason="", ssl=0.0/0.0, value=0.0/0.0, clientAuth=0.0/0.0)
   [junit4]   2> 3237483 INFO  (SUITE-AliasIntegrationTest-seed#[579AAEF77EB9E494]-worker) [    ] o.a.s.c.MiniSolrCloudCluster Starting cluster of 2 servers in /home/jenkins/jenkins-slave/workspace/Lucene-Solr-Tests-master/solr/build/solr-core/test/J2/temp/solr.cloud.AliasIntegrationTest_579AAEF77EB9E494-001/tempDir-001
   [junit4]   2> 3237483 INFO  (SUITE-AliasIntegrationTest-seed#[579AAEF77EB9E494]-worker) [    ] o.a.s.c.ZkTestServer STARTING ZK TEST SERVER
   [junit4]   2> 3237502 INFO  (ZkTestServer Run Thread) [    ] o.a.s.c.ZkTestServer client port:0.0.0.0/0.0.0.0:0
   [junit4]   2> 3237502 INFO  (ZkTestServer Run Thread) [    ] o.a.s.c.ZkTestServer Starting server
   [junit4]   2> 3237610 INFO  (SUITE-AliasIntegrationTest-seed#[579AAEF77EB9E494]-worker) [    ] o.a.s.c.ZkTestServer start zk server on port:42092
   [junit4]   2> 3237610 INFO  (SUITE-AliasIntegrationTest-seed#[579AAEF77EB9E494]-worker) [    ] o.a.s.c.ZkTestServer parse host and port list: 127.0.0.1:42092
   [junit4]   2> 3237610 INFO  (SUITE-AliasIntegrationTest-seed#[579AAEF77EB9E494]-worker) [    ] o.a.s.c.ZkTestServer connecting to 127.0.0.1 42092
   [junit4]   2> 3237683 INFO  (zkConnectionManagerCallback-8141-thread-1) [    ] o.a.s.c.c.ConnectionManager zkClient has connected
   [junit4]   2> 3237772 INFO  (zkConnectionManagerCallback-8143-thread-1) [    ] o.a.s.c.c.ConnectionManager zkClient has connected
   [junit4]   2> 3237806 INFO  (zkConnectionManagerCallback-8145-thread-1) [    ] o.a.s.c.c.ConnectionManager zkClient has connected
   [junit4]   2> 3237862 WARN  (jetty-launcher-8146-thread-1) [    ] o.e.j.s.AbstractConnector Ignoring deprecated socket close linger time
   [junit4]   2> 3237863 INFO  (jetty-launcher-8146-thread-1) [    ] o.a.s.c.s.e.JettySolrRunner Start Jetty (original configured port=0)
   [junit4]   2> 3237863 INFO  (jetty-launcher-8146-thread-1) [    ] o.a.s.c.s.e.JettySolrRunner Trying to start Jetty on port 0 try number 1 ...
   [junit4]   2> 3237863 INFO  (jetty-launcher-8146-thread-1) [    ] o.e.j.s.Server jetty-9.4.14.v20181114; built: 2018-11-14T21:20:31.478Z; git: c4550056e785fb5665914545889f21dc136ad9e6; jvm 11.0.1+13-LTS
   [junit4]   2> 3237863 WARN  (jetty-launcher-8146-thread-2) [    ] o.e.j.s.AbstractConnector Ignoring deprecated socket close linger time
   [junit4]   2> 3237863 INFO  (jetty-launcher-8146-thread-2) [    ] o.a.s.c.s.e.JettySolrRunner Start Jetty (original configured port=0)
   [junit4]   2> 3237863 INFO  (jetty-launcher-8146-thread-2) [    ] o.a.s.c.s.e.JettySolrRunner Trying to start Jetty on port 0 try number 1 ...
   [junit4]   2> 3237864 INFO  (jetty-launcher-8146-thread-2) [    ] o.e.j.s.Server jetty-9.4.14.v20181114; built: 2018-11-14T21:20:31.478Z; git: c4550056e785fb5665914545889f21dc136ad9e6; jvm 11.0.1+13-LTS
   [junit4]   2> 3237864 INFO  (jetty-launcher-8146-thread-1) [    ] o.e.j.s.session DefaultSessionIdManager workerName=node0
   [junit4]   2> 3237864 INFO  (jetty-launcher-8146-thread-1) [    ] o.e.j.s.session No SessionScavenger set, using defaults
   [junit4]   2> 3237864 INFO  (jetty-launcher-8146-thread-1) [    ] o.e.j.s.session node0 Scavenging every 600000ms
   [junit4]   2> 3237865 INFO  (jetty-launcher-8146-thread-1) [    ] o.e.j.s.h.ContextHandler Started o.e.j.s.ServletContextHandler@5ca03dbc{/solr,null,AVAILABLE}
   [junit4]   2> 3237867 INFO  (jetty-launcher-8146-thread-1) [    ] o.e.j.s.AbstractConnector Started ServerConnector@3fb7abb3{HTTP/1.1,[http/1.1, h2c]}{127.0.0.1:39178}
   [junit4]   2> 3237867 INFO  (jetty-launcher-8146-thread-1) [    ] o.e.j.s.Server Started @3237943ms
   [junit4]   2> 3237867 INFO  (jetty-launcher-8146-thread-1) [    ] o.a.s.c.s.e.JettySolrRunner Jetty properties: {hostContext=/solr, hostPort=39178}
   [junit4]   2> 3237867 ERROR (jetty-launcher-8146-thread-1) [    ] o.a.s.u.StartupLoggingUtils Missing Java Option solr.log.dir. Logging may be missing or incomplete.
   [junit4]   2> 3237867 INFO  (jetty-launcher-8146-thread-1) [    ] o.a.s.s.SolrDispatchFilter Using logger factory org.apache.logging.slf4j.Log4jLoggerFactory
   [junit4]   2> 3237867 INFO  (jetty-launcher-8146-thread-1) [    ] o.a.s.s.SolrDispatchFilter  ___      _       Welcome to Apache Solr™ version 9.0.0
   [junit4]   2> 3237867 INFO  (jetty-launcher-8146-thread-1) [    ] o.a.s.s.SolrDispatchFilter / __| ___| |_ _   Starting in cloud mode on port null
   [junit4]   2> 3237867 INFO  (jetty-launcher-8146-thread-1) [    ] o.a.s.s.SolrDispatchFilter \__ \/ _ \ | '_|  Install dir: null
   [junit4]   2> 3237867 INFO  (jetty-launcher-8146-thread-1) [    ] o.a.s.s.SolrDispatchFilter |___/\___/_|_|    Start time: 2019-05-17T03:44:40.514450Z
   [junit4]   2> 3237868 INFO  (jetty-launcher-8146-thread-2) [    ] o.e.j.s.session DefaultSessionIdManager workerName=node0
   [junit4]   2> 3237868 INFO  (jetty-launcher-8146-thread-2) [    ] o.e.j.s.session No SessionScavenger set, using defaults
   [junit4]   2> 3237868 INFO  (jetty-launcher-8146-thread-2) [    ] o.e.j.s.session node0 Scavenging every 600000ms
   [junit4]   2> 3237868 INFO  (jetty-launcher-8146-thread-2) [    ] o.e.j.s.h.ContextHandler Started o.e.j.s.ServletContextHandler@5c94d475{/solr,null,AVAILABLE}
   [junit4]   2> 3237869 INFO  (jetty-launcher-8146-thread-2) [    ] o.e.j.s.AbstractConnector Started ServerConnector@3d9f82f8{HTTP/1.1,[http/1.1, h2c]}{127.0.0.1:46034}
   [junit4]   2> 3237869 INFO  (jetty-launcher-8146-thread-2) [    ] o.e.j.s.Server Started @3237945ms
   [junit4]   2> 3237869 INFO  (jetty-launcher-8146-thread-2) [    ] o.a.s.c.s.e.JettySolrRunner Jetty properties: {hostContext=/solr, hostPort=46034}
   [junit4]   2> 3237869 ERROR (jetty-launcher-8146-thread-2) [    ] o.a.s.u.StartupLoggingUtils Missing Java Option solr.log.dir. Logging may be missing or incomplete.
   [junit4]   2> 3237869 INFO  (jetty-launcher-8146-thread-2) [    ] o.a.s.s.SolrDispatchFilter Using logger factory org.apache.logging.slf4j.Log4jLoggerFactory
   [junit4]   2> 3237869 INFO  (jetty-launcher-8146-thread-2) [    ] o.a.s.s.SolrDispatchFilter  ___      _       Welcome to Apache Solr™ version 9.0.0
   [junit4]   2> 3237869 INFO  (jetty-launcher-8146-thread-2) [    ] o.a.s.s.SolrDispatchFilter / __| ___| |_ _   Starting in cloud mode on port null
   [junit4]   2> 3237869 INFO  (jetty-launcher-8146-thread-2) [    ] o.a.s.s.SolrDispatchFilter \__ \/ _ \ | '_|  Install dir: null
   [junit4]   2> 3237869 INFO  (jetty-launcher-8146-thread-2) [    ] o.a.s.s.SolrDispatchFilter |___/\___/_|_|    Start time: 2019-05-17T03:44:40.516441Z
   [junit4]   2> 3237971 INFO  (zkConnectionManagerCallback-8148-thread-1) [    ] o.a.s.c.c.ConnectionManager zkClient has connected
   [junit4]   2> 3237971 INFO  (jetty-launcher-8146-thread-1) [    ] o.a.s.s.SolrDispatchFilter solr.xml found in ZooKeeper. Loading...
   [junit4]   2> 3237991 INFO  (zkConnectionManagerCallback-8150-thread-1) [    ] o.a.s.c.c.ConnectionManager zkClient has connected
   [junit4]   2> 3238023 INFO  (jetty-launcher-8146-thread-2) [    ] o.a.s.s.SolrDispatchFilter solr.xml found in ZooKeeper. Loading...
   [junit4]   2> 3238130 WARN  (NIOServerCxn.Factory:0.0.0.0/0.0.0.0:0) [    ] o.a.z.s.NIOServerCnxn Unable to read additional data from client sessionid 0x1096826d53f0004, likely client has closed socket
   [junit4]   2> 3238940 INFO  (jetty-launcher-8146-thread-2) [    ] o.a.s.h.c.HttpShardHandlerFactory Host whitelist initialized: WhitelistHostChecker [whitelistHosts=null, whitelistHostCheckingEnabled=true]
   [junit4]   2> 3238941 WARN  (jetty-launcher-8146-thread-2) [    ] o.e.j.u.s.S.config No Client EndPointIdentificationAlgorithm configured for SslContextFactory@6c52c8c2[provider=null,keyStore=null,trustStore=null]
   [junit4]   2> 3238959 WARN  (jetty-launcher-8146-thread-2) [    ] o.e.j.u.s.S.config No Client EndPointIdentificationAlgorithm configured for SslContextFactory@27e1cc30[provider=null,keyStore=null,trustStore=null]
   [junit4]   2> 3238960 INFO  (jetty-launcher-8146-thread-2) [    ] o.a.s.c.ZkContainer Zookeeper client=127.0.0.1:42092/solr
   [junit4]   2> 3239000 INFO  (zkConnectionManagerCallback-8158-thread-1) [    ] o.a.s.c.c.ConnectionManager zkClient has connected
   [junit4]   2> 3239036 INFO  (zkConnectionManagerCallback-8160-thread-1) [    ] o.a.s.c.c.ConnectionManager zkClient has connected
   [junit4]   2> 3239377 INFO  (jetty-launcher-8146-thread-2) [n:127.0.0.1:46034_solr    ] o.a.s.c.OverseerElectionContext I am going to be the leader 127.0.0.1:46034_solr
   [junit4]   2> 3239378 INFO  (jetty-launcher-8146-thread-2) [n:127.0.0.1:46034_solr    ] o.a.s.c.Overseer Overseer (id=74705384824045574-127.0.0.1:46034_solr-n_0000000000) starting
   [junit4]   2> 3239400 INFO  (zkConnectionManagerCallback-8167-thread-1) [    ] o.a.s.c.c.ConnectionManager zkClient has connected
   [junit4]   2> 3239416 INFO  (jetty-launcher-8146-thread-2) [n:127.0.0.1:46034_solr    ] o.a.s.c.s.i.ZkClientClusterStateProvider Cluster at 127.0.0.1:42092/solr ready
   [junit4]   2> 3239449 INFO  (OverseerStateUpdate-74705384824045574-127.0.0.1:46034_solr-n_0000000000) [n:127.0.0.1:46034_solr    ] o.a.s.c.Overseer Starting to work on the main queue : 127.0.0.1:46034_solr
   [junit4]   2> 3239538 INFO  (jetty-launcher-8146-thread-2) [n:127.0.0.1:46034_solr    ] o.a.s.c.ZkController Register node as live in ZooKeeper:/live_nodes/127.0.0.1:46034_solr
   [junit4]   2> 3239559 INFO  (zkCallback-8166-thread-1) [    ] o.a.s.c.c.ZkStateReader Updated live nodes from ZooKeeper... (0) -> (1)
   [junit4]   2> 3239560 INFO  (zkCallback-8159-thread-1) [    ] o.a.s.c.c.ZkStateReader Updated live nodes from ZooKeeper... (0) -> (1)
   [junit4]   2> 3239632 INFO  (jetty-launcher-8146-thread-2) [n:127.0.0.1:46034_solr    ] o.a.s.h.a.MetricsHistoryHandler No .system collection, keeping metrics history in memory.
   [junit4]   2> 3239649 INFO  (jetty-launcher-8146-thread-1) [    ] o.a.s.h.c.HttpShardHandlerFactory Host whitelist initialized: WhitelistHostChecker [whitelistHosts=null, whitelistHostCheckingEnabled=true]
   [junit4]   2> 3239650 WARN  (jetty-launcher-8146-thread-1) [    ] o.e.j.u.s.S.config No Client EndPointIdentificationAlgorithm configured for SslContextFactory@7be3c6f1[provider=null,keyStore=null,trustStore=null]
   [junit4]   2> 3239670 WARN  (jetty-launcher-8146-thread-1) [    ] o.e.j.u.s.S.config No Client EndPointIdentificationAlgorithm configured for SslContextFactory@53d3bccd[provider=null,keyStore=null,trustStore=null]
   [junit4]   2> 3239686 INFO  (jetty-launcher-8146-thread-1) [    ] o.a.s.c.ZkContainer Zookeeper client=127.0.0.1:42092/solr
   [junit4]   2> 3239705 INFO  (zkConnectionManagerCallback-8174-thread-1) [    ] o.a.s.c.c.ConnectionManager zkClient has connected
   [junit4]   2> 3239708 INFO  (zkConnectionManagerCallback-8176-thread-1) [    ] o.a.s.c.c.ConnectionManager zkClient has connected
   [junit4]   2> 3239738 INFO  (jetty-launcher-8146-thread-1) [n:127.0.0.1:39178_solr    ] o.a.s.c.c.ZkStateReader Updated live nodes from ZooKeeper... (0) -> (1)
   [junit4]   2> 3239740 INFO  (jetty-launcher-8146-thread-1) [n:127.0.0.1:39178_solr    ] o.a.s.c.ZkController Publish node=127.0.0.1:39178_solr as DOWN
   [junit4]   2> 3239741 INFO  (jetty-launcher-8146-thread-1) [n:127.0.0.1:39178_solr    ] o.a.s.c.TransientSolrCoreCacheDefault Allocating transient cache for 2147483647 transient cores
   [junit4]   2> 3239741 INFO  (jetty-launcher-8146-thread-1) [n:127.0.0.1:39178_solr    ] o.a.s.c.ZkController Register node as live in ZooKeeper:/live_nodes/127.0.0.1:39178_solr
   [junit4]   2> 3239758 INFO  (zkCallback-8166-thread-1) [    ] o.a.s.c.c.ZkStateReader Updated live nodes from ZooKeeper... (1) -> (2)
   [junit4]   2> 3239759 INFO  (jetty-launcher-8146-thread-2) [n:127.0.0.1:46034_solr    ] o.a.s.m.r.SolrJmxReporter JMX monitoring for 'solr_46034.solr.node' (registry 'solr.node') enabled at server: com.sun.jmx.mbeanserver.JmxMBeanServer@1d1572a
   [junit4]   2> 3239759 INFO  (zkCallback-8175-thread-1) [    ] o.a.s.c.c.ZkStateReader Updated live nodes from ZooKeeper... (1) -> (2)
   [junit4]   2> 3239774 INFO  (zkConnectionManagerCallback-8183-thread-1) [    ] o.a.s.c.c.ConnectionManager zkClient has connected
   [junit4]   2> 3239775 INFO  (jetty-launcher-8146-thread-1) [n:127.0.0.1:39178_solr    ] o.a.s.c.c.ZkStateReader Updated live nodes from ZooKeeper... (0) -> (2)
   [junit4]   2> 3239776 INFO  (jetty-launcher-8146-thread-1) [n:127.0.0.1:39178_solr    ] o.a.s.c.s.i.ZkClientClusterStateProvider Cluster at 127.0.0.1:42092/solr ready
   [junit4]   2> 3239828 INFO  (zkCallback-8159-thread-1) [    ] o.a.s.c.c.ZkStateReader Updated live nodes from ZooKeeper... (1) -> (2)
   [junit4]   2> 3239850 INFO  (jetty-launcher-8146-thread-1) [n:127.0.0.1:39178_solr    ] o.a.s.h.a.MetricsHistoryHandler No .system collection, keeping metrics history in memory.
   [junit4]   2> 3240009 INFO  (jetty-launcher-8146-thread-2) [n:127.0.0.1:46034_solr    ] o.a.s.m.r.SolrJmxReporter JMX monitoring for 'solr_46034.solr.jvm' (registry 'solr.jvm') enabled at server: com.sun.jmx.mbeanserver.JmxMBeanServer@1d1572a
   [junit4]   2> 3240009 INFO  (jetty-launcher-8146-thread-2) [n:127.0.0.1:46034_solr    ] o.a.s.m.r.SolrJmxReporter JMX monitoring for 'solr_46034.solr.jetty' (registry 'solr.jetty') enabled at server: com.sun.jmx.mbeanserver.JmxMBeanServer@1d1572a
   [junit4]   2> 3240010 INFO  (jetty-launcher-8146-thread-2) [n:127.0.0.1:46034_solr    ] o.a.s.c.CorePropertiesLocator Found 0 core definitions underneath /home/jenkins/jenkins-slave/workspace/Lucene-Solr-Tests-master/solr/build/solr-core/test/J2/temp/solr.cloud.AliasIntegrationTest_579AAEF77EB9E494-001/tempDir-001/node2/.
   [junit4]   2> 3240208 INFO  (jetty-launcher-8146-thread-1) [n:127.0.0.1:39178_solr    ] o.a.s.m.r.SolrJmxReporter JMX monitoring for 'solr_39178.solr.node' (registry 'solr.node') enabled at server: com.sun.jmx.mbeanserver.JmxMBeanServer@1d1572a
   [junit4]   2> 3240246 INFO  (jetty-launcher-8146-thread-1) [n:127.0.0.1:39178_solr    ] o.a.s.m.r.SolrJmxReporter JMX monitoring for 'solr_39178.solr.jvm' (registry 'solr.jvm') enabled at server: com.sun.jmx.mbeanserver.JmxMBeanServer@1d1572a
   [junit4]   2> 3240246 INFO  (jetty-launcher-8146-thread-1) [n:127.0.0.1:39178_solr    ] o.a.s.m.r.SolrJmxReporter JMX monitoring for 'solr_39178.solr.jetty' (registry 'solr.jetty') enabled at server: com.sun.jmx.mbeanserver.JmxMBeanServer@1d1572a
   [junit4]   2> 3240264 INFO  (jetty-launcher-8146-thread-1) [n:127.0.0.1:39178_solr    ] o.a.s.c.CorePropertiesLocator Found 0 core definitions underneath /home/jenkins/jenkins-slave/workspace/Lucene-Solr-Tests-master/solr/build/solr-core/test/J2/temp/solr.cloud.AliasIntegrationTest_579AAEF77EB9E494-001/tempDir-001/node1/.
   [junit4]   2> 3240540 INFO  (zkConnectionManagerCallback-8189-thread-1) [    ] o.a.s.c.c.ConnectionManager zkClient has connected
   [junit4]   2> 3240541 INFO  (SUITE-AliasIntegrationTest-seed#[579AAEF77EB9E494]-worker) [    ] o.a.s.c.c.ZkStateReader Updated live nodes from ZooKeeper... (0) -> (2)
   [junit4]   2> 3240542 INFO  (SUITE-AliasIntegrationTest-seed#[579AAEF77EB9E494]-worker) [    ] o.a.s.c.s.i.ZkClientClusterStateProvider Cluster at 127.0.0.1:42092/solr ready
   [junit4]   2> 3240819 INFO  (TEST-AliasIntegrationTest.testClusterStateProviderAPI-seed#[579AAEF77EB9E494]) [    ] o.a.s.SolrTestCaseJ4 ###Starting testClusterStateProviderAPI
   [junit4]   2> 3241066 INFO  (qtp1668613959-22233) [n:127.0.0.1:46034_solr    ] o.a.s.h.a.CollectionsHandler Invoked Collection Action :clusterstatus with params action=CLUSTERSTATUS&wt=javabin&version=2 and sendToOCPQueue=true
   [junit4]   2> 3241067 INFO  (qtp1668613959-22233) [n:127.0.0.1:46034_solr    ] o.a.s.s.HttpSolrCall [admin] webapp=null path=/admin/collections params={action=CLUSTERSTATUS&wt=javabin&version=2} status=0 QTime=0
   [junit4]   2> 3241082 INFO  (qtp869581817-22223) [n:127.0.0.1:39178_solr    ] o.a.s.h.a.CollectionsHandler Invoked Collection Action :create with params collection.configName=conf&name=collection1meta&nrtReplicas=1&action=CREATE&numShards=2&wt=javabin&version=2 and sendToOCPQueue=true
   [junit4]   2> 3241211 INFO  (OverseerThreadFactory-7111-thread-1-processing-n:127.0.0.1:46034_solr) [n:127.0.0.1:46034_solr    ] o.a.s.c.a.c.CreateCollectionCmd Create collection collection1meta
   [junit4]   2> 3241349 INFO  (OverseerStateUpdate-74705384824045574-127.0.0.1:46034_solr-n_0000000000) [n:127.0.0.1:46034_solr    ] o.a.s.c.o.SliceMutator createReplica() {
   [junit4]   2>   "operation":"ADDREPLICA",
   [junit4]   2>   "collection":"collection1meta",
   [junit4]   2>   "shard":"shard1",
   [junit4]   2>   "core":"collection1meta_shard1_replica_n1",
   [junit4]   2>   "state":"down",
   [junit4]   2>   "base_url":"http://127.0.0.1:39178/solr",
   [junit4]   2>   "type":"NRT",
   [junit4]   2>   "waitForFinalState":"false"} 
   [junit4]   2> 3241350 INFO  (OverseerStateUpdate-74705384824045574-127.0.0.1:46034_solr-n_0000000000) [n:127.0.0.1:46034_solr    ] o.a.s.c.o.SliceMutator createReplica() {
   [junit4]   2>   "operation":"ADDREPLICA",
   [junit4]   2>   "collection":"collection1meta",
   [junit4]   2>   "shard":"shard2",
   [junit4]   2>   "core":"collection1meta_shard2_replica_n2",
   [junit4]   2>   "state":"down",
   [junit4]   2>   "base_url":"http://127.0.0.1:46034/solr",
   [junit4]   2>   "type":"NRT",
   [junit4]   2>   "waitForFinalState":"false"} 
   [junit4]   2> 3241610 INFO  (qtp869581817-22225) [n:127.0.0.1:39178_solr    x:collection1meta_shard1_replica_n1] o.a.s.h.a.CoreAdminOperation core create command qt=/admin/cores&coreNodeName=core_node3&collection.configName=conf&newCollection=true&name=collection1meta_shard1_replica_n1&action=CREATE&numShards=2&collection=collection1meta&shard=shard1&wt=javabin&version=2&replicaType=NRT
   [junit4]   2> 3241613 INFO  (qtp1668613959-22235) [n:127.0.0.1:46034_solr    x:collection1meta_shard2_replica_n2] o.a.s.h.a.CoreAdminOperation core create command qt=/admin/cores&coreNodeName=core_node4&collection.configName=conf&newCollection=true&name=collection1meta_shard2_replica_n2&action=CREATE&numShards=2&collection=collection1meta&shard=shard2&wt=javabin&version=2&replicaType=NRT
   [junit4]   2> 3241613 INFO  (qtp1668613959-22235) [n:127.0.0.1:46034_solr    x:collection1meta_shard2_replica_n2] o.a.s.c.TransientSolrCoreCacheDefault Allocating transient cache for 2147483647 transient cores
   [junit4]   2> 3242937 INFO  (qtp1668613959-22235) [n:127.0.0.1:46034_solr c:collection1meta s:shard2 r:core_node4 x:collection1meta_shard2_replica_n2] o.a.s.c.SolrConfig Using Lucene MatchVersion: 9.0.0
   [junit4]   2> 3243031 INFO  (qtp1668613959-22235) [n:127.0.0.1:46034_solr c:collection1meta s:shard2 r:core_node4 x:collection1meta_shard2_replica_n2] o.a.s.s.IndexSchema [collection1meta_shard2_replica_n2] Schema name=minimal
   [junit4]   2> 3243033 INFO  (qtp1668613959-22235) [n:127.0.0.1:46034_solr c:collection1meta s:shard2 r:core_node4 x:collection1meta_shard2_replica_n2] o.a.s.s.IndexSchema Loaded schema minimal/1.1 with uniqueid field id
   [junit4]   2> 3243033 INFO  (qtp1668613959-22235) [n:127.0.0.1:46034_solr c:collection1meta s:shard2 r:core_node4 x:collection1meta_shard2_replica_n2] o.a.s.c.CoreContainer Creating SolrCore 'collection1meta_shard2_replica_n2' using configuration from collection collection1meta, trusted=true
   [junit4]   2> 3243034 INFO  (qtp1668613959-22235) [n:127.0.0.1:46034_solr c:collection1meta s:shard2 r:core_node4 x:collection1meta_shard2_replica_n2] o.a.s.m.r.SolrJmxReporter JMX monitoring for 'solr_46034.solr.core.collection1meta.shard2.replica_n2' (registry 'solr.core.collection1meta.shard2.replica_n2') enabled at server: com.sun.jmx.mbeanserver.JmxMBeanServer@1d1572a
   [junit4]   2> 3243034 INFO  (qtp1668613959-22235) [n:127.0.0.1:46034_solr c:collection1meta s:shard2 r:core_node4 x:collection1meta_shard2_replica_n2] o.a.s.c.SolrCore [[collection1meta_shard2_replica_n2] ] Opening new SolrCore at [/home/jenkins/jenkins-slave/workspace/Lucene-Solr-Tests-master/solr/build/solr-core/test/J2/temp/solr.cloud.AliasIntegrationTest_579AAEF77EB9E494-001/tempDir-001/node2/collection1meta_shard2_replica_n2], dataDir=[/home/jenkins/jenkins-slave/workspace/Lucene-Solr-Tests-master/solr/build/solr-core/test/J2/temp/solr.cloud.AliasIntegrationTest_579AAEF77EB9E494-001/tempDir-001/node2/./collection1meta_shard2_replica_n2/data/]
   [junit4]   2> 3243063 INFO  (qtp869581817-22225) [n:127.0.0.1:39178_solr c:collection1meta s:shard1 r:core_node3 x:collection1meta_shard1_replica_n1] o.a.s.c.SolrConfig Using Lucene MatchVersion: 9.0.0
   [junit4]   2> 3243089 INFO  (qtp869581817-22225) [n:127.0.0.1:39178_solr c:collection1meta s:shard1 r:core_node3 x:collection1meta_shard1_replica_n1] o.a.s.s.IndexSchema [collection1meta_shard1_replica_n1] Schema name=minimal
   [junit4]   2> 3243144 INFO  (qtp869581817-22225) [n:127.0.0.1:39178_solr c:collection1meta s:shard1 r:core_node3 x:collection1meta_shard1_replica_n1] o.a.s.s.IndexSchema Loaded schema minimal/1.1 with uniqueid field id
   [junit4]   2> 3243144 INFO  (qtp869581817-22225) [n:127.0.0.1:39178_solr c:collection1meta s:shard1 r:core_node3 x:collection1meta_shard1_replica_n1] o.a.s.c.CoreContainer Creating SolrCore 'collection1meta_shard1_replica_n1' using configuration from collection collection1meta, trusted=true
   [junit4]   2> 3243144 INFO  (qtp869581817-22225) [n:127.0.0.1:39178_solr c:collection1meta s:shard1 r:core_node3 x:collection1meta_shard1_replica_n1] o.a.s.m.r.SolrJmxReporter JMX monitoring for 'solr_39178.solr.core.collection1meta.shard1.replica_n1' (registry 'solr.core.collection1meta.shard1.replica_n1') enabled at server: com.sun.jmx.mbeanserver.JmxMBeanServer@1d1572a
   [junit4]   2> 3243144 INFO  (qtp869581817-22225) [n:127.0.0.1:39178_solr c:collection1meta s:shard1 r:core_node3 x:collection1meta_shard1_replica_n1] o.a.s.c.SolrCore [[collection1meta_shard1_replica_n1] ] Opening new SolrCore at [/home/jenkins/jenkins-slave/workspace/Lucene-Solr-Tests-master/solr/build/solr-core/test/J2/temp/solr.cloud.AliasIntegrationTest_579AAEF77EB9E494-001/tempDir-001/node1/collection1meta_shard1_replica_n1], dataDir=[/home/jenkins/jenkins-slave/workspace/Lucene-Solr-Tests-master/solr/build/solr-core/test/J2/temp/solr.cloud.AliasIntegrationTest_579AAEF77EB9E494-001/tempDir-001/node1/./collection1meta_shard1_replica_n1/data/]
   [junit4]   2> 3243452 INFO  (qtp1668613959-22235) [n:127.0.0.1:46034_solr c:collection1meta s:shard2 r:core_node4 x:collection1meta_shard2_replica_n2] o.a.s.u.UpdateHandler Using UpdateLog implementation: org.apache.solr.update.UpdateLog
   [junit4]   2> 3243452 INFO  (qtp1668613959-22235) [n:127.0.0.1:46034_solr c:collection1meta s:shard2 r:core_node4 x:collection1meta_shard2_replica_n2] o.a.s.u.UpdateLog Initializing UpdateLog: dataDir=null defaultSyncLevel=FLUSH numRecordsToKeep=100 maxNumLogsToKeep=10 numVersionBuckets=65536
   [junit4]   2> 3243454 INFO  (qtp1668613959-22235) [n:127.0.0.1:46034_solr c:collection1meta s:shard2 r:core_node4 x:collection1meta_shard2_replica_n2] o.a.s.u.CommitTracker Hard AutoCommit: disabled
   [junit4]   2> 3243454 INFO  (qtp1668613959-22235) [n:127.0.0.1:46034_solr c:collection1meta s:shard2 r:core_node4 x:collection1meta_shard2_replica_n2] o.a.s.u.CommitTracker Soft AutoCommit: disabled
   [junit4]   2> 3243455 INFO  (qtp1668613959-22235) [n:127.0.0.1:46034_solr c:collection1meta s:shard2 r:core_node4 x:collection1meta_shard2_replica_n2] o.a.s.s.SolrIndexSearcher Opening [Searcher@45a7e28d[collection1meta_shard2_replica_n2] main]
   [junit4]   2> 3243488 INFO  (qtp1668613959-22235) [n:127.0.0.1:46034_solr c:collection1meta s:shard2 r:core_node4 x:collection1meta_shard2_replica_n2] o.a.s.r.ManagedResourceStorage Configured ZooKeeperStorageIO with znodeBase: /configs/conf
   [junit4]   2> 3243489 INFO  (qtp1668613959-22235) [n:127.0.0.1:46034_solr c:collection1meta s:shard2 r:core_node4 x:collection1meta_shard2_replica_n2] o.a.s.r.ManagedResourceStorage Loaded null at path _rest_managed.json using ZooKeeperStorageIO:path=/configs/conf
   [junit4]   2> 3243489 INFO  (qtp1668613959-22235) [n:127.0.0.1:46034_solr c:collection1meta s:shard2 r:core_node4 x:collection1meta_shard2_replica_n2] o.a.s.h.ReplicationHandler Commits will be reserved for 10000ms.
   [junit4]   2> 3243489 INFO  (qtp1668613959-22235) [n:127.0.0.1:46034_solr c:collection1meta s:shard2 r:core_node4 x:collection1meta_shard2_replica_n2] o.a.s.u.UpdateLog Could not find max version in index or recent updates, using new clock 1633749236329742336
   [junit4]   2> 3243492 INFO  (searcherExecutor-7123-thread-1-processing-n:127.0.0.1:46034_solr x:collection1meta_shard2_replica_n2 c:collection1meta s:shard2 r:core_node4) [n:127.0.0.1:46034_solr c:collection1meta s:shard2 r:core_node4 x:collection1meta_shard2_replica_n2] o.a.s.c.SolrCore [collection1meta_shard2_replica_n2] Registered new searcher Searcher@45a7e28d[collection1meta_shard2_replica_n2] main{ExitableDirectoryReader(UninvertingDirectoryReader())}
   [junit4]   2> 3243526 INFO  (qtp1668613959-22235) [n:127.0.0.1:46034_solr c:collection1meta s:shard2 r:core_node4 x:collection1meta_shard2_replica_n2] o.a.s.c.ZkShardTerms Successful update of terms at /collections/collection1meta/terms/shard2 to Terms{values={core_node4=0}, version=0}
   [junit4]   2> 3243527 INFO  (qtp1668613959-22235) [n:127.0.0.1:46034_solr c:collection1meta s:shard2 r:core_node4 x:collection1meta_shard2_replica_n2] o.a.s.c.ShardLeaderElectionContextBase make sure parent is created /collections/collection1meta/leaders/shard2
   [junit4]   2> 3243530 INFO  (qtp869581817-22225) [n:127.0.0.1:39178_solr c:collection1meta s:shard1 r:core_node3 x:collection1meta_shard1_replica_n1] o.a.s.u.UpdateHandler Using UpdateLog implementation: org.apache.solr.update.UpdateLog
   [junit4]   2> 3243530 INFO  (qtp869581817-22225) [n:127.0.0.1:39178_solr c:collection1meta s:shard1 r:core_node3 x:collection1meta_shard1_replica_n1] o.a.s.u.UpdateLog Initializing UpdateLog: dataDir=null defaultSyncLevel=FLUSH numRecordsToKeep=100 maxNumLogsToKeep=10 numVersionBuckets=65536
   [junit4]   2> 3243531 INFO  (qtp869581817-22225) [n:127.0.0.1:39178_solr c:collection1meta s:shard1 r:core_node3 x:collection1meta_shard1_replica_n1] o.a.s.u.CommitTracker Hard AutoCommit: disabled
   [junit4]   2> 3243531 INFO  (qtp869581817-22225) [n:127.0.0.1:39178_solr c:collection1meta s:shard1 r:core_node3 x:collection1meta_shard1_replica_n1] o.a.s.u.CommitTracker Soft AutoCommit: disabled
   [junit4]   2> 3243541 INFO  (qtp1668613959-22235) [n:127.0.0.1:46034_solr c:collection1meta s:shard2 r:core_node4 x:collection1meta_shard2_replica_n2] o.a.s.c.ShardLeaderElectionContext Enough replicas found to continue.
   [junit4]   2> 3243541 INFO  (qtp1668613959-22235) [n:127.0.0.1:46034_solr c:collection1meta s:shard2 r:core_node4 x:collection1meta_shard2_replica_n2] o.a.s.c.ShardLeaderElectionContext I may be the new leader - try and sync
   [junit4]   2> 3243541 INFO  (qtp1668613959-22235) [n:127.0.0.1:46034_solr c:collection1meta s:shard2 r:core_node4 x:collection1meta_shard2_replica_n2] o.a.s.c.SyncStrategy Sync replicas to http://127.0.0.1:46034/solr/collection1meta_shard2_replica_n2/
   [junit4]   2> 3243541 INFO  (qtp1668613959-22235) [n:127.0.0.1:46034_solr c:collection1meta s:shard2 r:core_node4 x:collection1meta_shard2_replica_n2] o.a.s.c.SyncStrategy Sync Success - now sync replicas to me
   [junit4]   2> 3243542 INFO  (qtp1668613959-22235) [n:127.0.0.1:46034_solr c:collection1meta s:shard2 r:core_node4 x:collection1meta_shard2_replica_n2] o.a.s.c.SyncStrategy http://127.0.0.1:46034/solr/collection1meta_shard2_replica_n2/ has no replicas
   [junit4]   2> 3243542 INFO  (qtp1668613959-22235) [n:127.0.0.1:46034_solr c:collection1meta s:shard2 r:core_node4 x:collection1meta_shard2_replica_n2] o.a.s.c.ShardLeaderElectionContextBase Creating leader registration node /collections/collection1meta/leaders/shard2/leader after winning as /collections/collection1meta/leader_elect/shard2/election/74705384824045574-core_node4-n_0000000000
   [junit4]   2> 3243543 INFO  (qtp1668613959-22235) [n:127.0.0.1:46034_solr c:collection1meta s:shard2 r:core_node4 x:collection1meta_shard2_replica_n2] o.a.s.c.ShardLeaderElectionContext I am the new leader: http://127.0.0.1:46034/solr/collection1meta_shard2_replica_n2/ shard2
   [junit4]   2> 3243545 INFO  (qtp869581817-22225) [n:127.0.0.1:39178_solr c:collection1meta s:shard1 r:core_node3 x:collection1meta_shard1_replica_n1] o.a.s.s.SolrIndexSearcher Opening [Searcher@2f97d460[collection1meta_shard1_replica_n1] main]
   [junit4]   2> 3243557 INFO  (qtp869581817-22225) [n:127.0.0.1:39178_solr c:collection1meta s:shard1 r:core_node3 x:collection1meta_shard1_replica_n1] o.a.s.r.ManagedResourceStorage Configured ZooKeeperStorageIO with znodeBase: /configs/conf
   [junit4]   2> 3243558 INFO  (qtp869581817-22225) [n:127.0.0.1:39178_solr c:collection1meta s:shard1 r:core_node3 x:collection1meta_shard1_replica_n1] o.a.s.r.ManagedResourceStorage Loaded null at path _rest_managed.json using ZooKeeperStorageIO:path=/configs/conf
   [junit4]   2> 3243558 INFO  (qtp869581817-22225) [n:127.0.0.1:39178_solr c:collection1meta s:shard1 r:core_node3 x:collection1meta_shard1_replica_n1] o.a.s.h.ReplicationHandler Commits will be reserved for 10000ms.
   [junit4]   2> 3243558 INFO  (qtp869581817-22225) [n:127.0.0.1:39178_solr c:collection1meta s:shard1 r:core_node3 x:collection1meta_shard1_replica_n1] o.a.s.u.UpdateLog Could not find max version in index or recent updates, using new clock 1633749236402094080
   [junit4]   2> 3243579 INFO  (searcherExecutor-7124-thread-1-processing-n:127.0.0.1:39178_solr x:collection1meta_shard1_replica_n1 c:collection1meta s:shard1 r:core_node3) [n:127.0.0.1:39178_solr c:collection1meta s:shard1 r:core_node3 x:collection1meta_shard1_replica_n1] o.a.s.c.SolrCore [collection1meta_shard1_replica_n1] Registered new searcher Searcher@2f97d460[collection1meta_shard1_replica_n1] main{ExitableDirectoryReader(UninvertingDirectoryReader())}
   [junit4]   2> 3243590 INFO  (qtp869581817-22225) [n:127.0.0.1:39178_solr c:collection1meta s:shard1 r:core_node3 x:collection1meta_shard1_replica_n1] o.a.s.c.ZkShardTerms Successful update of terms at /collections/collection1meta/terms/shard1 to Terms{values={core_node3=0}, version=0}
   [junit4]   2> 3243590 INFO  (qtp869581817-22225) [n:127.0.0.1:39178_solr c:collection1meta s:shard1 r:core_node3 x:collection1meta_shard1_replica_n1] o.a.s.c.ShardLeaderElectionContextBase make sure parent is created /collections/collection1meta/leaders/shard1
   [junit4]   2> 3243592 INFO  (qtp869581817-22225) [n:127.0.0.1:39178_solr c:collection1meta s:shard1 r:core_node3 x:collection1meta_shard1_replica_n1] o.a.s.c.ShardLeaderElectionContext Enough replicas found to continue.
   [junit4]   2> 3243592 INFO  (qtp869581817-22225) [n:127.0.0.1:39178_solr c:collection1meta s:shard1 r:core_node3 x:collection1meta_shard1_replica_n1] o.a.s.c.ShardLeaderElectionContext I may be the new leader - try and sync
   [junit4]   2> 3243592 INFO  (qtp869581817-22225) [n:127.0.0.1:39178_solr c:collection1meta s:shard1 r:core_node3 x:collection1meta_shard1_replica_n1] o.a.s.c.SyncStrategy Sync replicas to http://127.0.0.1:39178/solr/collection1meta_shard1_replica_n1/
   [junit4]   2> 3243592 INFO  (qtp869581817-22225) [n:127.0.0.1:39178_solr c:collection1meta s:shard1 r:core_node3 x:collection1meta_shard1_replica_n1] o.a.s.c.SyncStrategy Sync Success - now sync replicas to me
   [junit4]   2> 3243593 INFO  (qtp869581817-22225) [n:127.0.0.1:39178_solr c:collection1meta s:shard1 r:core_node3 x:collection1meta_shard1_replica_n1] o.a.s.c.SyncStrategy http://127.0.0.1:39178/solr/collection1meta_shard1_replica_n1/ has no replicas
   [junit4]   2> 3243593 INFO  (qtp869581817-22225) [n:127.0.0.1:39178_solr c:collection1meta s:shard1 r:core_node3 x:collection1meta_shard1_replica_n1] o.a.s.c.ShardLeaderElectionContextBase Creating leader registration node /collections/collection1meta/leaders/shard1/leader after winning as /collections/collection1meta/leader_elect/shard1/election/74705384824045577-core_node3-n_0000000000
   [junit4]   2> 3243603 INFO  (qtp869581817-22225) [n:127.0.0.1:39178_solr c:collection1meta s:shard1 r:core_node3 x:collection1meta_shard1_replica_n1] o.a.s.c.ShardLeaderElectionContext I am the new leader: http://127.0.0.1:39178/solr/collection1meta_shard1_replica_n1/ shard1
   [junit4]   2> 3243705 INFO  (zkCallback-8159-thread-2) [    ] o.a.s.c.c.ZkStateReader A cluster state change: [WatchedEvent state:SyncConnected type:NodeDataChanged path:/collections/collection1meta/state.json] for collection [collection1meta] has occurred - updating... (live nodes size: [2])
   [junit4]   2> 3243705 INFO  (zkCallback-8159-thread-1) [    ] o.a.s.c.c.ZkStateReader A cluster state change: [WatchedEvent state:SyncConnected type:NodeDataChanged path:/collections/collection1meta/state.json] for collection [collection1meta] has occurred - updating... (live nodes size: [2])
   [junit4]   2> 3243705 INFO  (zkCallback-8175-thread-1) [    ] o.a.s.c.c.ZkStateReader A cluster state change: [WatchedEvent state:SyncConnected type:NodeDataChanged path:/collections/collection1meta/state.json] for collection [collection1meta] has occurred - updating... (live nodes size: [2])
   [junit4]   2> 3243706 INFO  (qtp869581817-22225) [n:127.0.0.1:39178_solr c:collection1meta s:shard1 r:core_node3 x:collection1meta_shard1_replica_n1] o.a.s.c.ZkController I am the leader, no recovery necessary
   [junit4]   2> 3243706 INFO  (qtp1668613959-22235) [n:127.0.0.1:46034_solr c:collection1meta s:shard2 r:core_node4 x:collection1meta_shard2_replica_n2] o.a.s.c.ZkController I am the leader, no recovery necessary
   [junit4]   2> 3243708 INFO  (qtp869581817-22225) [n:127.0.0.1:39178_solr c:collection1meta s:shard1 r:core_node3 x:collection1meta_shard1_replica_n1] o.a.s.s.HttpSolrCall [admin] webapp=null path=/admin/cores params={qt=/admin/cores&coreNodeName=core_node3&collection.configName=conf&newCollection=true&name=collection1meta_shard1_replica_n1&action=CREATE&numShards=2&collection=collection1meta&shard=shard1&wt=javabin&version=2&replicaType=NRT} status=0 QTime=2098
   [junit4]   2> 3243709 INFO  (qtp1668613959-22235) [n:127.0.0.1:46034_solr c:collection1meta s:shard2 r:core_node4 x:collection1meta_shard2_replica_n2] o.a.s.s.HttpSolrCall [admin] webapp=null path=/admin/cores params={qt=/admin/cores&coreNodeName=core_node4&collection.configName=conf&newCollection=true&name=collection1meta_shard2_replica_n2&action=CREATE&numShards=2&collection=collection1meta&shard=shard2&wt=javabin&version=2&replicaType=NRT} status=0 QTime=2096
   [junit4]   2> 3243733 INFO  (qtp869581817-22223) [n:127.0.0.1:39178_solr    ] o.a.s.h.a.CollectionsHandler Wait for new collection to be active for at most 45 seconds. Check all shard replicas
   [junit4]   2> 3243829 INFO  (zkCallback-8175-thread-2) [    ] o.a.s.c.c.ZkStateReader A cluster state change: [WatchedEvent state:SyncConnected type:NodeDataChanged path:/collections/collection1meta/state.json] for collection [collection1meta] has occurred - updating... (live nodes size: [2])
   [junit4]   2> 3243829 INFO  (zkCallback-8175-thread-1) [    ] o.a.s.c.c.ZkStateReader A cluster state change: [WatchedEvent state:SyncConnected type:NodeDataChanged path:/collections/collection1meta/state.json] for collection [collection1meta] has occurred - updating... (live nodes size: [2])
   [junit4]   2> 3243830 INFO  (qtp869581817-22223) [n:127.0.0.1:39178_solr    ] o.a.s.s.HttpSolrCall [admin] webapp=null path=/admin/collections params={collection.configName=conf&name=collection1meta&nrtReplicas=1&action=CREATE&numShards=2&wt=javabin&version=2} status=0 QTime=2747
   [junit4]   2> 3243830 INFO  (zkCallback-8159-thread-2) [    ] o.a.s.c.c.ZkStateReader A cluster state change: [WatchedEvent state:SyncConnected type:NodeDataChanged path:/collections/collection1meta/state.json] for collection [collection1meta] has occurred - updating... (live nodes size: [2])
   [junit4]   2> 3243830 INFO  (zkCallback-8159-thread-1) [    ] o.a.s.c.c.ZkStateReader A cluster state change: [WatchedEvent state:SyncConnected type:NodeDataChanged path:/collections/collection1meta/state.json] for collection [collection1meta] has occurred - updating... (live nodes size: [2])
   [junit4]   2> 3243833 INFO  (qtp869581817-22226) [n:127.0.0.1:39178_solr    ] o.a.s.h.a.CollectionsHandler Invoked Collection Action :create with params collection.configName=conf&name=collection2meta&nrtReplicas=1&action=CREATE&numShards=1&wt=javabin&version=2 and sendToOCPQueue=true
   [junit4]   2> 3243848 INFO  (zkCallback-8159-thread-3) [    ] o.a.s.c.c.ZkStateReader A cluster state change: [WatchedEvent state:SyncConnected type:NodeDataChanged path:/collections/collection1meta/state.json] for collection [collection1meta] has occurred - updating... (live nodes size: [2])
   [junit4]   2> 3243849 INFO  (OverseerCollectionConfigSetProcessor-74705384824045574-127.0.0.1:46034_solr-n_0000000000) [n:127.0.0.1:46034_solr    ] o.a.s.c.OverseerTaskQueue Response ZK path: /overseer/collection-queue-work/qnr-0000000000 doesn't exist.  Requestor may have disconnected from ZooKeeper
   [junit4]   2> 3243851 INFO  (OverseerThreadFactory-7111-thread-2-processing-n:127.0.0.1:46034_solr) [n:127.0.0.1:46034_solr    ] o.a.s.c.a.c.CreateCollectionCmd Create collection collection2meta
   [junit4]   2> 3243997 INFO  (OverseerStateUpdate-74705384824045574-127.0.0.1:46034_solr-n_0000000000) [n:127.0.0.1:46034_solr    ] o.a.s.c.o.SliceMutator createReplica() {
   [junit4]   2>   "operation":"ADDREPLICA",
   [junit4]   2>   "collection":"collection2meta",
   [junit4]   2>   "shard":"shard1",
   [junit4]   2>   "core":"collection2meta_shard1_replica_n1",
   [junit4]   2>   "state":"down",
   [junit4]   2>   "base_url":"http://127.0.0.1:46034/solr",
   [junit4]   2>   "type":"NRT",
   [junit4]   2>   "waitForFinalState":"false"} 
   [junit4]   2> 3244222 INFO  (qtp1668613959-22236) [n:127.0.0.1:46034_solr    x:collection2meta_shard1_replica_n1] o.a.s.h.a.CoreAdminOperation core create command qt=/admin/cores&coreNodeName=core_node2&collection.configName=conf&newCollection=true&name=collection2meta_shard1_replica_n1&action=CREATE&numShards=1&collection=collection2meta&shard=shard1&wt=javabin&version=2&replicaType=NRT
   [junit4]   2> 3245296 INFO  (qtp1668613959-22236) [n:127.0.0.1:46034_solr c:collection2meta s:shard1 r:core_node2 x:collection2meta_shard1_replica_n1] o.a.s.c.SolrConfig Using Lucene MatchVersion: 9.0.0
   [junit4]   2> 3245328 INFO  (qtp1668613959-22236) [n:127.0.0.1:46034_solr c:collection2meta s:shard1 r:core_node2 x:collection2meta_shard1_replica_n1] o.a.s.s.IndexSchema [collection2meta_shard1_replica_n1] Schema name=minimal
   [junit4]   2> 3245330 INFO  (qtp1668613959-22236) [n:127.0.0.1:46034_solr c:collection2meta s:shard1 r:core_node2 x:collection2meta_shard1_replica_n1] o.a.s.s.IndexSchema Loaded schema minimal/1.1 with uniqueid field id
   [junit4]   2> 3245330 INFO  (qtp1668613959-22236) [n:127.0.0.1:46034_solr c:collection2meta s:shard1 r:core_node2 x:collection2meta_shard1_replica_n1] o.a.s.c.CoreContainer Creating SolrCore 'collection2meta_shard1_replica_n1' using configuration from collection collection2meta, trusted=true
   [junit4]   2> 3245330 INFO  (qtp1668613959-22236) [n:127.0.0.1:46034_solr c:collection2meta s:shard1 r:core_node2 x:collection2meta_shard1_replica_n1] o.a.s.m.r.SolrJmxReporter JMX monitoring for 'solr_46034.solr.core.collection2meta.shard1.replica_n1' (registry 'solr.core.collection2meta.shard1.replica_n1') enabled at server: com.sun.jmx.mbeanserver.JmxMBeanServer@1d1572a
   [junit4]   2> 3245330 INFO  (qtp1668613959-22236) [n:127.0.0.1:46034_solr c:collection2meta s:shard1 r:core_node2 x:collection2meta_shard1_replica_n1] o.a.s.c.SolrCore [[collection2meta_shard1_replica_n1] ] Opening new SolrCore at [/home/jenkins/jenkins-slave/workspace/Lucene-Solr-Tests-master/solr/build/solr-core/test/J2/temp/solr.cloud.AliasIntegrationTest_579AAEF77EB9E494-001/tempDir-001/node2/collection2meta_shard1_replica_n1], dataDir=[/home/jenkins/jenkins-slave/workspace/Lucene-Solr-Tests-master/solr/build/solr-core/test/J2/temp/solr.cloud.AliasIntegrationTest_579AAEF77EB9E494-001/tempDir-001/node2/./collection2meta_shard1_replica_n1/data/]
   [junit4]   2> 3245586 INFO  (qtp1668613959-22236) [n:127.0.0.1:46034_solr c:collection2meta s:shard1 r:core_node2 x:collection2meta_shard1_replica_n1] o.a.s.u.UpdateHandler Using UpdateLog implementation: org.apache.solr.update.UpdateLog
   [junit4]   2> 3245586 INFO  (qtp1668613959-22236) [n:127.0.0.1:46034_solr c:collection2meta s:shard1 r:core_node2 x:collection2meta_shard1_replica_n1] o.a.s.u.UpdateLog Initializing UpdateLog: dataDir=null defaultSyncLevel=FLUSH numRecordsToKeep=100 maxNumLogsToKeep=10 numVersionBuckets=65536
   [junit4]   2> 3245588 INFO  (qtp1668613959-22236) [n:127.0.0.1:46034_solr c:collection2meta s:shard1 r:core_node2 x:collection2meta_shard1_replica_n1] o.a.s.u.CommitTracker Hard AutoCommit: disabled
   [junit4]   2> 3245588 INFO  (qtp1668613959-22236) [n:127.0.0.1:46034_solr c:collection2meta s:shard1 r:core_node2 x:collection2meta_shard1_replica_n1] o.a.s.u.CommitTracker Soft AutoCommit: disabled
   [junit4]   2> 3245589 INFO  (qtp1668613959-22236) [n:127.0.0.1:46034_solr c:collection2meta s:shard1 r:core_node2 x:collection2meta_shard1_replica_n1] o.a.s.s.SolrIndexSearcher Opening [Searcher@71c39c90[collection2meta_shard1_replica_n1] main]
   [junit4]   2> 3245590 INFO  (qtp1668613959-22236) [n:127.0.0.1:46034_solr c:collection2meta s:shard1 r:core_node2 x:collection2meta_shard1_replica_n1] o.a.s.r.ManagedResourceStorage Configured ZooKeeperStorageIO with znodeBase: /configs/conf
   [junit4]   2> 3245592 INFO  (qtp1668613959-22236) [n:127.0.0.1:46034_solr c:collection2meta s:shard1 r:core_node2 x:collection2meta_shard1_replica_n1] o.a.s.r.ManagedResourceStorage Loaded null at path _rest_managed.json using ZooKeeperStorageIO:path=/configs/conf
   [junit4]   2> 3245592 INFO  (qtp1668613959-22236) [n:127.0.0.1:46034_solr c:collection2meta s:shard1 r:core_node2 x:collection2meta_shard1_replica_n1] o.a.s.h.ReplicationHandler Commits will be reserved for 10000ms.
   [junit4]   2> 3245593 INFO  (qtp1668613959-22236) [n:127.0.0.1:46034_solr c:collection2meta s:shard1 r:core_node2 x:collection2meta_shard1_replica_n1] o.a.s.u.UpdateLog Could not find max version in index or recent updates, using new clock 1633749238535946240
   [junit4]   2> 3245621 INFO  (qtp1668613959-22236) [n:127.0.0.1:46034_solr c:collection2meta s:shard1 r:core_node2 x:collection2meta_shard1_replica_n1] o.a.s.c.ZkShardTerms Successful update of terms at /collections/collection2meta/terms/shard1 to Terms{values={core_node2=0}, version=0}
   [junit4]   2> 3245621 INFO  (qtp1668613959-22236) [n:127.0.0.1:46034_solr c:collection2meta s:shard1 r:core_node2 x:collection2meta_shard1_replica_n1] o.a.s.c.ShardLeaderElectionContextBase make sure parent is created /collections/collection2meta/leaders/shard1
   [junit4]   2> 3245623 INFO  (searcherExecutor-7133-thread-1-processing-n:127.0.0.1:46034_solr x:collection2meta_shard1_replica_n1 c:collection2meta s:shard1 r:core_node2) [n:127.0.0.1:46034_solr c:collection2meta s:shard1 r:core_node2 x:collection2meta_shard1_replica_n1] o.a.s.c.SolrCore [collection2meta_shard1_replica_n1] Registered new searcher Searcher@71c39c90[collection2meta_shard1_replica_n1] main{ExitableDirectoryReader(UninvertingDirectoryReader())}
   [junit4]   2> 3245636 INFO  (qtp1668613959-22236) [n:127.0.0.1:46034_solr c:collection2meta s:shard1 r:core_node2 x:collection2meta_shard1_replica_n1] o.a.s.c.ShardLeaderElectionContext Enough replicas found to continue.
   [junit4]   2> 3245636 INFO  (qtp1668613959-22236) [n:127.0.0.1:46034_solr c:collection2meta s:shard1 r:core_node2 x:collection2meta_shard1_replica_n1] o.a.s.c.ShardLeaderElectionContext I may be the new leader - try and sync
   [junit4]   2> 3245636 INFO  (qtp1668613959-22236) [n:127.0.0.1:46034_solr c:collection2meta s:shard1 r:core_node2 x:collection2meta_shard1_replica_n1] o.a.s.c.SyncStrategy Sync replicas to http://127.0.0.1:46034/solr/collection2meta_shard1_replica_n1/
   [junit4]   2> 3245636 INFO  (qtp1668613959-22236) [n:127.0.0.1:46034_solr c:collection2meta s:shard1 r:core_node2 x:collection2meta_shard1_replica_n1] o.a.s.c.SyncStrategy Sync Success - now sync replicas to me
   [junit4]   2> 3245636 INFO  (qtp1668613959-22236) [n:127.0.0.1:46034_solr c:collection2meta s:shard1 r:core_node2 x:collection2meta_shard1_replica_n1] o.a.s.c.SyncStrategy http://127.0.0.1:46034/solr/collection2meta_shard1_replica_n1/ has no replicas
   [junit4]   2> 3245636 INFO  (qtp1668613959-22236) [n:127.0.0.1:46034_solr c:collection2meta s:shard1 r:core_node2 x:collection2meta_shard1_replica_n1] o.a.s.c.ShardLeaderElectionContextBase Creating leader registration node /collections/collection2meta/leaders/shard1/leader after winning as /collections/collection2meta/leader_elect/shard1/election/74705384824045574-core_node2-n_0000000000
   [junit4]   2> 3245637 INFO  (qtp1668613959-22236) [n:127.0.0.1:46034_solr c:collection2meta s:shard1 r:core_node2 x:collection2meta_shard1_replica_n1] o.a.s.c.ShardLeaderElectionContext I am the new leader: http://127.0.0.1:46034/solr/collection2meta_shard1_replica_n1/ shard1
   [junit4]   2> 3245757 INFO  (zkCallback-8159-thread-3) [    ] o.a.s.c.c.ZkStateReader A cluster state change: [WatchedEvent state:SyncConnected type:NodeDataChanged path:/collections/collection2meta/state.json] for collection [collection2meta] has occurred - updating... (live nodes size: [2])
   [junit4]   2> 3245757 INFO  (zkCallback-8159-thread-1) [    ] o.a.s.c.c.ZkStateReader A cluster state change: [WatchedEvent state:SyncConnected type:NodeDataChanged path:/collections/collection2meta/state.json] for collection [collection2meta] has occurred - updating... (live nodes size: [2])
   [junit4]   2> 3245758 INFO  (qtp1668613959-22236) [n:127.0.0.1:46034_solr c:collection2meta s:shard1 r:core_node2 x:collection2meta_shard1_replica_n1] o.a.s.c.ZkController I am the leader, no recovery necessary
   [junit4]   2> 3245760 INFO  (qtp1668613959-22236) [n:127.0.0.1:46034_solr c:collection2meta s:shard1 r:core_node2 x:collection2meta_shard1_replica_n1] o.a.s.s.HttpSolrCall [admin] webapp=null path=/admin/cores params={qt=/admin/cores&coreNodeName=core_node2&collection.configName=conf&newCollection=true&name=collection2meta_shard1_replica_n1&action=CREATE&numShards=1&collection=collection2meta&shard=shard1&wt=javabin&version=2&replicaType=NRT} status=0 QTime=1537
   [junit4]   2> 3245776 INFO  (qtp869581817-22226) [n:127.0.0.1:39178_solr    ] o.a.s.h.a.CollectionsHandler Wait for new collection to be active for at most 45 seconds. Check all shard replicas
   [junit4]   2> 3245882 INFO  (OverseerCollectionConfigSetProcessor-74705384824045574-127.0.0.1:46034_solr-n_0000000000) [n:127.0.0.1:46034_solr    ] o.a.s.c.OverseerTaskQueue Response ZK path: /overseer/collection-queue-work/qnr-0000000002 doesn't exist.  Requestor may have disconnected from ZooKeeper
   [junit4]   2> 3245886 INFO  (zkCallback-8175-thread-2) [    ] o.a.s.c.c.ZkStateReader A cluster state change: [WatchedEvent state:SyncConnected type:NodeDataChanged path:/collections/collection2meta/state.json] for collection [collection2meta] has occurred - updating... (live nodes size: [2])
   [junit4]   2> 3245886 INFO  (qtp869581817-22226) [n:127.0.0.1:39178_solr    ] o.a.s.s.HttpSolrCall [admin] webapp=null path=/admin/collections params={collection.configName=conf&name=collection2meta&nrtReplicas=1&action=CREATE&numShards=1&wt=javabin&version=2} status=0 QTime=2053
   [junit4]   2> 3245907 INFO  (TEST-AliasIntegrationTest.testClusterStateProviderAPI-seed#[579AAEF77EB9E494]) [    ] o.a.s.c.SolrCloudTestCase active replica count: 2 expected replica count: 2
   [junit4]   2> 3245907 INFO  (watches-8186-thread-1) [    ] o.a.s.c.SolrCloudTestCase active replica count: 2 expected replica count: 2
   [junit4]   2> 3245908 INFO  (TEST-AliasIntegrationTest.testClusterStateProviderAPI-seed#[579AAEF77EB9E494]) [    ] o.a.s.c.SolrCloudTestCase active replica count: 1 expected replica count: 1
   [junit4]   2> 3245908 INFO  (watches-8186-thread-1) [    ] o.a.s.c.SolrCloudTestCase active replica count: 1 expected replica count: 1
   [junit4]   2> 3245925 INFO  (qtp869581817-22222) [n:127.0.0.1:39178_solr    ] o.a.s.h.a.CollectionsHandler Invoked Collection Action :aliasprop with params name=testClusterStateProviderAPI&action=ALIASPROP&property.foo=baz&property.bar=bam&wt=javabin&version=2 and sendToOCPQueue=true
   [junit4]   2> 3245926 INFO  (zkCallback-8159-thread-3) [    ] o.a.s.c.c.ZkStateReader A cluster state change: [WatchedEvent state:SyncConnected type:NodeDataChanged path:/collections/collection2meta/state.json] for collection [collection2meta] has occurred - updating... (live nodes size: [2])
   [junit4]   2> 3245926 INFO  (zkCallback-8159-thread-1) [    ] o.a.s.c.c.ZkStateReader A cluster state change: [WatchedEvent state:SyncConnected type:NodeDataChanged path:/collections/collection2meta/state.json] for collection [collection2meta] has occurred - updating... (live nodes size: [2])
   [junit4]   2> 3245939 INFO  (zkCallback-8159-thread-2) [    ] o.a.s.c.c.ZkStateReader A cluster state change: [WatchedEvent state:SyncConnected type:NodeDataChanged path:/collections/collection2meta/state.json] for collection [collection2meta] has occurred - updating... (live nodes size: [2])
   [junit4]   2> 3246019 INFO  (qtp869581817-22222) [n:127.0.0.1:39178_solr    ] o.a.s.s.HttpSolrCall [admin] webapp=null path=/admin/collections params={name=testClusterStateProviderAPI&action=ALIASPROP&property.foo=baz&property.bar=bam&wt=javabin&version=2} status=0 QTime=94
   [junit4]   2> 3246033 INFO  (TEST-AliasIntegrationTest.testClusterStateProviderAPI-seed#[579AAEF77EB9E494]) [    ] o.a.s.SolrTestCaseJ4 ###Ending testClusterStateProviderAPI
   [junit4]   2> 3246105 INFO  (TEST-AliasIntegrationTest.testClusterStateProviderAPI-seed#[579AAEF77EB9E494]) [    ] o.a.s.c.c.ZkStateReader Updated live nodes from ZooKeeper... (0) -> (2)
   [junit4]   2> 3246107 INFO  (qtp869581817-22224) [n:127.0.0.1:39178_solr    ] o.a.s.h.a.CollectionsHandler Invoked Collection Action :delete with params name=collection2meta&action=DELETE&wt=javabin&version=2 and sendToOCPQueue=true
   [junit4]   2> 3246126 INFO  (OverseerCollectionConfigSetProcessor-74705384824045574-127.0.0.1:46034_solr-n_0000000000) [n:127.0.0.1:46034_solr    ] o.a.s.c.OverseerTaskQueue Response ZK path: /overseer/collection-queue-work/qnr-0000000004 doesn't exist.  Requestor may have disconnected from ZooKeeper
   [junit4]   2> 3246126 INFO  (OverseerThreadFactory-7111-thread-4-processing-n:127.0.0.1:46034_solr) [n:127.0.0.1:46034_solr    ] o.a.s.c.a.c.OverseerCollectionMessageHandler Executing Collection Cmd=action=UNLOAD&deleteInstanceDir=true&deleteDataDir=true&deleteMetricsHistory=true, asyncId=null
   [junit4]   2> 3246128 INFO  (qtp1668613959-22234) [n:127.0.0.1:46034_solr    x:collection2meta_shard1_replica_n1] o.a.s.m.SolrMetricManager Closing metric reporters for registry=solr.core.collection2meta.shard1.replica_n1, tag=null
   [junit4]   2> 3246128 INFO  (qtp1668613959-22234) [n:127.0.0.1:46034_solr    x:collection2meta_shard1_replica_n1] o.a.s.m.r.SolrJmxReporter Closing reporter [org.apache.solr.metrics.reporters.SolrJmxReporter@594edd42: rootName = solr_46034, domain = solr.core.collection2meta.shard1.replica_n1, service url = null, agent id = null] for registry solr.core.collection2meta.shard1.replica_n1 / com.codahale.metrics.MetricRegistry@66bfbe20
   [junit4]   2> 3246180 INFO  (qtp1668613959-22234) [n:127.0.0.1:46034_solr    x:collection2meta_shard1_replica_n1] o.a.s.c.SolrCore [collection2meta_shard1_replica_n1]  CLOSING SolrCore org.apache.solr.core.SolrCore@3ec73cc3
   [junit4]   2> 3246181 INFO  (qtp1668613959-22234) [n:127.0.0.1:46034_solr    x:collection2meta_shard1_replica_n1] o.a.s.m.SolrMetricManager Closing metric reporters for registry=solr.core.collection2meta.shard1.replica_n1, tag=3ec73cc3
   [junit4]   2> 3246181 INFO  (qtp1668613959-22234) [n:127.0.0.1:46034_solr    x:collection2meta_shard1_replica_n1] o.a.s.m.SolrMetricManager Closing metric reporters for registry=solr.collection.collection2meta.shard1.leader, tag=3ec73cc3
   [junit4]   2> 3246200 INFO  (qtp1668613959-22234) [n:127.0.0.1:46034_solr    x:collection2meta_shard1_replica_n1] o.a.s.c.ZkShardTerms Successful update of terms at /collections/collection2meta/terms/shard1 to Terms{values={}, version=1}
   [junit4]   2> 3246201 INFO  (qtp1668613959-22234) [n:127.0.0.1:46034_solr    x:collection2meta_shard1_replica_n1] o.a.s.s.HttpSolrCall [admin] webapp=null path=/admin/cores params={deleteInstanceDir=true&deleteMetricsHistory=true&core=collection2meta_shard1_replica_n1&qt=/admin/cores&deleteDataDir=true&action=UNLOAD&wt=javabin&version=2} status=0 QTime=74
   [junit4]   2> 3246344 INFO  (zkCallback-8159-thread-2) [    ] o.a.s.c.c.ZkStateReader A cluster state change: [WatchedEvent state:SyncConnected type:NodeDeleted path:/collections/collection2meta/state.json] for collection [collection2meta] has occurred - updating... (live nodes size: [2])
   [junit4]   2> 3246344 INFO  (zkCallback-8159-thread-1) [    ] o.a.s.c.c.ZkStateReader A cluster state change: [WatchedEvent state:SyncConnected type:NodeDeleted path:/collections/collection2meta/state.json] for collection [collection2meta] has occurred - updating... (live nodes size: [2])
   [junit4]   2> 3246345 INFO  (zkCallback-8159-thread-4) [    ] o.a.s.c.c.ZkStateReader A cluster state change: [WatchedEvent state:SyncConnected type:NodeDeleted path:/collections/collection2meta/state.json] for collection [collection2meta] has occurred - updating... (live nodes size: [2])
   [junit4]   2> 3246365 INFO  (OverseerCollectionConfigSetProcessor-74705384824045574-127.0.0.1:46034_solr-n_0000000000) [n:127.0.0.1:46034_solr    ] o.a.s.c.OverseerTaskQueue Response ZK path: /overseer/collection-queue-work/qnr-0000000006 doesn't exist.  Requestor may have disconnected from ZooKeeper
   [junit4]   2> 3246366 INFO  (qtp869581817-22224) [n:127.0.0.1:39178_solr    ] o.a.s.s.HttpSolrCall [admin] webapp=null path=/admin/collections params={name=collection2meta&action=DELETE&wt=javabin&version=2} status=0 QTime=258
   [junit4]   2> 3246366 INFO  (qtp869581817-22224) [n:127.0.0.1:39178_solr    ] o.a.s.h.a.CollectionsHandler Invoked Collection Action :delete with params name=collection1meta&action=DELETE&wt=javabin&version=2 and sendToOCPQueue=true
   [junit4]   2> 3246380 WARN  (OverseerCollectionConfigSetProcessor-74705384824045574-127.0.0.1:46034_solr-n_0000000000) [n:127.0.0.1:46034_solr    ] o.a.s.c.LockTree lock_is_leaked at[collection2meta]
   [junit4]   2> 3246388 INFO  (OverseerThreadFactory-7111-thread-4-processing-n:127.0.0.1:46034_solr) [n:127.0.0.1:46034_solr    ] o.a.s.c.LockTree Unlocked multiple times : collection2meta
   [junit4]   2> 3246389 INFO  (OverseerThreadFactory-7111-thread-5-processing-n:127.0.0.1:46034_solr) [n:127.0.0.1:46034_solr    ] o.a.s.c.a.c.OverseerCollectionMessageHandler Executing Collection Cmd=action=UNLOAD&deleteInstanceDir=true&deleteDataDir=true&deleteMetricsHistory=true, asyncId=null
   [junit4]   2> 3246390 INFO  (qtp869581817-22225) [n:127.0.0.1:39178_solr    x:collection1meta_shard1_replica_n1] o.a.s.m.SolrMetricManager Closing metric reporters for registry=solr.core.collection1meta.shard1.replica_n1, tag=null
   [junit4]   2> 3246390 INFO  (qtp869581817-22225) [n:127.0.0.1:39178_solr    x:collection1meta_shard1_replica_n1] o.a.s.m.r.SolrJmxReporter Closing reporter [org.apache.solr.metrics.reporters.SolrJmxReporter@67a43aae: rootName = solr_39178, domain = solr.core.collection1meta.shard1.replica_n1, service url = null, agent id = null] for registry solr.core.collection1meta.shard1.replica_n1 / com.codahale.metrics.MetricRegistry@4819a986
   [junit4]   2> 3246401 INFO  (qtp1668613959-22235) [n:127.0.0.1:46034_solr    x:collection1meta_shard2_replica_n2] o.a.s.m.SolrMetricManager Closing metric reporters for registry=solr.core.collection1meta.shard2.replica_n2, tag=null
   [junit4]   2> 3246401 INFO  (qtp1668613959-22235) [n:127.0.0.1:46034_solr    x:collection1meta_shard2_replica_n2] o.a.s.m.r.SolrJmxReporter Closing reporter [org.apache.solr.metrics.reporters.SolrJmxReporter@7f6f15bf: rootName = solr_46034, domain = solr.core.collection1meta.shard2.replica_n2, service url = null, agent id = null] for registry solr.core.collection1meta.shard2.replica_n2 / com.codahale.metrics.MetricRegistry@1763d512
   [junit4]   2> 3246459 INFO  (qtp869581817-22225) [n:127.0.0.1:39178_solr    x:collection1meta_shard1_replica_n1] o.a.s.c.SolrCore [collection1meta_shard1_replica_n1]  CLOSING SolrCore org.apache.solr.core.SolrCore@46fe79ac
   [junit4]   2> 3246459 INFO  (qtp869581817-22225) [n:127.0.0.1:39178_solr    x:collection1meta_shard1_replica_n1] o.a.s.m.SolrMetricManager Closing metric reporters for registry=solr.core.collection1meta.shard1.replica_n1, tag=46fe79ac
   [junit4]   2> 3246459 INFO  (qtp869581817-22225) [n:127.0.0.1:39178_solr    x:collection1meta_shard1_replica_n1] o.a.s.m.SolrMetricManager Closing metric reporters for registry=solr.collection.collection1meta.shard1.leader, tag=46fe79ac
   [junit4]   2> 3246475 INFO  (qtp869581817-22225) [n:127.0.0.1:39178_solr    x:collection1meta_shard1_replica_n1] o.a.s.c.ZkShardTerms Successful update of terms at /collections/collection1meta/terms/shard1 to Terms{values={}, version=1}
   [junit4]   2> 3246477 INFO  (qtp869581817-22225) [n:127.0.0.1:39178_solr    x:collection1meta_shard1_replica_n1] o.a.s.s.HttpSolrCall [admin] webapp=null path=/admin/cores params={deleteInstanceDir=true&deleteMetricsHistory=true&core=collection1meta_shard1_replica_n1&qt=/admin/cores&deleteDataDir=true&action=UNLOAD&wt=javabin&version=2} status=0 QTime=86
   [junit4]   2> 3246478 INFO  (qtp1668613959-22235) [n:127.0.0.1:46034_solr    x:collection1meta_shard2_replica_n2] o.a.s.c.SolrCore [collection1meta_shard2_replica_n2]  CLOSING SolrCore org.apache.solr.core.SolrCore@1fdf92c0
   [junit4]   2> 3246478 INFO  (qtp1668613959-22235) [n:127.0.0.1:46034_solr    x:collection1meta_shard2_replica_n2] o.a.s.m.SolrMetricManager Closing metric reporters for registry=solr.core.collection1meta.shard2.replica_n2, tag=1fdf92c0
   [junit4]   2> 3246478 INFO  (qtp1668613959-22235) [n:127.0.0.1:46034_solr    x:collection1meta_shard2_replica_n2] o.a.s.m.SolrMetricManager Closing metric reporters for registry=solr.collection.collection1meta.shard2.leader, tag=1fdf92c0
   [junit4]   2> 3246491 INFO  (qtp1668613959-22235) [n:127.0.0.1:46034_solr    x:collection1meta_shard2_replica_n2] o.a.s.c.ZkShardTerms Successful update of terms at /collections/collection1meta/terms/shard2 to Terms{values={}, version=1}
   [junit4]   2> 3246493 INFO  (qtp1668613959-22235) [n:127.0.0.1:46034_solr    x:collection1meta_shard2_replica_n2] o.a.s.s.HttpSolrCall [admin] webapp=null path=/admin/cores params={deleteInstanceDir=true&deleteMetricsHistory=true&core=collection1meta_shard2_replica_n2&qt=/admin/cores&deleteDataDir=true&action=UNLOAD&wt=javabin&version=2} status=0 QTime=92
   [junit4]   2> 3246616 INFO  (zkCallback-8175-thread-2) [    ] o.a.s.c.c.ZkStateReader A cluster state change: [WatchedEvent state:SyncConnected type:NodeDeleted path:/collections/collection1meta/state.json] for collection [collection1meta] has occurred - updating... (live nodes size: [2])
   [junit4]   2> 3246616 INFO  (zkCallback-8175-thread-1) [    ] o.a.s.c.c.ZkStateReader A cluster state change: [WatchedEvent state:SyncConnected type:NodeDeleted path:/collections/collection1meta/state.json] for collection [collection1meta] has occurred - updating... (live nodes size: [2])
   [junit4]   2> 3246616 INFO  (zkCallback-8159-thread-2) [    ] o.a.s.c.c.ZkStateReader A cluster state change: [WatchedEvent state:SyncConnected type:NodeDeleted path:/collections/collection1meta/state.json] for collection [collection1meta] has occurred - updating... (live nodes size: [2])
   [junit4]   2> 3246616 INFO  (zkCallback-8159-thread-4) [    ] o.a.s.c.c.ZkStateReader A cluster state change: [WatchedEvent state:SyncConnected type:NodeDeleted path:/collections/collection1meta/state.json] for collection [collection1meta] has occurred - updating... (live nodes size: [2])
   [junit4]   2> 3246616 INFO  (zkCallback-8159-thread-1) [    ] o.a.s.c.c.ZkStateReader A cluster state change: [WatchedEvent state:SyncConnected type:NodeDeleted path:/collections/collection1meta/state.json] for collection [collection1meta] has occurred - updating... (live nodes size: [2])
   [junit4]   2> 3246653 INFO  (qtp869581817-22224) [n:127.0.0.1:39178_solr    ] o.a.s.s.HttpSolrCall [admin] webapp=null path=/admin/collections params={name=collection1meta&action=DELETE&wt=javabin&version=2} status=0 QTime=286
   [junit4]   2> NOTE: reproduce with: ant test  -Dtestcase=AliasIntegrationTest -Dtests.method=testClusterStateProviderAPI -Dtests.seed=579AAEF77EB9E494 -Dtests.multiplier=2 -Dtests.slow=true -Dtests.locale=se-NO -Dtests.timezone=America/Argentina/Cordoba -Dtests.asserts=true -Dtests.file.encoding=UTF-8
   [junit4] FAILURE 6.10s J2 | AliasIntegrationTest.testClusterStateProviderAPI <<<
   [junit4]    > Throwable #1: java.lang.AssertionError: {} expected:<2> but was:<0>
   [junit4]    > 	at __randomizedtesting.SeedInfo.seed([579AAEF77EB9E494:484D32DB0DB21DDF]:0)
   [junit4]    > 	at org.apache.solr.cloud.AliasIntegrationTest.testClusterStateProviderAPI(AliasIntegrationTest.java:293)
   [junit4]    > 	at java.base/jdk.internal.reflect.NativeMethodAccessorImpl.invoke0(Native Method)
   [junit4]    > 	at java.base/jdk.internal.reflect.NativeMethodAccessorImpl.invoke(NativeMethodAccessorImpl.java:62)
   [junit4]    > 	at java.base/jdk.internal.reflect.DelegatingMethodAccessorImpl.invoke(DelegatingMethodAccessorImpl.java:43)
   [junit4]    > 	at java.base/java.lang.reflect.Method.invoke(Method.java:566)
   [junit4]    > 	at java.base/java.lang.Thread.run(Thread.java:834)
   [junit4]   2> 3246780 INFO  (TEST-AliasIntegrationTest.testModifyPropertiesV2-seed#[579AAEF77EB9E494]) [    ] o.a.s.SolrTestCaseJ4 ###Starting testModifyPropertiesV2
   [junit4]   2> 3246806 INFO  (qtp869581817-22223) [n:127.0.0.1:39178_solr    ] o.a.s.h.a.CollectionsHandler Invoked Collection Action :create with params collection.configName=conf&name=collection1meta&nrtReplicas=1&action=CREATE&numShards=2&wt=javabin&version=2 and sendToOCPQueue=true
   [junit4]   2> 3246828 INFO  (OverseerThreadFactory-7111-thread-5-processing-n:127.0.0.1:46034_solr) [n:127.0.0.1:46034_solr    ] o.a.s.c.a.c.CreateCollectionCmd Create collection collection1meta
   [junit4]   2> 3246828 INFO  (OverseerCollectionConfigSetProcessor-74705384824045574-127.0.0.1:46034_solr-n_0000000000) [n:127.0.0.1:46034_solr    ] o.a.s.c.OverseerTaskQueue Response ZK path: /overseer/collection-queue-work/qnr-0000000008 doesn't exist.  Requestor may have disconnected from ZooKeeper
   [junit4]   2> 3247055 INFO  (OverseerStateUpdate-74705384824045574-127.0.0.1:46034_solr-n_0000000000) [n:127.0.0.1:46034_solr    ] o.a.s.c.o.SliceMutator createReplica() {
   [junit4]   2>   "operation":"ADDREPLICA",
   [junit4]   2>   "collection":"collection1meta",
   [junit4]   2>   "shard":"shard1",
   [junit4]   2>   "core":"collection1meta_shard1_replica_n1",
   [junit4]   2>   "state":"down",
   [junit4]   2>   "base_url":"http://127.0.0.1:46034/solr",
   [junit4]   2>   "type":"NRT",
   [junit4]   2>   "waitForFinalState":"false"} 
   [junit4]   2> 3247091 INFO  (OverseerStateUpdate-74705384824045574-127.0.0.1:46034_solr-n_0000000000) [n:127.0.0.1:46034_solr    ] o.a.s.c.o.SliceMutator createReplica() {
   [junit4]   2>   "operation":"ADDREPLICA",
   [junit4]   2>   "collection":"collection1meta",
   [junit4]   2>   "shard":"shard2",
   [junit4]   2>   "core":"collection1meta_shard2_replica_n2",
   [junit4]   2>   "state":"down",
   [junit4]   2>   "base_url":"http://127.0.0.1:39178/solr",
   [junit4]   2>   "type":"NRT",
   [junit4]   2>   "waitForFinalState":"false"} 
   [junit4]   2> 3247316 INFO  (qtp869581817-22226) [n:127.0.0.1:39178_solr    x:collection1meta_shard2_replica_n2] o.a.s.h.a.CoreAdminOperation core create command qt=/admin/cores&coreNodeName=core_node4&collection.configName=conf&newCollection=true&name=collection1meta_shard2_replica_n2&action=CREATE&numShards=2&collection=collection1meta&shard=shard2&wt=javabin&version=2&replicaType=NRT
   [junit4]   2> 3247332 INFO  (qtp1668613959-22236) [n:127.0.0.1:46034_solr    x:collection1meta_shard1_replica_n1] o.a.s.h.a.CoreAdminOperation core create command qt=/admin/cores&coreNodeName=core_node3&collection.configName=conf&newCollection=true&name=collection1meta_shard1_replica_n1&action=CREATE&numShards=2&collection=collection1meta&shard=shard1&wt=javabin&version=2&replicaType=NRT
   [junit4]   2> 3248391 INFO  (qtp869581817-22226) [n:127.0.0.1:39178_solr c:collection1meta s:shard2 r:core_node4 x:collection1meta_shard2_replica_n2] o.a.s.c.SolrConfig Using Lucene MatchVersion: 9.0.0
   [junit4]   2> 3248610 INFO  (qtp869581817-22226) [n:127.0.0.1:39178_solr c:collection1meta s:shard2 r:core_node4 x:collection1meta_shard2_replica_n2] o.a.s.s.IndexSchema [collection1meta_shard2_replica_n2] Schema name=minimal
   [junit4]   2> 3248620 INFO  (qtp1668613959-22236) [n:127.0.0.1:46034_solr c:collection1meta s:shard1 r:core_node3 x:collection1meta_shard1_replica_n1] o.a.s.c.SolrConfig Using Lucene MatchVersion: 9.0.0
   [junit4]   2> 3248645 INFO  (qtp869581817-22226) [n:127.0.0.1:39178_solr c:collection1meta s:shard2 r:core_node4 x:collection1meta_shard2_replica_n2] o.a.s.s.IndexSchema Loaded schema minimal/1.1 with uniqueid field id
   [junit4]   2> 3248645 INFO  (qtp869581817-22226) [n:127.0.0.1:39178_solr c:collection1meta s:shard2 r:core_node4 x:collection1meta_shard2_replica_n2] o.a.s.c.CoreContainer Creating SolrCore 'collection1meta_shard2_replica_n2' using configuration from collection collection1meta, trusted=true
   [junit4]   2> 3248646 INFO  (qtp869581817-22226) [n:127.0.0.1:39178_solr c:collection1meta s:shard2 r:core_node4 x:collection1meta_shard2_replica_n2] o.a.s.m.r.SolrJmxReporter JMX monitoring for 'solr_39178.solr.core.collection1meta.shard2.replica_n2' (registry 'solr.core.collection1meta.shard2.replica_n2') enabled at server: com.sun.jmx.mbeanserver.JmxMBeanServer@1d1572a
   [junit4]   2> 3248646 INFO  (qtp869581817-22226) [n:127.0.0.1:39178_solr c:collection1meta s:shard2 r:core_node4 x:collection1meta_shard2_replica_n2] o.a.s.c.SolrCore [[collection1meta_shard2_replica_n2] ] Opening new SolrCore at [/home/jenkins/jenkins-slave/workspace/Lucene-Solr-Tests-master/solr/build/solr-core/test/J2/temp/solr.cloud.AliasIntegrationTest_579AAEF77EB9E494-001/tempDir-001/node1/collection1meta_shard2_replica_n2], dataDir=[/home/jenkins/jenkins-slave/workspace/Lucene-Solr-Tests-master/solr/build/solr-core/test/J2/temp/solr.cloud.AliasIntegrationTest_579AAEF77EB9E494-001/tempDir-001/node1/./collection1meta_shard2_replica_n2/data/]
   [junit4]   2> 3248716 INFO  (qtp1668613959-22236) [n:127.0.0.1:46034_solr c:collection1meta s:shard1 r:core_node3 x:collection1meta_shard1_replica_n1] o.a.s.s.IndexSchema [collection1meta_shard1_replica_n1] Schema name=minimal
   [junit4]   2> 3248791 INFO  (qtp1668613959-22236) [n:127.0.0.1:46034_solr c:collection1meta s:shard1 r:core_node3 x:collection1meta_shard1_replica_n1] o.a.s.s.IndexSchema Loaded schema minimal/1.1 with uniqueid field id
   [junit4]   2> 3248791 INFO  (qtp1668613959-22236) [n:127.0.0.1:46034_solr c:collection1meta s:shard1 r:core_node3 x:collection1meta_shard1_replica_n1] o.a.s.c.CoreContainer Creating SolrCore 'collection1meta_shard1_replica_n1' using configuration from collection collection1meta, trusted=true
   [junit4]   2> 3248792 INFO  (qtp1668613959-22236) [n:127.0.0.1:46034_solr c:collection1meta s:shard1 r:core_node3 x:collection1meta_shard1_replica_n1] o.a.s.m.r.SolrJmxReporter JMX monitoring for 'solr_46034.solr.core.collection1meta.shard1.replica_n1' (registry 'solr.core.collection1meta.shard1.replica_n1') enabled at server: com.sun.jmx.mbeanserver.JmxMBeanServer@1d1572a
   [junit4]   2> 3248792 INFO  (qtp1668613959-22236) [n:127.0.0.1:46034_solr c:collection1meta s:shard1 r:core_node3 x:collection1meta_shard1_replica_n1] o.a.s.c.SolrCore [[collection1meta_shard1_replica_n1] ] Opening new SolrCore at [/home/jenkins/jenkins-slave/workspace/Lucene-Solr-Tests-master/solr/build/solr-core/test/J2/temp/solr.cloud.AliasIntegrationTest_579AAEF77EB9E494-001/tempDir-001/node2/collection1meta_shard1_replica_n1], dataDir=[/home/jenkins/jenkins-slave/workspace/Lucene-Solr-Tests-master/solr/build/solr-core/test/J2/temp/solr.cloud.AliasIntegrationTest_579AAEF77EB9E494-001/tempDir-001/node2/./collection1meta_shard1_replica_n1/data/]
   [junit4]   2> 3249305 INFO  (qtp1668613959-22236) [n:127.0.0.1:46034_solr c:collection1meta s:shard1 r:core_node3 x:collection1meta_shard1_replica_n1] o.a.s.u.UpdateHandler Using UpdateLog implementation: org.apache.solr.update.UpdateLog
   [junit4]   2> 3249305 INFO  (qtp1668613959-22236) [n:127.0.0.1:46034_solr c:collection1meta s:shard1 r:core_node3 x:collection1meta_shard1_replica_n1] o.a.s.u.UpdateLog Initializing UpdateLog: dataDir=null defaultSyncLevel=FLUSH numRecordsToKeep=100 maxNumLogsToKeep=10 numVersionBuckets=65536
   [junit4]   2> 3249307 INFO  (qtp1668613959-22236) [n:127.0.0.1:46034_solr c:collection1meta s:shard1 r:core_node3 x:collection1meta_shard1_replica_n1] o.a.s.u.CommitTracker Hard AutoCommit: disabled
   [junit4]   2> 3249307 INFO  (qtp1668613959-22236) [n:127.0.0.1:46034_solr c:collection1meta s:shard1 r:core_node3 x:collection1meta_shard1_replica_n1] o.a.s.u.CommitTracker Soft AutoCommit: disabled
   [junit4]   2> 3249308 INFO  (qtp1668613959-22236) [n:127.0.0.1:46034_solr c:collection1meta s:shard1 r:core_node3 x:collection1meta_shard1_replica_n1] o.a.s.s.SolrIndexSearcher Opening [Searcher@25a8cdcd[collection1meta_shard1_replica_n1] main]
   [junit4]   2> 3249322 INFO  (qtp869581817-22226) [n:127.0.0.1:39178_solr c:collection1meta s:shard2 r:core_node4 x:collection1meta_shard2_replica_n2] o.a.s.u.UpdateHandler Using UpdateLog implementation: org.apache.solr.update.UpdateLog
   [junit4]   2> 3249322 INFO  (qtp869581817-22226) [n:127.0.0.1:39178_solr c:collection1meta s:shard2 r:core_node4 x:collection1meta_shard2_replica_n2] o.a.s.u.UpdateLog Initializing UpdateLog: dataDir=null defaultSyncLevel=FLUSH numRecordsToKeep=100 maxNumLogsToKeep=10 numVersionBuckets=65536
   [junit4]   2> 3249322 INFO  (qtp1668613959-22236) [n:127.0.0.1:46034_solr c:collection1meta s:shard1 r:core_node3 x:collection1meta_shard1_replica_n1] o.a.s.r.ManagedResourceStorage Configured ZooKeeperStorageIO with znodeBase: /configs/conf
   [junit4]   2> 3249322 INFO  (qtp1668613959-22236) [n:127.0.0.1:46034_solr c:collection1meta s:shard1 r:core_node3 x:collection1meta_shard1_replica_n1] o.a.s.r.ManagedResourceStorage Loaded null at path _rest_managed.json using ZooKeeperStorageIO:path=/configs/conf
   [junit4]   2> 3249323 INFO  (qtp1668613959-22236) [n:127.0.0.1:46034_solr c:collection1meta s:shard1 r:core_node3 x:collection1meta_shard1_replica_n1] o.a.s.h.ReplicationHandler Commits will be reserved for 10000ms.
   [junit4]   2> 3249323 INFO  (qtp869581817-22226) [n:127.0.0.1:39178_solr c:collection1meta s:shard2 r:core_node4 x:collection1meta_shard2_replica_n2] o.a.s.u.CommitTracker Hard AutoCommit: disabled
   [junit4]   2> 3249323 INFO  (qtp869581817-22226) [n:127.0.0.1:39178_solr c:collection1meta s:shard2 r:core_node4 x:collection1meta_shard2_replica_n2] o.a.s.u.CommitTracker Soft AutoCommit: disabled
   [junit4]   2> 3249323 INFO  (qtp1668613959-22236) [n:127.0.0.1:46034_solr c:collection1meta s:shard1 r:core_node3 x:collection1meta_shard1_replica_n1] o.a.s.u.UpdateLog Could not find max version in index or recent updates, using new clock 1633749242447134720
   [junit4]   2> 3249325 INFO  (qtp869581817-22226) [n:127.0.0.1:39178_solr c:collection1meta s:shard2 r:core_node4 x:collection1meta_shard2_replica_n2] o.a.s.s.SolrIndexSearcher Opening [Searcher@45419299[collection1meta_shard2_replica_n2] main]
   [junit4]   2> 3249343 INFO  (searcherExecutor-7139-thread-1-processing-n:127.0.0.1:46034_solr x:collection1meta_shard1_replica_n1 c:collection1meta s:shard1 r:core_node3) [n:127.0.0.1:46034_solr c:collection1meta s:shard1 r:core_node3 x:collection1meta_shard1_replica_n1] o.a.s.c.SolrCore [collection1meta_shard1_replica_n1] Registered new searcher Searcher@25a8cdcd[collection1meta_shard1_replica_n1] main{ExitableDirectoryReader(UninvertingDirectoryReader())}
   [junit4]   2> 3249360 INFO  (qtp1668613959-22236) [n:127.0.0.1:46034_solr c:collection1meta s:shard1 r:core_node3 x:collection1meta_shard1_replica_n1] o.a.s.c.ZkShardTerms Successful update of terms at /collections/collection1meta/terms/shard1 to Terms{values={core_node3=0}, version=0}
   [junit4]   2> 3249360 INFO  (qtp1668613959-22236) [n:127.0.0.1:46034_solr c:collection1meta s:shard1 r:core_node3 x:collection1meta_shard1_replica_n1] o.a.s.c.ShardLeaderElectionContextBase make sure parent is created /collections/collection1meta/leaders/shard1
   [junit4]   2> 3249362 INFO  (qtp869581817-22226) [n:127.0.0.1:39178_solr c:collection1meta s:shard2 r:core_node4 x:collection1meta_shard2_replica_n2] o.a.s.r.ManagedResourceStorage Configured ZooKeeperStorageIO with znodeBase: /configs/conf
   [junit4]   2> 3249362 INFO  (qtp869581817-22226) [n:127.0.0.1:39178_solr c:collection1meta s:shard2 r:core_node4 x:collection1meta_shard2_replica_n2] o.a.s.r.ManagedResourceStorage Loaded null at path _rest_managed.json using ZooKeeperStorageIO:path=/configs/conf
   [junit4]   2> 3249363 INFO  (qtp869581817-22226) [n:127.0.0.1:39178_solr c:collection1meta s:shard2 r:core_node4 x:collection1meta_shard2_replica_n2] o.a.s.h.ReplicationHandler Commits will be reserved for 10000ms.
   [junit4]   2> 3249363 INFO  (qtp869581817-22226) [n:127.0.0.1:39178_solr c:collection1meta s:shard2 r:core_node4 x:collection1meta_shard2_replica_n2] o.a.s.u.UpdateLog Could not find max version in index or recent updates, using new clock 1633749242489077760
   [junit4]   2> 3249366 INFO  (searcherExecutor-7138-thread-1-processing-n:127.0.0.1:39178_solr x:collection1meta_shard2_replica_n2 c:collection1meta s:shard2 r:core_node4) [n:127.0.0.1:39178_solr c:collection1meta s:shard2 r:core_node4 x:collection1meta_shard2_replica_n2] o.a.s.c.SolrCore [collection1meta_shard2_replica_n2] Registered new searcher Searcher@45419299[collection1meta_shard2_replica_n2] main{ExitableDirectoryReader(UninvertingDirectoryReader())}
   [junit4]   2> 3249380 INFO  (qtp869581817-22226) [n:127.0.0.1:39178_solr c:collection1meta s:shard2 r:core_node4 x:collection1meta_shard2_replica_n2] o.a.s.c.ZkShardTerms Successful update of terms at /collections/collection1meta/terms/shard2 to Terms{values={core_node4=0}, version=0}
   [junit4]   2> 3249380 INFO  (qtp869581817-22226) [n:127.0.0.1:39178_solr c:collection1meta s:shard2 r:core_node4 x:collection1meta_shard2_replica_n2] o.a.s.c.ShardLeaderElectionContextBase make sure parent is created /collections/collection1meta/leaders/shard2
   [junit4]   2> 3249394 INFO  (qtp1668613959-22236) [n:127.0.0.1:46034_solr c:collection1meta s:shard1 r:core_node3 x:collection1meta_shard1_replica_n1] o.a.s.c.ShardLeaderElectionContext Enough replicas found to continue.
   [junit4]   2> 3249394 INFO  (qtp1668613959-22236) [n:127.0.0.1:46034_solr c:collection1meta s:shard1 r:core_node3 x:collection1meta_shard1_replica_n1] o.a.s.c.ShardLeaderElectionContext I may be the new leader - try and sync
   [junit4]   2> 3249394 INFO  (qtp1668613959-22236) [n:127.0.0.1:46034_solr c:collection1meta s:shard1 r:core_node3 x:collection1meta_shard1_replica_n1] o.a.s.c.SyncStrategy Sync replicas to http://127.0.0.1:46034/solr/collection1meta_shard1_replica_n1/
   [junit4]   2> 3249415 INFO  (qtp1668613959-22236) [n:127.0.0.1:46034_solr c:collection1meta s:shard1 r:core_node3 x:collection1meta_shard1_replica_n1] o.a.s.c.SyncStrategy Sync Success - now sync replicas to me
   [junit4]   2> 3249415 INFO  (qtp869581817-22226) [n:127.0.0.1:39178_solr c:collection1meta s:shard2 r:core_node4 x:collection1meta_shard2_replica_n2] o.a.s.c.ShardLeaderElectionContext Enough replicas found to continue.
   [junit4]   2> 3249415 INFO  (qtp869581817-22226) [n:127.0.0.1:39178_solr c:collection1meta s:shard2 r:core_node4 x:collection1meta_shard2_replica_n2] o.a.s.c.ShardLeaderElectionContext I may be the new leader - try and sync
   [junit4]   2> 3249415 INFO  (qtp869581817-22226) [n:127.0.0.1:39178_solr c:collection1meta s:shard2 r:core_node4 x:collection1meta_shard2_replica_n2] o.a.s.c.SyncStrategy Sync replicas to http://127.0.0.1:39178/solr/collection1meta_shard2_replica_n2/
   [junit4]   2> 3249415 INFO  (qtp1668613959-22236) [n:127.0.0.1:46034_solr c:collection1meta s:shard1 r:core_node3 x:collection1meta_shard1_replica_n1] o.a.s.c.SyncStrategy http://127.0.0.1:46034/solr/collection1meta_shard1_replica_n1/ has no replicas
   [junit4]   2> 3249415 INFO  (qtp1668613959-22236) [n:127.0.0.1:46034_solr c:collection1meta s:shard1 r:core_node3 x:collection1meta_shard1_replica_n1] o.a.s.c.ShardLeaderElectionContextBase Creating leader registration node /collections/collection1meta/leaders/shard1/leader after winning as /collections/collection1meta/leader_elect/shard1/election/74705384824045574-core_node3-n_0000000000
   [junit4]   2> 3249415 INFO  (qtp869581817-22226) [n:127.0.0.1:39178_solr c:collection1meta s:shard2 r:core_node4 x:collection1meta_shard2_replica_n2] o.a.s.c.SyncStrategy Sync Success - now sync replicas to me
   [junit4]   2> 3249415 INFO  (qtp869581817-22226) [n:127.0.0.1:39178_solr c:collection1meta s:shard2 r:core_node4 x:collection1meta_shard2_replica_n2] o.a.s.c.SyncStrategy http://127.0.0.1:39178/solr/collection1meta_shard2_replica_n2/ has no replicas
   [junit4]   2> 3249415 INFO  (qtp869581817-22226) [n:127.0.0.1:39178_solr c:collection1meta s:shard2 r:core_node4 x:collection1meta_shard2_replica_n2] o.a.s.c.ShardLeaderElectionContextBase Creating leader registration node /collections/collection1meta/leaders/shard2/leader after winning as /collections/collection1meta/leader_elect/shard2/election/74705384824045577-core_node4-n_0000000000
   [junit4]   2> 3249417 INFO  (qtp1668613959-22236) [n:127.0.0.1:46034_solr c:collection1meta s:shard1 r:core_node3 x:collection1meta_shard1_replica_n1] o.a.s.c.ShardLeaderElectionContext I am the new leader: http://127.0.0.1:46034/solr/collection1meta_shard1_replica_n1/ shard1
   [junit4]   2> 3249417 INFO  (qtp869581817-22226) [n:127.0.0.1:39178_solr c:collection1meta s:shard2 r:core_node4 x:collection1meta_shard2_replica_n2] o.a.s.c.ShardLeaderElectionContext I am the new leader: http://127.0.0.1:39178/solr/collection1meta_shard2_replica_n2/ shard2
   [junit4]   2> 3249517 INFO  (zkCallback-8175-thread-2) [    ] o.a.s.c.c.ZkStateReader A cluster state change: [WatchedEvent state:SyncConnected type:NodeDataChanged path:/collections/collection1meta/state.json] for collection [collection1meta] has occurred - updating... (live nodes size: [2])
   [junit4]   2> 3249517 INFO  (zkCallback-8175-thread-1) [    ] o.a.s.c.c.ZkStateReader A cluster state change: [WatchedEvent state:SyncConnected type:NodeDataChanged path:/collections/collection1meta/state.json] for collection [collection1meta] has occurred - updating... (live nodes size: [2])
   [junit4]   2> 3249517 INFO  (zkCallback-8159-thread-4) [    ] o.a.s.c.c.ZkStateReader A cluster state change: [WatchedEvent state:SyncConnected type:NodeDataChanged path:/collections/collection1meta/state.json] for collection [collection1meta] has occurred - updating... (live nodes size: [2])
   [junit4]   2> 3249517 INFO  (zkCallback-8159-thread-1) [    ] o.a.s.c.c.ZkStateReader A cluster state change: [WatchedEvent state:SyncConnected type:NodeDataChanged path:/collections/collection1meta/state.json] for collection [collection1meta] has occurred - updating... (live nodes size: [2])
   [junit4]   2> 3249545 INFO  (qtp1668613959-22236) [n:127.0.0.1:46034_solr c:collection1meta s:shard1 r:core_node3 x:collection1meta_shard1_replica_n1] o.a.s.c.ZkController I am the leader, no recovery necessary
   [junit4]   2> 3249547 INFO  (qtp1668613959-22236) [n:127.0.0.1:46034_solr c:collection1meta s:shard1 r:core_node3 x:collection1meta_shard1_replica_n1] o.a.s.s.HttpSolrCall [admin] webapp=null path=/admin/cores params={qt=/admin/cores&coreNodeName=core_node3&collection.configName=conf&newCollection=true&name=collection1meta_shard1_replica_n1&action=CREATE&numShards=2&collection=collection1meta&shard=shard1&wt=javabin&version=2&replicaType=NRT} status=0 QTime=2215
   [junit4]   2> 3249655 INFO  (zkCallback-8175-thread-1) [    ] o.a.s.c.c.ZkStateReader A cluster state change: [WatchedEvent state:SyncConnected type:NodeDataChanged path:/collections/collection1meta/state.json] for collection [collection1meta] has occurred - updating... (live nodes size: [2])
   [junit4]   2> 3249655 INFO  (zkCallback-8175-thread-2) [    ] o.a.s.c.c.ZkStateReader A cluster state change: [WatchedEvent state:SyncConnected type:NodeDataChanged path:/collections/collection1meta/state.json] for collection [collection1meta] has occurred - updating... (live nodes size: [2])
   [junit4]   2> 3249655 INFO  (zkCallback-8159-thread-2) [    ] o.a.s.c.c.ZkStateReader A cluster state change: [WatchedEvent state:SyncConnected type:NodeDataChanged path:/collections/collection1meta/state.json] for collection [collection1meta] has occurred - updating... (live nodes size: [2])
   [junit4]   2> 3249655 INFO  (zkCallback-8159-thread-1) [    ] o.a.s.c.c.ZkStateReader A cluster state change: [WatchedEvent state:SyncConnected type:NodeDataChanged path:/collections/collection1meta/state.json] for collection [collection1meta] has occurred - updating... (live nodes size: [2])
   [junit4]   2> 3249655 INFO  (zkCallback-8159-thread-4) [    ] o.a.s.c.c.ZkStateReader A cluster state change: [WatchedEvent state:SyncConnected type:NodeDataChanged path:/collections/collection1meta/state.json] for collection [collection1meta] has occurred - updating... (live nodes size: [2])
   [junit4]   2> 3249656 INFO  (qtp869581817-22226) [n:127.0.0.1:39178_solr c:collection1meta s:shard2 r:core_node4 x:collection1meta_shard2_replica_n2] o.a.s.c.ZkController I am the leader, no recovery necessary
   [junit4]   2> 3249691 INFO  (qtp869581817-22226) [n:127.0.0.1:39178_solr c:collection1meta s:shard2 r:core_node4 x:collection1meta_shard2_replica_n2] o.a.s.s.HttpSolrCall [admin] webapp=null path=/admin/cores params={qt=/admin/cores&coreNodeName=core_node4&collection.configName=conf&newCollection=true&name=collection1meta_shard2_replica_n2&action=CREATE&numShards=2&collection=collection1meta&shard=shard2&wt=javabin&version=2&replicaType=NRT} status=0 QTime=2375
   [junit4]   2> 3249727 INFO  (qtp869581817-22223) [n:127.0.0.1:39178_solr    ] o.a.s.h.a.CollectionsHandler Wait for new collection to be active for at most 45 seconds. Check all shard replicas
   [junit4]   2> 3249816 INFO  (zkCallback-8159-thread-4) [    ] o.a.s.c.c.ZkStateReader A cluster state change: [WatchedEvent state:SyncConnected type:NodeDataChanged path:/collections/collection1meta/state.json] for collection [collection1meta] has occurred - updating... (live nodes size: [2])
   [junit4]   2> 3249816 INFO  (zkCallback-8159-thread-1) [    ] o.a.s.c.c.ZkStateReader A cluster state change: [WatchedEvent state:SyncConnected type:NodeDataChanged path:/collections/collection1meta/state.json] for collection [collection1meta] has occurred - updating... (live nodes size: [2])
   [junit4]   2> 3249816 INFO  (zkCallback-8159-thread-2) [    ] o.a.s.c.c.ZkStateReader A cluster state change: [WatchedEvent state:SyncConnected type:NodeDataChanged path:/collections/collection1meta/state.json] for collection [collection1meta] has occurred - updating... (live nodes size: [2])
   [junit4]   2> 3249816 INFO  (zkCallback-8175-thread-2) [    ] o.a.s.c.c.Zk

[...truncated too long message...]

r/collections/collection_two/state.json
   [junit4]   2> 	10	/solr/collections/collection_new/state.json
   [junit4]   2> 	9	/solr/collections/collection2/state.json
   [junit4]   2> 
   [junit4]   2> Maximum concurrent children watches above limit:
   [junit4]   2> 
   [junit4]   2> 	147	/solr/collections
   [junit4]   2> 	22	/solr/live_nodes
   [junit4]   2> 
   [junit4]   2> 3300575 INFO  (SUITE-AliasIntegrationTest-seed#[579AAEF77EB9E494]-worker) [    ] o.a.s.c.ZkTestServer parse host and port list: 127.0.0.1:42092
   [junit4]   2> 3300575 INFO  (SUITE-AliasIntegrationTest-seed#[579AAEF77EB9E494]-worker) [    ] o.a.s.c.ZkTestServer connecting to 127.0.0.1 42092
   [junit4]   2> NOTE: leaving temporary files on disk at: /home/jenkins/jenkins-slave/workspace/Lucene-Solr-Tests-master/solr/build/solr-core/test/J2/temp/solr.cloud.AliasIntegrationTest_579AAEF77EB9E494-001
   [junit4]   2> May 17, 2019 3:45:43 AM com.carrotsearch.randomizedtesting.ThreadLeakControl checkThreadLeaks
   [junit4]   2> WARNING: Will linger awaiting termination of 1 leaked thread(s).
   [junit4]   2> NOTE: test params are: codec=HighCompressionCompressingStoredFields(storedFieldsFormat=CompressingStoredFieldsFormat(compressionMode=HIGH_COMPRESSION, chunkSize=8, maxDocsPerChunk=457, blockSize=9), termVectorsFormat=CompressingTermVectorsFormat(compressionMode=HIGH_COMPRESSION, chunkSize=8, blockSize=9)), sim=Asserting(org.apache.lucene.search.similarities.AssertingSimilarity@7b35631), locale=se-NO, timezone=America/Argentina/Cordoba
   [junit4]   2> NOTE: Linux 4.4.0-112-generic amd64/Oracle Corporation 11.0.1 (64-bit)/cpus=4,threads=1,free=151585616,total=536870912
   [junit4]   2> NOTE: All tests run in this JVM: [TestSmileRequest, ZkNodePropsTest, AssignBackwardCompatibilityTest, TestMaxTokenLenTokenizer, SpatialHeatmapFacetsTest, SpatialFilterTest, MoveReplicaTest, TestRawTransformer, TestEmbeddedSolrServerSchemaAPI, ConvertedLegacyTest, ShardRoutingTest, TestStressInPlaceUpdates, ZkStateReaderTest, RootFieldTest, BlockJoinFacetRandomTest, TestChildDocTransformer, DistributedQueueTest, ClassificationUpdateProcessorTest, TestPHPSerializedResponseWriter, DistributedDebugComponentTest, DistributedFacetPivotSmallTest, ConcurrentDeleteAndCreateCollectionTest, CacheHeaderTest, TestOverriddenPrefixQueryForCustomFieldType, NoCacheHeaderTest, UninvertDocValuesMergePolicyTest, TestBinaryResponseWriter, TestGraphTermsQParserPlugin, TestSimpleTrackingShardHandler, TestSimExecutePlanAction, TestHalfAndHalfDocValues, TestSubQueryTransformerCrossCore, TestManagedSynonymGraphFilterFactory, ConnectionManagerTest, TestSafeXMLParsing, TestLuceneIndexBackCompat, OverseerTest, TestDistributedGrouping, TestMacros, TestLMDirichletSimilarityFactory, TestPostingsSolrHighlighter, BooleanFieldTest, CustomHighlightComponentTest, CachingDirectoryFactoryTest, DeleteInactiveReplicaTest, TestDFISimilarityFactory, RequestLoggingTest, TestSSLRandomization, UUIDUpdateProcessorFallbackTest, TestRuleBasedAuthorizationPlugin, TriggerIntegrationTest, DistanceFunctionTest, TestReplicaProperties, HdfsBasicDistributedZk2Test, TaggingAttributeTest, SolrRrdBackendFactoryTest, AutoAddReplicasPlanActionTest, OverseerRolesTest, TestUnInvertedFieldException, RandomizedTaggerTest, DataDrivenBlockJoinTest, MaxSizeAutoCommitTest, TestJsonFacetRefinement, TestSizeLimitedDistributedMap, TestRestoreCore, DistributedQueryComponentCustomSortTest, TestRTGBase, BlobRepositoryCloudTest, TestMissingGroups, TestInPlaceUpdateWithRouteField, TestPhraseSuggestions, TestDynamicLoading, TestAnalyzedSuggestions, TestAtomicUpdateErrorCases, BaseCdcrDistributedZkTest, TestSchemaManager, SolrCoreCheckLockOnStartupTest, JvmMetricsTest, SSLMigrationTest, PreAnalyzedFieldManagedSchemaCloudTest, ChaosMonkeySafeLeaderTest, ClusterStateUpdateTest, DeleteReplicaTest, TestLRUStatsCache, SimplePostToolTest, CdcrVersionReplicationTest, TestCoreAdminApis, TestDocTermOrds, TestScoreJoinQPScore, InfoHandlerTest, TestUseDocValuesAsStored, AnalyticsMergeStrategyTest, TestNumericTerms32, DistribCursorPagingTest, TestLegacyField, OverriddenZkACLAndCredentialsProvidersTest, DateMathParserTest, TestFieldCacheReopen, TestNumericRangeQuery64, TestPullReplica, BufferStoreTest, TestQuerySenderListener, CleanupOldIndexTest, BasicAuthIntegrationTest, SolrIndexConfigTest, MBeansHandlerTest, TestCorePropertiesReload, TestReversedWildcardFilterFactory, TestSimLargeCluster, TestManagedResourceStorage, BigEndianAscendingWordDeserializerTest, TestFreeTextSuggestions, SearchRateTriggerIntegrationTest, AssignTest, CollectionTooManyReplicasTest, TestSolrQueryParser, JWTAuthPluginTest, TestLegacyNumericRangeQueryBuilder, TestFieldCacheVsDocValues, TestIntervalFaceting, TestBlobHandler, UtilsToolTest, CSVRequestHandlerTest, PropertiesRequestHandlerTest, HttpPartitionWithTlogReplicasTest, TestAuthenticationFramework, SpellPossibilityIteratorTest, TestCloudPseudoReturnFields, HighlighterConfigTest, CategoryRoutedAliasUpdateProcessorTest, TestConfigSetsAPIExclusivity, TestManagedSchemaThreadSafety, TestMinMaxOnMultiValuedField, TestBadConfig, ExecutePlanActionTest, CoreAdminRequestStatusTest, TestSchemaSimilarityResource, SuggesterTest, TestComplexPhraseLeadingWildcard, TestPseudoReturnFields, EnumFieldTest, OutputWriterTest, SampleTest, SolrInfoBeanTest, SolrTestCaseJ4Test, TestDistributedMissingSort, TestDocumentBuilder, TestGroupingSearch, TestHighlightDedupGrouping, TestJoin, TestRandomDVFaceting, TestSolrCoreProperties, TestTolerantSearch, TestTrie, PathHierarchyTokenizerFactoryTest, ProtectedTermFilterFactoryTest, TestCharFilters, TestDeprecatedFilters, TestLuceneMatchVersion, TestWordDelimiterFilterFactory, TokenizerChainTest, TestEmbeddedSolrServerAdminHandler, TestEmbeddedSolrServerConstructors, TestJettySolrRunner, ConnectionReuseTest, AliasIntegrationTest]
   [junit4] Completed [464/857 (1!)] on J2 in 64.11s, 9 tests, 1 failure <<< FAILURES!

[...truncated 48749 lines...]
-ecj-javadoc-lint-src:
    [mkdir] Created dir: /tmp/ecj833572492
 [ecj-lint] Compiling 69 source files to /tmp/ecj833572492
 [ecj-lint] invalid Class-Path header in manifest of jar file: /home/jenkins/.ivy2/cache/org.restlet.jee/org.restlet/jars/org.restlet-2.3.0.jar
 [ecj-lint] invalid Class-Path header in manifest of jar file: /home/jenkins/.ivy2/cache/org.restlet.jee/org.restlet.ext.servlet/jars/org.restlet.ext.servlet-2.3.0.jar
 [ecj-lint] ----------
 [ecj-lint] 1. ERROR in /home/jenkins/jenkins-slave/workspace/Lucene-Solr-Tests-master/solr/contrib/dataimporthandler/src/java/org/apache/solr/handler/dataimport/JdbcDataSource.java (at line 28)
 [ecj-lint] 	import javax.naming.InitialContext;
 [ecj-lint] 	       ^^^^^^^^^^^^^^^^^^^^^^^^^^^
 [ecj-lint] The type javax.naming.InitialContext is not accessible
 [ecj-lint] ----------
 [ecj-lint] 2. ERROR in /home/jenkins/jenkins-slave/workspace/Lucene-Solr-Tests-master/solr/contrib/dataimporthandler/src/java/org/apache/solr/handler/dataimport/JdbcDataSource.java (at line 29)
 [ecj-lint] 	import javax.naming.NamingException;
 [ecj-lint] 	       ^^^^^^^^^^^^^^^^^^^^^^^^^^^^
 [ecj-lint] The type javax.naming.NamingException is not accessible
 [ecj-lint] ----------
 [ecj-lint] 3. ERROR in /home/jenkins/jenkins-slave/workspace/Lucene-Solr-Tests-master/solr/contrib/dataimporthandler/src/java/org/apache/solr/handler/dataimport/JdbcDataSource.java (at line 182)
 [ecj-lint] 	c = getFromJndi(initProps, jndiName);
 [ecj-lint] 	    ^^^^^^^^^^^
 [ecj-lint] The method getFromJndi(Properties, String) from the type new Callable<Connection>(){} refers to the missing type NamingException
 [ecj-lint] ----------
 [ecj-lint] 4. ERROR in /home/jenkins/jenkins-slave/workspace/Lucene-Solr-Tests-master/solr/contrib/dataimporthandler/src/java/org/apache/solr/handler/dataimport/JdbcDataSource.java (at line 245)
 [ecj-lint] 	private Connection getFromJndi(final Properties initProps, final String jndiName) throws NamingException,
 [ecj-lint] 	                                                                                         ^^^^^^^^^^^^^^^
 [ecj-lint] NamingException cannot be resolved to a type
 [ecj-lint] ----------
 [ecj-lint] 5. ERROR in /home/jenkins/jenkins-slave/workspace/Lucene-Solr-Tests-master/solr/contrib/dataimporthandler/src/java/org/apache/solr/handler/dataimport/JdbcDataSource.java (at line 249)
 [ecj-lint] 	InitialContext ctx =  new InitialContext();
 [ecj-lint] 	^^^^^^^^^^^^^^
 [ecj-lint] InitialContext cannot be resolved to a type
 [ecj-lint] ----------
 [ecj-lint] 6. ERROR in /home/jenkins/jenkins-slave/workspace/Lucene-Solr-Tests-master/solr/contrib/dataimporthandler/src/java/org/apache/solr/handler/dataimport/JdbcDataSource.java (at line 249)
 [ecj-lint] 	InitialContext ctx =  new InitialContext();
 [ecj-lint] 	                          ^^^^^^^^^^^^^^
 [ecj-lint] InitialContext cannot be resolved to a type
 [ecj-lint] ----------
 [ecj-lint] 6 problems (6 errors)

BUILD FAILED
/home/jenkins/jenkins-slave/workspace/Lucene-Solr-Tests-master/build.xml:634: The following error occurred while executing this line:
/home/jenkins/jenkins-slave/workspace/Lucene-Solr-Tests-master/build.xml:101: The following error occurred while executing this line:
/home/jenkins/jenkins-slave/workspace/Lucene-Solr-Tests-master/solr/build.xml:687: The following error occurred while executing this line:
/home/jenkins/jenkins-slave/workspace/Lucene-Solr-Tests-master/solr/common-build.xml:479: The following error occurred while executing this line:
/home/jenkins/jenkins-slave/workspace/Lucene-Solr-Tests-master/lucene/common-build.xml:2010: The following error occurred while executing this line:
/home/jenkins/jenkins-slave/workspace/Lucene-Solr-Tests-master/lucene/common-build.xml:2049: Compile failed; see the compiler error output for details.

Total time: 239 minutes 57 seconds
Build step 'Invoke Ant' marked build as failure
Archiving artifacts
Recording test results
Email was triggered for: Failure - Any
Sending email for trigger: Failure - Any

Mime
View raw message