lucene-dev mailing list archives

Site index · List index
Message view « Date » · « Thread »
Top « Date » · « Thread »
From Apache Jenkins Server <jenk...@builds.apache.org>
Subject [JENKINS] Lucene-Solr-Tests-master - Build # 3327 - Unstable
Date Fri, 03 May 2019 07:32:25 GMT
Build: https://builds.apache.org/job/Lucene-Solr-Tests-master/3327/

1 tests failed.
FAILED:  org.apache.solr.cloud.DistributedQueueTest.testLeakChildWatcher

Error Message:
expected:<1> but was:<0>

Stack Trace:
java.lang.AssertionError: expected:<1> but was:<0>
	at __randomizedtesting.SeedInfo.seed([B3CAD1A2347DE75A:B66A99B90C64F414]:0)
	at org.junit.Assert.fail(Assert.java:88)
	at org.junit.Assert.failNotEquals(Assert.java:834)
	at org.junit.Assert.assertEquals(Assert.java:645)
	at org.junit.Assert.assertEquals(Assert.java:631)
	at org.apache.solr.cloud.DistributedQueueTest.testLeakChildWatcher(DistributedQueueTest.java:216)
	at java.base/jdk.internal.reflect.NativeMethodAccessorImpl.invoke0(Native Method)
	at java.base/jdk.internal.reflect.NativeMethodAccessorImpl.invoke(NativeMethodAccessorImpl.java:62)
	at java.base/jdk.internal.reflect.DelegatingMethodAccessorImpl.invoke(DelegatingMethodAccessorImpl.java:43)
	at java.base/java.lang.reflect.Method.invoke(Method.java:566)
	at com.carrotsearch.randomizedtesting.RandomizedRunner.invoke(RandomizedRunner.java:1750)
	at com.carrotsearch.randomizedtesting.RandomizedRunner$8.evaluate(RandomizedRunner.java:938)
	at com.carrotsearch.randomizedtesting.RandomizedRunner$9.evaluate(RandomizedRunner.java:974)
	at com.carrotsearch.randomizedtesting.RandomizedRunner$10.evaluate(RandomizedRunner.java:988)
	at com.carrotsearch.randomizedtesting.rules.SystemPropertiesRestoreRule$1.evaluate(SystemPropertiesRestoreRule.java:57)
	at org.apache.lucene.util.TestRuleSetupTeardownChained$1.evaluate(TestRuleSetupTeardownChained.java:49)
	at org.apache.lucene.util.AbstractBeforeAfterRule$1.evaluate(AbstractBeforeAfterRule.java:45)
	at org.apache.lucene.util.TestRuleThreadAndTestName$1.evaluate(TestRuleThreadAndTestName.java:48)
	at org.apache.lucene.util.TestRuleIgnoreAfterMaxFailures$1.evaluate(TestRuleIgnoreAfterMaxFailures.java:64)
	at org.apache.lucene.util.TestRuleMarkFailure$1.evaluate(TestRuleMarkFailure.java:47)
	at com.carrotsearch.randomizedtesting.rules.StatementAdapter.evaluate(StatementAdapter.java:36)
	at com.carrotsearch.randomizedtesting.ThreadLeakControl$StatementRunner.run(ThreadLeakControl.java:368)
	at com.carrotsearch.randomizedtesting.ThreadLeakControl.forkTimeoutingTask(ThreadLeakControl.java:817)
	at com.carrotsearch.randomizedtesting.ThreadLeakControl$3.evaluate(ThreadLeakControl.java:468)
	at com.carrotsearch.randomizedtesting.RandomizedRunner.runSingleTest(RandomizedRunner.java:947)
	at com.carrotsearch.randomizedtesting.RandomizedRunner$5.evaluate(RandomizedRunner.java:832)
	at com.carrotsearch.randomizedtesting.RandomizedRunner$6.evaluate(RandomizedRunner.java:883)
	at com.carrotsearch.randomizedtesting.RandomizedRunner$7.evaluate(RandomizedRunner.java:894)
	at com.carrotsearch.randomizedtesting.rules.StatementAdapter.evaluate(StatementAdapter.java:36)
	at com.carrotsearch.randomizedtesting.rules.SystemPropertiesRestoreRule$1.evaluate(SystemPropertiesRestoreRule.java:57)
	at org.apache.lucene.util.AbstractBeforeAfterRule$1.evaluate(AbstractBeforeAfterRule.java:45)
	at com.carrotsearch.randomizedtesting.rules.StatementAdapter.evaluate(StatementAdapter.java:36)
	at org.apache.lucene.util.TestRuleStoreClassName$1.evaluate(TestRuleStoreClassName.java:41)
	at com.carrotsearch.randomizedtesting.rules.NoShadowingOrOverridesOnMethodsRule$1.evaluate(NoShadowingOrOverridesOnMethodsRule.java:40)
	at com.carrotsearch.randomizedtesting.rules.NoShadowingOrOverridesOnMethodsRule$1.evaluate(NoShadowingOrOverridesOnMethodsRule.java:40)
	at com.carrotsearch.randomizedtesting.rules.StatementAdapter.evaluate(StatementAdapter.java:36)
	at com.carrotsearch.randomizedtesting.rules.StatementAdapter.evaluate(StatementAdapter.java:36)
	at org.apache.lucene.util.TestRuleAssertionsRequired$1.evaluate(TestRuleAssertionsRequired.java:53)
	at org.apache.lucene.util.TestRuleMarkFailure$1.evaluate(TestRuleMarkFailure.java:47)
	at org.apache.lucene.util.TestRuleIgnoreAfterMaxFailures$1.evaluate(TestRuleIgnoreAfterMaxFailures.java:64)
	at org.apache.lucene.util.TestRuleIgnoreTestSuites$1.evaluate(TestRuleIgnoreTestSuites.java:54)
	at com.carrotsearch.randomizedtesting.rules.StatementAdapter.evaluate(StatementAdapter.java:36)
	at com.carrotsearch.randomizedtesting.ThreadLeakControl$StatementRunner.run(ThreadLeakControl.java:368)
	at java.base/java.lang.Thread.run(Thread.java:834)




Build Log:
[...truncated 12621 lines...]
   [junit4] Suite: org.apache.solr.cloud.DistributedQueueTest
   [junit4]   2> 218789 INFO  (SUITE-DistributedQueueTest-seed#[B3CAD1A2347DE75A]-worker)
[    ] o.a.s.SolrTestCaseJ4 SecureRandom sanity checks: test.solr.allowed.securerandom=null
& java.security.egd=file:/dev/./urandom
   [junit4]   2> Creating dataDir: /x1/jenkins/jenkins-slave/workspace/Lucene-Solr-Tests-master/solr/build/solr-core/test/J2/temp/solr.cloud.DistributedQueueTest_B3CAD1A2347DE75A-001/init-core-data-001
   [junit4]   2> 218790 WARN  (SUITE-DistributedQueueTest-seed#[B3CAD1A2347DE75A]-worker)
[    ] o.a.s.SolrTestCaseJ4 startTrackingSearchers: numOpens=2 numCloses=2
   [junit4]   2> 218790 INFO  (SUITE-DistributedQueueTest-seed#[B3CAD1A2347DE75A]-worker)
[    ] o.a.s.SolrTestCaseJ4 Using PointFields (NUMERIC_POINTS_SYSPROP=true) w/NUMERIC_DOCVALUES_SYSPROP=false
   [junit4]   2> 218791 INFO  (SUITE-DistributedQueueTest-seed#[B3CAD1A2347DE75A]-worker)
[    ] o.a.s.SolrTestCaseJ4 Randomized ssl (false) and clientAuth (true) via: @org.apache.solr.util.RandomizeSSL(reason="",
ssl=0.0/0.0, value=0.0/0.0, clientAuth=0.0/0.0)
   [junit4]   2> 218797 INFO  (TEST-DistributedQueueTest.testPeekElements-seed#[B3CAD1A2347DE75A])
[    ] o.a.s.SolrTestCaseJ4 ###Starting testPeekElements
   [junit4]   2> 218798 INFO  (TEST-DistributedQueueTest.testPeekElements-seed#[B3CAD1A2347DE75A])
[    ] o.a.s.c.ZkTestServer STARTING ZK TEST SERVER
   [junit4]   2> 218803 INFO  (ZkTestServer Run Thread) [    ] o.a.s.c.ZkTestServer client
port:0.0.0.0/0.0.0.0:0
   [junit4]   2> 218803 INFO  (ZkTestServer Run Thread) [    ] o.a.s.c.ZkTestServer Starting
server
   [junit4]   2> 218903 INFO  (TEST-DistributedQueueTest.testPeekElements-seed#[B3CAD1A2347DE75A])
[    ] o.a.s.c.ZkTestServer start zk server on port:43709
   [junit4]   2> 218903 INFO  (TEST-DistributedQueueTest.testPeekElements-seed#[B3CAD1A2347DE75A])
[    ] o.a.s.c.ZkTestServer parse host and port list: 127.0.0.1:43709
   [junit4]   2> 218903 INFO  (TEST-DistributedQueueTest.testPeekElements-seed#[B3CAD1A2347DE75A])
[    ] o.a.s.c.ZkTestServer connecting to 127.0.0.1 43709
   [junit4]   2> 218932 INFO  (zkConnectionManagerCallback-1905-thread-1) [    ] o.a.s.c.c.ConnectionManager
zkClient has connected
   [junit4]   2> 218995 INFO  (zkConnectionManagerCallback-1907-thread-1) [    ] o.a.s.c.c.ConnectionManager
zkClient has connected
   [junit4]   2> 219004 INFO  (zkConnectionManagerCallback-1909-thread-1) [    ] o.a.s.c.c.ConnectionManager
zkClient has connected
   [junit4]   2> 220527 INFO  (TEST-DistributedQueueTest.testPeekElements-seed#[B3CAD1A2347DE75A])
[    ] o.a.s.SolrTestCaseJ4 ###Ending testPeekElements
   [junit4]   2> 220533 INFO  (TEST-DistributedQueueTest.testPeekElements-seed#[B3CAD1A2347DE75A])
[    ] o.a.s.c.ZkTestServer Shutting down ZkTestServer.
   [junit4]   2> 220534 WARN  (NIOServerCxn.Factory:0.0.0.0/0.0.0.0:0) [    ] o.a.z.s.NIOServerCnxn
Unable to read additional data from client sessionid 0x10430d7b2770000, likely client has
closed socket
   [junit4]   2> 220539 INFO  (TEST-DistributedQueueTest.testPeekElements-seed#[B3CAD1A2347DE75A])
[    ] o.a.s.c.ZkTestServer parse host and port list: 127.0.0.1:43709
   [junit4]   2> 220539 INFO  (TEST-DistributedQueueTest.testPeekElements-seed#[B3CAD1A2347DE75A])
[    ] o.a.s.c.ZkTestServer connecting to 127.0.0.1 43709
   [junit4]   2> 220544 INFO  (TEST-DistributedQueueTest.testLeakChildWatcher-seed#[B3CAD1A2347DE75A])
[    ] o.a.s.SolrTestCaseJ4 ###Starting testLeakChildWatcher
   [junit4]   2> 220545 INFO  (TEST-DistributedQueueTest.testLeakChildWatcher-seed#[B3CAD1A2347DE75A])
[    ] o.a.s.c.ZkTestServer STARTING ZK TEST SERVER
   [junit4]   2> 220553 INFO  (ZkTestServer Run Thread) [    ] o.a.s.c.ZkTestServer client
port:0.0.0.0/0.0.0.0:0
   [junit4]   2> 220553 INFO  (ZkTestServer Run Thread) [    ] o.a.s.c.ZkTestServer Starting
server
   [junit4]   2> 220653 INFO  (TEST-DistributedQueueTest.testLeakChildWatcher-seed#[B3CAD1A2347DE75A])
[    ] o.a.s.c.ZkTestServer start zk server on port:34608
   [junit4]   2> 220653 INFO  (TEST-DistributedQueueTest.testLeakChildWatcher-seed#[B3CAD1A2347DE75A])
[    ] o.a.s.c.ZkTestServer parse host and port list: 127.0.0.1:34608
   [junit4]   2> 220653 INFO  (TEST-DistributedQueueTest.testLeakChildWatcher-seed#[B3CAD1A2347DE75A])
[    ] o.a.s.c.ZkTestServer connecting to 127.0.0.1 34608
   [junit4]   2> 220706 INFO  (zkConnectionManagerCallback-1912-thread-1) [    ] o.a.s.c.c.ConnectionManager
zkClient has connected
   [junit4]   2> 220732 INFO  (zkConnectionManagerCallback-1914-thread-1) [    ] o.a.s.c.c.ConnectionManager
zkClient has connected
   [junit4]   2> 220754 INFO  (zkConnectionManagerCallback-1916-thread-1) [    ] o.a.s.c.c.ConnectionManager
zkClient has connected
   [junit4]   2> 220953 INFO  (TEST-DistributedQueueTest.testLeakChildWatcher-seed#[B3CAD1A2347DE75A])
[    ] o.a.s.SolrTestCaseJ4 ###Ending testLeakChildWatcher
   [junit4]   2> 220954 INFO  (TEST-DistributedQueueTest.testLeakChildWatcher-seed#[B3CAD1A2347DE75A])
[    ] o.a.s.c.ZkTestServer Shutting down ZkTestServer.
   [junit4]   2> 220962 INFO  (TEST-DistributedQueueTest.testLeakChildWatcher-seed#[B3CAD1A2347DE75A])
[    ] o.a.s.c.ZkTestServer parse host and port list: 127.0.0.1:34608
   [junit4]   2> 220962 INFO  (TEST-DistributedQueueTest.testLeakChildWatcher-seed#[B3CAD1A2347DE75A])
[    ] o.a.s.c.ZkTestServer connecting to 127.0.0.1 34608
   [junit4]   2> NOTE: reproduce with: ant test  -Dtestcase=DistributedQueueTest -Dtests.method=testLeakChildWatcher
-Dtests.seed=B3CAD1A2347DE75A -Dtests.multiplier=2 -Dtests.slow=true -Dtests.locale=af-ZA
-Dtests.timezone=Asia/Chita -Dtests.asserts=true -Dtests.file.encoding=UTF-8
   [junit4] FAILURE 0.43s J2 | DistributedQueueTest.testLeakChildWatcher <<<
   [junit4]    > Throwable #1: java.lang.AssertionError: expected:<1> but was:<0>
   [junit4]    > 	at __randomizedtesting.SeedInfo.seed([B3CAD1A2347DE75A:B66A99B90C64F414]:0)
   [junit4]    > 	at org.apache.solr.cloud.DistributedQueueTest.testLeakChildWatcher(DistributedQueueTest.java:216)
   [junit4]    > 	at java.base/jdk.internal.reflect.NativeMethodAccessorImpl.invoke0(Native
Method)
   [junit4]    > 	at java.base/jdk.internal.reflect.NativeMethodAccessorImpl.invoke(NativeMethodAccessorImpl.java:62)
   [junit4]    > 	at java.base/jdk.internal.reflect.DelegatingMethodAccessorImpl.invoke(DelegatingMethodAccessorImpl.java:43)
   [junit4]    > 	at java.base/java.lang.reflect.Method.invoke(Method.java:566)
   [junit4]    > 	at java.base/java.lang.Thread.run(Thread.java:834)
   [junit4]   2> 220977 INFO  (TEST-DistributedQueueTest.testLocallyOffer-seed#[B3CAD1A2347DE75A])
[    ] o.a.s.SolrTestCaseJ4 ###Starting testLocallyOffer
   [junit4]   2> 220977 INFO  (TEST-DistributedQueueTest.testLocallyOffer-seed#[B3CAD1A2347DE75A])
[    ] o.a.s.c.ZkTestServer STARTING ZK TEST SERVER
   [junit4]   2> 220986 INFO  (ZkTestServer Run Thread) [    ] o.a.s.c.ZkTestServer client
port:0.0.0.0/0.0.0.0:0
   [junit4]   2> 220986 INFO  (ZkTestServer Run Thread) [    ] o.a.s.c.ZkTestServer Starting
server
   [junit4]   2> 221078 INFO  (TEST-DistributedQueueTest.testLocallyOffer-seed#[B3CAD1A2347DE75A])
[    ] o.a.s.c.ZkTestServer start zk server on port:35032
   [junit4]   2> 221078 INFO  (TEST-DistributedQueueTest.testLocallyOffer-seed#[B3CAD1A2347DE75A])
[    ] o.a.s.c.ZkTestServer parse host and port list: 127.0.0.1:35032
   [junit4]   2> 221078 INFO  (TEST-DistributedQueueTest.testLocallyOffer-seed#[B3CAD1A2347DE75A])
[    ] o.a.s.c.ZkTestServer connecting to 127.0.0.1 35032
   [junit4]   2> 221118 INFO  (zkConnectionManagerCallback-1919-thread-1) [    ] o.a.s.c.c.ConnectionManager
zkClient has connected
   [junit4]   2> 221135 INFO  (zkConnectionManagerCallback-1921-thread-1) [    ] o.a.s.c.c.ConnectionManager
zkClient has connected
   [junit4]   2> 221144 INFO  (zkConnectionManagerCallback-1923-thread-1) [    ] o.a.s.c.c.ConnectionManager
zkClient has connected
   [junit4]   2> 221606 INFO  (TEST-DistributedQueueTest.testLocallyOffer-seed#[B3CAD1A2347DE75A])
[    ] o.a.s.SolrTestCaseJ4 ###Ending testLocallyOffer
   [junit4]   2> 221607 INFO  (TEST-DistributedQueueTest.testLocallyOffer-seed#[B3CAD1A2347DE75A])
[    ] o.a.s.c.ZkTestServer Shutting down ZkTestServer.
   [junit4]   2> 221613 INFO  (TEST-DistributedQueueTest.testLocallyOffer-seed#[B3CAD1A2347DE75A])
[    ] o.a.s.c.ZkTestServer parse host and port list: 127.0.0.1:35032
   [junit4]   2> 221613 INFO  (TEST-DistributedQueueTest.testLocallyOffer-seed#[B3CAD1A2347DE75A])
[    ] o.a.s.c.ZkTestServer connecting to 127.0.0.1 35032
   [junit4]   2> 221619 INFO  (TEST-DistributedQueueTest.testDistributedQueueBlocking-seed#[B3CAD1A2347DE75A])
[    ] o.a.s.SolrTestCaseJ4 ###Starting testDistributedQueueBlocking
   [junit4]   2> 221620 INFO  (TEST-DistributedQueueTest.testDistributedQueueBlocking-seed#[B3CAD1A2347DE75A])
[    ] o.a.s.c.ZkTestServer STARTING ZK TEST SERVER
   [junit4]   2> 221620 INFO  (ZkTestServer Run Thread) [    ] o.a.s.c.ZkTestServer client
port:0.0.0.0/0.0.0.0:0
   [junit4]   2> 221620 INFO  (ZkTestServer Run Thread) [    ] o.a.s.c.ZkTestServer Starting
server
   [junit4]   2> 221720 INFO  (TEST-DistributedQueueTest.testDistributedQueueBlocking-seed#[B3CAD1A2347DE75A])
[    ] o.a.s.c.ZkTestServer start zk server on port:45886
   [junit4]   2> 221721 INFO  (TEST-DistributedQueueTest.testDistributedQueueBlocking-seed#[B3CAD1A2347DE75A])
[    ] o.a.s.c.ZkTestServer parse host and port list: 127.0.0.1:45886
   [junit4]   2> 221721 INFO  (TEST-DistributedQueueTest.testDistributedQueueBlocking-seed#[B3CAD1A2347DE75A])
[    ] o.a.s.c.ZkTestServer connecting to 127.0.0.1 45886
   [junit4]   2> 221766 INFO  (zkConnectionManagerCallback-1926-thread-1) [    ] o.a.s.c.c.ConnectionManager
zkClient has connected
   [junit4]   2> 221798 INFO  (zkConnectionManagerCallback-1928-thread-1) [    ] o.a.s.c.c.ConnectionManager
zkClient has connected
   [junit4]   2> 221911 INFO  (zkConnectionManagerCallback-1930-thread-1) [    ] o.a.s.c.c.ConnectionManager
zkClient has connected
   [junit4]   2> 223216 WARN  (zkConnectionManagerCallback-1930-thread-1) [    ] o.a.s.c.c.ConnectionManager
Watcher org.apache.solr.common.cloud.ConnectionManager@7d517afc name: ZooKeeperConnection
Watcher:127.0.0.1:45886/solr got event WatchedEvent state:Disconnected type:None path:null
path: null type: None
   [junit4]   2> 223216 WARN  (zkConnectionManagerCallback-1930-thread-1) [    ] o.a.s.c.c.ConnectionManager
zkClient has disconnected
   [junit4]   2> 224634 WARN  (TEST-DistributedQueueTest.testDistributedQueueBlocking-seed#[B3CAD1A2347DE75A]-SendThread(localhost:45886))
[    ] o.a.z.ClientCnxn Unable to reconnect to ZooKeeper service, session 0x10430d7bd750002
has expired
   [junit4]   2> 224635 WARN  (zkConnectionManagerCallback-1930-thread-1) [    ] o.a.s.c.c.ConnectionManager
Watcher org.apache.solr.common.cloud.ConnectionManager@7d517afc name: ZooKeeperConnection
Watcher:127.0.0.1:45886/solr got event WatchedEvent state:Expired type:None path:null path:
null type: None
   [junit4]   2> 224635 WARN  (zkConnectionManagerCallback-1930-thread-1) [    ] o.a.s.c.c.ConnectionManager
Our previous ZooKeeper session was expired. Attempting to reconnect to recover relationship
with ZooKeeper...
   [junit4]   2> 224635 WARN  (zkConnectionManagerCallback-1930-thread-1) [    ] o.a.s.c.c.DefaultConnectionStrategy
Connection expired - starting a new one...
   [junit4]   2> 224646 INFO  (zkConnectionManagerCallback-1930-thread-1-EventThread) [
   ] o.a.s.c.c.ConnectionManager zkClient has connected
   [junit4]   2> 224647 INFO  (zkConnectionManagerCallback-1930-thread-1) [    ] o.a.s.c.c.ConnectionManager
Connection with ZooKeeper reestablished.
   [junit4]   2> 224647 INFO  (zkConnectionManagerCallback-1930-thread-1) [    ] o.a.s.c.c.DefaultConnectionStrategy
Reconnected to ZooKeeper
   [junit4]   2> 224647 INFO  (zkConnectionManagerCallback-1930-thread-1) [    ] o.a.s.c.c.ConnectionManager
zkClient Connected:true
   [junit4]   2> 225802 INFO  (TEST-DistributedQueueTest.testDistributedQueueBlocking-seed#[B3CAD1A2347DE75A])
[    ] o.a.s.SolrTestCaseJ4 ###Ending testDistributedQueueBlocking
   [junit4]   2> 225804 INFO  (TEST-DistributedQueueTest.testDistributedQueueBlocking-seed#[B3CAD1A2347DE75A])
[    ] o.a.s.c.ZkTestServer Shutting down ZkTestServer.
   [junit4]   2> 225805 WARN  (NIOServerCxn.Factory:0.0.0.0/0.0.0.0:0) [    ] o.a.z.s.NIOServerCnxn
Unable to read additional data from client sessionid 0x10430d7bd750000, likely client has
closed socket
   [junit4]   2> 225806 WARN  (ZkTestServer Run Thread) [    ] o.a.s.c.ZkTestServer Watch
limit violations: 
   [junit4]   2> Maximum concurrent children watches above limit:
   [junit4]   2> 
   [junit4]   2> 	2	/solr/distqueue/test
   [junit4]   2> 
   [junit4]   2> 225807 INFO  (TEST-DistributedQueueTest.testDistributedQueueBlocking-seed#[B3CAD1A2347DE75A])
[    ] o.a.s.c.ZkTestServer parse host and port list: 127.0.0.1:45886
   [junit4]   2> 225807 INFO  (TEST-DistributedQueueTest.testDistributedQueueBlocking-seed#[B3CAD1A2347DE75A])
[    ] o.a.s.c.ZkTestServer connecting to 127.0.0.1 45886
   [junit4]   2> 225816 INFO  (TEST-DistributedQueueTest.testDistributedQueueCache-seed#[B3CAD1A2347DE75A])
[    ] o.a.s.SolrTestCaseJ4 ###Starting testDistributedQueueCache
   [junit4]   2> 225817 INFO  (TEST-DistributedQueueTest.testDistributedQueueCache-seed#[B3CAD1A2347DE75A])
[    ] o.a.s.c.ZkTestServer STARTING ZK TEST SERVER
   [junit4]   2> 225830 INFO  (ZkTestServer Run Thread) [    ] o.a.s.c.ZkTestServer client
port:0.0.0.0/0.0.0.0:0
   [junit4]   2> 225830 INFO  (ZkTestServer Run Thread) [    ] o.a.s.c.ZkTestServer Starting
server
   [junit4]   2> 225930 INFO  (TEST-DistributedQueueTest.testDistributedQueueCache-seed#[B3CAD1A2347DE75A])
[    ] o.a.s.c.ZkTestServer start zk server on port:35583
   [junit4]   2> 225930 INFO  (TEST-DistributedQueueTest.testDistributedQueueCache-seed#[B3CAD1A2347DE75A])
[    ] o.a.s.c.ZkTestServer parse host and port list: 127.0.0.1:35583
   [junit4]   2> 225930 INFO  (TEST-DistributedQueueTest.testDistributedQueueCache-seed#[B3CAD1A2347DE75A])
[    ] o.a.s.c.ZkTestServer connecting to 127.0.0.1 35583
   [junit4]   2> 225966 INFO  (zkConnectionManagerCallback-1933-thread-1) [    ] o.a.s.c.c.ConnectionManager
zkClient has connected
   [junit4]   2> 225971 INFO  (zkConnectionManagerCallback-1935-thread-1) [    ] o.a.s.c.c.ConnectionManager
zkClient has connected
   [junit4]   2> 225982 INFO  (zkConnectionManagerCallback-1937-thread-1) [    ] o.a.s.c.c.ConnectionManager
zkClient has connected
   [junit4]   2> 226021 INFO  (TEST-DistributedQueueTest.testDistributedQueueCache-seed#[B3CAD1A2347DE75A])
[    ] o.a.s.SolrTestCaseJ4 ###Ending testDistributedQueueCache
   [junit4]   2> 226022 INFO  (TEST-DistributedQueueTest.testDistributedQueueCache-seed#[B3CAD1A2347DE75A])
[    ] o.a.s.c.ZkTestServer Shutting down ZkTestServer.
   [junit4]   2> 226028 INFO  (TEST-DistributedQueueTest.testDistributedQueueCache-seed#[B3CAD1A2347DE75A])
[    ] o.a.s.c.ZkTestServer parse host and port list: 127.0.0.1:35583
   [junit4]   2> 226028 INFO  (TEST-DistributedQueueTest.testDistributedQueueCache-seed#[B3CAD1A2347DE75A])
[    ] o.a.s.c.ZkTestServer connecting to 127.0.0.1 35583
   [junit4]   2> 226042 INFO  (TEST-DistributedQueueTest.testDistributedQueue-seed#[B3CAD1A2347DE75A])
[    ] o.a.s.SolrTestCaseJ4 ###Starting testDistributedQueue
   [junit4]   2> 226043 INFO  (TEST-DistributedQueueTest.testDistributedQueue-seed#[B3CAD1A2347DE75A])
[    ] o.a.s.c.ZkTestServer STARTING ZK TEST SERVER
   [junit4]   2> 226043 INFO  (ZkTestServer Run Thread) [    ] o.a.s.c.ZkTestServer client
port:0.0.0.0/0.0.0.0:0
   [junit4]   2> 226043 INFO  (ZkTestServer Run Thread) [    ] o.a.s.c.ZkTestServer Starting
server
   [junit4]   2> 226143 INFO  (TEST-DistributedQueueTest.testDistributedQueue-seed#[B3CAD1A2347DE75A])
[    ] o.a.s.c.ZkTestServer start zk server on port:39427
   [junit4]   2> 226143 INFO  (TEST-DistributedQueueTest.testDistributedQueue-seed#[B3CAD1A2347DE75A])
[    ] o.a.s.c.ZkTestServer parse host and port list: 127.0.0.1:39427
   [junit4]   2> 226143 INFO  (TEST-DistributedQueueTest.testDistributedQueue-seed#[B3CAD1A2347DE75A])
[    ] o.a.s.c.ZkTestServer connecting to 127.0.0.1 39427
   [junit4]   2> 226158 INFO  (zkConnectionManagerCallback-1940-thread-1) [    ] o.a.s.c.c.ConnectionManager
zkClient has connected
   [junit4]   2> 226170 INFO  (zkConnectionManagerCallback-1942-thread-1) [    ] o.a.s.c.c.ConnectionManager
zkClient has connected
   [junit4]   2> 226175 INFO  (zkConnectionManagerCallback-1944-thread-1) [    ] o.a.s.c.c.ConnectionManager
zkClient has connected
   [junit4]   2> 228192 INFO  (TEST-DistributedQueueTest.testDistributedQueue-seed#[B3CAD1A2347DE75A])
[    ] o.a.s.SolrTestCaseJ4 ###Ending testDistributedQueue
   [junit4]   2> 228193 INFO  (TEST-DistributedQueueTest.testDistributedQueue-seed#[B3CAD1A2347DE75A])
[    ] o.a.s.c.ZkTestServer Shutting down ZkTestServer.
   [junit4]   2> 228205 INFO  (TEST-DistributedQueueTest.testDistributedQueue-seed#[B3CAD1A2347DE75A])
[    ] o.a.s.c.ZkTestServer parse host and port list: 127.0.0.1:39427
   [junit4]   2> 228205 INFO  (TEST-DistributedQueueTest.testDistributedQueue-seed#[B3CAD1A2347DE75A])
[    ] o.a.s.c.ZkTestServer connecting to 127.0.0.1 39427
   [junit4]   2> NOTE: leaving temporary files on disk at: /x1/jenkins/jenkins-slave/workspace/Lucene-Solr-Tests-master/solr/build/solr-core/test/J2/temp/solr.cloud.DistributedQueueTest_B3CAD1A2347DE75A-001
   [junit4]   2> May 03, 2019 6:22:49 AM com.carrotsearch.randomizedtesting.ThreadLeakControl
checkThreadLeaks
   [junit4]   2> WARNING: Will linger awaiting termination of 4 leaked thread(s).
   [junit4]   2> NOTE: test params are: codec=Asserting(Lucene80): {}, docValues:{}, maxPointsInLeafNode=1483,
maxMBSortInHeap=7.32500741306834, sim=Asserting(org.apache.lucene.search.similarities.AssertingSimilarity@6f6bc9e3),
locale=af-ZA, timezone=Asia/Chita
   [junit4]   2> NOTE: Linux 4.4.0-137-generic amd64/Oracle Corporation 11.0.1 (64-bit)/cpus=4,threads=1,free=135876328,total=264241152
   [junit4]   2> NOTE: All tests run in this JVM: [SmileWriterTest, ByteBuffersDirectoryFactoryTest,
RankQueryTest, TestClusterStateMutator, UnloadDistributedZkTest, CloudMLTQParserTest, BinaryUpdateRequestHandlerTest,
TestCloudPhrasesIdentificationComponent, TestPerFieldSimilarityWithDefaultOverride, NestedAtomicUpdateTest,
PolyFieldTest, DeleteReplicaTest, TestPartialUpdateDeduplication, DistributedQueueTest]
   [junit4] Completed [68/855 (1!)] on J2 in 9.91s, 6 tests, 1 failure <<< FAILURES!

[...truncated 52671 lines...]
[asciidoctor:convert] asciidoctor: ERROR: about-this-guide.adoc: line 1: invalid part, must
have at least one section (e.g., chapter, appendix, etc.)
[asciidoctor:convert] asciidoctor: ERROR: solr-glossary.adoc: line 1: invalid part, must have
at least one section (e.g., chapter, appendix, etc.)
     [java] Processed 2531 links (2070 relative) to 3358 anchors in 253 files
     [echo] Validated Links & Anchors via: /x1/jenkins/jenkins-slave/workspace/Lucene-Solr-Tests-master/solr/build/solr-ref-guide/bare-bones-html/

-documentation-lint:
    [jtidy] FIXME: Broken HTML checks were disabled, as jtidy can't handle HTML5.
     [echo] Checking for broken links...
     [exec] 
     [exec] Crawl/parse...
     [exec] 
     [exec] Verify...
     [echo] Checking for malformed docs...

jar-checksums:

resolve:

ivy-availability-check:
[loadresource] Do not set property disallowed.ivy.jars.list as its length is 0.

-ivy-fail-disallowed-ivy-version:

ivy-fail:

ivy-configure:
[ivy:configure] :: loading settings :: file = /x1/jenkins/jenkins-slave/workspace/Lucene-Solr-Tests-master/lucene/top-level-ivy-settings.xml

resolve:

ivy-availability-check:
[loadresource] Do not set property disallowed.ivy.jars.list as its length is 0.

-ivy-fail-disallowed-ivy-version:

ivy-fail:

ivy-configure:
[ivy:configure] :: loading settings :: file = /x1/jenkins/jenkins-slave/workspace/Lucene-Solr-Tests-master/lucene/top-level-ivy-settings.xml

resolve:

resolve:

ivy-availability-check:
[loadresource] Do not set property disallowed.ivy.jars.list as its length is 0.

-ivy-fail-disallowed-ivy-version:

ivy-fail:

ivy-configure:
[ivy:configure] :: loading settings :: file = /x1/jenkins/jenkins-slave/workspace/Lucene-Solr-Tests-master/lucene/top-level-ivy-settings.xml

resolve:

ivy-availability-check:
[loadresource] Do not set property disallowed.ivy.jars.list as its length is 0.

-ivy-fail-disallowed-ivy-version:

ivy-fail:

ivy-configure:
[ivy:configure] :: loading settings :: file = /x1/jenkins/jenkins-slave/workspace/Lucene-Solr-Tests-master/lucene/top-level-ivy-settings.xml

resolve:

ivy-availability-check:
[loadresource] Do not set property disallowed.ivy.jars.list as its length is 0.

-ivy-fail-disallowed-ivy-version:

ivy-fail:

ivy-configure:
[ivy:configure] :: loading settings :: file = /x1/jenkins/jenkins-slave/workspace/Lucene-Solr-Tests-master/lucene/top-level-ivy-settings.xml

resolve:

ivy-availability-check:
[loadresource] Do not set property disallowed.ivy.jars.list as its length is 0.

-ivy-fail-disallowed-ivy-version:

ivy-fail:

ivy-configure:
[ivy:configure] :: loading settings :: file = /x1/jenkins/jenkins-slave/workspace/Lucene-Solr-Tests-master/lucene/top-level-ivy-settings.xml

resolve:

ivy-availability-check:
[loadresource] Do not set property disallowed.ivy.jars.list as its length is 0.

-ivy-fail-disallowed-ivy-version:

ivy-fail:

ivy-configure:
[ivy:configure] :: loading settings :: file = /x1/jenkins/jenkins-slave/workspace/Lucene-Solr-Tests-master/lucene/top-level-ivy-settings.xml

resolve:

ivy-availability-check:
[loadresource] Do not set property disallowed.ivy.jars.list as its length is 0.

-ivy-fail-disallowed-ivy-version:

ivy-fail:

ivy-configure:
[ivy:configure] :: loading settings :: file = /x1/jenkins/jenkins-slave/workspace/Lucene-Solr-Tests-master/lucene/top-level-ivy-settings.xml

resolve:

ivy-availability-check:
[loadresource] Do not set property disallowed.ivy.jars.list as its length is 0.

-ivy-fail-disallowed-ivy-version:

ivy-fail:

ivy-configure:
[ivy:configure] :: loading settings :: file = /x1/jenkins/jenkins-slave/workspace/Lucene-Solr-Tests-master/lucene/top-level-ivy-settings.xml

resolve:

ivy-availability-check:
[loadresource] Do not set property disallowed.ivy.jars.list as its length is 0.

-ivy-fail-disallowed-ivy-version:

ivy-fail:

ivy-configure:
[ivy:configure] :: loading settings :: file = /x1/jenkins/jenkins-slave/workspace/Lucene-Solr-Tests-master/lucene/top-level-ivy-settings.xml

resolve:

ivy-availability-check:
[loadresource] Do not set property disallowed.ivy.jars.list as its length is 0.

-ivy-fail-disallowed-ivy-version:

ivy-fail:

ivy-configure:
[ivy:configure] :: loading settings :: file = /x1/jenkins/jenkins-slave/workspace/Lucene-Solr-Tests-master/lucene/top-level-ivy-settings.xml

resolve:

ivy-availability-check:
[loadresource] Do not set property disallowed.ivy.jars.list as its length is 0.

-ivy-fail-disallowed-ivy-version:

ivy-fail:

ivy-configure:
[ivy:configure] :: loading settings :: file = /x1/jenkins/jenkins-slave/workspace/Lucene-Solr-Tests-master/lucene/top-level-ivy-settings.xml

resolve:

ivy-availability-check:
[loadresource] Do not set property disallowed.ivy.jars.list as its length is 0.

-ivy-fail-disallowed-ivy-version:

ivy-fail:

ivy-configure:
[ivy:configure] :: loading settings :: file = /x1/jenkins/jenkins-slave/workspace/Lucene-Solr-Tests-master/lucene/top-level-ivy-settings.xml

resolve:

ivy-availability-check:
[loadresource] Do not set property disallowed.ivy.jars.list as its length is 0.

-ivy-fail-disallowed-ivy-version:

ivy-fail:

ivy-configure:
[ivy:configure] :: loading settings :: file = /x1/jenkins/jenkins-slave/workspace/Lucene-Solr-Tests-master/lucene/top-level-ivy-settings.xml

resolve:

ivy-availability-check:
[loadresource] Do not set property disallowed.ivy.jars.list as its length is 0.

-ivy-fail-disallowed-ivy-version:

ivy-fail:

ivy-configure:
[ivy:configure] :: loading settings :: file = /x1/jenkins/jenkins-slave/workspace/Lucene-Solr-Tests-master/lucene/top-level-ivy-settings.xml

resolve:

ivy-availability-check:
[loadresource] Do not set property disallowed.ivy.jars.list as its length is 0.

-ivy-fail-disallowed-ivy-version:

ivy-fail:

ivy-configure:
[ivy:configure] :: loading settings :: file = /x1/jenkins/jenkins-slave/workspace/Lucene-Solr-Tests-master/lucene/top-level-ivy-settings.xml

resolve:

ivy-availability-check:
[loadresource] Do not set property disallowed.ivy.jars.list as its length is 0.

-ivy-fail-disallowed-ivy-version:

ivy-fail:

ivy-configure:
[ivy:configure] :: loading settings :: file = /x1/jenkins/jenkins-slave/workspace/Lucene-Solr-Tests-master/lucene/top-level-ivy-settings.xml

resolve:

ivy-availability-check:
[loadresource] Do not set property disallowed.ivy.jars.list as its length is 0.

-ivy-fail-disallowed-ivy-version:

ivy-fail:

ivy-configure:
[ivy:configure] :: loading settings :: file = /x1/jenkins/jenkins-slave/workspace/Lucene-Solr-Tests-master/lucene/top-level-ivy-settings.xml

resolve:

ivy-availability-check:
[loadresource] Do not set property disallowed.ivy.jars.list as its length is 0.

-ivy-fail-disallowed-ivy-version:

ivy-fail:

ivy-configure:
[ivy:configure] :: loading settings :: file = /x1/jenkins/jenkins-slave/workspace/Lucene-Solr-Tests-master/lucene/top-level-ivy-settings.xml

resolve:

ivy-availability-check:
[loadresource] Do not set property disallowed.ivy.jars.list as its length is 0.

-ivy-fail-disallowed-ivy-version:

ivy-fail:

ivy-configure:
[ivy:configure] :: loading settings :: file = /x1/jenkins/jenkins-slave/workspace/Lucene-Solr-Tests-master/lucene/top-level-ivy-settings.xml

resolve:

ivy-availability-check:
[loadresource] Do not set property disallowed.ivy.jars.list as its length is 0.

-ivy-fail-disallowed-ivy-version:

ivy-fail:

ivy-configure:
[ivy:configure] :: loading settings :: file = /x1/jenkins/jenkins-slave/workspace/Lucene-Solr-Tests-master/lucene/top-level-ivy-settings.xml

resolve:

ivy-availability-check:
[loadresource] Do not set property disallowed.ivy.jars.list as its length is 0.

-ivy-fail-disallowed-ivy-version:

ivy-fail:

ivy-configure:
[ivy:configure] :: loading settings :: file = /x1/jenkins/jenkins-slave/workspace/Lucene-Solr-Tests-master/lucene/top-level-ivy-settings.xml

resolve:

ivy-availability-check:
[loadresource] Do not set property disallowed.ivy.jars.list as its length is 0.

-ivy-fail-disallowed-ivy-version:

ivy-fail:

ivy-configure:
[ivy:configure] :: loading settings :: file = /x1/jenkins/jenkins-slave/workspace/Lucene-Solr-Tests-master/lucene/top-level-ivy-settings.xml

resolve:

ivy-availability-check:
[loadresource] Do not set property disallowed.ivy.jars.list as its length is 0.

-ivy-fail-disallowed-ivy-version:

ivy-fail:

ivy-configure:
[ivy:configure] :: loading settings :: file = /x1/jenkins/jenkins-slave/workspace/Lucene-Solr-Tests-master/lucene/top-level-ivy-settings.xml

resolve:

ivy-availability-check:
[loadresource] Do not set property disallowed.ivy.jars.list as its length is 0.

-ivy-fail-disallowed-ivy-version:

ivy-fail:

ivy-configure:
[ivy:configure] :: loading settings :: file = /x1/jenkins/jenkins-slave/workspace/Lucene-Solr-Tests-master/lucene/top-level-ivy-settings.xml

resolve:

ivy-availability-check:
[loadresource] Do not set property disallowed.ivy.jars.list as its length is 0.

-ivy-fail-disallowed-ivy-version:

ivy-fail:

ivy-configure:
[ivy:configure] :: loading settings :: file = /x1/jenkins/jenkins-slave/workspace/Lucene-Solr-Tests-master/lucene/top-level-ivy-settings.xml

resolve:

ivy-availability-check:
[loadresource] Do not set property disallowed.ivy.jars.list as its length is 0.

-ivy-fail-disallowed-ivy-version:

ivy-fail:

ivy-configure:
[ivy:configure] :: loading settings :: file = /x1/jenkins/jenkins-slave/workspace/Lucene-Solr-Tests-master/lucene/top-level-ivy-settings.xml

common.resolve:

resolve:

ivy-availability-check:
[loadresource] Do not set property disallowed.ivy.jars.list as its length is 0.

-ivy-fail-disallowed-ivy-version:

ivy-fail:

ivy-configure:
[ivy:configure] :: loading settings :: file = /x1/jenkins/jenkins-slave/workspace/Lucene-Solr-Tests-master/lucene/top-level-ivy-settings.xml

resolve:

ivy-availability-check:
[loadresource] Do not set property disallowed.ivy.jars.list as its length is 0.

-ivy-fail-disallowed-ivy-version:

ivy-fail:

ivy-configure:
[ivy:configure] :: loading settings :: file = /x1/jenkins/jenkins-slave/workspace/Lucene-Solr-Tests-master/lucene/top-level-ivy-settings.xml

resolve:

ivy-availability-check:
[loadresource] Do not set property disallowed.ivy.jars.list as its length is 0.

-ivy-fail-disallowed-ivy-version:

ivy-fail:

ivy-configure:
[ivy:configure] :: loading settings :: file = /x1/jenkins/jenkins-slave/workspace/Lucene-Solr-Tests-master/lucene/top-level-ivy-settings.xml

resolve:

ivy-availability-check:
[loadresource] Do not set property disallowed.ivy.jars.list as its length is 0.

-ivy-fail-disallowed-ivy-version:

ivy-fail:

ivy-configure:
[ivy:configure] :: loading settings :: file = /x1/jenkins/jenkins-slave/workspace/Lucene-Solr-Tests-master/lucene/top-level-ivy-settings.xml

resolve:

ivy-availability-check:
[loadresource] Do not set property disallowed.ivy.jars.list as its length is 0.

-ivy-fail-disallowed-ivy-version:

ivy-fail:

ivy-configure:
[ivy:configure] :: loading settings :: file = /x1/jenkins/jenkins-slave/workspace/Lucene-Solr-Tests-master/lucene/top-level-ivy-settings.xml

resolve:

jar-checksums:
    [mkdir] Created dir: /x1/jenkins/jenkins-slave/workspace/Lucene-Solr-Tests-master/lucene/null396639775
     [copy] Copying 38 files to /x1/jenkins/jenkins-slave/workspace/Lucene-Solr-Tests-master/lucene/null396639775
   [delete] Deleting directory /x1/jenkins/jenkins-slave/workspace/Lucene-Solr-Tests-master/lucene/null396639775

resolve-example:

ivy-availability-check:
[loadresource] Do not set property disallowed.ivy.jars.list as its length is 0.

-ivy-fail-disallowed-ivy-version:

ivy-fail:

ivy-configure:
[ivy:configure] :: loading settings :: file = /x1/jenkins/jenkins-slave/workspace/Lucene-Solr-Tests-master/lucene/top-level-ivy-settings.xml

resolve:

resolve-server:

ivy-availability-check:
[loadresource] Do not set property disallowed.ivy.jars.list as its length is 0.

-ivy-fail-disallowed-ivy-version:

ivy-fail:

ivy-fail:

ivy-configure:
[ivy:configure] :: loading settings :: file = /x1/jenkins/jenkins-slave/workspace/Lucene-Solr-Tests-master/lucene/top-level-ivy-settings.xml

resolve:

resolve:

ivy-availability-check:
[loadresource] Do not set property disallowed.ivy.jars.list as its length is 0.

-ivy-fail-disallowed-ivy-version:

ivy-fail:

ivy-fail:

ivy-configure:
[ivy:configure] :: loading settings :: file = /x1/jenkins/jenkins-slave/workspace/Lucene-Solr-Tests-master/lucene/top-level-ivy-settings.xml

resolve:

ivy-availability-check:
[loadresource] Do not set property disallowed.ivy.jars.list as its length is 0.

-ivy-fail-disallowed-ivy-version:

ivy-fail:

ivy-fail:

ivy-configure:
[ivy:configure] :: loading settings :: file = /x1/jenkins/jenkins-slave/workspace/Lucene-Solr-Tests-master/lucene/top-level-ivy-settings.xml

resolve:

ivy-availability-check:
[loadresource] Do not set property disallowed.ivy.jars.list as its length is 0.

-ivy-fail-disallowed-ivy-version:

ivy-fail:

ivy-configure:
[ivy:configure] :: loading settings :: file = /x1/jenkins/jenkins-slave/workspace/Lucene-Solr-Tests-master/lucene/top-level-ivy-settings.xml

resolve:

ivy-availability-check:
[loadresource] Do not set property disallowed.ivy.jars.list as its length is 0.

-ivy-fail-disallowed-ivy-version:

ivy-fail:

ivy-fail:

ivy-configure:
[ivy:configure] :: loading settings :: file = /x1/jenkins/jenkins-slave/workspace/Lucene-Solr-Tests-master/lucene/top-level-ivy-settings.xml

resolve:

ivy-availability-check:
[loadresource] Do not set property disallowed.ivy.jars.list as its length is 0.

-ivy-fail-disallowed-ivy-version:

ivy-fail:

ivy-configure:
[ivy:configure] :: loading settings :: file = /x1/jenkins/jenkins-slave/workspace/Lucene-Solr-Tests-master/lucene/top-level-ivy-settings.xml

resolve:

ivy-availability-check:
[loadresource] Do not set property disallowed.ivy.jars.list as its length is 0.

-ivy-fail-disallowed-ivy-version:

ivy-fail:

ivy-fail:

ivy-configure:
[ivy:configure] :: loading settings :: file = /x1/jenkins/jenkins-slave/workspace/Lucene-Solr-Tests-master/lucene/top-level-ivy-settings.xml

resolve:

ivy-availability-check:
[loadresource] Do not set property disallowed.ivy.jars.list as its length is 0.

-ivy-fail-disallowed-ivy-version:

ivy-fail:

ivy-fail:

ivy-configure:
[ivy:configure] :: loading settings :: file = /x1/jenkins/jenkins-slave/workspace/Lucene-Solr-Tests-master/lucene/top-level-ivy-settings.xml

resolve:

ivy-availability-check:
[loadresource] Do not set property disallowed.ivy.jars.list as its length is 0.

-ivy-fail-disallowed-ivy-version:

ivy-fail:

ivy-fail:

ivy-configure:
[ivy:configure] :: loading settings :: file = /x1/jenkins/jenkins-slave/workspace/Lucene-Solr-Tests-master/lucene/top-level-ivy-settings.xml

resolve:

ivy-availability-check:
[loadresource] Do not set property disallowed.ivy.jars.list as its length is 0.

-ivy-fail-disallowed-ivy-version:

ivy-fail:

ivy-fail:

ivy-configure:
[ivy:configure] :: loading settings :: file = /x1/jenkins/jenkins-slave/workspace/Lucene-Solr-Tests-master/lucene/top-level-ivy-settings.xml

resolve:

ivy-availability-check:
[loadresource] Do not set property disallowed.ivy.jars.list as its length is 0.

-ivy-fail-disallowed-ivy-version:

ivy-fail:

ivy-fail:

ivy-configure:
[ivy:configure] :: loading settings :: file = /x1/jenkins/jenkins-slave/workspace/Lucene-Solr-Tests-master/lucene/top-level-ivy-settings.xml

resolve:

ivy-availability-check:
[loadresource] Do not set property disallowed.ivy.jars.list as its length is 0.

-ivy-fail-disallowed-ivy-version:

ivy-fail:

ivy-fail:

ivy-configure:
[ivy:configure] :: loading settings :: file = /x1/jenkins/jenkins-slave/workspace/Lucene-Solr-Tests-master/lucene/top-level-ivy-settings.xml

resolve:

ivy-availability-check:
[loadresource] Do not set property disallowed.ivy.jars.list as its length is 0.

-ivy-fail-disallowed-ivy-version:

ivy-fail:

ivy-fail:

ivy-configure:
[ivy:configure] :: loading settings :: file = /x1/jenkins/jenkins-slave/workspace/Lucene-Solr-Tests-master/lucene/top-level-ivy-settings.xml

resolve:

ivy-availability-check:
[loadresource] Do not set property disallowed.ivy.jars.list as its length is 0.

-ivy-fail-disallowed-ivy-version:

ivy-fail:

ivy-fail:

ivy-configure:
[ivy:configure] :: loading settings :: file = /x1/jenkins/jenkins-slave/workspace/Lucene-Solr-Tests-master/lucene/top-level-ivy-settings.xml

resolve:

ivy-availability-check:
[loadresource] Do not set property disallowed.ivy.jars.list as its length is 0.

-ivy-fail-disallowed-ivy-version:

ivy-fail:

ivy-fail:

ivy-configure:
[ivy:configure] :: loading settings :: file = /x1/jenkins/jenkins-slave/workspace/Lucene-Solr-Tests-master/lucene/top-level-ivy-settings.xml

resolve:

ivy-availability-check:
[loadresource] Do not set property disallowed.ivy.jars.list as its length is 0.

-ivy-fail-disallowed-ivy-version:

ivy-fail:

ivy-fail:

ivy-configure:
[ivy:configure] :: loading settings :: file = /x1/jenkins/jenkins-slave/workspace/Lucene-Solr-Tests-master/lucene/top-level-ivy-settings.xml

resolve:

jar-checksums:
    [mkdir] Created dir: /x1/jenkins/jenkins-slave/workspace/Lucene-Solr-Tests-master/solr/null145100130
     [copy] Copying 239 files to /x1/jenkins/jenkins-slave/workspace/Lucene-Solr-Tests-master/solr/null145100130
   [delete] Deleting directory /x1/jenkins/jenkins-slave/workspace/Lucene-Solr-Tests-master/solr/null145100130

check-working-copy:
[ivy:cachepath] :: resolving dependencies :: #;working@lucene1-us-west
[ivy:cachepath] 	confs: [default]
[ivy:cachepath] 	found org.eclipse.jgit#org.eclipse.jgit;5.3.0.201903130848-r in public
[ivy:cachepath] 	found com.jcraft#jsch;0.1.54 in public
[ivy:cachepath] 	found com.jcraft#jzlib;1.1.1 in public
[ivy:cachepath] 	found com.googlecode.javaewah#JavaEWAH;1.1.6 in public
[ivy:cachepath] 	found org.slf4j#slf4j-api;1.7.2 in public
[ivy:cachepath] 	found org.bouncycastle#bcpg-jdk15on;1.60 in public
[ivy:cachepath] 	found org.bouncycastle#bcprov-jdk15on;1.60 in public
[ivy:cachepath] 	found org.bouncycastle#bcpkix-jdk15on;1.60 in public
[ivy:cachepath] 	found org.slf4j#slf4j-nop;1.7.2 in public
[ivy:cachepath] :: resolution report :: resolve 61ms :: artifacts dl 11ms
	---------------------------------------------------------------------
	|                  |            modules            ||   artifacts   |
	|       conf       | number| search|dwnlded|evicted|| number|dwnlded|
	---------------------------------------------------------------------
	|      default     |   9   |   0   |   0   |   0   ||   9   |   0   |
	---------------------------------------------------------------------
[wc-checker] Initializing working copy...
[wc-checker] Checking working copy status...

-jenkins-base:

BUILD SUCCESSFUL
Total time: 122 minutes 10 seconds
Archiving artifacts
java.lang.InterruptedException: no matches found within 10000
	at hudson.FilePath$ValidateAntFileMask.hasMatch(FilePath.java:2847)
	at hudson.FilePath$ValidateAntFileMask.invoke(FilePath.java:2726)
	at hudson.FilePath$ValidateAntFileMask.invoke(FilePath.java:2707)
	at hudson.FilePath$FileCallableWrapper.call(FilePath.java:3086)
Also:   hudson.remoting.Channel$CallSiteStackTrace: Remote call to lucene
		at hudson.remoting.Channel.attachCallSiteStackTrace(Channel.java:1741)
		at hudson.remoting.UserRequest$ExceptionResponse.retrieve(UserRequest.java:357)
		at hudson.remoting.Channel.call(Channel.java:955)
		at hudson.FilePath.act(FilePath.java:1072)
		at hudson.FilePath.act(FilePath.java:1061)
		at hudson.FilePath.validateAntFileMask(FilePath.java:2705)
		at hudson.tasks.ArtifactArchiver.perform(ArtifactArchiver.java:243)
		at hudson.tasks.BuildStepCompatibilityLayer.perform(BuildStepCompatibilityLayer.java:81)
		at hudson.tasks.BuildStepMonitor$1.perform(BuildStepMonitor.java:20)
		at hudson.model.AbstractBuild$AbstractBuildExecution.perform(AbstractBuild.java:744)
		at hudson.model.AbstractBuild$AbstractBuildExecution.performAllBuildSteps(AbstractBuild.java:690)
		at hudson.model.Build$BuildExecution.post2(Build.java:186)
		at hudson.model.AbstractBuild$AbstractBuildExecution.post(AbstractBuild.java:635)
		at hudson.model.Run.execute(Run.java:1835)
		at hudson.model.FreeStyleBuild.run(FreeStyleBuild.java:43)
		at hudson.model.ResourceController.execute(ResourceController.java:97)
		at hudson.model.Executor.run(Executor.java:429)
Caused: hudson.FilePath$TunneledInterruptedException
	at hudson.FilePath$FileCallableWrapper.call(FilePath.java:3088)
	at hudson.remoting.UserRequest.perform(UserRequest.java:212)
	at hudson.remoting.UserRequest.perform(UserRequest.java:54)
	at hudson.remoting.Request$2.run(Request.java:369)
	at hudson.remoting.InterceptingExecutorService$1.call(InterceptingExecutorService.java:72)
	at java.util.concurrent.FutureTask.run(FutureTask.java:266)
	at java.util.concurrent.ThreadPoolExecutor.runWorker(ThreadPoolExecutor.java:1142)
	at java.util.concurrent.ThreadPoolExecutor$Worker.run(ThreadPoolExecutor.java:617)
	at java.lang.Thread.run(Thread.java:748)
Caused: java.lang.InterruptedException: java.lang.InterruptedException: no matches found within
10000
	at hudson.FilePath.act(FilePath.java:1074)
	at hudson.FilePath.act(FilePath.java:1061)
	at hudson.FilePath.validateAntFileMask(FilePath.java:2705)
	at hudson.tasks.ArtifactArchiver.perform(ArtifactArchiver.java:243)
	at hudson.tasks.BuildStepCompatibilityLayer.perform(BuildStepCompatibilityLayer.java:81)
	at hudson.tasks.BuildStepMonitor$1.perform(BuildStepMonitor.java:20)
	at hudson.model.AbstractBuild$AbstractBuildExecution.perform(AbstractBuild.java:744)
	at hudson.model.AbstractBuild$AbstractBuildExecution.performAllBuildSteps(AbstractBuild.java:690)
	at hudson.model.Build$BuildExecution.post2(Build.java:186)
	at hudson.model.AbstractBuild$AbstractBuildExecution.post(AbstractBuild.java:635)
	at hudson.model.Run.execute(Run.java:1835)
	at hudson.model.FreeStyleBuild.run(FreeStyleBuild.java:43)
	at hudson.model.ResourceController.execute(ResourceController.java:97)
	at hudson.model.Executor.run(Executor.java:429)
No artifacts found that match the file pattern "**/*.events,heapdumps/**,**/hs_err_pid*".
Configuration error?
Recording test results
Build step 'Publish JUnit test result report' changed build result to UNSTABLE
Email was triggered for: Unstable (Test Failures)
Sending email for trigger: Unstable (Test Failures)

Mime
View raw message