lucene-dev mailing list archives

Site index · List index
Message view « Date » · « Thread »
Top « Date » · « Thread »
From Policeman Jenkins Server <jenk...@thetaphi.de>
Subject [JENKINS] Lucene-Solr-8.x-Windows (64bit/jdk-10.0.1) - Build # 256 - Unstable!
Date Wed, 15 May 2019 09:33:59 GMT
Build: https://jenkins.thetaphi.de/job/Lucene-Solr-8.x-Windows/256/
Java: 64bit/jdk-10.0.1 -XX:-UseCompressedOops -XX:+UseParallelGC

1 tests failed.
FAILED:  org.apache.solr.prometheus.exporter.SolrExporterIntegrationTest.jvmMetrics

Error Message:
expected:<36> but was:<48>

Stack Trace:
java.lang.AssertionError: expected:<36> but was:<48>
	at __randomizedtesting.SeedInfo.seed([F9B3905E696473E5:2A07ADB17C8ABF71]:0)
	at org.junit.Assert.fail(Assert.java:88)
	at org.junit.Assert.failNotEquals(Assert.java:834)
	at org.junit.Assert.assertEquals(Assert.java:645)
	at org.junit.Assert.assertEquals(Assert.java:631)
	at org.apache.solr.prometheus.exporter.SolrExporterIntegrationTest.jvmMetrics(SolrExporterIntegrationTest.java:71)
	at java.base/jdk.internal.reflect.NativeMethodAccessorImpl.invoke0(Native Method)
	at java.base/jdk.internal.reflect.NativeMethodAccessorImpl.invoke(NativeMethodAccessorImpl.java:62)
	at java.base/jdk.internal.reflect.DelegatingMethodAccessorImpl.invoke(DelegatingMethodAccessorImpl.java:43)
	at java.base/java.lang.reflect.Method.invoke(Method.java:564)
	at com.carrotsearch.randomizedtesting.RandomizedRunner.invoke(RandomizedRunner.java:1750)
	at com.carrotsearch.randomizedtesting.RandomizedRunner$8.evaluate(RandomizedRunner.java:938)
	at com.carrotsearch.randomizedtesting.RandomizedRunner$9.evaluate(RandomizedRunner.java:974)
	at com.carrotsearch.randomizedtesting.RandomizedRunner$10.evaluate(RandomizedRunner.java:988)
	at com.carrotsearch.randomizedtesting.rules.SystemPropertiesRestoreRule$1.evaluate(SystemPropertiesRestoreRule.java:57)
	at org.apache.lucene.util.TestRuleSetupTeardownChained$1.evaluate(TestRuleSetupTeardownChained.java:49)
	at org.apache.lucene.util.AbstractBeforeAfterRule$1.evaluate(AbstractBeforeAfterRule.java:45)
	at org.apache.lucene.util.TestRuleThreadAndTestName$1.evaluate(TestRuleThreadAndTestName.java:48)
	at org.apache.lucene.util.TestRuleIgnoreAfterMaxFailures$1.evaluate(TestRuleIgnoreAfterMaxFailures.java:64)
	at org.apache.lucene.util.TestRuleMarkFailure$1.evaluate(TestRuleMarkFailure.java:47)
	at com.carrotsearch.randomizedtesting.rules.StatementAdapter.evaluate(StatementAdapter.java:36)
	at com.carrotsearch.randomizedtesting.ThreadLeakControl$StatementRunner.run(ThreadLeakControl.java:368)
	at com.carrotsearch.randomizedtesting.ThreadLeakControl.forkTimeoutingTask(ThreadLeakControl.java:817)
	at com.carrotsearch.randomizedtesting.ThreadLeakControl$3.evaluate(ThreadLeakControl.java:468)
	at com.carrotsearch.randomizedtesting.RandomizedRunner.runSingleTest(RandomizedRunner.java:947)
	at com.carrotsearch.randomizedtesting.RandomizedRunner$5.evaluate(RandomizedRunner.java:832)
	at com.carrotsearch.randomizedtesting.RandomizedRunner$6.evaluate(RandomizedRunner.java:883)
	at com.carrotsearch.randomizedtesting.RandomizedRunner$7.evaluate(RandomizedRunner.java:894)
	at com.carrotsearch.randomizedtesting.rules.StatementAdapter.evaluate(StatementAdapter.java:36)
	at com.carrotsearch.randomizedtesting.rules.SystemPropertiesRestoreRule$1.evaluate(SystemPropertiesRestoreRule.java:57)
	at org.apache.lucene.util.AbstractBeforeAfterRule$1.evaluate(AbstractBeforeAfterRule.java:45)
	at com.carrotsearch.randomizedtesting.rules.StatementAdapter.evaluate(StatementAdapter.java:36)
	at org.apache.lucene.util.TestRuleStoreClassName$1.evaluate(TestRuleStoreClassName.java:41)
	at com.carrotsearch.randomizedtesting.rules.NoShadowingOrOverridesOnMethodsRule$1.evaluate(NoShadowingOrOverridesOnMethodsRule.java:40)
	at com.carrotsearch.randomizedtesting.rules.NoShadowingOrOverridesOnMethodsRule$1.evaluate(NoShadowingOrOverridesOnMethodsRule.java:40)
	at com.carrotsearch.randomizedtesting.rules.StatementAdapter.evaluate(StatementAdapter.java:36)
	at com.carrotsearch.randomizedtesting.rules.StatementAdapter.evaluate(StatementAdapter.java:36)
	at org.apache.lucene.util.TestRuleAssertionsRequired$1.evaluate(TestRuleAssertionsRequired.java:53)
	at org.apache.lucene.util.TestRuleMarkFailure$1.evaluate(TestRuleMarkFailure.java:47)
	at org.apache.lucene.util.TestRuleIgnoreAfterMaxFailures$1.evaluate(TestRuleIgnoreAfterMaxFailures.java:64)
	at org.apache.lucene.util.TestRuleIgnoreTestSuites$1.evaluate(TestRuleIgnoreTestSuites.java:54)
	at com.carrotsearch.randomizedtesting.rules.StatementAdapter.evaluate(StatementAdapter.java:36)
	at com.carrotsearch.randomizedtesting.ThreadLeakControl$StatementRunner.run(ThreadLeakControl.java:368)
	at java.base/java.lang.Thread.run(Thread.java:844)




Build Log:
[...truncated 24255 lines...]
   [junit4] Suite: org.apache.solr.prometheus.exporter.SolrExporterIntegrationTest
   [junit4]   2> Creating dataDir: C:\Users\jenkins\workspace\Lucene-Solr-8.x-Windows\solr\build\contrib\solr-prometheus-exporter\test\J0\temp\solr.prometheus.exporter.SolrExporterIntegrationTest_F9B3905E696473E5-001\init-core-data-001
   [junit4]   1> 09:25:35.287 [jetty-launcher-24-thread-3] ERROR org.apache.solr.util.StartupLoggingUtils
- Missing Java Option solr.log.dir. Logging may be missing or incomplete.
   [junit4]   1> 09:25:35.288 [jetty-launcher-24-thread-1] ERROR org.apache.solr.util.StartupLoggingUtils
- Missing Java Option solr.log.dir. Logging may be missing or incomplete.
   [junit4]   1> 09:25:35.289 [jetty-launcher-24-thread-2] ERROR org.apache.solr.util.StartupLoggingUtils
- Missing Java Option solr.log.dir. Logging may be missing or incomplete.
   [junit4]   1> 09:25:35.290 [jetty-launcher-24-thread-4] ERROR org.apache.solr.util.StartupLoggingUtils
- Missing Java Option solr.log.dir. Logging may be missing or incomplete.
   [junit4]   1> replica:core_node3 rstate:active live:true
   [junit4]   1> replica:core_node5 rstate:active live:true
   [junit4]   1> replica:core_node7 rstate:active live:true
   [junit4]   1> replica:core_node8 rstate:active live:true
   [junit4]   1> no one is recoverying
   [junit4]   1> 09:25:42.876 [qtp1862326825-172] ERROR org.apache.solr.schema.ManagedIndexSchema
- Bad version when trying to persist schema using 2 due to: org.apache.zookeeper.KeeperException$BadVersionException:
KeeperErrorCode = BadVersion for /configs/collection1_config/managed-schema
   [junit4]   1> 09:25:42.876 [qtp1864945502-173] ERROR org.apache.solr.schema.ManagedIndexSchema
- Bad version when trying to persist schema using 2 due to: org.apache.zookeeper.KeeperException$BadVersionException:
KeeperErrorCode = BadVersion for /configs/collection1_config/managed-schema
   [junit4]   1> 09:25:43.041 [qtp821706878-141] ERROR org.apache.solr.schema.ManagedIndexSchema
- Bad version when trying to persist schema using 3 due to: org.apache.zookeeper.KeeperException$BadVersionException:
KeeperErrorCode = BadVersion for /configs/collection1_config/managed-schema
   [junit4]   1> 09:25:43.215 [qtp1864945502-153] ERROR org.apache.solr.schema.ManagedIndexSchema
- Bad version when trying to persist schema using 4 due to: org.apache.zookeeper.KeeperException$BadVersionException:
KeeperErrorCode = BadVersion for /configs/collection1_config/managed-schema
   [junit4]   1> 09:25:43.400 [qtp1864945502-156] ERROR org.apache.solr.schema.ManagedIndexSchema
- Bad version when trying to persist schema using 5 due to: org.apache.zookeeper.KeeperException$BadVersionException:
KeeperErrorCode = BadVersion for /configs/collection1_config/managed-schema
   [junit4]   1> 09:25:43.404 [qtp1862326825-142] ERROR org.apache.solr.schema.ManagedIndexSchema
- Bad version when trying to persist schema using 5 due to: org.apache.zookeeper.KeeperException$BadVersionException:
KeeperErrorCode = BadVersion for /configs/collection1_config/managed-schema
   [junit4]   1> Waiting for Prometheus exporter
   [junit4]   1> Prometheus exporter running
   [junit4]   1> Prometheus exporter running
   [junit4]   1> Waiting for Prometheus exporter
   [junit4]   1> Prometheus exporter running
   [junit4]   1> Waiting for Prometheus exporter
   [junit4]   1> Prometheus exporter running
   [junit4]   2> NOTE: reproduce with: ant test  -Dtestcase=SolrExporterIntegrationTest
-Dtests.method=jvmMetrics -Dtests.seed=F9B3905E696473E5 -Dtests.slow=true -Dtests.locale=tr
-Dtests.timezone=ACT -Dtests.asserts=true -Dtests.file.encoding=ISO-8859-1
   [junit4] FAILURE 0.48s J0 | SolrExporterIntegrationTest.jvmMetrics <<<
   [junit4]    > Throwable #1: java.lang.AssertionError: expected:<36> but was:<48>
   [junit4]    > 	at __randomizedtesting.SeedInfo.seed([F9B3905E696473E5:2A07ADB17C8ABF71]:0)
   [junit4]    > 	at org.apache.solr.prometheus.exporter.SolrExporterIntegrationTest.jvmMetrics(SolrExporterIntegrationTest.java:71)
   [junit4]    > 	at java.base/jdk.internal.reflect.NativeMethodAccessorImpl.invoke0(Native
Method)
   [junit4]    > 	at java.base/jdk.internal.reflect.NativeMethodAccessorImpl.invoke(NativeMethodAccessorImpl.java:62)
   [junit4]    > 	at java.base/jdk.internal.reflect.DelegatingMethodAccessorImpl.invoke(DelegatingMethodAccessorImpl.java:43)
   [junit4]    > 	at java.base/java.lang.reflect.Method.invoke(Method.java:564)
   [junit4]    > 	at java.base/java.lang.Thread.run(Thread.java:844)
   [junit4]   1> Waiting for Prometheus exporter
   [junit4]   1> Prometheus exporter running
   [junit4]   2> NOTE: leaving temporary files on disk at: C:\Users\jenkins\workspace\Lucene-Solr-8.x-Windows\solr\build\contrib\solr-prometheus-exporter\test\J0\temp\solr.prometheus.exporter.SolrExporterIntegrationTest_F9B3905E696473E5-001
   [junit4]   2> NOTE: test params are: codec=CheapBastard, sim=Asserting(org.apache.lucene.search.similarities.AssertingSimilarity@aacbce5),
locale=tr, timezone=ACT
   [junit4]   2> NOTE: Windows 10 10.0 amd64/Oracle Corporation 10.0.1 (64-bit)/cpus=3,threads=1,free=105468736,total=287309824
   [junit4]   2> NOTE: All tests run in this JVM: [SolrStandaloneScraperTest, SolrExporterIntegrationTest]
   [junit4] Completed [5/5 (1!)] on J0 in 12.98s, 5 tests, 1 failure <<< FAILURES!

[...truncated 34759 lines...]
[repro] Jenkins log URL: https://jenkins.thetaphi.de/job/Lucene-Solr-8.x-Windows/256/consoleText

[repro] Revision: 4585ce086871bb1823a90a5652335efa573ec9ba

[repro] Ant options: "-Dargs=-XX:-UseCompressedOops -XX:+UseParallelGC"

[repro] ant clean

[...truncated 6 lines...]
[repro] Test suites by module:
[repro]    solr\contrib\prometheus-exporter
[repro]       SolrExporterIntegrationTest
[repro] ant compile-test

[...truncated 2854 lines...]
[repro] ant test-nocompile -Dtests.dups=5 -Dtests.maxfailures=5 -Dtests.class="*.SolrExporterIntegrationTest"
-Dtests.showOutput=onerror "-Dargs=-XX:-UseCompressedOops -XX:+UseParallelGC" -Dtests.seed=F9B3905E696473E5
-Dtests.slow=true -Dtests.locale=tr -Dtests.timezone=ACT -Dtests.asserts=true -Dtests.file.encoding=ISO-8859-1

[...truncated 93 lines...]
[repro] Failures:
[repro]   0/5 failed: org.apache.solr.prometheus.exporter.SolrExporterIntegrationTest
[repro] Exiting with code 0

[...truncated 78 lines...]

Mime
View raw message