lucene-dev mailing list archives

Site index · List index
Message view « Date » · « Thread »
Top « Date » · « Thread »
From Apache Jenkins Server <jenk...@builds.apache.org>
Subject [JENKINS] Lucene-Solr-BadApples-Tests-8.x - Build # 91 - Still Failing
Date Wed, 01 May 2019 07:46:08 GMT
Build: https://builds.apache.org/job/Lucene-Solr-BadApples-Tests-8.x/91/

3 tests failed.
FAILED:  org.apache.solr.update.PeerSyncTest.test

Error Message:
Unexpected exception type, expected SolrException but got org.apache.solr.client.solrj.SolrServerException: Timeout occurred while waiting response from server at: http://127.0.0.1:46572/nk_z/a/collection1

Stack Trace:
junit.framework.AssertionFailedError: Unexpected exception type, expected SolrException but got org.apache.solr.client.solrj.SolrServerException: Timeout occurred while waiting response from server at: http://127.0.0.1:46572/nk_z/a/collection1
	at __randomizedtesting.SeedInfo.seed([3305A115FE94BB4A:BB519ECF5068D6B2]:0)
	at org.apache.lucene.util.LuceneTestCase.expectThrows(LuceneTestCase.java:2700)
	at org.apache.lucene.util.LuceneTestCase.expectThrows(LuceneTestCase.java:2689)
	at org.apache.solr.update.PeerSyncTest.test(PeerSyncTest.java:279)
	at sun.reflect.NativeMethodAccessorImpl.invoke0(Native Method)
	at sun.reflect.NativeMethodAccessorImpl.invoke(NativeMethodAccessorImpl.java:62)
	at sun.reflect.DelegatingMethodAccessorImpl.invoke(DelegatingMethodAccessorImpl.java:43)
	at java.lang.reflect.Method.invoke(Method.java:498)
	at com.carrotsearch.randomizedtesting.RandomizedRunner.invoke(RandomizedRunner.java:1750)
	at com.carrotsearch.randomizedtesting.RandomizedRunner$8.evaluate(RandomizedRunner.java:938)
	at com.carrotsearch.randomizedtesting.RandomizedRunner$9.evaluate(RandomizedRunner.java:974)
	at com.carrotsearch.randomizedtesting.RandomizedRunner$10.evaluate(RandomizedRunner.java:988)
	at org.apache.solr.BaseDistributedSearchTestCase$ShardsRepeatRule$ShardsFixedStatement.callStatement(BaseDistributedSearchTestCase.java:1082)
	at org.apache.solr.BaseDistributedSearchTestCase$ShardsRepeatRule$ShardsStatement.evaluate(BaseDistributedSearchTestCase.java:1054)
	at com.carrotsearch.randomizedtesting.rules.SystemPropertiesRestoreRule$1.evaluate(SystemPropertiesRestoreRule.java:57)
	at org.apache.lucene.util.TestRuleSetupTeardownChained$1.evaluate(TestRuleSetupTeardownChained.java:49)
	at org.apache.lucene.util.AbstractBeforeAfterRule$1.evaluate(AbstractBeforeAfterRule.java:45)
	at org.apache.lucene.util.TestRuleThreadAndTestName$1.evaluate(TestRuleThreadAndTestName.java:48)
	at org.apache.lucene.util.TestRuleIgnoreAfterMaxFailures$1.evaluate(TestRuleIgnoreAfterMaxFailures.java:64)
	at org.apache.lucene.util.TestRuleMarkFailure$1.evaluate(TestRuleMarkFailure.java:47)
	at com.carrotsearch.randomizedtesting.rules.StatementAdapter.evaluate(StatementAdapter.java:36)
	at com.carrotsearch.randomizedtesting.ThreadLeakControl$StatementRunner.run(ThreadLeakControl.java:368)
	at com.carrotsearch.randomizedtesting.ThreadLeakControl.forkTimeoutingTask(ThreadLeakControl.java:817)
	at com.carrotsearch.randomizedtesting.ThreadLeakControl$3.evaluate(ThreadLeakControl.java:468)
	at com.carrotsearch.randomizedtesting.RandomizedRunner.runSingleTest(RandomizedRunner.java:947)
	at com.carrotsearch.randomizedtesting.RandomizedRunner$5.evaluate(RandomizedRunner.java:832)
	at com.carrotsearch.randomizedtesting.RandomizedRunner$6.evaluate(RandomizedRunner.java:883)
	at com.carrotsearch.randomizedtesting.RandomizedRunner$7.evaluate(RandomizedRunner.java:894)
	at com.carrotsearch.randomizedtesting.rules.StatementAdapter.evaluate(StatementAdapter.java:36)
	at com.carrotsearch.randomizedtesting.rules.SystemPropertiesRestoreRule$1.evaluate(SystemPropertiesRestoreRule.java:57)
	at org.apache.lucene.util.AbstractBeforeAfterRule$1.evaluate(AbstractBeforeAfterRule.java:45)
	at com.carrotsearch.randomizedtesting.rules.StatementAdapter.evaluate(StatementAdapter.java:36)
	at org.apache.lucene.util.TestRuleStoreClassName$1.evaluate(TestRuleStoreClassName.java:41)
	at com.carrotsearch.randomizedtesting.rules.NoShadowingOrOverridesOnMethodsRule$1.evaluate(NoShadowingOrOverridesOnMethodsRule.java:40)
	at com.carrotsearch.randomizedtesting.rules.NoShadowingOrOverridesOnMethodsRule$1.evaluate(NoShadowingOrOverridesOnMethodsRule.java:40)
	at com.carrotsearch.randomizedtesting.rules.StatementAdapter.evaluate(StatementAdapter.java:36)
	at com.carrotsearch.randomizedtesting.rules.StatementAdapter.evaluate(StatementAdapter.java:36)
	at com.carrotsearch.randomizedtesting.rules.StatementAdapter.evaluate(StatementAdapter.java:36)
	at org.apache.lucene.util.TestRuleAssertionsRequired$1.evaluate(TestRuleAssertionsRequired.java:53)
	at org.apache.lucene.util.TestRuleMarkFailure$1.evaluate(TestRuleMarkFailure.java:47)
	at org.apache.lucene.util.TestRuleIgnoreAfterMaxFailures$1.evaluate(TestRuleIgnoreAfterMaxFailures.java:64)
	at org.apache.lucene.util.TestRuleIgnoreTestSuites$1.evaluate(TestRuleIgnoreTestSuites.java:54)
	at com.carrotsearch.randomizedtesting.rules.StatementAdapter.evaluate(StatementAdapter.java:36)
	at com.carrotsearch.randomizedtesting.ThreadLeakControl$StatementRunner.run(ThreadLeakControl.java:368)
	at java.lang.Thread.run(Thread.java:748)
Caused by: org.apache.solr.client.solrj.SolrServerException: Timeout occurred while waiting response from server at: http://127.0.0.1:46572/nk_z/a/collection1
	at org.apache.solr.client.solrj.impl.HttpSolrClient.executeMethod(HttpSolrClient.java:660)
	at org.apache.solr.client.solrj.impl.HttpSolrClient.request(HttpSolrClient.java:255)
	at org.apache.solr.client.solrj.impl.HttpSolrClient.request(HttpSolrClient.java:244)
	at org.apache.solr.client.solrj.SolrRequest.process(SolrRequest.java:207)
	at org.apache.solr.client.solrj.SolrRequest.process(SolrRequest.java:224)
	at org.apache.solr.BaseDistributedSearchTestCase.add(BaseDistributedSearchTestCase.java:576)
	at org.apache.solr.update.PeerSyncTest.lambda$test$0(PeerSyncTest.java:281)
	at org.apache.lucene.util.LuceneTestCase.expectThrows(LuceneTestCase.java:2695)
	... 43 more
Caused by: java.net.SocketTimeoutException: Read timed out
	at java.net.SocketInputStream.socketRead0(Native Method)
	at java.net.SocketInputStream.socketRead(SocketInputStream.java:116)
	at java.net.SocketInputStream.read(SocketInputStream.java:171)
	at java.net.SocketInputStream.read(SocketInputStream.java:141)
	at org.apache.http.impl.io.SessionInputBufferImpl.streamRead(SessionInputBufferImpl.java:137)
	at org.apache.http.impl.io.SessionInputBufferImpl.fillBuffer(SessionInputBufferImpl.java:153)
	at org.apache.http.impl.io.SessionInputBufferImpl.readLine(SessionInputBufferImpl.java:282)
	at org.apache.http.impl.conn.DefaultHttpResponseParser.parseHead(DefaultHttpResponseParser.java:138)
	at org.apache.http.impl.conn.DefaultHttpResponseParser.parseHead(DefaultHttpResponseParser.java:56)
	at org.apache.http.impl.io.AbstractMessageParser.parse(AbstractMessageParser.java:259)
	at org.apache.http.impl.DefaultBHttpClientConnection.receiveResponseHeader(DefaultBHttpClientConnection.java:163)
	at org.apache.http.impl.conn.CPoolProxy.receiveResponseHeader(CPoolProxy.java:165)
	at org.apache.http.protocol.HttpRequestExecutor.doReceiveResponse(HttpRequestExecutor.java:273)
	at org.apache.http.protocol.HttpRequestExecutor.execute(HttpRequestExecutor.java:125)
	at org.apache.http.impl.execchain.MainClientExec.execute(MainClientExec.java:272)
	at org.apache.http.impl.execchain.ProtocolExec.execute(ProtocolExec.java:185)
	at org.apache.http.impl.execchain.RetryExec.execute(RetryExec.java:89)
	at org.apache.http.impl.execchain.RedirectExec.execute(RedirectExec.java:110)
	at org.apache.http.impl.client.InternalHttpClient.doExecute(InternalHttpClient.java:185)
	at org.apache.http.impl.client.CloseableHttpClient.execute(CloseableHttpClient.java:83)
	at org.apache.http.impl.client.CloseableHttpClient.execute(CloseableHttpClient.java:56)
	at org.apache.solr.client.solrj.impl.HttpSolrClient.executeMethod(HttpSolrClient.java:548)
	... 50 more


FAILED:  org.apache.solr.update.PeerSyncWithLeaderTest.test

Error Message:
Unexpected exception type, expected SolrException but got org.apache.solr.client.solrj.SolrServerException: Timeout occurred while waiting response from server at: http://127.0.0.1:38520/bg/collection1

Stack Trace:
junit.framework.AssertionFailedError: Unexpected exception type, expected SolrException but got org.apache.solr.client.solrj.SolrServerException: Timeout occurred while waiting response from server at: http://127.0.0.1:38520/bg/collection1
	at __randomizedtesting.SeedInfo.seed([3305A115FE94BB4A:BB519ECF5068D6B2]:0)
	at org.apache.lucene.util.LuceneTestCase.expectThrows(LuceneTestCase.java:2700)
	at org.apache.lucene.util.LuceneTestCase.expectThrows(LuceneTestCase.java:2689)
	at org.apache.solr.update.PeerSyncTest.test(PeerSyncTest.java:279)
	at sun.reflect.NativeMethodAccessorImpl.invoke0(Native Method)
	at sun.reflect.NativeMethodAccessorImpl.invoke(NativeMethodAccessorImpl.java:62)
	at sun.reflect.DelegatingMethodAccessorImpl.invoke(DelegatingMethodAccessorImpl.java:43)
	at java.lang.reflect.Method.invoke(Method.java:498)
	at com.carrotsearch.randomizedtesting.RandomizedRunner.invoke(RandomizedRunner.java:1750)
	at com.carrotsearch.randomizedtesting.RandomizedRunner$8.evaluate(RandomizedRunner.java:938)
	at com.carrotsearch.randomizedtesting.RandomizedRunner$9.evaluate(RandomizedRunner.java:974)
	at com.carrotsearch.randomizedtesting.RandomizedRunner$10.evaluate(RandomizedRunner.java:988)
	at org.apache.solr.BaseDistributedSearchTestCase$ShardsRepeatRule$ShardsFixedStatement.callStatement(BaseDistributedSearchTestCase.java:1082)
	at org.apache.solr.BaseDistributedSearchTestCase$ShardsRepeatRule$ShardsStatement.evaluate(BaseDistributedSearchTestCase.java:1054)
	at com.carrotsearch.randomizedtesting.rules.SystemPropertiesRestoreRule$1.evaluate(SystemPropertiesRestoreRule.java:57)
	at org.apache.lucene.util.TestRuleSetupTeardownChained$1.evaluate(TestRuleSetupTeardownChained.java:49)
	at org.apache.lucene.util.AbstractBeforeAfterRule$1.evaluate(AbstractBeforeAfterRule.java:45)
	at org.apache.lucene.util.TestRuleThreadAndTestName$1.evaluate(TestRuleThreadAndTestName.java:48)
	at org.apache.lucene.util.TestRuleIgnoreAfterMaxFailures$1.evaluate(TestRuleIgnoreAfterMaxFailures.java:64)
	at org.apache.lucene.util.TestRuleMarkFailure$1.evaluate(TestRuleMarkFailure.java:47)
	at com.carrotsearch.randomizedtesting.rules.StatementAdapter.evaluate(StatementAdapter.java:36)
	at com.carrotsearch.randomizedtesting.ThreadLeakControl$StatementRunner.run(ThreadLeakControl.java:368)
	at com.carrotsearch.randomizedtesting.ThreadLeakControl.forkTimeoutingTask(ThreadLeakControl.java:817)
	at com.carrotsearch.randomizedtesting.ThreadLeakControl$3.evaluate(ThreadLeakControl.java:468)
	at com.carrotsearch.randomizedtesting.RandomizedRunner.runSingleTest(RandomizedRunner.java:947)
	at com.carrotsearch.randomizedtesting.RandomizedRunner$5.evaluate(RandomizedRunner.java:832)
	at com.carrotsearch.randomizedtesting.RandomizedRunner$6.evaluate(RandomizedRunner.java:883)
	at com.carrotsearch.randomizedtesting.RandomizedRunner$7.evaluate(RandomizedRunner.java:894)
	at com.carrotsearch.randomizedtesting.rules.StatementAdapter.evaluate(StatementAdapter.java:36)
	at com.carrotsearch.randomizedtesting.rules.SystemPropertiesRestoreRule$1.evaluate(SystemPropertiesRestoreRule.java:57)
	at org.apache.lucene.util.AbstractBeforeAfterRule$1.evaluate(AbstractBeforeAfterRule.java:45)
	at com.carrotsearch.randomizedtesting.rules.StatementAdapter.evaluate(StatementAdapter.java:36)
	at org.apache.lucene.util.TestRuleStoreClassName$1.evaluate(TestRuleStoreClassName.java:41)
	at com.carrotsearch.randomizedtesting.rules.NoShadowingOrOverridesOnMethodsRule$1.evaluate(NoShadowingOrOverridesOnMethodsRule.java:40)
	at com.carrotsearch.randomizedtesting.rules.NoShadowingOrOverridesOnMethodsRule$1.evaluate(NoShadowingOrOverridesOnMethodsRule.java:40)
	at com.carrotsearch.randomizedtesting.rules.StatementAdapter.evaluate(StatementAdapter.java:36)
	at com.carrotsearch.randomizedtesting.rules.StatementAdapter.evaluate(StatementAdapter.java:36)
	at com.carrotsearch.randomizedtesting.rules.StatementAdapter.evaluate(StatementAdapter.java:36)
	at org.apache.lucene.util.TestRuleAssertionsRequired$1.evaluate(TestRuleAssertionsRequired.java:53)
	at org.apache.lucene.util.TestRuleMarkFailure$1.evaluate(TestRuleMarkFailure.java:47)
	at org.apache.lucene.util.TestRuleIgnoreAfterMaxFailures$1.evaluate(TestRuleIgnoreAfterMaxFailures.java:64)
	at org.apache.lucene.util.TestRuleIgnoreTestSuites$1.evaluate(TestRuleIgnoreTestSuites.java:54)
	at com.carrotsearch.randomizedtesting.rules.StatementAdapter.evaluate(StatementAdapter.java:36)
	at com.carrotsearch.randomizedtesting.ThreadLeakControl$StatementRunner.run(ThreadLeakControl.java:368)
	at java.lang.Thread.run(Thread.java:748)
Caused by: org.apache.solr.client.solrj.SolrServerException: Timeout occurred while waiting response from server at: http://127.0.0.1:38520/bg/collection1
	at org.apache.solr.client.solrj.impl.HttpSolrClient.executeMethod(HttpSolrClient.java:660)
	at org.apache.solr.client.solrj.impl.HttpSolrClient.request(HttpSolrClient.java:255)
	at org.apache.solr.client.solrj.impl.HttpSolrClient.request(HttpSolrClient.java:244)
	at org.apache.solr.client.solrj.SolrRequest.process(SolrRequest.java:207)
	at org.apache.solr.client.solrj.SolrRequest.process(SolrRequest.java:224)
	at org.apache.solr.BaseDistributedSearchTestCase.add(BaseDistributedSearchTestCase.java:576)
	at org.apache.solr.update.PeerSyncTest.lambda$test$0(PeerSyncTest.java:281)
	at org.apache.lucene.util.LuceneTestCase.expectThrows(LuceneTestCase.java:2695)
	... 43 more
Caused by: java.net.SocketTimeoutException: Read timed out
	at java.net.SocketInputStream.socketRead0(Native Method)
	at java.net.SocketInputStream.socketRead(SocketInputStream.java:116)
	at java.net.SocketInputStream.read(SocketInputStream.java:171)
	at java.net.SocketInputStream.read(SocketInputStream.java:141)
	at org.apache.http.impl.io.SessionInputBufferImpl.streamRead(SessionInputBufferImpl.java:137)
	at org.apache.http.impl.io.SessionInputBufferImpl.fillBuffer(SessionInputBufferImpl.java:153)
	at org.apache.http.impl.io.SessionInputBufferImpl.readLine(SessionInputBufferImpl.java:282)
	at org.apache.http.impl.conn.DefaultHttpResponseParser.parseHead(DefaultHttpResponseParser.java:138)
	at org.apache.http.impl.conn.DefaultHttpResponseParser.parseHead(DefaultHttpResponseParser.java:56)
	at org.apache.http.impl.io.AbstractMessageParser.parse(AbstractMessageParser.java:259)
	at org.apache.http.impl.DefaultBHttpClientConnection.receiveResponseHeader(DefaultBHttpClientConnection.java:163)
	at org.apache.http.impl.conn.CPoolProxy.receiveResponseHeader(CPoolProxy.java:165)
	at org.apache.http.protocol.HttpRequestExecutor.doReceiveResponse(HttpRequestExecutor.java:273)
	at org.apache.http.protocol.HttpRequestExecutor.execute(HttpRequestExecutor.java:125)
	at org.apache.http.impl.execchain.MainClientExec.execute(MainClientExec.java:272)
	at org.apache.http.impl.execchain.ProtocolExec.execute(ProtocolExec.java:185)
	at org.apache.http.impl.execchain.RetryExec.execute(RetryExec.java:89)
	at org.apache.http.impl.execchain.RedirectExec.execute(RedirectExec.java:110)
	at org.apache.http.impl.client.InternalHttpClient.doExecute(InternalHttpClient.java:185)
	at org.apache.http.impl.client.CloseableHttpClient.execute(CloseableHttpClient.java:83)
	at org.apache.http.impl.client.CloseableHttpClient.execute(CloseableHttpClient.java:56)
	at org.apache.solr.client.solrj.impl.HttpSolrClient.executeMethod(HttpSolrClient.java:548)
	... 50 more


FAILED:  org.apache.solr.update.TestInPlaceUpdatesDistrib.test

Error Message:
Thread pool didn't terminate within 15 secs

Stack Trace:
java.lang.AssertionError: Thread pool didn't terminate within 15 secs
	at __randomizedtesting.SeedInfo.seed([3305A115FE94BB4A:BB519ECF5068D6B2]:0)
	at org.junit.Assert.fail(Assert.java:88)
	at org.junit.Assert.assertTrue(Assert.java:41)
	at org.apache.solr.update.TestInPlaceUpdatesDistrib.reorderedDeletesTest(TestInPlaceUpdatesDistrib.java:776)
	at org.apache.solr.update.TestInPlaceUpdatesDistrib.test(TestInPlaceUpdatesDistrib.java:175)
	at sun.reflect.NativeMethodAccessorImpl.invoke0(Native Method)
	at sun.reflect.NativeMethodAccessorImpl.invoke(NativeMethodAccessorImpl.java:62)
	at sun.reflect.DelegatingMethodAccessorImpl.invoke(DelegatingMethodAccessorImpl.java:43)
	at java.lang.reflect.Method.invoke(Method.java:498)
	at com.carrotsearch.randomizedtesting.RandomizedRunner.invoke(RandomizedRunner.java:1750)
	at com.carrotsearch.randomizedtesting.RandomizedRunner$8.evaluate(RandomizedRunner.java:938)
	at com.carrotsearch.randomizedtesting.RandomizedRunner$9.evaluate(RandomizedRunner.java:974)
	at com.carrotsearch.randomizedtesting.RandomizedRunner$10.evaluate(RandomizedRunner.java:988)
	at org.apache.solr.BaseDistributedSearchTestCase$ShardsRepeatRule$ShardsFixedStatement.callStatement(BaseDistributedSearchTestCase.java:1082)
	at org.apache.solr.BaseDistributedSearchTestCase$ShardsRepeatRule$ShardsStatement.evaluate(BaseDistributedSearchTestCase.java:1054)
	at com.carrotsearch.randomizedtesting.rules.SystemPropertiesRestoreRule$1.evaluate(SystemPropertiesRestoreRule.java:57)
	at org.apache.lucene.util.TestRuleSetupTeardownChained$1.evaluate(TestRuleSetupTeardownChained.java:49)
	at org.apache.lucene.util.AbstractBeforeAfterRule$1.evaluate(AbstractBeforeAfterRule.java:45)
	at org.apache.lucene.util.TestRuleThreadAndTestName$1.evaluate(TestRuleThreadAndTestName.java:48)
	at org.apache.lucene.util.TestRuleIgnoreAfterMaxFailures$1.evaluate(TestRuleIgnoreAfterMaxFailures.java:64)
	at org.apache.lucene.util.TestRuleMarkFailure$1.evaluate(TestRuleMarkFailure.java:47)
	at com.carrotsearch.randomizedtesting.rules.StatementAdapter.evaluate(StatementAdapter.java:36)
	at com.carrotsearch.randomizedtesting.ThreadLeakControl$StatementRunner.run(ThreadLeakControl.java:368)
	at com.carrotsearch.randomizedtesting.ThreadLeakControl.forkTimeoutingTask(ThreadLeakControl.java:817)
	at com.carrotsearch.randomizedtesting.ThreadLeakControl$3.evaluate(ThreadLeakControl.java:468)
	at com.carrotsearch.randomizedtesting.RandomizedRunner.runSingleTest(RandomizedRunner.java:947)
	at com.carrotsearch.randomizedtesting.RandomizedRunner$5.evaluate(RandomizedRunner.java:832)
	at com.carrotsearch.randomizedtesting.RandomizedRunner$6.evaluate(RandomizedRunner.java:883)
	at com.carrotsearch.randomizedtesting.RandomizedRunner$7.evaluate(RandomizedRunner.java:894)
	at com.carrotsearch.randomizedtesting.rules.StatementAdapter.evaluate(StatementAdapter.java:36)
	at com.carrotsearch.randomizedtesting.rules.SystemPropertiesRestoreRule$1.evaluate(SystemPropertiesRestoreRule.java:57)
	at org.apache.lucene.util.AbstractBeforeAfterRule$1.evaluate(AbstractBeforeAfterRule.java:45)
	at com.carrotsearch.randomizedtesting.rules.StatementAdapter.evaluate(StatementAdapter.java:36)
	at org.apache.lucene.util.TestRuleStoreClassName$1.evaluate(TestRuleStoreClassName.java:41)
	at com.carrotsearch.randomizedtesting.rules.NoShadowingOrOverridesOnMethodsRule$1.evaluate(NoShadowingOrOverridesOnMethodsRule.java:40)
	at com.carrotsearch.randomizedtesting.rules.NoShadowingOrOverridesOnMethodsRule$1.evaluate(NoShadowingOrOverridesOnMethodsRule.java:40)
	at com.carrotsearch.randomizedtesting.rules.StatementAdapter.evaluate(StatementAdapter.java:36)
	at com.carrotsearch.randomizedtesting.rules.StatementAdapter.evaluate(StatementAdapter.java:36)
	at com.carrotsearch.randomizedtesting.rules.StatementAdapter.evaluate(StatementAdapter.java:36)
	at org.apache.lucene.util.TestRuleAssertionsRequired$1.evaluate(TestRuleAssertionsRequired.java:53)
	at org.apache.lucene.util.TestRuleMarkFailure$1.evaluate(TestRuleMarkFailure.java:47)
	at org.apache.lucene.util.TestRuleIgnoreAfterMaxFailures$1.evaluate(TestRuleIgnoreAfterMaxFailures.java:64)
	at org.apache.lucene.util.TestRuleIgnoreTestSuites$1.evaluate(TestRuleIgnoreTestSuites.java:54)
	at com.carrotsearch.randomizedtesting.rules.StatementAdapter.evaluate(StatementAdapter.java:36)
	at com.carrotsearch.randomizedtesting.ThreadLeakControl$StatementRunner.run(ThreadLeakControl.java:368)
	at java.lang.Thread.run(Thread.java:748)




Build Log:
[...truncated 13556 lines...]
   [junit4] Suite: org.apache.solr.update.PeerSyncTest
   [junit4]   2> 559024 INFO  (SUITE-PeerSyncTest-seed#[3305A115FE94BB4A]-worker) [    ] o.a.s.SolrTestCaseJ4 SecureRandom sanity checks: test.solr.allowed.securerandom=null & java.security.egd=file:/dev/./urandom
   [junit4]   2> Creating dataDir: /x1/jenkins/jenkins-slave/workspace/Lucene-Solr-BadApples-Tests-8.x/solr/build/solr-core/test/J1/temp/solr.update.PeerSyncTest_3305A115FE94BB4A-001/init-core-data-001
   [junit4]   2> 559025 WARN  (SUITE-PeerSyncTest-seed#[3305A115FE94BB4A]-worker) [    ] o.a.s.SolrTestCaseJ4 startTrackingSearchers: numOpens=8 numCloses=8
   [junit4]   2> 559025 INFO  (SUITE-PeerSyncTest-seed#[3305A115FE94BB4A]-worker) [    ] o.a.s.SolrTestCaseJ4 Using PointFields (NUMERIC_POINTS_SYSPROP=true) w/NUMERIC_DOCVALUES_SYSPROP=false
   [junit4]   2> 559028 INFO  (SUITE-PeerSyncTest-seed#[3305A115FE94BB4A]-worker) [    ] o.a.s.SolrTestCaseJ4 Randomized ssl (false) and clientAuth (false) via: @org.apache.solr.SolrTestCaseJ4$SuppressSSL(bugUrl=https://issues.apache.org/jira/browse/SOLR-5776)
   [junit4]   2> 559028 INFO  (SUITE-PeerSyncTest-seed#[3305A115FE94BB4A]-worker) [    ] o.a.s.BaseDistributedSearchTestCase Setting hostContext system property: /nk_z/a
   [junit4]   2> 559030 INFO  (TEST-PeerSyncTest.test-seed#[3305A115FE94BB4A]) [    ] o.a.s.SolrTestCaseJ4 ####initCore
   [junit4]   2> 559031 INFO  (TEST-PeerSyncTest.test-seed#[3305A115FE94BB4A]) [    ] o.a.s.c.SolrResourceLoader [null] Added 2 libs to classloader, from paths: [/x1/jenkins/jenkins-slave/workspace/Lucene-Solr-BadApples-Tests-8.x/solr/core/src/test-files/solr/collection1/lib, /x1/jenkins/jenkins-slave/workspace/Lucene-Solr-BadApples-Tests-8.x/solr/core/src/test-files/solr/collection1/lib/classes]
   [junit4]   2> 559060 INFO  (TEST-PeerSyncTest.test-seed#[3305A115FE94BB4A]) [    ] o.a.s.c.SolrConfig Using Lucene MatchVersion: 8.1.0
   [junit4]   2> 559079 INFO  (TEST-PeerSyncTest.test-seed#[3305A115FE94BB4A]) [    ] o.a.s.s.IndexSchema [null] Schema name=test
   [junit4]   2> 559193 INFO  (TEST-PeerSyncTest.test-seed#[3305A115FE94BB4A]) [    ] o.a.s.s.IndexSchema Loaded schema test/1.0 with uniqueid field id
   [junit4]   2> 559607 INFO  (TEST-PeerSyncTest.test-seed#[3305A115FE94BB4A]) [    ] o.a.s.h.c.HttpShardHandlerFactory Host whitelist initialized: WhitelistHostChecker [whitelistHosts=null, whitelistHostCheckingEnabled=false]
   [junit4]   2> 559613 WARN  (TEST-PeerSyncTest.test-seed#[3305A115FE94BB4A]) [    ] o.e.j.u.s.S.config No Client EndPointIdentificationAlgorithm configured for SslContextFactory@6388fa4[provider=null,keyStore=null,trustStore=null]
   [junit4]   2> 559617 WARN  (TEST-PeerSyncTest.test-seed#[3305A115FE94BB4A]) [    ] o.e.j.u.s.S.config No Client EndPointIdentificationAlgorithm configured for SslContextFactory@3c9d332c[provider=null,keyStore=null,trustStore=null]
   [junit4]   2> 559642 INFO  (TEST-PeerSyncTest.test-seed#[3305A115FE94BB4A]) [    ] o.a.s.c.TransientSolrCoreCacheDefault Allocating transient cache for 2147483647 transient cores
   [junit4]   2> 559642 INFO  (TEST-PeerSyncTest.test-seed#[3305A115FE94BB4A]) [    ] o.a.s.h.a.MetricsHistoryHandler No .system collection, keeping metrics history in memory.
   [junit4]   2> 559664 INFO  (TEST-PeerSyncTest.test-seed#[3305A115FE94BB4A]) [    ] o.a.s.m.r.SolrJmxReporter JMX monitoring for 'solr.node' (registry 'solr.node') enabled at server: com.sun.jmx.mbeanserver.JmxMBeanServer@5d168182
   [junit4]   2> 559675 INFO  (TEST-PeerSyncTest.test-seed#[3305A115FE94BB4A]) [    ] o.a.s.m.r.SolrJmxReporter JMX monitoring for 'solr.jvm' (registry 'solr.jvm') enabled at server: com.sun.jmx.mbeanserver.JmxMBeanServer@5d168182
   [junit4]   2> 559675 INFO  (TEST-PeerSyncTest.test-seed#[3305A115FE94BB4A]) [    ] o.a.s.m.r.SolrJmxReporter JMX monitoring for 'solr.jetty' (registry 'solr.jetty') enabled at server: com.sun.jmx.mbeanserver.JmxMBeanServer@5d168182
   [junit4]   2> 559678 INFO  (coreLoadExecutor-2177-thread-1) [    x:collection1] o.a.s.c.SolrResourceLoader [null] Added 2 libs to classloader, from paths: [/x1/jenkins/jenkins-slave/workspace/Lucene-Solr-BadApples-Tests-8.x/solr/core/src/test-files/solr/collection1/lib, /x1/jenkins/jenkins-slave/workspace/Lucene-Solr-BadApples-Tests-8.x/solr/core/src/test-files/solr/collection1/lib/classes]
   [junit4]   2> 559713 INFO  (coreLoadExecutor-2177-thread-1) [    x:collection1] o.a.s.c.SolrConfig Using Lucene MatchVersion: 8.1.0
   [junit4]   2> 559740 INFO  (coreLoadExecutor-2177-thread-1) [    x:collection1] o.a.s.s.IndexSchema [collection1] Schema name=test
   [junit4]   2> 559857 INFO  (coreLoadExecutor-2177-thread-1) [    x:collection1] o.a.s.s.IndexSchema Loaded schema test/1.0 with uniqueid field id
   [junit4]   2> 559867 INFO  (coreLoadExecutor-2177-thread-1) [    x:collection1] o.a.s.c.CoreContainer Creating SolrCore 'collection1' using configuration from instancedir /x1/jenkins/jenkins-slave/workspace/Lucene-Solr-BadApples-Tests-8.x/solr/core/src/test-files/solr/collection1, trusted=true
   [junit4]   2> 559867 INFO  (coreLoadExecutor-2177-thread-1) [    x:collection1] o.a.s.m.r.SolrJmxReporter JMX monitoring for 'solr.core.collection1' (registry 'solr.core.collection1') enabled at server: com.sun.jmx.mbeanserver.JmxMBeanServer@5d168182
   [junit4]   2> 559868 INFO  (coreLoadExecutor-2177-thread-1) [    x:collection1] o.a.s.c.SolrCore [[collection1] ] Opening new SolrCore at [/x1/jenkins/jenkins-slave/workspace/Lucene-Solr-BadApples-Tests-8.x/solr/core/src/test-files/solr/collection1], dataDir=[/x1/jenkins/jenkins-slave/workspace/Lucene-Solr-BadApples-Tests-8.x/solr/build/solr-core/test/J1/temp/solr.update.PeerSyncTest_3305A115FE94BB4A-001/init-core-data-001/]
   [junit4]   2> 559870 INFO  (coreLoadExecutor-2177-thread-1) [    x:collection1] o.a.s.u.RandomMergePolicy RandomMergePolicy wrapping class org.apache.lucene.index.AlcoholicMergePolicy: [AlcoholicMergePolicy: minMergeSize=0, mergeFactor=10, maxMergeSize=749581179, maxMergeSizeForForcedMerge=9223372036854775807, calibrateSizeByDeletes=true, maxMergeDocs=2147483647, maxCFSSegmentSizeMB=8.796093022207999E12, noCFSRatio=0.1]
   [junit4]   2> 559872 WARN  (coreLoadExecutor-2177-thread-1) [    x:collection1] o.a.s.c.RequestHandlers INVALID paramSet a in requestHandler {type = requestHandler,name = /dump,class = DumpRequestHandler,attributes = {initParams=a, name=/dump, class=DumpRequestHandler},args = {defaults={a=A,b=B}}}
   [junit4]   2> 559926 INFO  (coreLoadExecutor-2177-thread-1) [    x:collection1] o.a.s.u.UpdateHandler Using UpdateLog implementation: org.apache.solr.update.UpdateLog
   [junit4]   2> 559926 INFO  (coreLoadExecutor-2177-thread-1) [    x:collection1] o.a.s.u.UpdateLog Initializing UpdateLog: dataDir= defaultSyncLevel=FLUSH numRecordsToKeep=100 maxNumLogsToKeep=10 numVersionBuckets=65536
   [junit4]   2> 559928 INFO  (coreLoadExecutor-2177-thread-1) [    x:collection1] o.a.s.u.CommitTracker Hard AutoCommit: disabled
   [junit4]   2> 559928 INFO  (coreLoadExecutor-2177-thread-1) [    x:collection1] o.a.s.u.CommitTracker Soft AutoCommit: disabled
   [junit4]   2> 559929 INFO  (coreLoadExecutor-2177-thread-1) [    x:collection1] o.a.s.u.RandomMergePolicy RandomMergePolicy wrapping class org.apache.lucene.index.TieredMergePolicy: [TieredMergePolicy: maxMergeAtOnce=48, maxMergeAtOnceExplicit=15, maxMergedSegmentMB=96.130859375, floorSegmentMB=1.5888671875, forceMergeDeletesPctAllowed=23.96773388076008, segmentsPerTier=42.0, maxCFSSegmentSizeMB=8.796093022207999E12, noCFSRatio=1.0, deletesPctAllowed=20.952375949953108
   [junit4]   2> 559929 INFO  (coreLoadExecutor-2177-thread-1) [    x:collection1] o.a.s.s.SolrIndexSearcher Opening [Searcher@20ce0ae2[collection1] main]
   [junit4]   2> 559929 WARN  (coreLoadExecutor-2177-thread-1) [    x:collection1] o.a.s.r.ManagedResourceStorage Cannot write to config directory /x1/jenkins/jenkins-slave/workspace/Lucene-Solr-BadApples-Tests-8.x/solr/core/src/test-files/solr/collection1/conf; switching to use InMemory storage instead.
   [junit4]   2> 559930 INFO  (coreLoadExecutor-2177-thread-1) [    x:collection1] o.a.s.h.ReplicationHandler Commits will be reserved for 10000ms.
   [junit4]   2> 559930 INFO  (coreLoadExecutor-2177-thread-1) [    x:collection1] o.a.s.u.UpdateLog Could not find max version in index or recent updates, using new clock 1632311583198674944
   [junit4]   2> 559933 INFO  (searcherExecutor-2178-thread-1-processing-x:collection1) [    x:collection1] o.a.s.c.SolrCore [collection1] Registered new searcher Searcher@20ce0ae2[collection1] main{ExitableDirectoryReader(UninvertingDirectoryReader())}
   [junit4]   2> 559933 INFO  (TEST-PeerSyncTest.test-seed#[3305A115FE94BB4A]) [    ] o.a.s.SolrTestCaseJ4 ####initCore end
   [junit4]   2> 560117 INFO  (TEST-PeerSyncTest.test-seed#[3305A115FE94BB4A]) [    ] o.a.s.SolrTestCaseJ4 Writing core.properties file to /x1/jenkins/jenkins-slave/workspace/Lucene-Solr-BadApples-Tests-8.x/solr/build/solr-core/test/J1/temp/solr.update.PeerSyncTest_3305A115FE94BB4A-001/tempDir-001/control/cores/collection1
   [junit4]   2> 560118 WARN  (TEST-PeerSyncTest.test-seed#[3305A115FE94BB4A]) [    ] o.e.j.s.AbstractConnector Ignoring deprecated socket close linger time
   [junit4]   2> 560119 INFO  (TEST-PeerSyncTest.test-seed#[3305A115FE94BB4A]) [    ] o.a.s.c.s.e.JettySolrRunner Start Jetty (original configured port=0)
   [junit4]   2> 560119 INFO  (TEST-PeerSyncTest.test-seed#[3305A115FE94BB4A]) [    ] o.a.s.c.s.e.JettySolrRunner Trying to start Jetty on port 0 try number 1 ...
   [junit4]   2> 560119 INFO  (TEST-PeerSyncTest.test-seed#[3305A115FE94BB4A]) [    ] o.e.j.s.Server jetty-9.4.14.v20181114; built: 2018-11-14T21:20:31.478Z; git: c4550056e785fb5665914545889f21dc136ad9e6; jvm 1.8.0_191-b12
   [junit4]   2> 560120 INFO  (TEST-PeerSyncTest.test-seed#[3305A115FE94BB4A]) [    ] o.e.j.s.session DefaultSessionIdManager workerName=node0
   [junit4]   2> 560120 INFO  (TEST-PeerSyncTest.test-seed#[3305A115FE94BB4A]) [    ] o.e.j.s.session No SessionScavenger set, using defaults
   [junit4]   2> 560120 INFO  (TEST-PeerSyncTest.test-seed#[3305A115FE94BB4A]) [    ] o.e.j.s.session node0 Scavenging every 600000ms
   [junit4]   2> 560122 INFO  (TEST-PeerSyncTest.test-seed#[3305A115FE94BB4A]) [    ] o.e.j.s.h.ContextHandler Started o.e.j.s.ServletContextHandler@49ac5468{/nk_z/a,null,AVAILABLE}
   [junit4]   2> 560123 INFO  (TEST-PeerSyncTest.test-seed#[3305A115FE94BB4A]) [    ] o.e.j.s.AbstractConnector Started ServerConnector@270aaebf{HTTP/1.1,[http/1.1, h2c]}{127.0.0.1:46250}
   [junit4]   2> 560123 INFO  (TEST-PeerSyncTest.test-seed#[3305A115FE94BB4A]) [    ] o.e.j.s.Server Started @560182ms
   [junit4]   2> 560123 INFO  (TEST-PeerSyncTest.test-seed#[3305A115FE94BB4A]) [    ] o.a.s.c.s.e.JettySolrRunner Jetty properties: {schema=schema.xml, solrconfig=solrconfig-tlog.xml, hostContext=/nk_z/a, hostPort=46250, coreRootDirectory=/x1/jenkins/jenkins-slave/workspace/Lucene-Solr-BadApples-Tests-8.x/solr/build/solr-core/test/J1/temp/solr.update.PeerSyncTest_3305A115FE94BB4A-001/tempDir-001/control/cores}
   [junit4]   2> 560123 ERROR (TEST-PeerSyncTest.test-seed#[3305A115FE94BB4A]) [    ] o.a.s.u.StartupLoggingUtils Missing Java Option solr.log.dir. Logging may be missing or incomplete.
   [junit4]   2> 560124 INFO  (TEST-PeerSyncTest.test-seed#[3305A115FE94BB4A]) [    ] o.a.s.s.SolrDispatchFilter Using logger factory org.apache.logging.slf4j.Log4jLoggerFactory
   [junit4]   2> 560124 INFO  (TEST-PeerSyncTest.test-seed#[3305A115FE94BB4A]) [    ] o.a.s.s.SolrDispatchFilter  ___      _       Welcome to Apache Solr™ version 8.1.0
   [junit4]   2> 560124 INFO  (TEST-PeerSyncTest.test-seed#[3305A115FE94BB4A]) [    ] o.a.s.s.SolrDispatchFilter / __| ___| |_ _   Starting in standalone mode on port null
   [junit4]   2> 560124 INFO  (TEST-PeerSyncTest.test-seed#[3305A115FE94BB4A]) [    ] o.a.s.s.SolrDispatchFilter \__ \/ _ \ | '_|  Install dir: null
   [junit4]   2> 560124 INFO  (TEST-PeerSyncTest.test-seed#[3305A115FE94BB4A]) [    ] o.a.s.s.SolrDispatchFilter |___/\___/_|_|    Start time: 2019-05-01T06:53:53.463Z
   [junit4]   2> 560124 INFO  (TEST-PeerSyncTest.test-seed#[3305A115FE94BB4A]) [    ] o.a.s.c.SolrXmlConfig Loading container configuration from /x1/jenkins/jenkins-slave/workspace/Lucene-Solr-BadApples-Tests-8.x/solr/build/solr-core/test/J1/temp/solr.update.PeerSyncTest_3305A115FE94BB4A-001/tempDir-001/control/solr.xml
   [junit4]   2> 560129 INFO  (TEST-PeerSyncTest.test-seed#[3305A115FE94BB4A]) [    ] o.a.s.c.SolrXmlConfig Configuration parameter autoReplicaFailoverWorkLoopDelay is ignored
   [junit4]   2> 560129 INFO  (TEST-PeerSyncTest.test-seed#[3305A115FE94BB4A]) [    ] o.a.s.c.SolrXmlConfig Configuration parameter autoReplicaFailoverBadNodeExpiration is ignored
   [junit4]   2> 560131 INFO  (TEST-PeerSyncTest.test-seed#[3305A115FE94BB4A]) [    ] o.a.s.c.SolrXmlConfig MBean server found: com.sun.jmx.mbeanserver.JmxMBeanServer@5d168182, but no JMX reporters were configured - adding default JMX reporter.
   [junit4]   2> 560175 INFO  (TEST-PeerSyncTest.test-seed#[3305A115FE94BB4A]) [    ] o.a.s.h.c.HttpShardHandlerFactory Host whitelist initialized: WhitelistHostChecker [whitelistHosts=null, whitelistHostCheckingEnabled=false]
   [junit4]   2> 560177 WARN  (TEST-PeerSyncTest.test-seed#[3305A115FE94BB4A]) [    ] o.e.j.u.s.S.config No Client EndPointIdentificationAlgorithm configured for SslContextFactory@72deaeab[provider=null,keyStore=null,trustStore=null]
   [junit4]   2> 560181 WARN  (TEST-PeerSyncTest.test-seed#[3305A115FE94BB4A]) [    ] o.e.j.u.s.S.config No Client EndPointIdentificationAlgorithm configured for SslContextFactory@7ebd98c0[provider=null,keyStore=null,trustStore=null]
   [junit4]   2> 560207 INFO  (TEST-PeerSyncTest.test-seed#[3305A115FE94BB4A]) [    ] o.a.s.c.TransientSolrCoreCacheDefault Allocating transient cache for 4 transient cores
   [junit4]   2> 560207 INFO  (TEST-PeerSyncTest.test-seed#[3305A115FE94BB4A]) [    ] o.a.s.h.a.MetricsHistoryHandler No .system collection, keeping metrics history in memory.
   [junit4]   2> 560237 INFO  (TEST-PeerSyncTest.test-seed#[3305A115FE94BB4A]) [    ] o.a.s.m.r.SolrJmxReporter JMX monitoring for 'solr.node' (registry 'solr.node') enabled at server: com.sun.jmx.mbeanserver.JmxMBeanServer@5d168182
   [junit4]   2> 560253 INFO  (TEST-PeerSyncTest.test-seed#[3305A115FE94BB4A]) [    ] o.a.s.m.r.SolrJmxReporter JMX monitoring for 'solr.jvm' (registry 'solr.jvm') enabled at server: com.sun.jmx.mbeanserver.JmxMBeanServer@5d168182
   [junit4]   2> 560253 INFO  (TEST-PeerSyncTest.test-seed#[3305A115FE94BB4A]) [    ] o.a.s.m.r.SolrJmxReporter JMX monitoring for 'solr.jetty' (registry 'solr.jetty') enabled at server: com.sun.jmx.mbeanserver.JmxMBeanServer@5d168182
   [junit4]   2> 560256 INFO  (TEST-PeerSyncTest.test-seed#[3305A115FE94BB4A]) [    ] o.a.s.c.CorePropertiesLocator Found 1 core definitions underneath /x1/jenkins/jenkins-slave/workspace/Lucene-Solr-BadApples-Tests-8.x/solr/build/solr-core/test/J1/temp/solr.update.PeerSyncTest_3305A115FE94BB4A-001/tempDir-001/control/cores
   [junit4]   2> 560256 INFO  (TEST-PeerSyncTest.test-seed#[3305A115FE94BB4A]) [    ] o.a.s.c.CorePropertiesLocator Cores are: [collection1]
   [junit4]   2> 560257 INFO  (coreLoadExecutor-2191-thread-1) [    x:collection1] o.a.s.c.SolrResourceLoader [null] Added 2 libs to classloader, from paths: [/x1/jenkins/jenkins-slave/workspace/Lucene-Solr-BadApples-Tests-8.x/solr/core/src/test-files/solr/collection1/lib, /x1/jenkins/jenkins-slave/workspace/Lucene-Solr-BadApples-Tests-8.x/solr/core/src/test-files/solr/collection1/lib/classes]
   [junit4]   2> 560291 INFO  (coreLoadExecutor-2191-thread-1) [    x:collection1] o.a.s.c.SolrConfig Using Lucene MatchVersion: 8.1.0
   [junit4]   2> 560312 INFO  (coreLoadExecutor-2191-thread-1) [    x:collection1] o.a.s.s.IndexSchema [collection1] Schema name=test
   [junit4]   2> 560439 INFO  (coreLoadExecutor-2191-thread-1) [    x:collection1] o.a.s.s.IndexSchema Loaded schema test/1.0 with uniqueid field id
   [junit4]   2> 560449 INFO  (coreLoadExecutor-2191-thread-1) [    x:collection1] o.a.s.c.CoreContainer Creating SolrCore 'collection1' using configuration from configset /x1/jenkins/jenkins-slave/workspace/Lucene-Solr-BadApples-Tests-8.x/solr/core/src/test-files/solr/collection1, trusted=true
   [junit4]   2> 560450 INFO  (coreLoadExecutor-2191-thread-1) [    x:collection1] o.a.s.m.r.SolrJmxReporter JMX monitoring for 'solr.core.collection1' (registry 'solr.core.collection1') enabled at server: com.sun.jmx.mbeanserver.JmxMBeanServer@5d168182
   [junit4]   2> 560450 INFO  (coreLoadExecutor-2191-thread-1) [    x:collection1] o.a.s.c.SolrCore [[collection1] ] Opening new SolrCore at [/x1/jenkins/jenkins-slave/workspace/Lucene-Solr-BadApples-Tests-8.x/solr/core/src/test-files/solr/collection1], dataDir=[/x1/jenkins/jenkins-slave/workspace/Lucene-Solr-BadApples-Tests-8.x/solr/build/solr-core/test/J1/temp/solr.update.PeerSyncTest_3305A115FE94BB4A-001/tempDir-001/control/cores/collection1/data/]
   [junit4]   2> 560453 INFO  (coreLoadExecutor-2191-thread-1) [    x:collection1] o.a.s.u.RandomMergePolicy RandomMergePolicy wrapping class org.apache.lucene.index.AlcoholicMergePolicy: [AlcoholicMergePolicy: minMergeSize=0, mergeFactor=10, maxMergeSize=749581179, maxMergeSizeForForcedMerge=9223372036854775807, calibrateSizeByDeletes=true, maxMergeDocs=2147483647, maxCFSSegmentSizeMB=8.796093022207999E12, noCFSRatio=0.1]
   [junit4]   2> 560456 WARN  (coreLoadExecutor-2191-thread-1) [    x:collection1] o.a.s.c.RequestHandlers INVALID paramSet a in requestHandler {type = requestHandler,name = /dump,class = DumpRequestHandler,attributes = {initParams=a, name=/dump, class=DumpRequestHandler},args = {defaults={a=A,b=B}}}
   [junit4]   2> 560516 INFO  (coreLoadExecutor-2191-thread-1) [    x:collection1] o.a.s.u.UpdateHandler Using UpdateLog implementation: org.apache.solr.update.UpdateLog
   [junit4]   2> 560516 INFO  (coreLoadExecutor-2191-thread-1) [    x:collection1] o.a.s.u.UpdateLog Initializing UpdateLog: dataDir= defaultSyncLevel=FLUSH numRecordsToKeep=100 maxNumLogsToKeep=10 numVersionBuckets=65536
   [junit4]   2> 560517 INFO  (coreLoadExecutor-2191-thread-1) [    x:collection1] o.a.s.u.CommitTracker Hard AutoCommit: disabled
   [junit4]   2> 560517 INFO  (coreLoadExecutor-2191-thread-1) [    x:collection1] o.a.s.u.CommitTracker Soft AutoCommit: disabled
   [junit4]   2> 560519 INFO  (coreLoadExecutor-2191-thread-1) [    x:collection1] o.a.s.u.RandomMergePolicy RandomMergePolicy wrapping class org.apache.lucene.index.TieredMergePolicy: [TieredMergePolicy: maxMergeAtOnce=48, maxMergeAtOnceExplicit=15, maxMergedSegmentMB=96.130859375, floorSegmentMB=1.5888671875, forceMergeDeletesPctAllowed=23.96773388076008, segmentsPerTier=42.0, maxCFSSegmentSizeMB=8.796093022207999E12, noCFSRatio=1.0, deletesPctAllowed=20.952375949953108
   [junit4]   2> 560519 INFO  (coreLoadExecutor-2191-thread-1) [    x:collection1] o.a.s.s.SolrIndexSearcher Opening [Searcher@267b862d[collection1] main]
   [junit4]   2> 560519 WARN  (coreLoadExecutor-2191-thread-1) [    x:collection1] o.a.s.r.ManagedResourceStorage Cannot write to config directory /x1/jenkins/jenkins-slave/workspace/Lucene-Solr-BadApples-Tests-8.x/solr/core/src/test-files/solr/collection1/conf; switching to use InMemory storage instead.
   [junit4]   2> 560520 INFO  (coreLoadExecutor-2191-thread-1) [    x:collection1] o.a.s.h.ReplicationHandler Commits will be reserved for 10000ms.
   [junit4]   2> 560520 INFO  (coreLoadExecutor-2191-thread-1) [    x:collection1] o.a.s.u.UpdateLog Could not find max version in index or recent updates, using new clock 1632311583817334784
   [junit4]   2> 560523 INFO  (searcherExecutor-2192-thread-1-processing-x:collection1) [    x:collection1] o.a.s.c.SolrCore [collection1] Registered new searcher Searcher@267b862d[collection1] main{ExitableDirectoryReader(UninvertingDirectoryReader())}
   [junit4]   2> 560699 INFO  (TEST-PeerSyncTest.test-seed#[3305A115FE94BB4A]) [    ] o.a.s.SolrTestCaseJ4 Writing core.properties file to /x1/jenkins/jenkins-slave/workspace/Lucene-Solr-BadApples-Tests-8.x/solr/build/solr-core/test/J1/temp/solr.update.PeerSyncTest_3305A115FE94BB4A-001/tempDir-001/shard0/cores/collection1
   [junit4]   2> 560700 WARN  (TEST-PeerSyncTest.test-seed#[3305A115FE94BB4A]) [    ] o.e.j.s.AbstractConnector Ignoring deprecated socket close linger time
   [junit4]   2> 560700 INFO  (TEST-PeerSyncTest.test-seed#[3305A115FE94BB4A]) [    ] o.a.s.c.s.e.JettySolrRunner Start Jetty (original configured port=0)
   [junit4]   2> 560700 INFO  (TEST-PeerSyncTest.test-seed#[3305A115FE94BB4A]) [    ] o.a.s.c.s.e.JettySolrRunner Trying to start Jetty on port 0 try number 1 ...
   [junit4]   2> 560700 INFO  (TEST-PeerSyncTest.test-seed#[3305A115FE94BB4A]) [    ] o.e.j.s.Server jetty-9.4.14.v20181114; built: 2018-11-14T21:20:31.478Z; git: c4550056e785fb5665914545889f21dc136ad9e6; jvm 1.8.0_191-b12
   [junit4]   2> 560702 INFO  (TEST-PeerSyncTest.test-seed#[3305A115FE94BB4A]) [    ] o.e.j.s.session DefaultSessionIdManager workerName=node0
   [junit4]   2> 560702 INFO  (TEST-PeerSyncTest.test-seed#[3305A115FE94BB4A]) [    ] o.e.j.s.session No SessionScavenger set, using defaults
   [junit4]   2> 560702 INFO  (TEST-PeerSyncTest.test-seed#[3305A115FE94BB4A]) [    ] o.e.j.s.session node0 Scavenging every 600000ms
   [junit4]   2> 560702 INFO  (TEST-PeerSyncTest.test-seed#[3305A115FE94BB4A]) [    ] o.e.j.s.h.ContextHandler Started o.e.j.s.ServletContextHandler@6b58639e{/nk_z/a,null,AVAILABLE}
   [junit4]   2> 560703 INFO  (TEST-PeerSyncTest.test-seed#[3305A115FE94BB4A]) [    ] o.e.j.s.AbstractConnector Started ServerConnector@6fbb9226{HTTP/1.1,[http/1.1, h2c]}{127.0.0.1:46572}
   [junit4]   2> 560703 INFO  (TEST-PeerSyncTest.test-seed#[3305A115FE94BB4A]) [    ] o.e.j.s.Server Started @560761ms
   [junit4]   2> 560703 INFO  (TEST-PeerSyncTest.test-seed#[3305A115FE94BB4A]) [    ] o.a.s.c.s.e.JettySolrRunner Jetty properties: {schema=schema.xml, solrconfig=solrconfig-tlog.xml, hostContext=/nk_z/a, hostPort=46572, coreRootDirectory=/x1/jenkins/jenkins-slave/workspace/Lucene-Solr-BadApples-Tests-8.x/solr/build/solr-core/test/J1/temp/solr.update.PeerSyncTest_3305A115FE94BB4A-001/tempDir-001/shard0/cores}
   [junit4]   2> 560703 ERROR (TEST-PeerSyncTest.test-seed#[3305A115FE94BB4A]) [    ] o.a.s.u.StartupLoggingUtils Missing Java Option solr.log.dir. Logging may be missing or incomplete.
   [junit4]   2> 560703 INFO  (TEST-PeerSyncTest.test-seed#[3305A115FE94BB4A]) [    ] o.a.s.s.SolrDispatchFilter Using logger factory org.apache.logging.slf4j.Log4jLoggerFactory
   [junit4]   2> 560703 INFO  (TEST-PeerSyncTest.test-seed#[3305A115FE94BB4A]) [    ] o.a.s.s.SolrDispatchFilter  ___      _       Welcome to Apache Solr™ version 8.1.0
   [junit4]   2> 560703 INFO  (TEST-PeerSyncTest.test-seed#[3305A115FE94BB4A]) [    ] o.a.s.s.SolrDispatchFilter / __| ___| |_ _   Starting in standalone mode on port null
   [junit4]   2> 560703 INFO  (TEST-PeerSyncTest.test-seed#[3305A115FE94BB4A]) [    ] o.a.s.s.SolrDispatchFilter \__ \/ _ \ | '_|  Install dir: null
   [junit4]   2> 560703 INFO  (TEST-PeerSyncTest.test-seed#[3305A115FE94BB4A]) [    ] o.a.s.s.SolrDispatchFilter |___/\___/_|_|    Start time: 2019-05-01T06:53:54.042Z
   [junit4]   2> 560704 INFO  (TEST-PeerSyncTest.test-seed#[3305A115FE94BB4A]) [    ] o.a.s.c.SolrXmlConfig Loading container configuration from /x1/jenkins/jenkins-slave/workspace/Lucene-Solr-BadApples-Tests-8.x/solr/build/solr-core/test/J1/temp/solr.update.PeerSyncTest_3305A115FE94BB4A-001/tempDir-001/shard0/solr.xml
   [junit4]   2> 560708 INFO  (TEST-PeerSyncTest.test-seed#[3305A115FE94BB4A]) [    ] o.a.s.c.SolrXmlConfig Configuration parameter autoReplicaFailoverWorkLoopDelay is ignored
   [junit4]   2> 560708 INFO  (TEST-PeerSyncTest.test-seed#[3305A115FE94BB4A]) [    ] o.a.s.c.SolrXmlConfig Configuration parameter autoReplicaFailoverBadNodeExpiration is ignored
   [junit4]   2> 560710 INFO  (TEST-PeerSyncTest.test-seed#[3305A115FE94BB4A]) [    ] o.a.s.c.SolrXmlConfig MBean server found: com.sun.jmx.mbeanserver.JmxMBeanServer@5d168182, but no JMX reporters were configured - adding default JMX reporter.
   [junit4]   2> 560874 INFO  (TEST-PeerSyncTest.test-seed#[3305A115FE94BB4A]) [    ] o.a.s.h.c.HttpShardHandlerFactory Host whitelist initialized: WhitelistHostChecker [whitelistHosts=null, whitelistHostCheckingEnabled=false]
   [junit4]   2> 560876 WARN  (TEST-PeerSyncTest.test-seed#[3305A115FE94BB4A]) [    ] o.e.j.u.s.S.config No Client EndPointIdentificationAlgorithm configured for SslContextFactory@44e596f8[provider=null,keyStore=null,trustStore=null]
   [junit4]   2> 560880 WARN  (TEST-PeerSyncTest.test-seed#[3305A115FE94BB4A]) [    ] o.e.j.u.s.S.config No Client EndPointIdentificationAlgorithm configured for SslContextFactory@579d41ab[provider=null,keyStore=null,trustStore=null]
   [junit4]   2> 560905 INFO  (TEST-PeerSyncTest.test-seed#[3305A115FE94BB4A]) [    ] o.a.s.c.TransientSolrCoreCacheDefault Allocating transient cache for 4 transient cores
   [junit4]   2> 560905 INFO  (TEST-PeerSyncTest.test-seed#[3305A115FE94BB4A]) [    ] o.a.s.h.a.MetricsHistoryHandler No .system collection, keeping metrics history in memory.
   [junit4]   2> 560932 INFO  (TEST-PeerSyncTest.test-seed#[3305A115FE94BB4A]) [    ] o.a.s.m.r.SolrJmxReporter JMX monitoring for 'solr.node' (registry 'solr.node') enabled at server: com.sun.jmx.mbeanserver.JmxMBeanServer@5d168182
   [junit4]   2> 560949 INFO  (TEST-PeerSyncTest.test-seed#[3305A115FE94BB4A]) [    ] o.a.s.m.r.SolrJmxReporter JMX monitoring for 'solr.jvm' (registry 'solr.jvm') enabled at server: com.sun.jmx.mbeanserver.JmxMBeanServer@5d168182
   [junit4]   2> 560949 INFO  (TEST-PeerSyncTest.test-seed#[3305A115FE94BB4A]) [    ] o.a.s.m.r.SolrJmxReporter JMX monitoring for 'solr.jetty' (registry 'solr.jetty') enabled at server: com.sun.jmx.mbeanserver.JmxMBeanServer@5d168182
   [junit4]   2> 560951 INFO  (TEST-PeerSyncTest.test-seed#[3305A115FE94BB4A]) [    ] o.a.s.c.CorePropertiesLocator Found 1 core definitions underneath /x1/jenkins/jenkins-slave/workspace/Lucene-Solr-BadApples-Tests-8.x/solr/build/solr-core/test/J1/temp/solr.update.PeerSyncTest_3305A115FE94BB4A-001/tempDir-001/shard0/cores
   [junit4]   2> 560951 INFO  (TEST-PeerSyncTest.test-seed#[3305A115FE94BB4A]) [    ] o.a.s.c.CorePropertiesLocator Cores are: [collection1]
   [junit4]   2> 560953 INFO  (coreLoadExecutor-2205-thread-1) [    x:collection1] o.a.s.c.SolrResourceLoader [null] Added 2 libs to classloader, from paths: [/x1/jenkins/jenkins-slave/workspace/Lucene-Solr-BadApples-Tests-8.x/solr/core/src/test-files/solr/collection1/lib, /x1/jenkins/jenkins-slave/workspace/Lucene-Solr-BadApples-Tests-8.x/solr/core/src/test-files/solr/collection1/lib/classes]
   [junit4]   2> 560992 INFO  (coreLoadExecutor-2205-thread-1) [    x:collection1] o.a.s.c.SolrConfig Using Lucene MatchVersion: 8.1.0
   [junit4]   2> 561013 INFO  (coreLoadExecutor-2205-thread-1) [    x:collection1] o.a.s.s.IndexSchema [collection1] Schema name=test
   [junit4]   2> 561137 INFO  (coreLoadExecutor-2205-thread-1) [    x:collection1] o.a.s.s.IndexSchema Loaded schema test/1.0 with uniqueid field id
   [junit4]   2> 561147 INFO  (coreLoadExecutor-2205-thread-1) [    x:collection1] o.a.s.c.CoreContainer Creating SolrCore 'collection1' using configuration from configset /x1/jenkins/jenkins-slave/workspace/Lucene-Solr-BadApples-Tests-8.x/solr/core/src/test-files/solr/collection1, trusted=true
   [junit4]   2> 561147 INFO  (coreLoadExecutor-2205-thread-1) [    x:collection1] o.a.s.m.r.SolrJmxReporter JMX monitoring for 'solr.core.collection1' (registry 'solr.core.collection1') enabled at server: com.sun.jmx.mbeanserver.JmxMBeanServer@5d168182
   [junit4]   2> 561148 INFO  (coreLoadExecutor-2205-thread-1) [    x:collection1] o.a.s.c.SolrCore [[collection1] ] Opening new SolrCore at [/x1/jenkins/jenkins-slave/workspace/Lucene-Solr-BadApples-Tests-8.x/solr/core/src/test-files/solr/collection1], dataDir=[/x1/jenkins/jenkins-slave/workspace/Lucene-Solr-BadApples-Tests-8.x/solr/build/solr-core/test/J1/temp/solr.update.PeerSyncTest_3305A115FE94BB4A-001/tempDir-001/shard0/cores/collection1/data/]
   [junit4]   2> 561150 INFO  (coreLoadExecutor-2205-thread-1) [    x:collection1] o.a.s.u.RandomMergePolicy RandomMergePolicy wrapping class org.apache.lucene.index.AlcoholicMergePolicy: [AlcoholicMergePolicy: minMergeSize=0, mergeFactor=10, maxMergeSize=749581179, maxMergeSizeForForcedMerge=9223372036854775807, calibrateSizeByDeletes=true, maxMergeDocs=2147483647, maxCFSSegmentSizeMB=8.796093022207999E12, noCFSRatio=0.1]
   [junit4]   2> 561152 WARN  (coreLoadExecutor-2205-thread-1) [    x:collection1] o.a.s.c.RequestHandlers INVALID paramSet a in requestHandler {type = requestHandler,name = /dump,class = DumpRequestHandler,attributes = {initParams=a, name=/dump, class=DumpRequestHandler},args = {defaults={a=A,b=B}}}
   [junit4]   2> 561218 INFO  (coreLoadExecutor-2205-thread-1) [    x:collection1] o.a.s.u.UpdateHandler Using UpdateLog implementation: org.apache.solr.update.UpdateLog
   [junit4]   2> 561218 INFO  (coreLoadExecutor-2205-thread-1) [    x:collection1] o.a.s.u.UpdateLog Initializing UpdateLog: dataDir= defaultSyncLevel=FLUSH numRecordsToKeep=100 maxNumLogsToKeep=10 numVersionBuckets=65536
   [junit4]   2> 561220 INFO  (coreLoadExecutor-2205-thread-1) [    x:collection1] o.a.s.u.CommitTracker Hard AutoCommit: disabled
   [junit4]   2> 561220 INFO  (coreLoadExecutor-2205-thread-1) [    x:collection1] o.a.s.u.CommitTracker Soft AutoCommit: disabled
   [junit4]   2> 561221 INFO  (coreLoadExecutor-2205-thread-1) [    x:collection1] o.a.s.u.RandomMergePolicy RandomMergePolicy wrapping class org.apache.lucene.index.TieredMergePolicy: [TieredMergePolicy: maxMergeAtOnce=48, maxMergeAtOnceExplicit=15, maxMergedSegmentMB=96.130859375, floorSegmentMB=1.5888671875, forceMergeDeletesPctAllowed=23.96773388076008, segmentsPerTier=42.0, maxCFSSegmentSizeMB=8.796093022207999E12, noCFSRatio=1.0, deletesPctAllowed=20.952375949953108
   [junit4]   2> 561222 INFO  (coreLoadExecutor-2205-thread-1) [    x:collection1] o.a.s.s.SolrIndexSearcher Opening [Searcher@24381257[collection1] main]
   [junit4]   2> 561222 WARN  (coreLoadExecutor-2205-thread-1) [    x:collection1] o.a.s.r.ManagedResourceStorage Cannot write to config directory /x1/jenkins/jenkins-slave/workspace/Lucene-Solr-BadApples-Tests-8.x/solr/core/src/test-files/solr/collection1/conf; switching to use InMemory storage instead.
   [junit4]   2> 561223 INFO  (coreLoadExecutor-2205-thread-1) [    x:collection1] o.a.s.h.ReplicationHandler Commits will be reserved for 10000ms.
   [junit4]   2> 561223 INFO  (coreLoadExecutor-2205-thread-1) [    x:collection1] o.a.s.u.UpdateLog Could not find max version in index or recent updates, using new clock 1632311584554483712
   [junit4]   2> 561226 INFO  (searcherExecutor-2206-thread-1-processing-x:collection1) [    x:collection1] o.a.s.c.SolrCore [collection1] Registered new searcher Searcher@24381257[collection1] main{ExitableDirectoryReader(UninvertingDirectoryReader())}
   [junit4]   2> 561404 INFO  (TEST-PeerSyncTest.test-seed#[3305A115FE94BB4A]) [    ] o.a.s.SolrTestCaseJ4 Writing core.properties file to /x1/jenkins/jenkins-slave/workspace/Lucene-Solr-BadApples-Tests-8.x/solr/build/solr-core/test/J1/temp/solr.update.PeerSyncTest_3305A115FE94BB4A-001/tempDir-001/shard1/cores/collection1
   [junit4]   2> 561405 WARN  (TEST-PeerSyncTest.test-seed#[3305A115FE94BB4A]) [    ] o.e.j.s.AbstractConnector Ignoring deprecated socket close linger time
   [junit4]   2> 561406 INFO  (TEST-PeerSyncTest.test-seed#[3305A115FE94BB4A]) [    ] o.a.s.c.s.e.JettySolrRunner Start Jetty (original configured port=0)
   [junit4]   2> 561406 INFO  (TEST-PeerSyncTest.test-seed#[3305A115FE94BB4A]) [    ] o.a.s.c.s.e.JettySolrRunner Trying to start Jetty on port 0 try number 1 ...
   [junit4]   2> 561406 INFO  (TEST-PeerSyncTest.test-seed#[3305A115FE94BB4A]) [    ] o.e.j.s.Server jetty-9.4.14.v20181114; built: 2018-11-14T21:20:31.478Z; git: c4550056e785fb5665914545889f21dc136ad9e6; jvm 1.8.0_191-b12
   [junit4]   2> 561407 INFO  (TEST-PeerSyncTest.test-seed#[3305A115FE94BB4A]) [    ] o.e.j.s.session DefaultSessionIdManager workerName=node0
   [junit4]   2> 561407 INFO  (TEST-PeerSyncTest.test-seed#[3305A115FE94BB4A]) [    ] o.e.j.s.session No SessionScavenger set, using defaults
   [junit4]   2> 561407 INFO  (TEST-PeerSyncTest.test-seed#[3305A115FE94BB4A]) [    ] o.e.j.s.session node0 Scavenging every 660000ms
   [junit4]   2> 561408 INFO  (TEST-PeerSyncTest.test-seed#[3305A115FE94BB4A]) [    ] o.e.j.s.h.ContextHandler Started o.e.j.s.ServletContextHandler@2e436bbb{/nk_z/a,null,AVAILABLE}
   [junit4]   2> 561408 INFO  (TEST-PeerSyncTest.test-seed#[3305A115FE94BB4A]) [    ] o.e.j.s.AbstractConnector Started ServerConnector@12e1a364{HTTP/1.1,[http/1.1, h2c]}{127.0.0.1:45728}
   [junit4]   2> 561408 INFO  (TEST-PeerSyncTest.test-seed#[3305A115FE94BB4A]) [    ] o.e.j.s.Server Started @561467ms
   [junit4]   2> 561409 INFO  (TEST-PeerSyncTest.test-seed#[3305A115FE94BB4A]) [    ] o.a.s.c.s.e.JettySolrRunner Jetty properties: {schema=schema.xml, solrconfig=solrconfig-tlog.xml, hostContext=/nk_z/a, hostPort=45728, coreRootDirectory=/x1/jenkins/jenkins-slave/workspace/Lucene-Solr-BadApples-Tests-8.x/solr/build/solr-core/test/J1/temp/solr.update.PeerSyncTest_3305A115FE94BB4A-001/tempDir-001/shard1/cores}
   [junit4]   2> 561409 ERROR (TEST-PeerSyncTest.test-seed#[3305A115FE94BB4A]) [    ] o.a.s.u.StartupLoggingUtils Missing Java Option solr.log.dir. Logging may be missing or incomplete.
   [junit4]   2> 561409 INFO  (TEST-PeerSyncTest.test-seed#[3305A115FE94BB4A]) [    ] o.a.s.s.SolrDispatchFilter Using logger factory org.apache.logging.slf4j.Log4jLoggerFactory
   [junit4]   2> 561409 INFO  (TEST-PeerSyncTest.test-seed#[3305A115FE94BB4A]) [    ] o.a.s.s.SolrDispatchFilter  ___      _       Welcome to Apache Solr™ version 8.1.0
   [junit4]   2> 561409 INFO  (TEST-PeerSyncTest.test-seed#[3305A115FE94BB4A]) [    ] o.a.s.s.SolrDispatchFilter / __| ___| |_ _   Starting in standalone mode on port null
   [junit4]   2> 561409 INFO  (TEST-PeerSyncTest.test-seed#[3305A115FE94BB4A]) [    ] o.a.s.s.SolrDispatchFilter \__ \/ _ \ | '_|  Install dir: null
   [junit4]   2> 561409 INFO  (TEST-PeerSyncTest.test-seed#[3305A115FE94BB4A]) [    ] o.a.s.s.SolrDispatchFilter |___/\___/_|_|    Start time: 2019-05-01T06:53:54.748Z
   [junit4]   2> 561409 INFO  (TEST-PeerSyncTest.test-seed#[3305A115FE94BB4A]) [    ] o.a.s.c.SolrXmlConfig Loading container configuration from /x1/jenkins/jenkins-slave/workspace/Lucene-Solr-BadApples-Tests-8.x/solr/build/solr-core/test/J1/temp/solr.update.PeerSyncTest_3305A115FE94BB4A-001/tempDir-001/shard1/solr.xml
   [junit4]   2> 561414 INFO  (TEST-PeerSyncTest.test-seed#[3305A115FE94BB4A]) [    ] o.a.s.c.SolrXmlConfig Configuration parameter autoReplicaFailoverWorkLoopDelay is ignored
   [junit4]   2> 561414 INFO  (TEST-PeerSyncTest.test-seed#[3305A115FE94BB4A]) [    ] o.a.s.c.SolrXmlConfig Configuration parameter autoReplicaFailoverBadNodeExpiration is ignored
   [junit4]   2> 561416 INFO  (TEST-PeerSyncTest.test-seed#[3305A115FE94BB4A]) [    ] o.a.s.c.SolrXmlConfig MBean server found: com.sun.jmx.mbeanserver.JmxMBeanServer@5d168182, but no JMX reporters were configured - adding default JMX reporter.
   [junit4]   2> 561467 INFO  (TEST-PeerSyncTest.test-seed#[3305A115FE94BB4A]) [    ] o.a.s.h.c.HttpShardHandlerFactory Host whitelist initialized: WhitelistHostChecker [whitelistHosts=null, whitelistHostCheckingEnabled=false]
   [junit4]   2> 561469 WARN  (TEST-PeerSyncTest.test-seed#[3305A115FE94BB4A]) [    ] o.e.j.u.s.S.config No Client EndPointIdentificationAlgorithm configured for SslContextFactory@623a909a[provider=null,keyStore=null,trustStore=null]
   [junit4]   2> 561474 WARN  (TEST-PeerSyncTest.test-seed#[3305A115FE94BB4A]) [    ] o.e.j.u.s.S.config No Client EndPointIdentificationAlgorithm configured for SslContextFactory@26aa7f22[provider=null,keyStore=null,trustStore=null]
   [junit4]   2> 561501 INFO  (TEST-PeerSyncTest.test-seed#[3305A115FE94BB4A]) [    ] o.a.s.c.TransientSolrCoreCacheDefault Allocating transient cache for 4 transient cores
   [junit4]   2> 561501 INFO  (TEST-PeerSyncTest.test-seed#[3305A115FE94BB4A]) [    ] o.a.s.h.a.MetricsHistoryHandler No .system collection, keeping metrics history in memory.
   [junit4]   2> 561529 INFO  (TEST-PeerSyncTest.test-seed#[3305A115FE94BB4A]) [    ] o.a.s.m.r.SolrJmxReporter JMX monitoring for 'solr.node' (registry 'solr.node') enabled at server: com.sun.jmx.mbeanserver.JmxMBeanServer@5d168182
   [junit4]   2> 561546 INFO  (TEST-PeerSyncTest.test-seed#[3305A115FE94BB4A]) [    ] o.a.s.m.r.SolrJmxReporter JMX monitoring for 'solr.jvm' (registry 'solr.jvm') enabled at server: com.sun.jmx.mbeanserver.JmxMBeanServer@5d168182
   [junit4]   2> 561546 INFO  (TEST-PeerSyncTest.test-seed#[3305A115FE94BB4A]) [    ] o.a.s.m.r.SolrJmxReporter JMX monitoring for 'solr.jetty' (registry 'solr.jetty') enabled at server: com.sun.jmx.mbeanserver.JmxMBeanServer@5d168182
   [junit4]   2> 561548 INFO  (TEST-PeerSyncTest.test-seed#[3305A115FE94BB4A]) [    ] o.a.s.c.CorePropertiesLocator Found 1 core definitions underneath /x1/jenkins/jenkins-slave/workspace/Lucene-Solr-BadApples-Tests-8.x/solr/build/solr-core/test/J1/temp/solr.update.PeerSyncTest_3305A115FE94BB4A-001/tempDir-001/shard1/cores
   [junit4]   2> 561549 INFO  (TEST-PeerSyncTest.test-seed#[3305A115FE94BB4A]) [    ] o.a.s.c.CorePropertiesLocator Cores are: [collection1]
   [junit4]   2> 561549 INFO  (coreLoadExecutor-2219-thread-1) [    x:collection1] o.a.s.c.SolrResourceLoader [null] Added 2 libs to classloader, from paths: [/x1/jenkins/jenkins-slave/workspace/Lucene-Solr-BadApples-Tests-8.x/solr/core/src/test-files/solr/collection1/lib, /x1/jenkins/jenkins-slave/workspace/Lucene-Solr-BadApples-Tests-8.x/solr/core/src/test-files/solr/collection1/lib/classes]
   [junit4]   2> 561605 INFO  (coreLoadExecutor-2219-thread-1) [    x:collection1] o.a.s.c.SolrConfig Using Lucene MatchVersion: 8.1.0
   [junit4]   2> 561625 INFO  (coreLoadExecutor-2219-thread-1) [    x:collection1] o.a.s.s.IndexSchema [collection1] Schema name=test
   [junit4]   2> 561748 INFO  (coreLoadExecutor-2219-thread-1) [    x:collection1] o.a.s.s.IndexSchema Loaded schema test/1.0 with uniqueid field id
   [junit4]   2> 561758 INFO  (coreLoadExecutor-2219-thread-1) [    x:collection1] o.a.s.c.CoreContainer Creating SolrCore 'collection1' using configuration from configset /x1/jenkins/jenkins-slave/workspace/Lucene-Solr-BadApples-Tests-8.x/solr/core/src/test-files/solr/collection1, trusted=true
   [junit4]   2> 561758 INFO  (coreLoadExecutor-2219-thread-1) [    x:collection1] o.a.s.m.r.SolrJmxReporter JMX monitoring for 'solr.core.collection1' (registry 'solr.core.collection1') enabled at server: com.sun.jmx.mbeanserver.JmxMBeanServer@5d168182
   [junit4]   2> 561758 INFO  (coreLoadExecutor-2219-thread-1) [    x:collection1] o.a.s.c.SolrCore [[collection1] ] Opening new SolrCore at [/x1/jenkins/jenkins-slave/workspace/Lucene-Solr-BadApples-Tests-8.x/solr/core/src/test-files/solr/collection1], dataDir=[/x1/jenkins/jenkins-slave/workspace/Lucene-Solr-BadApples-Tests-8.x/solr/build/solr-core/test/J1/temp/solr.update.PeerSyncTest_3305A115FE94BB4A-001/tempDir-001/shard1/cores/collection1/data/]
   [junit4]   2> 561761 INFO  (coreLoadExecutor-2219-thread-1) [    x:collection1] o.a.s.u.RandomMergePolicy RandomMergePolicy wrapping class org.apache.lucene.index.AlcoholicMergePolicy: [AlcoholicMergePolicy: minMergeSize=0, mergeFactor=10, maxMergeSize=749581179, maxMergeSizeForForcedMerge=9223372036854775807, calibrateSizeByDeletes=true, maxMergeDocs=2147483647, maxCFSSegmentSizeMB=8.796093022207999E12, noCFSRatio=0.1]
   [junit4]   2> 561763 WARN  (coreLoadExecutor-2219-thread-1) [    x:collection1] o.a.s.c.RequestHandlers INVALID paramSet a in requestHandler {type = requestHandler,name = /dump,class = DumpRequestHandler,attributes = {initParams=a, name=/dump, class=DumpRequestHandler},args = {defaults={a=A,b=B}}}
   [junit4]   2> 561822 INFO  (coreLoadExecutor-2219-thread-1) [    x:collection1] o.a.s.u.UpdateHandler Using UpdateLog implementation: org.apache.solr.update.UpdateLog
   [junit4]   2> 561822 INFO  (coreLoadExecutor-2219-thread-1) [    x:collection1] o.a.s.u.UpdateLog Initializing UpdateLog: dataDir= defaultSyncLevel=FLUSH numRecordsToKeep=100 maxNumLogsToKeep=10 numVersionBuckets=65536
   [junit4]   2> 561823 INFO  (coreLoadExecutor-2219-thread-1) [    x:collection1] o.a.s.u.CommitTracker Hard AutoCommit: disabled
   [junit4]   2> 561823 INFO  (coreLoadExecutor-2219-thread-1) [    x:collection1] o.a.s.u.CommitTracker Soft AutoCommit: disabled
   [junit4]   2> 561824 INFO  (coreLoadExecutor-2219-thread-1) [    x:collection1] o.a.s.u.RandomMergePolicy RandomMergePolicy wrapping class org.apache.lucene.index.TieredMergePolicy: [TieredMergePolicy: maxMergeAtOnce=48, maxMergeAtOnceExplicit=15, maxMergedSegmentMB=96.130859375, floorSegmentMB=1.5888671875, forceMergeDeletesPctAllowed=23.96773388076008, segmentsPerTier=42.0, maxCFSSegmentSizeMB=8.796093022207999E12, noCFSRatio=1.0, deletesPctAllowed=20.952375949953108
   [junit4]   2> 561825 INFO  (coreLoadExecutor-2219-thread-1) [    x:collection1] o.a.s.s.SolrIndexSearcher Opening [Searcher@4f26032[collection1] main]
   [junit4]   2> 561825 WARN  (coreLoadExecutor-2219-thread-1) [    x:collection1] o.a.s.r.ManagedResourceStorage Cannot write to config directory /x1/jenkins/jenkins-slave/workspace/Lucene-Solr-BadApples-Tests-8.x/solr/core/src/test-files/solr/collection1/conf; switching to use InMemory storage instead.
   [junit4]   2> 561826 INFO  (coreLoadExecutor-2219-thread-1) [    x:collection1] o.a.s.h.ReplicationHandler Commits will be reserved for 10000ms.
   [junit4]   2> 561826 INFO  (coreLoadExecutor-2219-thread-1) [    x:collection1] o.a.s.u.UpdateLog Could not find max version in index or recent updates, using new clock 1632311585186775040
   [junit4]   2> 561834 INFO  (searcherExecutor-2220-thread-1-processing-x:collection1) [    x:collection1] o.a.s.c.SolrCore [collection1] Registered new searcher Searcher@4f26032[collection1] main{ExitableDirectoryReader(UninvertingDirectoryReader())}
   [junit4]   2> 562028 INFO  (TEST-PeerSyncTest.test-seed#[3305A115FE94BB4A]) [    ] o.a.s.SolrTestCaseJ4 Writing core.properties file to /x1/jenkins/jenkins-slave/workspace/Lucene-Solr-BadApples-Tests-8.x/solr/build/solr-core/test/J1/temp/solr.update.PeerSyncTest_3305A115FE94BB4A-001/tempDir-001/shard2/cores/collection1
   [junit4]   2> 562029 WARN  (TEST-PeerSyncTest.test-seed#[3305A115FE94BB4A]) [    ] o.e.j.s.AbstractConnector Ignoring deprecated socket close linger time
   [junit4]   2> 562029 INFO  (TEST-PeerSyncTest.test-seed#[3305A115FE94BB4A]) [    ] o.a.s.c.s.e.JettySolrRunner Start Jetty (original configured port=0)
   [junit4]   2> 562029 INFO  (TEST-PeerSyncTest.test-seed#[3305A115FE94BB4A]) [    ] o.a.s.c.s.e.JettySolrRunner Trying to start Jetty on port 0 try number 1 ...
   [junit4]   2> 562029 INFO  (TEST-PeerSyncTest.test-seed#[3305A115FE94BB4A]) [    ] o.e.j.s.Server jetty-9.4.14.v20181114; built: 2018-11-14T21:20:31.478Z; git: c4550056e785fb5665914545889f21dc136ad9e6; jvm 1.8.0_191-b12
   [junit4]   2> 562031 INFO  (TEST-PeerSyncTest.test-seed#[3305A115FE94BB4A]) [    ] o.e.j.s.session DefaultSessionIdManager workerName=node0
   [junit4]   2> 562031 INFO  (TEST-PeerSyncTest.test-seed#[3305A115FE94BB4A]) [    ] o.e.j.s.session No SessionScavenger set, using defaults
   [junit4]   2> 562031 INFO  (TEST-PeerSyncTest.test-seed#[3305A115FE94BB4A]) [    ] o.e.j.s.session node0 Scavenging every 660000ms
   [junit4]   2> 562032 INFO  (TEST-PeerSyncTest.test-seed#[3305A115FE94BB4A]) [    ] o.e.j.s.h.ContextHandler Started o.e.j.s.ServletContextHandler@4c61a1d4{/nk_z/a,null,AVAILABLE}
   [junit4]   2> 562032 INFO  (TEST-PeerSyncTest.test-seed#[3305A115FE94BB4A]) [    ] o.e.j.s.AbstractConnector Started ServerConnector@69745556{HTTP/1.1,[http/1.1, h2c]}{127.0.0.1:37401}
   [junit4]   2> 562032 INFO  (TEST-PeerSyncTest.test-seed#[3305A115FE94BB4A]) [    ] o.e.j.s.Server Started @562091ms
   [junit4]   2> 562032 INFO  (TEST-PeerSyncTest.test-seed#[3305A115FE94BB4A]) [    ] o.a.s.c.s.e.JettySolrRunner Jetty properties: {schema=schema.xml, solrconfig=solrconfig-tlog.xml, hostContext=/nk_z/a, hostPort=37401, coreRootDirectory=/x1/jenkins/jenkins-slave/workspace/Lucene-Solr-BadApples-Tests-8.x/solr/build/solr-core/test/J1/temp/solr.update.PeerSyncTest_3305A115FE94BB4A-001/tempDir-001/shard2/cores}
   [junit4]   2> 562033 ERROR (TEST-PeerSyncTest.test-seed#[3305A115FE94BB4A]) [    ] o.a.s.u.StartupLoggingUtils Missing Java Option solr.log.dir. Logging may be missing or incomplete.
   [junit4]   2> 562033 INFO  (TEST-PeerSyncTest.test-seed#[3305A115FE94BB4A]) [    ] o.a.s.s.SolrDispatchFilter Using logger factory org.apache.logging.slf4j.Log4jLoggerFactory
   [junit4]   2> 562033 INFO  (TEST-PeerSyncTest.test-seed#[3305A115FE94BB4A]) [    ] o.a.s.s.SolrDispatchFilter  ___      _       Welcome to Apache Solr™ version 8.1.0
   [junit4]   2> 562033 INFO  (TEST-PeerSyncTest.test-seed#[3305A115FE94BB4A]) [    ] o.a.s.s.SolrDispatchFilter / __| ___| |_ _   Starting in standalone mode on port null
   [junit4]   2> 562033 INFO  (TEST-PeerSyncTest.test-seed#[3305A115FE94BB4A]) [    ] o.a.s.s.SolrDispatchFilter \__ \/ _ \ | '_|  Install dir: null
   [junit4]   2> 562033 INFO  (TEST-PeerSyncTest.test-seed#[3305A115FE94BB4A]) [    ] o.a.s.s.SolrDispatchFilter |___/\___/_|_|    Start time: 2019-05-01T06:53:55.372Z
   [junit4]   2> 562033 INFO  (TEST-PeerSyncTest.test-seed#[3305A115FE94BB4A]) [    ] o.a.s.c.SolrXmlConfig Loading container configuration from /x1/jenkins/jenkins-slave/workspace/Lucene-Solr-BadApples-Tests-8.x/solr/build/solr-core/test/J1/temp/solr.update.PeerSyncTest_3305A115FE94BB4A-001/tempDir-001/shard2/solr.xml
   [junit4]   2> 562038 INFO  (TEST-PeerSyncTest.test-seed#[3305A115FE94BB4A]) [    ] o.a.s.c.SolrXmlConfig Configuration parameter autoReplicaFailoverWorkLoopDelay is ignored
   [junit4]   2> 562038 INFO  (TEST-PeerSyncTest.test-seed#[3305A115FE94BB4A]) [    ] o.a.s.c.SolrXmlConfig Configuration parameter autoReplicaFailoverBadNodeExpiration is ignored
   [junit4]   2> 562040 INFO  (TEST-PeerSyncTest.test-seed#[3305A115FE94BB4A]) [    ] o.a.s.c.SolrXmlConfig MBean server found: com.sun.jmx.mbeanserver.JmxMBeanServer@5d168182, but no JMX reporters were configured - adding default JMX reporter.
   [junit4]   2> 562173 INFO  (TEST-PeerSyncTest.test-seed#[3305A115FE94BB4A]) [    ] o.a.s.h.c.HttpShardHandlerFactory Host whitelist initialized: WhitelistHostChecker [whitelistHosts=null, whitelistHostCheckingEnabled=false]
   [junit4]   2> 562175 WARN  (TEST-PeerSyncTest.test-seed#[3305A115FE94BB4A]) [    ] o.e.j.u.s.S.config No Client EndPointIdentificationAlgorithm configured for SslContextFactory@5ef95c6c[provider=null,keyStore=null,trustStore=null]
   [junit4]   2> 562180 WARN  (TEST-PeerSyncTest.test-seed#[3305A115FE94BB4A]) [    ] o.e.j.u.s.S.config No Client EndPointIdentificationAlgorithm configured for SslContextFactory@d612441[provider=null,keyStore=null,trustStore=null]
   [junit4]   2> 562206 INFO  (TEST-PeerSyncTest.test-seed#[3305A115FE94BB4A]) [    ] o.a.s.c.TransientSolrCoreCacheDefault Allocating transient cache for 4 transient cores
   [junit4]   2> 562206 INFO  (TEST-PeerSyncTest.test-seed#[3305A115FE94BB4A]) [    ] o.a.s.h.a.MetricsHistoryHandler No .system collection, keeping metrics history in memory.
   [junit4]   2> 562234 INFO  (TEST-PeerSyncTest.test-seed#[3305A115FE94BB4A]) [    ] o.a.s.m.r.SolrJmxReporter JMX monitoring for 'solr.node' (registry 'solr.node') enabled at server: com.sun.jmx.mbeanserver.JmxMBeanServer@5d168182
   [junit4]   2> 562250 INFO  (TEST-PeerSyncTest.test-seed#[3305A115FE94BB4A]) [    ] o.a.s.m.r.SolrJmxReporter JMX monitoring for 'solr.jvm' (registry 'solr.jvm') enabled at server: com.sun.jmx.mbeanserver.JmxMBeanServer@5d168182
   [junit4]   2> 562250 INFO  (TEST-PeerSyncTest.test-seed#[3305A115FE94BB4A]) [    ] o.a.s.m.r.SolrJmxReporter JMX monitoring for 'solr.jetty' (registry 'solr.jetty') enabled at server: com.sun.jmx.mbeanserver.JmxMBeanServer@5d168182
   [junit4]   2> 562253 INFO  (TEST-PeerSyncTest.test-seed#[3305A115FE94BB4A]) [    ] o.a.s.c.CorePropertiesLocator Found 1 core definitions underneath /x1/jenkins/jenkins-slave/workspace/Lucene-Solr-BadApples-Tests-8.x/solr/build/solr-core/test/J1/temp/solr.update.PeerSyncTest_3305A115FE94BB4A-001/tempDir-001/shard2/cores
   [junit4]   2> 562253 INFO  (TEST-PeerSyncTest.test-seed#[3305A115FE94BB4A]) [    ] o.a.s.c.CorePropertiesLocator Cores are: [collection1]
   [junit4]   2> 562254 INFO  (coreLoadExecutor-2233-thread-1) [    x:collection1] o.a.s.c.SolrResourceLoader [null] Added 2 libs to classloader, from paths: [/x1/jenkins/jenkins-slave/workspace/Lucene-Solr-BadApples-Tests-8.x/solr/core/src/test-files/solr/collection1/lib, /x1/jenkins/jenkins-slave/workspace/Lucene-Solr-BadApples-Tests-8.x/solr/core/src/test-files/solr/collection1/lib/classes]
   [junit4]   2> 562289 INFO  (coreLoadExecutor-2233-thread-1) [    x:collection1] o.a.s.c.SolrConfig Using Lucene MatchVersion: 8.1.0
   [junit4]   2> 562322 INFO  (coreLoadExecutor-2233-thread-1) [    x:collection1] o.a.s.s.IndexSchema [collection1] Schema name=test
   [junit4]   2> 562455 INFO  (coreLoadExecutor-2233-thread-1) [    x:collection1] o.a.s.s.IndexSchema Loaded schema test/1.0 with uniqueid field id
   [junit4]   2> 562475 INFO  (coreLoadExecutor-2233-thread-1) [    x:collection1] o.a.s.c.CoreContainer Creating SolrCore 'collection1' using configuration from configset /x1/jenkins/jenkins-slave/workspace/Lucene-Solr-BadApples-Tests-8.x/solr/core/src/test-files/solr/collection1, trusted=true
   [junit4]   2> 562476 INFO  (coreLoadExecutor-2233-thread-1) [    x:collection1] o.a.s.m.r.SolrJmxReporter JMX monitoring for 'solr.core.collection1' (registry 'solr.core.collection1') enabled at server: com.sun.jmx.mbeanserver.JmxMBeanServer@5d168182
   [junit4]   2> 562476 INFO  (coreLoadExecutor-2233-thread-1) [    x:collection1] o.a.s.c.SolrCore [[collection1] ] Opening new SolrCore at [/x1/jenkins/jenkins-slave/workspace/Lucene-Solr-BadApples-Tests-8.x/solr/core/src/test-files/solr/collection1], dataDir=[/x1/jenkins/jenkins-slave/workspace/Lucene-Solr-BadApples-Tests-8.x/solr/build/solr-core/test/J1/temp/solr.update.PeerSyncTest_3305A115FE94BB4A-001/tempDir-001/shard2/cores/collection1/data/]
   [junit4]   2> 562478 INFO  (coreLoadExecutor-2233-thread-1) [    x:collection1] o.a.s.u.RandomMergePolicy RandomMergePolicy wrapping class org.apache.lucene.index.AlcoholicMergePolicy: [AlcoholicMergePolicy: minMergeSize=0, mergeFactor=10, maxMergeSize=749581179, maxMergeSizeForForcedMerge=9223372036854775807, calibrateSizeByDeletes=true, maxMergeDocs=2147483647, maxCFSSegmentSizeMB=8.796093022207999E12, noCFSRatio=0.1]
   [junit4]   2> 562480 WARN  (coreLoadExecutor-2233-thread-1) [    x:collection1] o.a.s.c.RequestHandlers INVALID paramSet a in requestHandler {type = requestHandler,name = /dump,class = DumpRequestHandler,attributes = {initParams=a, name=/dump, class=DumpRequestHandler},args = {defaults={a=A,b=B}}}
   [junit4]   2> 562540 INFO  (coreLoadExecutor-2233-thread-1) [    x:collection1] o.a.s.u.UpdateHandler Using UpdateLog implementation: org.apache.solr.update.UpdateLog
   [junit4]   2> 562540 INFO  (coreLoadExecutor-2233-thread-1) [    x:collection1] o.a.s.u.UpdateLog Initializing UpdateLog: dataDir= defaultSyncLevel=FLUSH numRecordsToKeep=100 maxNumLogsToKeep=10 numVersionBuckets=65536
   [junit4]   2> 562542 INFO  (coreLoadExecutor-2233-thread-1) [    x:collection1] o.a.s.u.CommitTracker Hard AutoCommit: disabled
   [junit4]   2> 562542 INFO  (coreLoadExecutor-2233-thread-1) [    x:collection1] o.a.s.u.CommitTracker Soft AutoCommit: disabled
   [junit4]   2> 562543 INFO  (coreLoadExecutor-2233-thread-1) [    x:collection1] o.a.s.u.RandomMergePolicy RandomMergePolicy wrapping class org.apache.lucene.index.TieredMergePolicy: [TieredMergePolicy: maxMergeAtOnce=48, maxMergeAtOnceExplicit=15, maxMergedSegmentMB=96.130859375, floorSegmentMB=1.5888671875, forceMergeDeletesPctAllowed=23.96773388076008, segmentsPerTier=42.0, maxCFSSegmentSizeMB=8.796093022207999E12, noCFSRatio=1.0, deletesPctAllowed=20.952375949953108
   [junit4]   2> 562544 INFO  (coreLoadExecutor-2233-thread-1) [    x:collection1] o.a.s.s.SolrIndexSearcher Opening [Searcher@4b6ef780[collection1] main]
   [junit4]   2> 562544 WARN  (coreLoadExecutor-2233-thread-1) [    x:collection1] o.a.s.r.ManagedResourceStorage Cannot write to config directory /x1/jenkins/jenkins-slave/workspace/Lucene-Solr-BadApples-Tests-8.x/solr/core/src/test-files/solr/collection1/conf; switching to use InMemory storage instead.
   [junit4]   2> 562545 INFO  (coreLoadExecutor-2233-thread-1) [    x:collection1] o.a.s.h.ReplicationHandler Commits will be reserved for 10000ms.
   [junit4]   2> 562545 INFO  (coreLoadExecutor-2233-thread-1) [    x:collection1] o.a.s.u.UpdateLog Could not find max version in index or recent updates, using new clock 1632311585940701184
   [junit4]   2> 562548 INFO  (searcherExecutor-2234-thread-1-processing-x:collection1) [    x:collection1] o.a.s.c.SolrCore [collection1] Registered new searcher Searcher@4b6ef780[collection1] main{ExitableDirectoryReader(UninvertingDirectoryReader())}
   [junit4]   2> 562548 INFO  (TEST-PeerSyncTest.test-seed#[3305A115FE94BB4A]) [    ] o.a.s.SolrTestCaseJ4 ###Starting test
   [junit4]   2> 562554 INFO  (qtp1937432173-6315) [    x:collection1] o.a.s.u.p.LogUpdateProcessorFactory [collection1]  webapp=/nk_z/a path=/update params={update.distrib=FROMLEADER&wt=javabin&version=2}{add=[1 (1)]} 0 2
   [junit4]   2> 562556 INFO  (qtp1727718363-6336) [    x:collection1] o.a.s.u.PeerSync PeerSync: core=collection1 url= START replicas=[http://127.0.0.1:46572/nk_z/a/collection1] nUpdates=100
   [junit4]   2> 562563 INFO  (qtp1937432173-6317) [    x:collection1] o.a.s.s.SolrIndexSearcher Opening [Searcher@7c5589ab[collection1] realtime]
   [junit4]   2> 562563 INFO  (qtp1937432173-6317) [    x:collection1] o.a.s.u.IndexFingerprint IndexFingerprint millis:5.0 result:{maxVersionSpecified=9223372036854775807, maxVersionEncountered=1, maxInHash=1, versionsHash=-5451962507482445012, numVersions=1, numDocs=1, maxDoc=1}
   [junit4]   2> 562563 INFO  (qtp1937432173-6317) [    x:collection1] o.a.s.c.S.Request [collection1]  webapp=/nk_z/a path=/get params={distrib=false&qt=/get&getFingerprint=9223372036854775807&wt=javabin&version=2} status=0 QTime=5
   [junit4]   2> 562566 INFO  (qtp1727718363-6336) [    x:collection1] o.a.s.u.IndexFingerprint IndexFingerprint millis:1.0 result:{maxVersionSpecified=9223372036854775807, maxVersionEncountered=0, maxInHash=0, versionsHash=0, numVersions=0, numDocs=0, maxDoc=0}
   [junit4]   2> 562566 INFO  (qtp1727718363-6336) [    x:collection1] o.a.s.u.PeerSync PeerSync: core=collection1 url= DONE.  We have no versions.  sync failed.
   [junit4]   2> 562567 INFO  (qtp1937432173-6318) [    x:collection1] o.a.s.u.IndexFingerprint IndexFingerprint millis:0.0 result:{maxVersionSpecified=9223372036854775807, maxVersionEncountered=1, maxInHash=1, versionsHash=-5451962507482445012, numVersions=1, numDocs=1, maxDoc=1}
   [junit4]   2> 562567 INFO  (qtp1937432173-6318) [    x:collection1] o.a.s.c.S.Request [collection1]  webapp=/nk_z/a path=/get params={distrib=false&qt=/get&fingerprint=true&getVersions=100&wt=javabin&version=2} status=0 QTime=0
   [junit4]   2> 562567 INFO  (qtp1727718363-6336) [    x:collection1] o.a.s.c.S.Request [collection1]  webapp=/nk_z/a path=/get params={qt=/get&getVersions=100&sync=http://127.0.0.1:46572/nk_z/a/collection1&wt=javabin&version=2} status=0 QTime=11
   [junit4]   2> 562570 INFO  (qtp1727718363-6337) [    x:collection1] o.a.s.u.p.LogUpdateProcessorFactory [collection1]  webapp=/nk_z/a path=/update params={update.distrib=FROMLEADER&wt=javabin&version=2}{add=[1 (1)]} 0 1
   [junit4]   2> 562571 INFO  (qtp1727718363-6338) [    x:collection1] o.a.s.u.PeerSync PeerSync: core=collection1 url= START replicas=[http://127.0.0.1:46572/nk_z/a/collection1] nUpdates=100
   [junit4]   2> 562571 INFO  (qtp1937432173-6314) [    x:collection1] o.a.s.u.IndexFingerprint IndexFingerprint millis:0.0 result:{maxVersionSpecified=9223372036854775807, maxVersionEncountered=1, maxInHash=1, versionsHash=-5451962507482445012, numVersions=1, numDocs=1, maxDoc=1}
   [junit4]   2> 562571 INFO  (qtp1937432173-6314) [    x:collection1] o.a.s.c.S.Request [collection1]  webapp=/nk_z/a path=/get params={distrib=false&qt=/get&getFingerprint=9223372036854775807&wt=javabin&version=2} status=0 QTime=0
   [junit4]   2> 562576 INFO  (qtp1727718363-6338) [    x:collection1] o.a.s.s.SolrIndexSearcher Opening [Searcher@71ba76e3[collection1] realtime]
   [junit4]   2> 562576 INFO  (qtp1727718363-6338) [    x:collection1] o.a.s.u.IndexFingerprint IndexFingerprint millis:4.0 result:{maxVersionSpecified=9223372036854775807, maxVersionEncountered=1, maxInHash=1, versionsHash=-5451962507482445012, numVersions=1, numDocs=1, maxDoc=1}
   [junit4]   2> 562577 INFO  (qtp1727718363-6338) [    x:collection1] o.a.s.u.PeerSync We are already in sync. No need to do a PeerSync 
   [junit4]   2> 562577 INFO  (qtp1727718363-6338) [    x:collection1] o.a.s.c.S.Request [collection1]  webapp=/nk_z/a path=/get params={qt=/get&getVersions=100&sync=http://127.0.0.1:46572/nk_z/a/collection1&wt=javabin&version=2} status=0 QTime=6
   [junit4]   2> 562577 INFO  (qtp1937432173-6315) [    x:collection1] o.a.s.u.DirectUpdateHandler2 start commit{_version_=1632311585974255616,optimize=false,openSearcher=true,waitSearcher=true,expungeDeletes=false,softCommit=false,prepareCommit=false}
   [junit4]   2> 562578 INFO  (qtp1937432173-6315) [    x:collection1] o.a.s.u.SolrIndexWriter Calling setCommitData with IW:org.apache.solr.update.SolrIndexWriter@284f6e9f commitCommandVersion:1632311585974255616
   [junit4]   2> 562580 INFO  (qtp1937432173-6315) [    x:collection1] o.a.s.s.SolrIndexSearcher Opening [Searcher@2fbdc759[collection1] main]
   [junit4]   2> 562581 INFO  (qtp1937432173-6315) [    x:collection1] o.a.s.u.DirectUpdateHandler2 end_commit_flush
   [junit4]   2> 562583 INFO  (searcherExecutor-2206-thread-1-processing-x:collection1) [    x:collection1] o.a.s.c.SolrCore [collection1] Registered new searcher Searcher@2fbdc759[collection1] main{ExitableDirectoryReader(UninvertingDirectoryReader(Uninverting(_0(8.1.0):C1:[diagnostics={os=Linux, java.vendor=Oracle Corporation, java.version=1.8.0_191, java.vm.version=25.191-b12, lucene.version=8.1.0, os.arch=amd64, java.runtime.version=1.8.0_191-b12, source=flush, os.version=4.4.0-137-generic, timestamp=1556693635900}]:[attributes={Lucene50StoredFieldsFormat.mode=BEST_SPEED}])))}
   [junit4]   2> 562583 INFO  (qtp1937432173-6315) [    x:collection1] o.a.s.u.p.LogUpdateProcessorFactory [collection1]  webapp=/nk_z/a path=/update params={waitSearcher=true&commit=true&softCommit=false&wt=javabin&version=2}{commit=} 0 6
   [junit4]   2> 562584 INFO  (qtp1727718363-6339) [    x:collection1] o.a.s.u.DirectUpdateHandler2 start commit{_version_=1632311585981595648,optimize=false,openSearcher=true,waitSearcher=true,expungeDeletes=false,softCommit=false,prepareCommit=false}
   [junit4]   2> 562584 INFO  (qtp1727718363-6339) [    x:collection1] o.a.s.u.SolrIndexWriter Calling setCommitData with IW:org.apache.solr.update.SolrIndexWriter@437ad4a6 commitCommandVersion:1632311585981595648
   [junit4]   2> 562586 INFO  (qtp1727718363-6339) [    x:collection1] o.a.s.s.SolrIndexSearcher Opening [Searcher@2a6e4884[collection1] main]
   [junit4]   2> 562586 INFO  (qtp1727718363-6339) [    x:collection1] o.a.s.u.DirectUpdateHandler2 end_commit_flush
   [junit4]   2> 562590 INFO  (searcherExecutor-2220-thread-1-processing-x:collection1) [    x:collection1] o.a.s.c.SolrCore [collection1] Registered new searcher Searcher@2a6e4884[collection1] main{ExitableDirectoryReader(UninvertingDirectoryReader(Uninverting(_0(8.1.0):C1:[diagnostics={os=Linux, java.vendor=Oracle Corporation, java.version=1.8.0_191, java.vm.version=25.191-b12, lucene.version=8.1.0, os.arch=amd64, java.runtime.version=1.8.0_191-b12, source=flush, os.version=4.4.0-137-generic, timestamp=1556693635913}]:[attributes={Lucene50StoredFieldsFormat.mode=BEST_SPEED}])))}
   [junit4]   2> 562590 INFO  (qtp1727718363-6339) [    x:collection1] o.a.s.u.p.LogUpdateProcessorFactory [collection1]  webapp=/nk_z/a path=/update params={waitSearcher=true&commit=true&softCommit=false&wt=javabin&version=2}{commit=} 0 6
   [junit4]   2> 562591 INFO  (qtp1937432173-6316) [    x:collection1] o.a.s.c.S.Request [collection1]  webapp=/nk_z/a path=/select params={q=*:*&wt=javabin&version=2} hits=1 status=0 QTime=0
   [junit4]   2> 562592 INFO  (qtp1727718363-6335) [    x:collection1] o.a.s.c.S.Request [collection1]  webapp=/nk_z/a path=/select params={q=*:*&wt=javabin&version=2} hits=1 status=0 QTime=0
   [junit4]   2> 562598 INFO  (qtp1937432173-6317) [    x:collection1] o.a.s.u.p.LogUpdateProcessorFactory [collection1]  webapp=/nk_z/a path=/update params={update.distrib=FROMLEADER&wt=javabin&version=2}{add=[2 (2)]} 0 2
   [junit4]   2> 562599 INFO  (qtp1727718363-6336) [    x:collection1] o.a.s.u.PeerSync PeerSync: core=collection1 url= START replicas=[http://127.0.0.1:46572/nk_z/a/collection1] nUpdates=100
   [junit4]   2> 562604 INFO  (qtp1937432173-6318) [    x:collection1] o.a.s.s.SolrIndexSearcher Opening [Searcher@29715c85[collection1] realtime]
   [junit4]   2> 562605 INFO  (qtp1937432173-6318) [    x:collection1] o.a.s.u.IndexFingerprint IndexFingerprint millis:5.0 result:{maxVersionSpecified=9223372036854775807, maxVersionEncountered=2, maxInHash=2, versionsHash=-1218814014108643565, numVersions=2, numDocs=2, maxDoc=1}
   [junit4]   2> 562605 INFO  (qtp1937432173-6318) [    x:collection1] o.a.s.c.S.Request [collection1]  webapp=/nk_z/a path=/get params={distrib=false&qt=/get&getFingerprint=9223372036854775807&wt=javabin&version=2} status=0 QTime=5
   [junit4]   2> 562605 INFO  (qtp1727718363-6336) [    x:collection1] o.a.s.u.IndexFingerprint IndexFingerprint millis:0.0 result:{maxVersionSpecified=9223372036854775807, maxVersionEncountered=1, maxInHash=1, versionsHash=-5451962507482445012, numVersions=1, numDocs=1, maxDoc=1}
   [junit4]   2> 562607 INFO  (qtp1937432173-6314) [    x:collection1] o.a.s.u.IndexFingerprint IndexFingerprint millis:0.0 result:{maxVersionSpecified=9223372036854775807, maxVersionEncountered=2, maxInHash=2, versionsHash=-1218814014108643565, numVersions=2, numDocs=2, maxDoc=1}
   [junit4]   2> 562607 INFO  (qtp1937432173-6314) [    x:collection1] o.a.s.c.S.Request [collection1]  webapp=/nk_z/a path=/get params={distrib=false&qt=/get&fingerprint=true&getVersions=100&wt=javabin&version=2} status=0 QTime=0
   [junit4]   2> 562607 INFO  (qtp1727718363-6336) [    x:collection1] o.a.s.u.PeerSync PeerSync: core=collection1 url=  Received 2 versions from http://127.0.0.1:46572/nk_z/a/collection1 fingerprint:{maxVersionSpecified=9223372036854775807, maxVersionEncountered=2, maxInHash=2, versionsHash=-1218814014108643565, numVersions=2, numDocs=2, maxDoc=1}
   [junit4]   2> 562608 INFO  (qtp1937432173-6315) [    x:collection1] o.a.s.c.S.Request [collection1]  webapp=/nk_z/a path=/get params={distrib=false&qt=/get&checkCanHandleVersionRanges=false&wt=javabin&version=2} status=0 QTime=0
   [junit4]   2> 562609 INFO  (qtp1727718363-6336) [    x:collection1] o.a.s.u.PeerSync PeerSync: core=collection1 url= Requesting updates from http://127.0.0.1:46572/nk_z/a/collection1n=1 versions=2...2
   [junit4]   2> 562612 INFO  (qtp1937432173-6316) [    x:collection1] o.a.s.u.IndexFingerprint IndexFingerprint millis:0.0 result:{maxVersionSpecified=2, maxVersionEncountered=2, maxInHash=2, versionsHash=-1218814014108643565, numVersions=2, numDocs=2, maxDoc=1}
   [junit4]   2> 562613 INFO  (qtp1937432173-6316) [    x:collection1] o.a.s.c.S.Request [collection1]  webapp=/nk_z/a path=/get params={getUpdates=2...2&distrib=false&qt=/get&fingerprint=true&onlyIfActive=false&wt=javabin&version=2} status=0 QTime=1
   [junit4]   2> 562617 INFO  (qtp1727718363-6336) [    x:collection1] o.a.s.u.p.LogUpdateProcessorFactory [collection1] {add=[2 (2)]} 0 3
   [junit4]   2> 562622 INFO  (qtp1727718363-6336) [    x:collection1] o.a.s.s.SolrIndexSearcher Opening [Searcher@20fee405[collection1] realtime]
   [junit4]   2> 562622 INFO  (qtp1727718363-6336) [    x:collection1] o.a.s.u.IndexFingerprint IndexFingerprint millis:5.0 result:{maxVersionSpecified=2, maxVersionEncountered=2, maxInHash=2, versionsHash=-1218814014108643565, numVersions=2, numDocs=2, maxDoc=1}
   [junit4]   2> 562622 INFO  (qtp1727718363-6336) [    x:collection1] o.a.s.u.PeerSync Fingerprint comparison: 0
   [junit4]   2> 562623 INFO  (qtp1727718363-6336) [    x:collection1] o.a.s.u.PeerSync PeerSync: core=collection1 url= DONE. sync succeeded
   [junit4]   2> 562623 INFO  (qtp1727718363-6336) [    x:collection1] o.a.s.c.S.Request [collection1]  webapp=/nk_z/a path=/get params={qt=/get&getVersions=100&sync=http://127.0.0.1:46572/nk_z/a/collection1&wt=javabin&version=2} status=0 QTime=24
   [junit4]   2> 562624 INFO  (qtp1937432173-6317) [    x:collection1] o.a.s.u.DirectUpdateHandler2 start commit{_version_=1632311586023538688,optimize=false,openSearcher=true,waitSearcher=true,expungeDeletes=false,softCommit=false,prepareCommit=false}
   [junit4]   2> 562624 INFO  (qtp1937432173-6317) [    x:collection1] o.a.s.u.SolrIndexWriter Calling setCommitData with IW:org.apache.solr.update.SolrIndexWriter@284f6e9f commitCommandVersion:1632311586023538688
   [junit4]   2> 562625 INFO  (qtp1937432173-6317) [    x:collection1] o.a.s.s.SolrIndexSearcher Opening [Searcher@149e343e[collection1] main]
   [junit4]   2> 562626 INFO  (qtp1937432173-6317) [    x:collection1] o.a.s.u.DirectUpdateHandler2 end_commit_flush
   [junit4]   2> 562628 INFO  (searcherExecutor-2206-thread-1-processing-x:collection1) [    x:collection1] o.a.s.c.SolrCore [collection1] Registered new searcher Searcher@149e343e[collection1] main{ExitableDirectoryReader(UninvertingDirectoryReader(Uninverting(_0(8.1.0):C1:[diagnostics={os=Linux, java.vendor=Oracle Corporation, java.version=1.8.0_191, java.vm.version=25.191-b12, lucene.version=8.1.0, os.arch=amd64, java.runtime.version=1.8.0_191-b12, source=flush, os.version=4.4.0-137-generic, timestamp=1556693635900}]:[attributes={Lucene50StoredFieldsFormat.mode=BEST_SPEED}]) Uninverting(_1(8.1.0):C1:[diagnostics={os=Linux, java.vendor=Oracle Corporation, java.version=1.8.0_191, java.vm.version=25.191-b12, lucene.version=8.1.0, os.arch=amd64, java.runtime.version=1.8.0_191-b12, source=flush, os.version=4.4.0-137-generic, timestamp=1556693635941}]:[attributes={Lucene50StoredFieldsFormat.mode=BEST_SPEED}])))}
   [junit4]   2> 562629 INFO  (qtp1937432173-6317) [    x:collection1] o.a.s.u.p.LogUpdateProcessorFactory [collection1]  webapp=/nk_z/a path=/update params={waitSearcher=true&commit=true&softCommit=false&wt=javabin&version=2}{commit=} 0 5
   [junit4]   2> 562630 INFO  (qtp1727718363-6337) [    x:collection1] o.a.s.u.DirectUpdateHandler2 start commit{_version_=1632311586029830144,optimize=false,openSearcher=true,waitSearcher=true,expungeDeletes=false,softCommit=false,prepareCommit=false}
   [junit4]   2> 562630 INFO  (qtp1727718363-6337) [    x:collection1] o.a.s.u.SolrIndexWriter Calling setCommitData with IW:org.apache.solr.update.SolrIndexWriter@437ad4a6 commitCommandVersion:1632311586029830144
   [junit4]   2> 562631 INFO  (qtp1727718363-6337) [    x:collection1] o.a.s.s.SolrIndexSearcher Opening [Searcher@546c9da1[collection1] main]
   [junit4]   2> 562636 INFO  (searcherExecutor-2220-thread-1-processing-x:collection1) [    x:collection1] o.a.s.c.SolrCore [collection1] Registered new searcher Searcher@546c9da1[collection1] main{ExitableDirectoryReader(UninvertingDirectoryReader(Uninverting(_0(8.1.0):C1:[diagnostics={os=Linux, java.vendor=Oracle Corporation, java.version=1.8.0_191, java.vm.version=25.191-b12, lucene.version=8.1.0, os.arch=amd64, java.runtime.version=1.8.0_191-b12, source=flush, os.version=4.4.0-137-generic, timestamp=1556693635913}]:[attributes={Lucene50StoredFieldsFormat.mode=BEST_SPEED}]) Uninverting(_1(8.1.0):C1:[diagnostics={os=Linux, java.vendor=Oracle Corporation, java.version=1.8.0_191, java.vm.version=25.191-b12, lucene.version=8.1.0, os.arch=amd64, java.runtime.version=1.8.0_191-b12, source=flush, os.version=4.4.0-137-generic, timestamp=1556693635959}]:[attributes={Lucene50StoredFieldsFormat.mode=BEST_SPEED}])))}
   [junit4]   2> 562637 INFO  (qtp1727718363-6337) [    x:collection1] o.a.s.u.DirectUpdateHandler2 end_commit_flush
   [junit4]   2> 562637 INFO  (qtp1727718363-6337) [    x:collection1] o.a.s.u.p.LogUpdateProcessorFactory [collection1]  webapp=/nk_z/a path=/update params={waitSearcher=true&commit=true&softCommit=false&wt=javabin&version=2}{commit=} 0 7
   [junit4]   2> 562638 INFO  (qtp1937432173-6318) [    x:collection1] o.a.s.c.S.Request [collection1]  webapp=/nk_z/a path=/select params={q=*:*&wt=javabin&version=2} hits=2 status=0 QTime=0
   [junit4]   2> 562640 INFO  (qtp1727718363-6338) [    x:collection1] o.a.s.c.S.Request [collection1]  webapp=/nk_z/a path=/select params={q=*:*&wt=javabin&version=2} hits=2 status=0 QTime=0
   [junit4]   2> 562645 INFO  (qtp1937432173-6314) [    x:collection1] o.a.s.u.p.LogUpdateProcessorFactory [collection1]  webapp=/nk_z/a path=/update params={update.distri

[...truncated too long message...]

ainer Shutting down CoreContainer instance=1221543727
   [junit4]   2> 2676428 INFO  (coreCloseExecutor-12866-thread-1) [    x:collection1] o.a.s.c.SolrCore [collection1]  CLOSING SolrCore org.apache.solr.core.SolrCore@5280b15b
   [junit4]   2> 2676428 INFO  (coreCloseExecutor-12866-thread-1) [    x:collection1] o.a.s.m.SolrMetricManager Closing metric reporters for registry=solr.core.collection1, tag=5280b15b
   [junit4]   2> 2676429 INFO  (coreCloseExecutor-12866-thread-1) [    x:collection1] o.a.s.m.r.SolrJmxReporter Closing reporter [org.apache.solr.metrics.reporters.SolrJmxReporter@5c93c68f: rootName = null, domain = solr.core.collection1, service url = null, agent id = null] for registry solr.core.collection1 / com.codahale.metrics.MetricRegistry@551f87b5
   [junit4]   2> 2676433 INFO  (SUITE-PeerSyncWithLeaderTest-seed#[3305A115FE94BB4A]-worker) [    ] o.a.s.m.SolrMetricManager Closing metric reporters for registry=solr.node, tag=null
   [junit4]   2> 2676433 INFO  (SUITE-PeerSyncWithLeaderTest-seed#[3305A115FE94BB4A]-worker) [    ] o.a.s.m.r.SolrJmxReporter Closing reporter [org.apache.solr.metrics.reporters.SolrJmxReporter@4ae69d2d: rootName = null, domain = solr.node, service url = null, agent id = null] for registry solr.node / com.codahale.metrics.MetricRegistry@779fe7f
   [junit4]   2> 2676434 INFO  (SUITE-PeerSyncWithLeaderTest-seed#[3305A115FE94BB4A]-worker) [    ] o.a.s.m.SolrMetricManager Closing metric reporters for registry=solr.jvm, tag=null
   [junit4]   2> 2676434 INFO  (SUITE-PeerSyncWithLeaderTest-seed#[3305A115FE94BB4A]-worker) [    ] o.a.s.m.r.SolrJmxReporter Closing reporter [org.apache.solr.metrics.reporters.SolrJmxReporter@506d267b: rootName = null, domain = solr.jvm, service url = null, agent id = null] for registry solr.jvm / com.codahale.metrics.MetricRegistry@337a6f38
   [junit4]   2> 2676434 INFO  (SUITE-PeerSyncWithLeaderTest-seed#[3305A115FE94BB4A]-worker) [    ] o.a.s.m.SolrMetricManager Closing metric reporters for registry=solr.jetty, tag=null
   [junit4]   2> 2676434 INFO  (SUITE-PeerSyncWithLeaderTest-seed#[3305A115FE94BB4A]-worker) [    ] o.a.s.m.r.SolrJmxReporter Closing reporter [org.apache.solr.metrics.reporters.SolrJmxReporter@1e0ec3ce: rootName = null, domain = solr.jetty, service url = null, agent id = null] for registry solr.jetty / com.codahale.metrics.MetricRegistry@62558fc2
   [junit4]   2> NOTE: leaving temporary files on disk at: /x1/jenkins/jenkins-slave/workspace/Lucene-Solr-BadApples-Tests-8.x/solr/build/solr-core/test/J1/temp/solr.update.PeerSyncWithLeaderTest_3305A115FE94BB4A-001
   [junit4]   2> NOTE: test params are: codec=Asserting(Lucene80): {title_stringNoNorms=BlockTreeOrds(blocksize=128), title_stemmed=FSTOrd50, multiDefault=FSTOrd50, _root_=BlockTreeOrds(blocksize=128), id=Lucene50(blocksize=128), text=PostingsFormat(name=LuceneFixedGap), title=FSTOrd50, title_lettertok=Lucene50(blocksize=128)}, docValues:{range_facet_l_dv=DocValuesFormat(name=Lucene80), _version_=DocValuesFormat(name=Direct), val_i_dvo=DocValuesFormat(name=Lucene80), range_facet_i_dv=DocValuesFormat(name=Direct), intDvoDefault=DocValuesFormat(name=Lucene80), timestamp=DocValuesFormat(name=Direct)}, maxPointsInLeafNode=920, maxMBSortInHeap=5.026849421629477, sim=Asserting(org.apache.lucene.search.similarities.AssertingSimilarity@61a3ef2f), locale=fr-BE, timezone=Asia/Dubai
   [junit4]   2> NOTE: Linux 4.4.0-137-generic amd64/Oracle Corporation 1.8.0_191 (64-bit)/cpus=4,threads=1,free=142455664,total=528482304
   [junit4]   2> NOTE: All tests run in this JVM: [RulesTest, TestSchemaVersionResource, SchemaApiFailureTest, TestDynamicURP, TestTolerantUpdateProcessorCloud, TestDeleteCollectionOnDownNodes, SoftAutoCommitTest, TestFastLRUCache, UniqFieldsUpdateProcessorFactoryTest, TestQuerySenderNoQuery, TestJsonRequest, TestCSVResponseWriter, TestRandomFaceting, RemoteQueryErrorTest, TestPivotHelperCode, ExternalFileFieldSortTest, TestXIncludeConfig, TestSearcherReuse, TestMultiValuedNumericRangeQuery, TestCSVLoader, DistribJoinFromCollectionTest, PreAnalyzedFieldTest, BlockCacheTest, TestReplicationHandlerDiskOverFlow, CdcrReplicationHandlerTest, TestComplexPhraseQParserPlugin, ZkStateWriterTest, ZookeeperStatusHandlerTest, TestCloudJSONFacetJoinDomain, TestLeaderElectionWithEmptyReplica, SolrCoreTest, TestManagedSchema, BasicFunctionalityTest, TestCloudSearcherWarming, TestRemoteStreaming, DirectSolrSpellCheckerTest, TestCollectionsAPIViaSolrCloudCluster, CoreAdminHandlerTest, SolrCloudReportersTest, PeerSyncTest, ExecutePlanActionTest, AtomicUpdateRemovalJavabinTest, NodeLostTriggerTest, DocumentAnalysisRequestHandlerTest, TriggerIntegrationTest, TestSSLRandomization, RegexBytesRefFilterTest, TestSha256AuthenticationProvider, ZkCLITest, CircularListTest, OpenExchangeRatesOrgProviderTest, MoreLikeThisHandlerTest, HdfsRestartWhileUpdatingTest, NodeAddedTriggerIntegrationTest, V2StandaloneTest, TestOrdValues, TestConfigSetsAPIExclusivity, ScriptEngineTest, HdfsDirectoryTest, AuditLoggerIntegrationTest, LargeFieldTest, FullHLLTest, SparseHLLTest, LoggingHandlerTest, TestIndexingPerformance, BigEndianAscendingWordSerializerTest, QueryResultKeyTest, TestStressInPlaceUpdates, TestCloudPseudoReturnFields, SecurityConfHandlerTest, TestAddFieldRealTimeGet, TestMaxScoreQueryParser, TestSimExecutePlanAction, MinimalSchemaTest, TestDistributedSearch, JSONWriterTest, TestSimpleTextCodec, TestBulkSchemaConcurrent, TestMergePolicyConfig, ExitableDirectoryReaderTest, DistributedFacetPivotWhiteBoxTest, IndexSizeTriggerTest, ConnectionReuseTest, TestGraphMLResponseWriter, MultiDestinationAuditLoggerTest, WrapperMergePolicyFactoryTest, InfixSuggestersTest, TestUseDocValuesAsStored2, TestOmitPositions, VersionInfoTest, MultiThreadedOCPTest, TestDownShardTolerantSearch, TestReplicaProperties, FullSolrCloudDistribCmdsTest, CdcrWithNodesRestartsTest, HdfsNNFailoverTest, StatsComponentTest, TestEmbeddedSolrServerConstructors, TestDocTermOrdsUninvertLimit, TestNumericTokenStream, HdfsTlogReplayBufferedWhileIndexingTest, DistributedQueryComponentOptimizationTest, TestJsonFacets, TestRealTimeGet, BasicDistributedZkTest, AdminHandlersProxyTest, TestCoreContainer, TestFieldResource, TestAuthenticationFramework, SolrInfoBeanTest, TestNestedDocsSort, SortByFunctionTest, TestMiniSolrCloudClusterSSL, TestManagedStopFilterFactory, BasicAuthStandaloneTest, TestHighlightDedupGrouping, CoreMergeIndexesAdminHandlerTest, TestCodecSupport, AnalysisErrorHandlingTest, TestHdfsBackupRestoreCore, DisMaxRequestHandlerTest, StressHdfsTest, LeaderElectionIntegrationTest, BJQParserTest, TestLMJelinekMercerSimilarityFactory, TestObjectReleaseTracker, ClassificationUpdateProcessorFactoryTest, TestSolrConfigHandlerConcurrent, TestReload, TestSimLargeCluster, ClusterStateTest, TestRetrieveFieldsOptimizer, OverseerTaskQueueTest, TestExactSharedStatsCache, SolrPluginUtilsTest, TestValueSourceCache, ConcurrentDeleteAndCreateCollectionTest, MetricsConfigTest, MetricsHistoryIntegrationTest, MigrateRouteKeyTest, OverseerModifyCollectionTest, RecoveryAfterSoftCommitTest, ReplicationFactorTest, SyncSliceTest, TestRebalanceLeaders, TestSolrCloudWithDelegationTokens, TestSolrCloudWithKerberosAlt, TestWithCollection, HdfsCollectionsAPIDistributedZkTest, ShardSplitTest, ConfigureRecoveryStrategyTest, CoreSorterTest, RequestHandlersTest, ResourceLoaderTest, SOLR749Test, TestConfigOverlay, TestConfigSetImmutable, TestCustomStream, BinaryUpdateRequestHandlerTest, RequestLoggingTest, SearchHandlerTest, TestSQLHandler, SystemInfoHandlerTest, TestCollectionAPIs, CustomHighlightComponentTest, DebugComponentTest, DistributedDebugComponentTest, DistributedExpandComponentTest, DistributedFacetPivotLongTailTest, DistributedSuggestComponentTest, QueryElevationComponentTest, ShufflingReplicaListTransformerTest, SuggestComponentTest, TermVectorComponentTest, TermsComponentTest, TestExpandComponent, TestExportWriter, JavabinLoaderTest, EmbeddedSolrNoSerializeTest, Tagger2Test, TaggerTest, XmlInterpolationTest, HighlighterConfigTest, HighlighterTest, TestSlowCompositeReaderWrapper, TestLegacyNumericUtils, SolrGraphiteReporterTest, SubstringBytesRefFilterTest, TestFacetMethods, TestFaceting, TestUnInvertedFieldException, TestWriterPerf, TestChildDocTransformer, TestSubQueryTransformerCrossCore, TestManagedResource, TestRestManager, TestBulkSchemaAPI, CurrencyFieldTypeTest, DocValuesMultiTest, IndexSchemaTest, NotRequiredUniqueKeyTest, SpatialRPTFieldTypeTest, TestCollationField, TestCollationFieldDocValues, TestSchemaManager, TestSchemalessBufferedUpdates, AnalyticsMergeStrategyTest, QueryEqualityTest, QueryParsingTest, ReturnFieldsTest, TestCustomSort, TestDocSet, TestFilteredDocIdSet, TestFiltering, TestLFUCache, TestSolr4Spatial, TestSolrJ, TestSort, TestStressUserVersions, TestStressVersions, DistributedFacetSimpleRefinementLongTailTest, TestBM25SimilarityFactory, TestDFRSimilarityFactory, TestPerFieldSimilarity, TestSweetSpotSimilarityFactory, SolrLogAuditLoggerPluginTest, TestPKIAuthenticationPlugin, TestImpersonationWithHadoopAuth, TestSolrCloudWithHadoopAuthPlugin, TestZkAclsWithHadoopAuth, NoCacheHeaderTest, SolrRequestParserTest, SpellCheckCollatorTest, SuggesterFSTTest, SuggesterTest, TestAnalyzedSuggestions, TestFreeTextSuggestions, TestFieldCacheVsDocValues, DirectUpdateHandlerTest, PeerSyncWithLeaderTest]
   [junit4] Completed [849/855 (3!)] on J1 in 140.35s, 1 test, 1 failure <<< FAILURES!

[...truncated 8993 lines...]
BUILD FAILED
/x1/jenkins/jenkins-slave/workspace/Lucene-Solr-BadApples-Tests-8.x/build.xml:643: The following error occurred while executing this line:
/x1/jenkins/jenkins-slave/workspace/Lucene-Solr-BadApples-Tests-8.x/build.xml:128: Found 1 violations in source files (File uses Mockito but has no assumeWorkingMockito() call).

Total time: 103 minutes 15 seconds
Build step 'Invoke Ant' marked build as failure
Archiving artifacts
Recording test results
Email was triggered for: Failure - Any
Sending email for trigger: Failure - Any

Mime
View raw message