lucene-dev mailing list archives

Site index · List index
Message view « Date » · « Thread »
Top « Date » · « Thread »
From Policeman Jenkins Server <jenk...@thetaphi.de>
Subject [JENKINS] Lucene-Solr-master-Windows (64bit/jdk-11.0.2) - Build # 7930 - Still Unstable!
Date Thu, 09 May 2019 03:13:48 GMT
Build: https://jenkins.thetaphi.de/job/Lucene-Solr-master-Windows/7930/
Java: 64bit/jdk-11.0.2 -XX:-UseCompressedOops -XX:+UseSerialGC

1 tests failed.
FAILED:  org.apache.solr.security.BasicAuthIntegrationTest.testBasicAuth

Error Message:
Error from server at http://127.0.0.1:57796/solr/authCollection: Error from server at null: Expected mime type application/octet-stream but got text/html. <html> <head> <meta http-equiv="Content-Type" content="text/html;charset=utf-8"/> <title>Error 401 require authentication</title> </head> <body><h2>HTTP ERROR 401</h2> <p>Problem accessing /solr/authCollection_shard2_replica_n2/select. Reason: <pre>    require authentication</pre></p><hr><a href="http://eclipse.org/jetty">Powered by Jetty:// 9.4.14.v20181114</a><hr/>  </body> </html> 

Stack Trace:
org.apache.solr.client.solrj.impl.HttpSolrClient$RemoteSolrException: Error from server at http://127.0.0.1:57796/solr/authCollection: Error from server at null: Expected mime type application/octet-stream but got text/html. <html>
<head>
<meta http-equiv="Content-Type" content="text/html;charset=utf-8"/>
<title>Error 401 require authentication</title>
</head>
<body><h2>HTTP ERROR 401</h2>
<p>Problem accessing /solr/authCollection_shard2_replica_n2/select. Reason:
<pre>    require authentication</pre></p><hr><a href="http://eclipse.org/jetty">Powered by Jetty:// 9.4.14.v20181114</a><hr/>

</body>
</html>

	at __randomizedtesting.SeedInfo.seed([1E0750AD432CAC1A:A26926BFE77F2F60]:0)
	at org.apache.solr.client.solrj.impl.HttpSolrClient.executeMethod(HttpSolrClient.java:649)
	at org.apache.solr.client.solrj.impl.HttpSolrClient.request(HttpSolrClient.java:255)
	at org.apache.solr.client.solrj.impl.HttpSolrClient.request(HttpSolrClient.java:244)
	at org.apache.solr.client.solrj.impl.LBSolrClient.doRequest(LBSolrClient.java:368)
	at org.apache.solr.client.solrj.impl.LBSolrClient.request(LBSolrClient.java:296)
	at org.apache.solr.client.solrj.impl.BaseCloudSolrClient.sendRequest(BaseCloudSolrClient.java:1068)
	at org.apache.solr.client.solrj.impl.BaseCloudSolrClient.requestWithRetryOnStaleState(BaseCloudSolrClient.java:837)
	at org.apache.solr.client.solrj.impl.BaseCloudSolrClient.request(BaseCloudSolrClient.java:769)
	at org.apache.solr.security.BasicAuthIntegrationTest.testBasicAuth(BasicAuthIntegrationTest.java:290)
	at java.base/jdk.internal.reflect.NativeMethodAccessorImpl.invoke0(Native Method)
	at java.base/jdk.internal.reflect.NativeMethodAccessorImpl.invoke(NativeMethodAccessorImpl.java:62)
	at java.base/jdk.internal.reflect.DelegatingMethodAccessorImpl.invoke(DelegatingMethodAccessorImpl.java:43)
	at java.base/java.lang.reflect.Method.invoke(Method.java:566)
	at com.carrotsearch.randomizedtesting.RandomizedRunner.invoke(RandomizedRunner.java:1750)
	at com.carrotsearch.randomizedtesting.RandomizedRunner$8.evaluate(RandomizedRunner.java:938)
	at com.carrotsearch.randomizedtesting.RandomizedRunner$9.evaluate(RandomizedRunner.java:974)
	at com.carrotsearch.randomizedtesting.RandomizedRunner$10.evaluate(RandomizedRunner.java:988)
	at com.carrotsearch.randomizedtesting.rules.SystemPropertiesRestoreRule$1.evaluate(SystemPropertiesRestoreRule.java:57)
	at org.apache.lucene.util.TestRuleSetupTeardownChained$1.evaluate(TestRuleSetupTeardownChained.java:49)
	at org.apache.lucene.util.AbstractBeforeAfterRule$1.evaluate(AbstractBeforeAfterRule.java:45)
	at org.apache.lucene.util.TestRuleThreadAndTestName$1.evaluate(TestRuleThreadAndTestName.java:48)
	at org.apache.lucene.util.TestRuleIgnoreAfterMaxFailures$1.evaluate(TestRuleIgnoreAfterMaxFailures.java:64)
	at org.apache.lucene.util.TestRuleMarkFailure$1.evaluate(TestRuleMarkFailure.java:47)
	at com.carrotsearch.randomizedtesting.rules.StatementAdapter.evaluate(StatementAdapter.java:36)
	at com.carrotsearch.randomizedtesting.ThreadLeakControl$StatementRunner.run(ThreadLeakControl.java:368)
	at com.carrotsearch.randomizedtesting.ThreadLeakControl.forkTimeoutingTask(ThreadLeakControl.java:817)
	at com.carrotsearch.randomizedtesting.ThreadLeakControl$3.evaluate(ThreadLeakControl.java:468)
	at com.carrotsearch.randomizedtesting.RandomizedRunner.runSingleTest(RandomizedRunner.java:947)
	at com.carrotsearch.randomizedtesting.RandomizedRunner$5.evaluate(RandomizedRunner.java:832)
	at com.carrotsearch.randomizedtesting.RandomizedRunner$6.evaluate(RandomizedRunner.java:883)
	at com.carrotsearch.randomizedtesting.RandomizedRunner$7.evaluate(RandomizedRunner.java:894)
	at com.carrotsearch.randomizedtesting.rules.StatementAdapter.evaluate(StatementAdapter.java:36)
	at com.carrotsearch.randomizedtesting.rules.SystemPropertiesRestoreRule$1.evaluate(SystemPropertiesRestoreRule.java:57)
	at org.apache.lucene.util.AbstractBeforeAfterRule$1.evaluate(AbstractBeforeAfterRule.java:45)
	at com.carrotsearch.randomizedtesting.rules.StatementAdapter.evaluate(StatementAdapter.java:36)
	at org.apache.lucene.util.TestRuleStoreClassName$1.evaluate(TestRuleStoreClassName.java:41)
	at com.carrotsearch.randomizedtesting.rules.NoShadowingOrOverridesOnMethodsRule$1.evaluate(NoShadowingOrOverridesOnMethodsRule.java:40)
	at com.carrotsearch.randomizedtesting.rules.NoShadowingOrOverridesOnMethodsRule$1.evaluate(NoShadowingOrOverridesOnMethodsRule.java:40)
	at com.carrotsearch.randomizedtesting.rules.StatementAdapter.evaluate(StatementAdapter.java:36)
	at com.carrotsearch.randomizedtesting.rules.StatementAdapter.evaluate(StatementAdapter.java:36)
	at org.apache.lucene.util.TestRuleAssertionsRequired$1.evaluate(TestRuleAssertionsRequired.java:53)
	at org.apache.lucene.util.TestRuleMarkFailure$1.evaluate(TestRuleMarkFailure.java:47)
	at org.apache.lucene.util.TestRuleIgnoreAfterMaxFailures$1.evaluate(TestRuleIgnoreAfterMaxFailures.java:64)
	at org.apache.lucene.util.TestRuleIgnoreTestSuites$1.evaluate(TestRuleIgnoreTestSuites.java:54)
	at com.carrotsearch.randomizedtesting.rules.StatementAdapter.evaluate(StatementAdapter.java:36)
	at com.carrotsearch.randomizedtesting.ThreadLeakControl$StatementRunner.run(ThreadLeakControl.java:368)
	at java.base/java.lang.Thread.run(Thread.java:834)




Build Log:
[...truncated 13966 lines...]
   [junit4] Suite: org.apache.solr.security.BasicAuthIntegrationTest
   [junit4]   2> Creating dataDir: C:\Users\jenkins\workspace\Lucene-Solr-master-Windows\solr\build\solr-core\test\J0\temp\solr.security.BasicAuthIntegrationTest_1E0750AD432CAC1A-001\init-core-data-001
   [junit4]   2> 1622643 INFO  (SUITE-BasicAuthIntegrationTest-seed#[1E0750AD432CAC1A]-worker) [    ] o.a.s.SolrTestCaseJ4 SecureRandom sanity checks: test.solr.allowed.securerandom=null & java.security.egd=file:/dev/./urandom
   [junit4]   2> 1622643 WARN  (SUITE-BasicAuthIntegrationTest-seed#[1E0750AD432CAC1A]-worker) [    ] o.a.s.SolrTestCaseJ4 startTrackingSearchers: numOpens=19 numCloses=19
   [junit4]   2> 1622643 INFO  (SUITE-BasicAuthIntegrationTest-seed#[1E0750AD432CAC1A]-worker) [    ] o.a.s.SolrTestCaseJ4 Using TrieFields (NUMERIC_POINTS_SYSPROP=false) w/NUMERIC_DOCVALUES_SYSPROP=true
   [junit4]   2> 1622643 INFO  (SUITE-BasicAuthIntegrationTest-seed#[1E0750AD432CAC1A]-worker) [    ] o.a.s.SolrTestCaseJ4 Randomized ssl (false) and clientAuth (false) via: @org.apache.solr.util.RandomizeSSL(reason="", value=0.0/0.0, ssl=0.0/0.0, clientAuth=0.0/0.0)
   [junit4]   2> 1622659 INFO  (TEST-BasicAuthIntegrationTest.testBasicAuth-seed#[1E0750AD432CAC1A]) [    ] o.a.s.SolrTestCaseJ4 ###Starting testBasicAuth
   [junit4]   2> 1622659 INFO  (TEST-BasicAuthIntegrationTest.testBasicAuth-seed#[1E0750AD432CAC1A]) [    ] o.a.s.c.MiniSolrCloudCluster Starting cluster of 3 servers in C:\Users\jenkins\workspace\Lucene-Solr-master-Windows\solr\build\solr-core\test\J0\temp\solr.security.BasicAuthIntegrationTest_1E0750AD432CAC1A-001\tempDir-001
   [junit4]   2> 1622659 INFO  (TEST-BasicAuthIntegrationTest.testBasicAuth-seed#[1E0750AD432CAC1A]) [    ] o.a.s.c.ZkTestServer STARTING ZK TEST SERVER
   [junit4]   2> 1622752 INFO  (ZkTestServer Run Thread) [    ] o.a.s.c.ZkTestServer client port:0.0.0.0/0.0.0.0:0
   [junit4]   2> 1622752 INFO  (ZkTestServer Run Thread) [    ] o.a.s.c.ZkTestServer Starting server
   [junit4]   2> 1622768 INFO  (TEST-BasicAuthIntegrationTest.testBasicAuth-seed#[1E0750AD432CAC1A]) [    ] o.a.s.c.ZkTestServer start zk server on port:57768
   [junit4]   2> 1622768 INFO  (TEST-BasicAuthIntegrationTest.testBasicAuth-seed#[1E0750AD432CAC1A]) [    ] o.a.s.c.ZkTestServer parse host and port list: 127.0.0.1:57768
   [junit4]   2> 1622768 INFO  (TEST-BasicAuthIntegrationTest.testBasicAuth-seed#[1E0750AD432CAC1A]) [    ] o.a.s.c.ZkTestServer connecting to 127.0.0.1 57768
   [junit4]   2> 1622783 INFO  (zkConnectionManagerCallback-10336-thread-1) [    ] o.a.s.c.c.ConnectionManager zkClient has connected
   [junit4]   2> 1622814 INFO  (zkConnectionManagerCallback-10338-thread-1) [    ] o.a.s.c.c.ConnectionManager zkClient has connected
   [junit4]   2> 1622830 INFO  (zkConnectionManagerCallback-10340-thread-1) [    ] o.a.s.c.c.ConnectionManager zkClient has connected
   [junit4]   2> 1622830 WARN  (NIOServerCxn.Factory:0.0.0.0/0.0.0.0:0) [    ] o.a.z.s.NIOServerCnxn Unable to read additional data from client sessionid 0x1001a3a0b770002, likely client has closed socket
   [junit4]   2> 1622830 WARN  (jetty-launcher-10341-thread-1) [    ] o.e.j.s.AbstractConnector Ignoring deprecated socket close linger time
   [junit4]   2> 1622830 INFO  (jetty-launcher-10341-thread-1) [    ] o.a.s.c.s.e.JettySolrRunner Start Jetty (original configured port=0)
   [junit4]   2> 1622830 INFO  (jetty-launcher-10341-thread-1) [    ] o.a.s.c.s.e.JettySolrRunner Trying to start Jetty on port 0 try number 1 ...
   [junit4]   2> 1622830 INFO  (jetty-launcher-10341-thread-1) [    ] o.e.j.s.Server jetty-9.4.14.v20181114; built: 2018-11-14T21:20:31.478Z; git: c4550056e785fb5665914545889f21dc136ad9e6; jvm 11.0.2+9
   [junit4]   2> 1622830 INFO  (jetty-launcher-10341-thread-1) [    ] o.e.j.s.session DefaultSessionIdManager workerName=node0
   [junit4]   2> 1622830 INFO  (jetty-launcher-10341-thread-1) [    ] o.e.j.s.session No SessionScavenger set, using defaults
   [junit4]   2> 1622830 INFO  (jetty-launcher-10341-thread-1) [    ] o.e.j.s.session node0 Scavenging every 600000ms
   [junit4]   2> 1622830 INFO  (jetty-launcher-10341-thread-1) [    ] o.e.j.s.h.ContextHandler Started o.e.j.s.ServletContextHandler@7ee46886{/solr,null,AVAILABLE}
   [junit4]   2> 1622846 WARN  (jetty-launcher-10341-thread-2) [    ] o.e.j.s.AbstractConnector Ignoring deprecated socket close linger time
   [junit4]   2> 1622846 INFO  (jetty-launcher-10341-thread-2) [    ] o.a.s.c.s.e.JettySolrRunner Start Jetty (original configured port=0)
   [junit4]   2> 1622846 INFO  (jetty-launcher-10341-thread-2) [    ] o.a.s.c.s.e.JettySolrRunner Trying to start Jetty on port 0 try number 1 ...
   [junit4]   2> 1622846 INFO  (jetty-launcher-10341-thread-2) [    ] o.e.j.s.Server jetty-9.4.14.v20181114; built: 2018-11-14T21:20:31.478Z; git: c4550056e785fb5665914545889f21dc136ad9e6; jvm 11.0.2+9
   [junit4]   2> 1622846 INFO  (jetty-launcher-10341-thread-2) [    ] o.e.j.s.session DefaultSessionIdManager workerName=node0
   [junit4]   2> 1622846 INFO  (jetty-launcher-10341-thread-2) [    ] o.e.j.s.session No SessionScavenger set, using defaults
   [junit4]   2> 1622846 INFO  (jetty-launcher-10341-thread-2) [    ] o.e.j.s.session node0 Scavenging every 600000ms
   [junit4]   2> 1622846 INFO  (jetty-launcher-10341-thread-2) [    ] o.e.j.s.h.ContextHandler Started o.e.j.s.ServletContextHandler@3e06fb66{/solr,null,AVAILABLE}
   [junit4]   2> 1622846 WARN  (jetty-launcher-10341-thread-3) [    ] o.e.j.s.AbstractConnector Ignoring deprecated socket close linger time
   [junit4]   2> 1622846 INFO  (jetty-launcher-10341-thread-3) [    ] o.a.s.c.s.e.JettySolrRunner Start Jetty (original configured port=0)
   [junit4]   2> 1622846 INFO  (jetty-launcher-10341-thread-3) [    ] o.a.s.c.s.e.JettySolrRunner Trying to start Jetty on port 0 try number 1 ...
   [junit4]   2> 1622846 INFO  (jetty-launcher-10341-thread-3) [    ] o.e.j.s.Server jetty-9.4.14.v20181114; built: 2018-11-14T21:20:31.478Z; git: c4550056e785fb5665914545889f21dc136ad9e6; jvm 11.0.2+9
   [junit4]   2> 1622846 INFO  (jetty-launcher-10341-thread-3) [    ] o.e.j.s.session DefaultSessionIdManager workerName=node0
   [junit4]   2> 1622846 INFO  (jetty-launcher-10341-thread-3) [    ] o.e.j.s.session No SessionScavenger set, using defaults
   [junit4]   2> 1622846 INFO  (jetty-launcher-10341-thread-3) [    ] o.e.j.s.session node0 Scavenging every 600000ms
   [junit4]   2> 1622846 INFO  (jetty-launcher-10341-thread-3) [    ] o.e.j.s.h.ContextHandler Started o.e.j.s.ServletContextHandler@779d936b{/solr,null,AVAILABLE}
   [junit4]   2> 1622846 INFO  (jetty-launcher-10341-thread-1) [    ] o.e.j.s.AbstractConnector Started ServerConnector@1b9cb6e{HTTP/1.1,[http/1.1, h2c]}{127.0.0.1:57793}
   [junit4]   2> 1622846 INFO  (jetty-launcher-10341-thread-1) [    ] o.e.j.s.Server Started @1622890ms
   [junit4]   2> 1622846 INFO  (jetty-launcher-10341-thread-1) [    ] o.a.s.c.s.e.JettySolrRunner Jetty properties: {hostContext=/solr, hostPort=57793}
   [junit4]   2> 1622846 ERROR (jetty-launcher-10341-thread-1) [    ] o.a.s.u.StartupLoggingUtils Missing Java Option solr.log.dir. Logging may be missing or incomplete.
   [junit4]   2> 1622846 INFO  (jetty-launcher-10341-thread-1) [    ] o.a.s.s.SolrDispatchFilter Using logger factory org.apache.logging.slf4j.Log4jLoggerFactory
   [junit4]   2> 1622846 INFO  (jetty-launcher-10341-thread-1) [    ] o.a.s.s.SolrDispatchFilter  ___      _       Welcome to Apache Solr? version 9.0.0
   [junit4]   2> 1622846 INFO  (jetty-launcher-10341-thread-1) [    ] o.a.s.s.SolrDispatchFilter / __| ___| |_ _   Starting in cloud mode on port null
   [junit4]   2> 1622846 INFO  (jetty-launcher-10341-thread-1) [    ] o.a.s.s.SolrDispatchFilter \__ \/ _ \ | '_|  Install dir: null
   [junit4]   2> 1622846 INFO  (jetty-launcher-10341-thread-1) [    ] o.a.s.s.SolrDispatchFilter |___/\___/_|_|    Start time: 2019-05-09T02:04:17.457118400Z
   [junit4]   2> 1622846 INFO  (jetty-launcher-10341-thread-2) [    ] o.e.j.s.AbstractConnector Started ServerConnector@7864dd1b{HTTP/1.1,[http/1.1, h2c]}{127.0.0.1:57796}
   [junit4]   2> 1622846 INFO  (jetty-launcher-10341-thread-2) [    ] o.e.j.s.Server Started @1622896ms
   [junit4]   2> 1622846 INFO  (jetty-launcher-10341-thread-2) [    ] o.a.s.c.s.e.JettySolrRunner Jetty properties: {hostContext=/solr, hostPort=57796}
   [junit4]   2> 1622846 ERROR (jetty-launcher-10341-thread-2) [    ] o.a.s.u.StartupLoggingUtils Missing Java Option solr.log.dir. Logging may be missing or incomplete.
   [junit4]   2> 1622846 INFO  (jetty-launcher-10341-thread-2) [    ] o.a.s.s.SolrDispatchFilter Using logger factory org.apache.logging.slf4j.Log4jLoggerFactory
   [junit4]   2> 1622846 INFO  (jetty-launcher-10341-thread-2) [    ] o.a.s.s.SolrDispatchFilter  ___      _       Welcome to Apache Solr? version 9.0.0
   [junit4]   2> 1622846 INFO  (jetty-launcher-10341-thread-2) [    ] o.a.s.s.SolrDispatchFilter / __| ___| |_ _   Starting in cloud mode on port null
   [junit4]   2> 1622846 INFO  (jetty-launcher-10341-thread-2) [    ] o.a.s.s.SolrDispatchFilter \__ \/ _ \ | '_|  Install dir: null
   [junit4]   2> 1622846 INFO  (jetty-launcher-10341-thread-2) [    ] o.a.s.s.SolrDispatchFilter |___/\___/_|_|    Start time: 2019-05-09T02:04:17.457118400Z
   [junit4]   2> 1622862 INFO  (jetty-launcher-10341-thread-3) [    ] o.e.j.s.AbstractConnector Started ServerConnector@e500dcb{HTTP/1.1,[http/1.1, h2c]}{127.0.0.1:57799}
   [junit4]   2> 1622862 INFO  (jetty-launcher-10341-thread-3) [    ] o.e.j.s.Server Started @1622900ms
   [junit4]   2> 1622862 INFO  (jetty-launcher-10341-thread-3) [    ] o.a.s.c.s.e.JettySolrRunner Jetty properties: {hostContext=/solr, hostPort=57799}
   [junit4]   2> 1622862 ERROR (jetty-launcher-10341-thread-3) [    ] o.a.s.u.StartupLoggingUtils Missing Java Option solr.log.dir. Logging may be missing or incomplete.
   [junit4]   2> 1622862 INFO  (jetty-launcher-10341-thread-3) [    ] o.a.s.s.SolrDispatchFilter Using logger factory org.apache.logging.slf4j.Log4jLoggerFactory
   [junit4]   2> 1622862 INFO  (jetty-launcher-10341-thread-3) [    ] o.a.s.s.SolrDispatchFilter  ___      _       Welcome to Apache Solr? version 9.0.0
   [junit4]   2> 1622862 INFO  (jetty-launcher-10341-thread-3) [    ] o.a.s.s.SolrDispatchFilter / __| ___| |_ _   Starting in cloud mode on port null
   [junit4]   2> 1622862 INFO  (jetty-launcher-10341-thread-3) [    ] o.a.s.s.SolrDispatchFilter \__ \/ _ \ | '_|  Install dir: null
   [junit4]   2> 1622862 INFO  (jetty-launcher-10341-thread-3) [    ] o.a.s.s.SolrDispatchFilter |___/\___/_|_|    Start time: 2019-05-09T02:04:17.473074800Z
   [junit4]   2> 1622877 INFO  (zkConnectionManagerCallback-10343-thread-1) [    ] o.a.s.c.c.ConnectionManager zkClient has connected
   [junit4]   2> 1622877 INFO  (zkConnectionManagerCallback-10345-thread-1) [    ] o.a.s.c.c.ConnectionManager zkClient has connected
   [junit4]   2> 1622877 INFO  (jetty-launcher-10341-thread-1) [    ] o.a.s.s.SolrDispatchFilter solr.xml found in ZooKeeper. Loading...
   [junit4]   2> 1622877 INFO  (jetty-launcher-10341-thread-2) [    ] o.a.s.s.SolrDispatchFilter solr.xml found in ZooKeeper. Loading...
   [junit4]   2> 1622940 INFO  (jetty-launcher-10341-thread-1) [    ] o.a.s.h.c.HttpShardHandlerFactory Host whitelist initialized: WhitelistHostChecker [whitelistHosts=null, whitelistHostCheckingEnabled=true]
   [junit4]   2> 1622986 WARN  (jetty-launcher-10341-thread-1) [    ] o.e.j.u.s.S.config No Client EndPointIdentificationAlgorithm configured for SslContextFactory@7f0246f[provider=null,keyStore=null,trustStore=null]
   [junit4]   2> 1622986 INFO  (zkConnectionManagerCallback-10347-thread-1) [    ] o.a.s.c.c.ConnectionManager zkClient has connected
   [junit4]   2> 1622986 INFO  (jetty-launcher-10341-thread-3) [    ] o.a.s.s.SolrDispatchFilter solr.xml found in ZooKeeper. Loading...
   [junit4]   2> 1623002 WARN  (jetty-launcher-10341-thread-1) [    ] o.e.j.u.s.S.config No Client EndPointIdentificationAlgorithm configured for SslContextFactory@46754bd3[provider=null,keyStore=null,trustStore=null]
   [junit4]   2> 1623002 INFO  (jetty-launcher-10341-thread-1) [    ] o.a.s.c.ZkContainer Zookeeper client=127.0.0.1:57768/solr
   [junit4]   2> 1623144 INFO  (jetty-launcher-10341-thread-2) [    ] o.a.s.h.c.HttpShardHandlerFactory Host whitelist initialized: WhitelistHostChecker [whitelistHosts=null, whitelistHostCheckingEnabled=true]
   [junit4]   2> 1623144 INFO  (zkConnectionManagerCallback-10356-thread-1) [    ] o.a.s.c.c.ConnectionManager zkClient has connected
   [junit4]   2> 1623144 WARN  (NIOServerCxn.Factory:0.0.0.0/0.0.0.0:0) [    ] o.a.z.s.NIOServerCnxn Unable to read additional data from client sessionid 0x1001a3a0b770006, likely client has closed socket
   [junit4]   2> 1623144 WARN  (jetty-launcher-10341-thread-2) [    ] o.e.j.u.s.S.config No Client EndPointIdentificationAlgorithm configured for SslContextFactory@4b44dc03[provider=null,keyStore=null,trustStore=null]
   [junit4]   2> 1623144 WARN  (jetty-launcher-10341-thread-2) [    ] o.e.j.u.s.S.config No Client EndPointIdentificationAlgorithm configured for SslContextFactory@be93b4d[provider=null,keyStore=null,trustStore=null]
   [junit4]   2> 1623158 INFO  (jetty-launcher-10341-thread-2) [    ] o.a.s.c.ZkContainer Zookeeper client=127.0.0.1:57768/solr
   [junit4]   2> 1623158 INFO  (zkConnectionManagerCallback-10359-thread-1) [    ] o.a.s.c.c.ConnectionManager zkClient has connected
   [junit4]   2> 1623158 INFO  (zkConnectionManagerCallback-10364-thread-1) [    ] o.a.s.c.c.ConnectionManager zkClient has connected
   [junit4]   2> 1623158 WARN  (NIOServerCxn.Factory:0.0.0.0/0.0.0.0:0) [    ] o.a.z.s.NIOServerCnxn Unable to read additional data from client sessionid 0x1001a3a0b770008, likely client has closed socket
   [junit4]   2> 1623158 INFO  (zkConnectionManagerCallback-10368-thread-1) [    ] o.a.s.c.c.ConnectionManager zkClient has connected
   [junit4]   2> 1623190 INFO  (jetty-launcher-10341-thread-2) [n:127.0.0.1:57796_solr    ] o.a.s.c.OverseerElectionContext I am going to be the leader 127.0.0.1:57796_solr
   [junit4]   2> 1623190 INFO  (jetty-launcher-10341-thread-2) [n:127.0.0.1:57796_solr    ] o.a.s.c.Overseer Overseer (id=72086430640701449-127.0.0.1:57796_solr-n_0000000000) starting
   [junit4]   2> 1623236 INFO  (jetty-launcher-10341-thread-1) [n:127.0.0.1:57793_solr    ] o.a.s.c.ZkController Register node as live in ZooKeeper:/live_nodes/127.0.0.1:57793_solr
   [junit4]   2> 1623252 INFO  (zkCallback-10367-thread-1) [    ] o.a.s.c.c.ZkStateReader Updated live nodes from ZooKeeper... (0) -> (1)
   [junit4]   2> 1623252 INFO  (zkCallback-10358-thread-1) [    ] o.a.s.c.c.ZkStateReader Updated live nodes from ZooKeeper... (0) -> (1)
   [junit4]   2> 1623252 INFO  (jetty-launcher-10341-thread-3) [    ] o.a.s.h.c.HttpShardHandlerFactory Host whitelist initialized: WhitelistHostChecker [whitelistHosts=null, whitelistHostCheckingEnabled=true]
   [junit4]   2> 1623252 WARN  (jetty-launcher-10341-thread-3) [    ] o.e.j.u.s.S.config No Client EndPointIdentificationAlgorithm configured for SslContextFactory@74890f6f[provider=null,keyStore=null,trustStore=null]
   [junit4]   2> 1623268 INFO  (zkConnectionManagerCallback-10380-thread-1) [    ] o.a.s.c.c.ConnectionManager zkClient has connected
   [junit4]   2> 1623268 INFO  (jetty-launcher-10341-thread-1) [n:127.0.0.1:57793_solr    ] o.a.s.c.c.ZkStateReader Updated live nodes from ZooKeeper... (0) -> (1)
   [junit4]   2> 1623268 INFO  (zkConnectionManagerCallback-10375-thread-1) [    ] o.a.s.c.c.ConnectionManager zkClient has connected
   [junit4]   2> 1623268 INFO  (jetty-launcher-10341-thread-1) [n:127.0.0.1:57793_solr    ] o.a.s.c.s.i.ZkClientClusterStateProvider Cluster at 127.0.0.1:57768/solr ready
   [junit4]   2> 1623268 INFO  (jetty-launcher-10341-thread-2) [n:127.0.0.1:57796_solr    ] o.a.s.c.c.ZkStateReader Updated live nodes from ZooKeeper... (0) -> (1)
   [junit4]   2> 1623268 INFO  (jetty-launcher-10341-thread-2) [n:127.0.0.1:57796_solr    ] o.a.s.c.s.i.ZkClientClusterStateProvider Cluster at 127.0.0.1:57768/solr ready
   [junit4]   2> 1623268 INFO  (jetty-launcher-10341-thread-2) [n:127.0.0.1:57796_solr    ] o.a.s.c.ZkController Publish node=127.0.0.1:57796_solr as DOWN
   [junit4]   2> 1623268 INFO  (jetty-launcher-10341-thread-2) [n:127.0.0.1:57796_solr    ] o.a.s.c.TransientSolrCoreCacheDefault Allocating transient cache for 2147483647 transient cores
   [junit4]   2> 1623268 INFO  (jetty-launcher-10341-thread-2) [n:127.0.0.1:57796_solr    ] o.a.s.c.ZkController Register node as live in ZooKeeper:/live_nodes/127.0.0.1:57796_solr
   [junit4]   2> 1623268 INFO  (zkCallback-10358-thread-1) [    ] o.a.s.c.c.ZkStateReader Updated live nodes from ZooKeeper... (1) -> (2)
   [junit4]   2> 1623268 INFO  (zkCallback-10367-thread-1) [    ] o.a.s.c.c.ZkStateReader Updated live nodes from ZooKeeper... (1) -> (2)
   [junit4]   2> 1623283 INFO  (jetty-launcher-10341-thread-1) [n:127.0.0.1:57793_solr    ] o.a.s.h.a.MetricsHistoryHandler No .system collection, keeping metrics history in memory.
   [junit4]   2> 1623283 INFO  (jetty-launcher-10341-thread-2) [n:127.0.0.1:57796_solr    ] o.a.s.h.a.MetricsHistoryHandler No .system collection, keeping metrics history in memory.
   [junit4]   2> 1623299 INFO  (zkCallback-10379-thread-1) [    ] o.a.s.c.c.ZkStateReader Updated live nodes from ZooKeeper... (1) -> (2)
   [junit4]   2> 1623299 WARN  (jetty-launcher-10341-thread-3) [    ] o.e.j.u.s.S.config No Client EndPointIdentificationAlgorithm configured for SslContextFactory@39fe611b[provider=null,keyStore=null,trustStore=null]
   [junit4]   2> 1623299 INFO  (zkCallback-10374-thread-1) [    ] o.a.s.c.c.ZkStateReader Updated live nodes from ZooKeeper... (1) -> (2)
   [junit4]   2> 1623299 INFO  (jetty-launcher-10341-thread-3) [    ] o.a.s.c.ZkContainer Zookeeper client=127.0.0.1:57768/solr
   [junit4]   2> 1623299 INFO  (OverseerStateUpdate-72086430640701449-127.0.0.1:57796_solr-n_0000000000) [n:127.0.0.1:57796_solr    ] o.a.s.c.Overseer Starting to work on the main queue : 127.0.0.1:57796_solr
   [junit4]   2> 1623315 INFO  (jetty-launcher-10341-thread-1) [n:127.0.0.1:57793_solr    ] o.a.s.m.r.SolrJmxReporter JMX monitoring for 'solr_57793.solr.node' (registry 'solr.node') enabled at server: com.sun.jmx.mbeanserver.JmxMBeanServer@3465033a
   [junit4]   2> 1623315 INFO  (jetty-launcher-10341-thread-2) [n:127.0.0.1:57796_solr    ] o.a.s.m.r.SolrJmxReporter JMX monitoring for 'solr_57796.solr.node' (registry 'solr.node') enabled at server: com.sun.jmx.mbeanserver.JmxMBeanServer@3465033a
   [junit4]   2> 1623330 INFO  (zkConnectionManagerCallback-10388-thread-1) [    ] o.a.s.c.c.ConnectionManager zkClient has connected
   [junit4]   2> 1623330 INFO  (jetty-launcher-10341-thread-2) [n:127.0.0.1:57796_solr    ] o.a.s.m.r.SolrJmxReporter JMX monitoring for 'solr_57796.solr.jvm' (registry 'solr.jvm') enabled at server: com.sun.jmx.mbeanserver.JmxMBeanServer@3465033a
   [junit4]   2> 1623330 INFO  (jetty-launcher-10341-thread-2) [n:127.0.0.1:57796_solr    ] o.a.s.m.r.SolrJmxReporter JMX monitoring for 'solr_57796.solr.jetty' (registry 'solr.jetty') enabled at server: com.sun.jmx.mbeanserver.JmxMBeanServer@3465033a
   [junit4]   2> 1623330 INFO  (jetty-launcher-10341-thread-2) [n:127.0.0.1:57796_solr    ] o.a.s.c.CorePropertiesLocator Found 0 core definitions underneath C:\Users\jenkins\workspace\Lucene-Solr-master-Windows\solr\build\solr-core\test\J0\temp\solr.security.BasicAuthIntegrationTest_1E0750AD432CAC1A-001\tempDir-001\node2\.
   [junit4]   2> 1623330 INFO  (jetty-launcher-10341-thread-1) [n:127.0.0.1:57793_solr    ] o.a.s.m.r.SolrJmxReporter JMX monitoring for 'solr_57793.solr.jvm' (registry 'solr.jvm') enabled at server: com.sun.jmx.mbeanserver.JmxMBeanServer@3465033a
   [junit4]   2> 1623330 INFO  (jetty-launcher-10341-thread-1) [n:127.0.0.1:57793_solr    ] o.a.s.m.r.SolrJmxReporter JMX monitoring for 'solr_57793.solr.jetty' (registry 'solr.jetty') enabled at server: com.sun.jmx.mbeanserver.JmxMBeanServer@3465033a
   [junit4]   2> 1623330 INFO  (jetty-launcher-10341-thread-1) [n:127.0.0.1:57793_solr    ] o.a.s.c.CorePropertiesLocator Found 0 core definitions underneath C:\Users\jenkins\workspace\Lucene-Solr-master-Windows\solr\build\solr-core\test\J0\temp\solr.security.BasicAuthIntegrationTest_1E0750AD432CAC1A-001\tempDir-001\node1\.
   [junit4]   2> 1623330 WARN  (NIOServerCxn.Factory:0.0.0.0/0.0.0.0:0) [    ] o.a.z.s.NIOServerCnxn Unable to read additional data from client sessionid 0x1001a3a0b77000c, likely client has closed socket
   [junit4]   2> 1623346 INFO  (zkConnectionManagerCallback-10390-thread-1) [    ] o.a.s.c.c.ConnectionManager zkClient has connected
   [junit4]   2> 1623346 INFO  (jetty-launcher-10341-thread-3) [n:127.0.0.1:57799_solr    ] o.a.s.c.c.ZkStateReader Updated live nodes from ZooKeeper... (0) -> (2)
   [junit4]   2> 1623346 INFO  (jetty-launcher-10341-thread-3) [n:127.0.0.1:57799_solr    ] o.a.s.c.ZkController Publish node=127.0.0.1:57799_solr as DOWN
   [junit4]   2> 1623346 INFO  (jetty-launcher-10341-thread-3) [n:127.0.0.1:57799_solr    ] o.a.s.c.TransientSolrCoreCacheDefault Allocating transient cache for 2147483647 transient cores
   [junit4]   2> 1623346 INFO  (jetty-launcher-10341-thread-3) [n:127.0.0.1:57799_solr    ] o.a.s.c.ZkController Register node as live in ZooKeeper:/live_nodes/127.0.0.1:57799_solr
   [junit4]   2> 1623346 INFO  (zkCallback-10374-thread-1) [    ] o.a.s.c.c.ZkStateReader Updated live nodes from ZooKeeper... (2) -> (3)
   [junit4]   2> 1623346 INFO  (zkCallback-10367-thread-1) [    ] o.a.s.c.c.ZkStateReader Updated live nodes from ZooKeeper... (2) -> (3)
   [junit4]   2> 1623346 INFO  (zkCallback-10358-thread-1) [    ] o.a.s.c.c.ZkStateReader Updated live nodes from ZooKeeper... (2) -> (3)
   [junit4]   2> 1623346 INFO  (zkCallback-10379-thread-1) [    ] o.a.s.c.c.ZkStateReader Updated live nodes from ZooKeeper... (2) -> (3)
   [junit4]   2> 1623346 INFO  (zkCallback-10389-thread-1) [    ] o.a.s.c.c.ZkStateReader Updated live nodes from ZooKeeper... (2) -> (3)
   [junit4]   2> 1623361 INFO  (zkConnectionManagerCallback-10397-thread-1) [    ] o.a.s.c.c.ConnectionManager zkClient has connected
   [junit4]   2> 1623361 INFO  (jetty-launcher-10341-thread-3) [n:127.0.0.1:57799_solr    ] o.a.s.c.c.ZkStateReader Updated live nodes from ZooKeeper... (0) -> (3)
   [junit4]   2> 1623361 INFO  (jetty-launcher-10341-thread-3) [n:127.0.0.1:57799_solr    ] o.a.s.c.s.i.ZkClientClusterStateProvider Cluster at 127.0.0.1:57768/solr ready
   [junit4]   2> 1623377 INFO  (jetty-launcher-10341-thread-3) [n:127.0.0.1:57799_solr    ] o.a.s.h.a.MetricsHistoryHandler No .system collection, keeping metrics history in memory.
   [junit4]   2> 1623393 INFO  (jetty-launcher-10341-thread-3) [n:127.0.0.1:57799_solr    ] o.a.s.m.r.SolrJmxReporter JMX monitoring for 'solr_57799.solr.node' (registry 'solr.node') enabled at server: com.sun.jmx.mbeanserver.JmxMBeanServer@3465033a
   [junit4]   2> 1623393 INFO  (jetty-launcher-10341-thread-3) [n:127.0.0.1:57799_solr    ] o.a.s.m.r.SolrJmxReporter JMX monitoring for 'solr_57799.solr.jvm' (registry 'solr.jvm') enabled at server: com.sun.jmx.mbeanserver.JmxMBeanServer@3465033a
   [junit4]   2> 1623393 INFO  (jetty-launcher-10341-thread-3) [n:127.0.0.1:57799_solr    ] o.a.s.m.r.SolrJmxReporter JMX monitoring for 'solr_57799.solr.jetty' (registry 'solr.jetty') enabled at server: com.sun.jmx.mbeanserver.JmxMBeanServer@3465033a
   [junit4]   2> 1623408 INFO  (jetty-launcher-10341-thread-3) [n:127.0.0.1:57799_solr    ] o.a.s.c.CorePropertiesLocator Found 0 core definitions underneath C:\Users\jenkins\workspace\Lucene-Solr-master-Windows\solr\build\solr-core\test\J0\temp\solr.security.BasicAuthIntegrationTest_1E0750AD432CAC1A-001\tempDir-001\node3\.
   [junit4]   2> 1623424 INFO  (zkConnectionManagerCallback-10403-thread-1) [    ] o.a.s.c.c.ConnectionManager zkClient has connected
   [junit4]   2> 1623424 INFO  (TEST-BasicAuthIntegrationTest.testBasicAuth-seed#[1E0750AD432CAC1A]) [    ] o.a.s.c.c.ZkStateReader Updated live nodes from ZooKeeper... (0) -> (3)
   [junit4]   2> 1623424 INFO  (TEST-BasicAuthIntegrationTest.testBasicAuth-seed#[1E0750AD432CAC1A]) [    ] o.a.s.c.s.i.ZkClientClusterStateProvider Cluster at 127.0.0.1:57768/solr ready
   [junit4]   2> 1623440 INFO  (qtp340882069-26896) [n:127.0.0.1:57793_solr    ] o.a.s.h.a.CollectionsHandler Invoked Collection Action :create with params collection.configName=conf&name=authCollection&nrtReplicas=1&action=CREATE&numShards=3&wt=javabin&version=2 and sendToOCPQueue=true
   [junit4]   2> 1623440 INFO  (OverseerThreadFactory-8424-thread-1-processing-n:127.0.0.1:57796_solr) [n:127.0.0.1:57796_solr    ] o.a.s.c.a.c.CreateCollectionCmd Create collection authCollection
   [junit4]   2> 1623549 INFO  (OverseerStateUpdate-72086430640701449-127.0.0.1:57796_solr-n_0000000000) [n:127.0.0.1:57796_solr    ] o.a.s.c.o.SliceMutator createReplica() {
   [junit4]   2>   "operation":"ADDREPLICA",
   [junit4]   2>   "collection":"authCollection",
   [junit4]   2>   "shard":"shard1",
   [junit4]   2>   "core":"authCollection_shard1_replica_n1",
   [junit4]   2>   "state":"down",
   [junit4]   2>   "base_url":"http://127.0.0.1:57793/solr",
   [junit4]   2>   "type":"NRT",
   [junit4]   2>   "waitForFinalState":"false"} 
   [junit4]   2> 1623549 INFO  (OverseerStateUpdate-72086430640701449-127.0.0.1:57796_solr-n_0000000000) [n:127.0.0.1:57796_solr    ] o.a.s.c.o.SliceMutator createReplica() {
   [junit4]   2>   "operation":"ADDREPLICA",
   [junit4]   2>   "collection":"authCollection",
   [junit4]   2>   "shard":"shard2",
   [junit4]   2>   "core":"authCollection_shard2_replica_n2",
   [junit4]   2>   "state":"down",
   [junit4]   2>   "base_url":"http://127.0.0.1:57796/solr",
   [junit4]   2>   "type":"NRT",
   [junit4]   2>   "waitForFinalState":"false"} 
   [junit4]   2> 1623549 INFO  (OverseerStateUpdate-72086430640701449-127.0.0.1:57796_solr-n_0000000000) [n:127.0.0.1:57796_solr    ] o.a.s.c.o.SliceMutator createReplica() {
   [junit4]   2>   "operation":"ADDREPLICA",
   [junit4]   2>   "collection":"authCollection",
   [junit4]   2>   "shard":"shard3",
   [junit4]   2>   "core":"authCollection_shard3_replica_n4",
   [junit4]   2>   "state":"down",
   [junit4]   2>   "base_url":"http://127.0.0.1:57799/solr",
   [junit4]   2>   "type":"NRT",
   [junit4]   2>   "waitForFinalState":"false"} 
   [junit4]   2> 1623768 INFO  (qtp340882069-26898) [n:127.0.0.1:57793_solr    x:authCollection_shard1_replica_n1] o.a.s.h.a.CoreAdminOperation core create command qt=/admin/cores&coreNodeName=core_node3&collection.configName=conf&newCollection=true&name=authCollection_shard1_replica_n1&action=CREATE&numShards=3&collection=authCollection&shard=shard1&wt=javabin&version=2&replicaType=NRT
   [junit4]   2> 1623768 INFO  (qtp455417666-26914) [n:127.0.0.1:57799_solr    x:authCollection_shard3_replica_n4] o.a.s.h.a.CoreAdminOperation core create command qt=/admin/cores&coreNodeName=core_node6&collection.configName=conf&newCollection=true&name=authCollection_shard3_replica_n4&action=CREATE&numShards=3&collection=authCollection&shard=shard3&wt=javabin&version=2&replicaType=NRT
   [junit4]   2> 1623768 INFO  (qtp542135020-26905) [n:127.0.0.1:57796_solr    x:authCollection_shard2_replica_n2] o.a.s.h.a.CoreAdminOperation core create command qt=/admin/cores&coreNodeName=core_node5&collection.configName=conf&newCollection=true&name=authCollection_shard2_replica_n2&action=CREATE&numShards=3&collection=authCollection&shard=shard2&wt=javabin&version=2&replicaType=NRT
   [junit4]   2> 1623768 INFO  (qtp340882069-26898) [n:127.0.0.1:57793_solr    x:authCollection_shard1_replica_n1] o.a.s.c.TransientSolrCoreCacheDefault Allocating transient cache for 2147483647 transient cores
   [junit4]   2> 1624799 INFO  (qtp455417666-26914) [n:127.0.0.1:57799_solr c:authCollection s:shard3 r:core_node6 x:authCollection_shard3_replica_n4] o.a.s.c.SolrConfig Using Lucene MatchVersion: 9.0.0
   [junit4]   2> 1624830 INFO  (qtp455417666-26914) [n:127.0.0.1:57799_solr c:authCollection s:shard3 r:core_node6 x:authCollection_shard3_replica_n4] o.a.s.s.IndexSchema [authCollection_shard3_replica_n4] Schema name=minimal
   [junit4]   2> 1624830 INFO  (qtp455417666-26914) [n:127.0.0.1:57799_solr c:authCollection s:shard3 r:core_node6 x:authCollection_shard3_replica_n4] o.a.s.s.IndexSchema Loaded schema minimal/1.1 with uniqueid field id
   [junit4]   2> 1624830 INFO  (qtp455417666-26914) [n:127.0.0.1:57799_solr c:authCollection s:shard3 r:core_node6 x:authCollection_shard3_replica_n4] o.a.s.c.CoreContainer Creating SolrCore 'authCollection_shard3_replica_n4' using configuration from collection authCollection, trusted=true
   [junit4]   2> 1624830 INFO  (qtp455417666-26914) [n:127.0.0.1:57799_solr c:authCollection s:shard3 r:core_node6 x:authCollection_shard3_replica_n4] o.a.s.m.r.SolrJmxReporter JMX monitoring for 'solr_57799.solr.core.authCollection.shard3.replica_n4' (registry 'solr.core.authCollection.shard3.replica_n4') enabled at server: com.sun.jmx.mbeanserver.JmxMBeanServer@3465033a
   [junit4]   2> 1624830 INFO  (qtp455417666-26914) [n:127.0.0.1:57799_solr c:authCollection s:shard3 r:core_node6 x:authCollection_shard3_replica_n4] o.a.s.c.SolrCore [[authCollection_shard3_replica_n4] ] Opening new SolrCore at [C:\Users\jenkins\workspace\Lucene-Solr-master-Windows\solr\build\solr-core\test\J0\temp\solr.security.BasicAuthIntegrationTest_1E0750AD432CAC1A-001\tempDir-001\node3\authCollection_shard3_replica_n4], dataDir=[C:\Users\jenkins\workspace\Lucene-Solr-master-Windows\solr\build\solr-core\test\J0\temp\solr.security.BasicAuthIntegrationTest_1E0750AD432CAC1A-001\tempDir-001\node3\.\authCollection_shard3_replica_n4\data\]
   [junit4]   2> 1624830 INFO  (qtp542135020-26905) [n:127.0.0.1:57796_solr c:authCollection s:shard2 r:core_node5 x:authCollection_shard2_replica_n2] o.a.s.c.SolrConfig Using Lucene MatchVersion: 9.0.0
   [junit4]   2> 1624830 INFO  (qtp340882069-26898) [n:127.0.0.1:57793_solr c:authCollection s:shard1 r:core_node3 x:authCollection_shard1_replica_n1] o.a.s.c.SolrConfig Using Lucene MatchVersion: 9.0.0
   [junit4]   2> 1624861 INFO  (qtp542135020-26905) [n:127.0.0.1:57796_solr c:authCollection s:shard2 r:core_node5 x:authCollection_shard2_replica_n2] o.a.s.s.IndexSchema [authCollection_shard2_replica_n2] Schema name=minimal
   [junit4]   2> 1624861 INFO  (qtp340882069-26898) [n:127.0.0.1:57793_solr c:authCollection s:shard1 r:core_node3 x:authCollection_shard1_replica_n1] o.a.s.s.IndexSchema [authCollection_shard1_replica_n1] Schema name=minimal
   [junit4]   2> 1624861 INFO  (qtp542135020-26905) [n:127.0.0.1:57796_solr c:authCollection s:shard2 r:core_node5 x:authCollection_shard2_replica_n2] o.a.s.s.IndexSchema Loaded schema minimal/1.1 with uniqueid field id
   [junit4]   2> 1624861 INFO  (qtp340882069-26898) [n:127.0.0.1:57793_solr c:authCollection s:shard1 r:core_node3 x:authCollection_shard1_replica_n1] o.a.s.s.IndexSchema Loaded schema minimal/1.1 with uniqueid field id
   [junit4]   2> 1624861 INFO  (qtp340882069-26898) [n:127.0.0.1:57793_solr c:authCollection s:shard1 r:core_node3 x:authCollection_shard1_replica_n1] o.a.s.c.CoreContainer Creating SolrCore 'authCollection_shard1_replica_n1' using configuration from collection authCollection, trusted=true
   [junit4]   2> 1624861 INFO  (qtp542135020-26905) [n:127.0.0.1:57796_solr c:authCollection s:shard2 r:core_node5 x:authCollection_shard2_replica_n2] o.a.s.c.CoreContainer Creating SolrCore 'authCollection_shard2_replica_n2' using configuration from collection authCollection, trusted=true
   [junit4]   2> 1624861 INFO  (qtp542135020-26905) [n:127.0.0.1:57796_solr c:authCollection s:shard2 r:core_node5 x:authCollection_shard2_replica_n2] o.a.s.m.r.SolrJmxReporter JMX monitoring for 'solr_57796.solr.core.authCollection.shard2.replica_n2' (registry 'solr.core.authCollection.shard2.replica_n2') enabled at server: com.sun.jmx.mbeanserver.JmxMBeanServer@3465033a
   [junit4]   2> 1624861 INFO  (qtp340882069-26898) [n:127.0.0.1:57793_solr c:authCollection s:shard1 r:core_node3 x:authCollection_shard1_replica_n1] o.a.s.m.r.SolrJmxReporter JMX monitoring for 'solr_57793.solr.core.authCollection.shard1.replica_n1' (registry 'solr.core.authCollection.shard1.replica_n1') enabled at server: com.sun.jmx.mbeanserver.JmxMBeanServer@3465033a
   [junit4]   2> 1624861 INFO  (qtp340882069-26898) [n:127.0.0.1:57793_solr c:authCollection s:shard1 r:core_node3 x:authCollection_shard1_replica_n1] o.a.s.c.SolrCore [[authCollection_shard1_replica_n1] ] Opening new SolrCore at [C:\Users\jenkins\workspace\Lucene-Solr-master-Windows\solr\build\solr-core\test\J0\temp\solr.security.BasicAuthIntegrationTest_1E0750AD432CAC1A-001\tempDir-001\node1\authCollection_shard1_replica_n1], dataDir=[C:\Users\jenkins\workspace\Lucene-Solr-master-Windows\solr\build\solr-core\test\J0\temp\solr.security.BasicAuthIntegrationTest_1E0750AD432CAC1A-001\tempDir-001\node1\.\authCollection_shard1_replica_n1\data\]
   [junit4]   2> 1624861 INFO  (qtp542135020-26905) [n:127.0.0.1:57796_solr c:authCollection s:shard2 r:core_node5 x:authCollection_shard2_replica_n2] o.a.s.c.SolrCore [[authCollection_shard2_replica_n2] ] Opening new SolrCore at [C:\Users\jenkins\workspace\Lucene-Solr-master-Windows\solr\build\solr-core\test\J0\temp\solr.security.BasicAuthIntegrationTest_1E0750AD432CAC1A-001\tempDir-001\node2\authCollection_shard2_replica_n2], dataDir=[C:\Users\jenkins\workspace\Lucene-Solr-master-Windows\solr\build\solr-core\test\J0\temp\solr.security.BasicAuthIntegrationTest_1E0750AD432CAC1A-001\tempDir-001\node2\.\authCollection_shard2_replica_n2\data\]
   [junit4]   2> 1624940 INFO  (qtp340882069-26898) [n:127.0.0.1:57793_solr c:authCollection s:shard1 r:core_node3 x:authCollection_shard1_replica_n1] o.a.s.u.UpdateHandler Using UpdateLog implementation: org.apache.solr.update.UpdateLog
   [junit4]   2> 1624940 INFO  (qtp340882069-26898) [n:127.0.0.1:57793_solr c:authCollection s:shard1 r:core_node3 x:authCollection_shard1_replica_n1] o.a.s.u.UpdateLog Initializing UpdateLog: dataDir=null defaultSyncLevel=FLUSH numRecordsToKeep=100 maxNumLogsToKeep=10 numVersionBuckets=65536
   [junit4]   2> 1624940 INFO  (qtp455417666-26914) [n:127.0.0.1:57799_solr c:authCollection s:shard3 r:core_node6 x:authCollection_shard3_replica_n4] o.a.s.u.UpdateHandler Using UpdateLog implementation: org.apache.solr.update.UpdateLog
   [junit4]   2> 1624940 INFO  (qtp455417666-26914) [n:127.0.0.1:57799_solr c:authCollection s:shard3 r:core_node6 x:authCollection_shard3_replica_n4] o.a.s.u.UpdateLog Initializing UpdateLog: dataDir=null defaultSyncLevel=FLUSH numRecordsToKeep=100 maxNumLogsToKeep=10 numVersionBuckets=65536
   [junit4]   2> 1624940 INFO  (qtp455417666-26914) [n:127.0.0.1:57799_solr c:authCollection s:shard3 r:core_node6 x:authCollection_shard3_replica_n4] o.a.s.u.CommitTracker Hard AutoCommit: disabled
   [junit4]   2> 1624940 INFO  (qtp340882069-26898) [n:127.0.0.1:57793_solr c:authCollection s:shard1 r:core_node3 x:authCollection_shard1_replica_n1] o.a.s.u.CommitTracker Hard AutoCommit: disabled
   [junit4]   2> 1624940 INFO  (qtp455417666-26914) [n:127.0.0.1:57799_solr c:authCollection s:shard3 r:core_node6 x:authCollection_shard3_replica_n4] o.a.s.u.CommitTracker Soft AutoCommit: disabled
   [junit4]   2> 1624940 INFO  (qtp340882069-26898) [n:127.0.0.1:57793_solr c:authCollection s:shard1 r:core_node3 x:authCollection_shard1_replica_n1] o.a.s.u.CommitTracker Soft AutoCommit: disabled
   [junit4]   2> 1624940 INFO  (qtp340882069-26898) [n:127.0.0.1:57793_solr c:authCollection s:shard1 r:core_node3 x:authCollection_shard1_replica_n1] o.a.s.s.SolrIndexSearcher Opening [Searcher@2c054709[authCollection_shard1_replica_n1] main]
   [junit4]   2> 1624940 INFO  (qtp340882069-26898) [n:127.0.0.1:57793_solr c:authCollection s:shard1 r:core_node3 x:authCollection_shard1_replica_n1] o.a.s.r.ManagedResourceStorage Configured ZooKeeperStorageIO with znodeBase: /configs/conf
   [junit4]   2> 1624940 INFO  (qtp340882069-26898) [n:127.0.0.1:57793_solr c:authCollection s:shard1 r:core_node3 x:authCollection_shard1_replica_n1] o.a.s.r.ManagedResourceStorage Loaded null at path _rest_managed.json using ZooKeeperStorageIO:path=/configs/conf
   [junit4]   2> 1624940 INFO  (qtp340882069-26898) [n:127.0.0.1:57793_solr c:authCollection s:shard1 r:core_node3 x:authCollection_shard1_replica_n1] o.a.s.h.ReplicationHandler Commits will be reserved for 10000ms.
   [junit4]   2> 1624940 INFO  (qtp340882069-26898) [n:127.0.0.1:57793_solr c:authCollection s:shard1 r:core_node3 x:authCollection_shard1_replica_n1] o.a.s.u.UpdateLog Could not find max version in index or recent updates, using new clock 1633018141266149376
   [junit4]   2> 1624940 INFO  (qtp455417666-26914) [n:127.0.0.1:57799_solr c:authCollection s:shard3 r:core_node6 x:authCollection_shard3_replica_n4] o.a.s.s.SolrIndexSearcher Opening [Searcher@2638f6b5[authCollection_shard3_replica_n4] main]
   [junit4]   2> 1624940 INFO  (searcherExecutor-8433-thread-1-processing-n:127.0.0.1:57793_solr x:authCollection_shard1_replica_n1 c:authCollection s:shard1 r:core_node3) [n:127.0.0.1:57793_solr c:authCollection s:shard1 r:core_node3 x:authCollection_shard1_replica_n1] o.a.s.c.SolrCore [authCollection_shard1_replica_n1] Registered new searcher Searcher@2c054709[authCollection_shard1_replica_n1] main{ExitableDirectoryReader(UninvertingDirectoryReader())}
   [junit4]   2> 1624940 INFO  (qtp455417666-26914) [n:127.0.0.1:57799_solr c:authCollection s:shard3 r:core_node6 x:authCollection_shard3_replica_n4] o.a.s.r.ManagedResourceStorage Configured ZooKeeperStorageIO with znodeBase: /configs/conf
   [junit4]   2> 1624940 INFO  (qtp455417666-26914) [n:127.0.0.1:57799_solr c:authCollection s:shard3 r:core_node6 x:authCollection_shard3_replica_n4] o.a.s.r.ManagedResourceStorage Loaded null at path _rest_managed.json using ZooKeeperStorageIO:path=/configs/conf
   [junit4]   2> 1624940 INFO  (qtp455417666-26914) [n:127.0.0.1:57799_solr c:authCollection s:shard3 r:core_node6 x:authCollection_shard3_replica_n4] o.a.s.h.ReplicationHandler Commits will be reserved for 10000ms.
   [junit4]   2> 1624940 INFO  (qtp455417666-26914) [n:127.0.0.1:57799_solr c:authCollection s:shard3 r:core_node6 x:authCollection_shard3_replica_n4] o.a.s.u.UpdateLog Could not find max version in index or recent updates, using new clock 1633018141266149376
   [junit4]   2> 1624940 INFO  (qtp340882069-26898) [n:127.0.0.1:57793_solr c:authCollection s:shard1 r:core_node3 x:authCollection_shard1_replica_n1] o.a.s.c.ZkShardTerms Successful update of terms at /collections/authCollection/terms/shard1 to Terms{values={core_node3=0}, version=0}
   [junit4]   2> 1624940 INFO  (qtp340882069-26898) [n:127.0.0.1:57793_solr c:authCollection s:shard1 r:core_node3 x:authCollection_shard1_replica_n1] o.a.s.c.ShardLeaderElectionContextBase make sure parent is created /collections/authCollection/leaders/shard1
   [junit4]   2> 1624955 INFO  (searcherExecutor-8431-thread-1-processing-n:127.0.0.1:57799_solr x:authCollection_shard3_replica_n4 c:authCollection s:shard3 r:core_node6) [n:127.0.0.1:57799_solr c:authCollection s:shard3 r:core_node6 x:authCollection_shard3_replica_n4] o.a.s.c.SolrCore [authCollection_shard3_replica_n4] Registered new searcher Searcher@2638f6b5[authCollection_shard3_replica_n4] main{ExitableDirectoryReader(UninvertingDirectoryReader())}
   [junit4]   2> 1624955 INFO  (qtp340882069-26898) [n:127.0.0.1:57793_solr c:authCollection s:shard1 r:core_node3 x:authCollection_shard1_replica_n1] o.a.s.c.ShardLeaderElectionContext Enough replicas found to continue.
   [junit4]   2> 1624955 INFO  (qtp340882069-26898) [n:127.0.0.1:57793_solr c:authCollection s:shard1 r:core_node3 x:authCollection_shard1_replica_n1] o.a.s.c.ShardLeaderElectionContext I may be the new leader - try and sync
   [junit4]   2> 1624955 INFO  (qtp340882069-26898) [n:127.0.0.1:57793_solr c:authCollection s:shard1 r:core_node3 x:authCollection_shard1_replica_n1] o.a.s.c.SyncStrategy Sync replicas to http://127.0.0.1:57793/solr/authCollection_shard1_replica_n1/
   [junit4]   2> 1624955 INFO  (qtp340882069-26898) [n:127.0.0.1:57793_solr c:authCollection s:shard1 r:core_node3 x:authCollection_shard1_replica_n1] o.a.s.c.SyncStrategy Sync Success - now sync replicas to me
   [junit4]   2> 1624955 INFO  (qtp340882069-26898) [n:127.0.0.1:57793_solr c:authCollection s:shard1 r:core_node3 x:authCollection_shard1_replica_n1] o.a.s.c.SyncStrategy http://127.0.0.1:57793/solr/authCollection_shard1_replica_n1/ has no replicas
   [junit4]   2> 1624955 INFO  (qtp340882069-26898) [n:127.0.0.1:57793_solr c:authCollection s:shard1 r:core_node3 x:authCollection_shard1_replica_n1] o.a.s.c.ShardLeaderElectionContextBase Creating leader registration node /collections/authCollection/leaders/shard1/leader after winning as /collections/authCollection/leader_elect/shard1/election/72086430640701447-core_node3-n_0000000000
   [junit4]   2> 1624955 INFO  (qtp455417666-26914) [n:127.0.0.1:57799_solr c:authCollection s:shard3 r:core_node6 x:authCollection_shard3_replica_n4] o.a.s.c.ZkShardTerms Successful update of terms at /collections/authCollection/terms/shard3 to Terms{values={core_node6=0}, version=0}
   [junit4]   2> 1624955 INFO  (qtp455417666-26914) [n:127.0.0.1:57799_solr c:authCollection s:shard3 r:core_node6 x:authCollection_shard3_replica_n4] o.a.s.c.ShardLeaderElectionContextBase make sure parent is created /collections/authCollection/leaders/shard3
   [junit4]   2> 1624955 INFO  (qtp340882069-26898) [n:127.0.0.1:57793_solr c:authCollection s:shard1 r:core_node3 x:authCollection_shard1_replica_n1] o.a.s.c.ShardLeaderElectionContext I am the new leader: http://127.0.0.1:57793/solr/authCollection_shard1_replica_n1/ shard1
   [junit4]   2> 1624955 INFO  (qtp455417666-26914) [n:127.0.0.1:57799_solr c:authCollection s:shard3 r:core_node6 x:authCollection_shard3_replica_n4] o.a.s.c.ShardLeaderElectionContext Enough replicas found to continue.
   [junit4]   2> 1624955 INFO  (qtp455417666-26914) [n:127.0.0.1:57799_solr c:authCollection s:shard3 r:core_node6 x:authCollection_shard3_replica_n4] o.a.s.c.ShardLeaderElectionContext I may be the new leader - try and sync
   [junit4]   2> 1624955 INFO  (qtp455417666-26914) [n:127.0.0.1:57799_solr c:authCollection s:shard3 r:core_node6 x:authCollection_shard3_replica_n4] o.a.s.c.SyncStrategy Sync replicas to http://127.0.0.1:57799/solr/authCollection_shard3_replica_n4/
   [junit4]   2> 1624955 INFO  (qtp455417666-26914) [n:127.0.0.1:57799_solr c:authCollection s:shard3 r:core_node6 x:authCollection_shard3_replica_n4] o.a.s.c.SyncStrategy Sync Success - now sync replicas to me
   [junit4]   2> 1624955 INFO  (qtp455417666-26914) [n:127.0.0.1:57799_solr c:authCollection s:shard3 r:core_node6 x:authCollection_shard3_replica_n4] o.a.s.c.SyncStrategy http://127.0.0.1:57799/solr/authCollection_shard3_replica_n4/ has no replicas
   [junit4]   2> 1624955 INFO  (qtp455417666-26914) [n:127.0.0.1:57799_solr c:authCollection s:shard3 r:core_node6 x:authCollection_shard3_replica_n4] o.a.s.c.ShardLeaderElectionContextBase Creating leader registration node /collections/authCollection/leaders/shard3/leader after winning as /collections/authCollection/leader_elect/shard3/election/72086430640701453-core_node6-n_0000000000
   [junit4]   2> 1624955 INFO  (qtp455417666-26914) [n:127.0.0.1:57799_solr c:authCollection s:shard3 r:core_node6 x:authCollection_shard3_replica_n4] o.a.s.c.ShardLeaderElectionContext I am the new leader: http://127.0.0.1:57799/solr/authCollection_shard3_replica_n4/ shard3
   [junit4]   2> 1624986 INFO  (qtp542135020-26905) [n:127.0.0.1:57796_solr c:authCollection s:shard2 r:core_node5 x:authCollection_shard2_replica_n2] o.a.s.u.UpdateHandler Using UpdateLog implementation: org.apache.solr.update.UpdateLog
   [junit4]   2> 1624986 INFO  (qtp542135020-26905) [n:127.0.0.1:57796_solr c:authCollection s:shard2 r:core_node5 x:authCollection_shard2_replica_n2] o.a.s.u.UpdateLog Initializing UpdateLog: dataDir=null defaultSyncLevel=FLUSH numRecordsToKeep=100 maxNumLogsToKeep=10 numVersionBuckets=65536
   [junit4]   2> 1624986 INFO  (qtp542135020-26905) [n:127.0.0.1:57796_solr c:authCollection s:shard2 r:core_node5 x:authCollection_shard2_replica_n2] o.a.s.u.CommitTracker Hard AutoCommit: disabled
   [junit4]   2> 1624986 INFO  (qtp542135020-26905) [n:127.0.0.1:57796_solr c:authCollection s:shard2 r:core_node5 x:authCollection_shard2_replica_n2] o.a.s.u.CommitTracker Soft AutoCommit: disabled
   [junit4]   2> 1624986 INFO  (qtp542135020-26905) [n:127.0.0.1:57796_solr c:authCollection s:shard2 r:core_node5 x:authCollection_shard2_replica_n2] o.a.s.s.SolrIndexSearcher Opening [Searcher@6b4c8e35[authCollection_shard2_replica_n2] main]
   [junit4]   2> 1624986 INFO  (qtp542135020-26905) [n:127.0.0.1:57796_solr c:authCollection s:shard2 r:core_node5 x:authCollection_shard2_replica_n2] o.a.s.r.ManagedResourceStorage Configured ZooKeeperStorageIO with znodeBase: /configs/conf
   [junit4]   2> 1624986 INFO  (qtp542135020-26905) [n:127.0.0.1:57796_solr c:authCollection s:shard2 r:core_node5 x:authCollection_shard2_replica_n2] o.a.s.r.ManagedResourceStorage Loaded null at path _rest_managed.json using ZooKeeperStorageIO:path=/configs/conf
   [junit4]   2> 1624986 INFO  (qtp542135020-26905) [n:127.0.0.1:57796_solr c:authCollection s:shard2 r:core_node5 x:authCollection_shard2_replica_n2] o.a.s.h.ReplicationHandler Commits will be reserved for 10000ms.
   [junit4]   2> 1624986 INFO  (qtp542135020-26905) [n:127.0.0.1:57796_solr c:authCollection s:shard2 r:core_node5 x:authCollection_shard2_replica_n2] o.a.s.u.UpdateLog Could not find max version in index or recent updates, using new clock 1633018141314383872
   [junit4]   2> 1624986 INFO  (searcherExecutor-8432-thread-1-processing-n:127.0.0.1:57796_solr x:authCollection_shard2_replica_n2 c:authCollection s:shard2 r:core_node5) [n:127.0.0.1:57796_solr c:authCollection s:shard2 r:core_node5 x:authCollection_shard2_replica_n2] o.a.s.c.SolrCore [authCollection_shard2_replica_n2] Registered new searcher Searcher@6b4c8e35[authCollection_shard2_replica_n2] main{ExitableDirectoryReader(UninvertingDirectoryReader())}
   [junit4]   2> 1625002 INFO  (qtp542135020-26905) [n:127.0.0.1:57796_solr c:authCollection s:shard2 r:core_node5 x:authCollection_shard2_replica_n2] o.a.s.c.ZkShardTerms Successful update of terms at /collections/authCollection/terms/shard2 to Terms{values={core_node5=0}, version=0}
   [junit4]   2> 1625002 INFO  (qtp542135020-26905) [n:127.0.0.1:57796_solr c:authCollection s:shard2 r:core_node5 x:authCollection_shard2_replica_n2] o.a.s.c.ShardLeaderElectionContextBase make sure parent is created /collections/authCollection/leaders/shard2
   [junit4]   2> 1625002 INFO  (qtp542135020-26905) [n:127.0.0.1:57796_solr c:authCollection s:shard2 r:core_node5 x:authCollection_shard2_replica_n2] o.a.s.c.ShardLeaderElectionContext Enough replicas found to continue.
   [junit4]   2> 1625002 INFO  (qtp542135020-26905) [n:127.0.0.1:57796_solr c:authCollection s:shard2 r:core_node5 x:authCollection_shard2_replica_n2] o.a.s.c.ShardLeaderElectionContext I may be the new leader - try and sync
   [junit4]   2> 1625002 INFO  (qtp542135020-26905) [n:127.0.0.1:57796_solr c:authCollection s:shard2 r:core_node5 x:authCollection_shard2_replica_n2] o.a.s.c.SyncStrategy Sync replicas to http://127.0.0.1:57796/solr/authCollection_shard2_replica_n2/
   [junit4]   2> 1625002 INFO  (qtp542135020-26905) [n:127.0.0.1:57796_solr c:authCollection s:shard2 r:core_node5 x:authCollection_shard2_replica_n2] o.a.s.c.SyncStrategy Sync Success - now sync replicas to me
   [junit4]   2> 1625002 INFO  (qtp542135020-26905) [n:127.0.0.1:57796_solr c:authCollection s:shard2 r:core_node5 x:authCollection_shard2_replica_n2] o.a.s.c.SyncStrategy http://127.0.0.1:57796/solr/authCollection_shard2_replica_n2/ has no replicas
   [junit4]   2> 1625002 INFO  (qtp542135020-26905) [n:127.0.0.1:57796_solr c:authCollection s:shard2 r:core_node5 x:authCollection_shard2_replica_n2] o.a.s.c.ShardLeaderElectionContextBase Creating leader registration node /collections/authCollection/leaders/shard2/leader after winning as /collections/authCollection/leader_elect/shard2/election/72086430640701449-core_node5-n_0000000000
   [junit4]   2> 1625002 INFO  (qtp542135020-26905) [n:127.0.0.1:57796_solr c:authCollection s:shard2 r:core_node5 x:authCollection_shard2_replica_n2] o.a.s.c.ShardLeaderElectionContext I am the new leader: http://127.0.0.1:57796/solr/authCollection_shard2_replica_n2/ shard2
   [junit4]   2> 1625111 INFO  (zkCallback-10358-thread-1) [    ] o.a.s.c.c.ZkStateReader A cluster state change: [WatchedEvent state:SyncConnected type:NodeDataChanged path:/collections/authCollection/state.json] for collection [authCollection] has occurred - updating... (live nodes size: [3])
   [junit4]   2> 1625111 INFO  (zkCallback-10389-thread-1) [    ] o.a.s.c.c.ZkStateReader A cluster state change: [WatchedEvent state:SyncConnected type:NodeDataChanged path:/collections/authCollection/state.json] for collection [authCollection] has occurred - updating... (live nodes size: [3])
   [junit4]   2> 1625111 INFO  (zkCallback-10367-thread-1) [    ] o.a.s.c.c.ZkStateReader A cluster state change: [WatchedEvent state:SyncConnected type:NodeDataChanged path:/collections/authCollection/state.json] for collection [authCollection] has occurred - updating... (live nodes size: [3])
   [junit4]   2> 1625111 INFO  (qtp455417666-26914) [n:127.0.0.1:57799_solr c:authCollection s:shard3 r:core_node6 x:authCollection_shard3_replica_n4] o.a.s.c.ZkController I am the leader, no recovery necessary
   [junit4]   2> 1625111 INFO  (qtp340882069-26898) [n:127.0.0.1:57793_solr c:authCollection s:shard1 r:core_node3 x:authCollection_shard1_replica_n1] o.a.s.c.ZkController I am the leader, no recovery necessary
   [junit4]   2> 1625111 INFO  (qtp542135020-26905) [n:127.0.0.1:57796_solr c:authCollection s:shard2 r:core_node5 x:authCollection_shard2_replica_n2] o.a.s.c.ZkController I am the leader, no recovery necessary
   [junit4]   2> 1625111 INFO  (qtp340882069-26898) [n:127.0.0.1:57793_solr c:authCollection s:shard1 r:core_node3 x:authCollection_shard1_replica_n1] o.a.s.s.HttpSolrCall [admin] webapp=null path=/admin/cores params={qt=/admin/cores&coreNodeName=core_node3&collection.configName=conf&newCollection=true&name=authCollection_shard1_replica_n1&action=CREATE&numShards=3&collection=authCollection&shard=shard1&wt=javabin&version=2&replicaType=NRT} status=0 QTime=1344
   [junit4]   2> 1625111 INFO  (qtp455417666-26914) [n:127.0.0.1:57799_solr c:authCollection s:shard3 r:core_node6 x:authCollection_shard3_replica_n4] o.a.s.s.HttpSolrCall [admin] webapp=null path=/admin/cores params={qt=/admin/cores&coreNodeName=core_node6&collection.configName=conf&newCollection=true&name=authCollection_shard3_replica_n4&action=CREATE&numShards=3&collection=authCollection&shard=shard3&wt=javabin&version=2&replicaType=NRT} status=0 QTime=1344
   [junit4]   2> 1625111 INFO  (zkCallback-10367-thread-2) [    ] o.a.s.c.c.ZkStateReader A cluster state change: [WatchedEvent state:SyncConnected type:NodeDataChanged path:/collections/authCollection/state.json] for collection [authCollection] has occurred - updating... (live nodes size: [3])
   [junit4]   2> 1625111 INFO  (zkCallback-10358-thread-2) [    ] o.a.s.c.c.ZkStateReader A cluster state change: [WatchedEvent state:SyncConnected type:NodeDataChanged path:/collections/authCollection/state.json] for collection [authCollection] has occurred - updating... (live nodes size: [3])
   [junit4]   2> 1625111 INFO  (zkCallback-10389-thread-2) [    ] o.a.s.c.c.ZkStateReader A cluster state change: [WatchedEvent state:SyncConnected type:NodeDataChanged path:/collections/authCollection/state.json] for collection [authCollection] has occurred - updating... (live nodes size: [3])
   [junit4]   2> 1625111 INFO  (qtp542135020-26905) [n:127.0.0.1:57796_solr c:authCollection s:shard2 r:core_node5 x:authCollection_shard2_replica_n2] o.a.s.s.HttpSolrCall [admin] webapp=null path=/admin/cores params={qt=/admin/cores&coreNodeName=core_node5&collection.configName=conf&newCollection=true&name=authCollection_shard2_replica_n2&action=CREATE&numShards=3&collection=authCollection&shard=shard2&wt=javabin&version=2&replicaType=NRT} status=0 QTime=1345
   [junit4]   2> 1625111 INFO  (qtp340882069-26896) [n:127.0.0.1:57793_solr    ] o.a.s.h.a.CollectionsHandler Wait for new collection to be active for at most 45 seconds. Check all shard replicas
   [junit4]   2> 1625221 INFO  (zkCallback-10358-thread-2) [    ] o.a.s.c.c.ZkStateReader A cluster state change: [WatchedEvent state:SyncConnected type:NodeDataChanged path:/collections/authCollection/state.json] for collection [authCollection] has occurred - updating... (live nodes size: [3])
   [junit4]   2> 1625221 INFO  (zkCallback-10358-thread-1) [    ] o.a.s.c.c.ZkStateReader A cluster state change: [WatchedEvent state:SyncConnected type:NodeDataChanged path:/collections/authCollection/state.json] for collection [authCollection] has occurred - updating... (live nodes size: [3])
   [junit4]   2> 1625221 INFO  (zkCallback-10367-thread-2) [    ] o.a.s.c.c.ZkStateReader A cluster state change: [WatchedEvent state:SyncConnected type:NodeDataChanged path:/collections/authCollection/state.json] for collection [authCollection] has occurred - updating... (live nodes size: [3])
   [junit4]   2> 1625221 INFO  (zkCallback-10367-thread-3) [    ] o.a.s.c.c.ZkStateReader A cluster state change: [WatchedEvent state:SyncConnected type:NodeDataChanged path:/collections/authCollection/state.json] for collection [authCollection] has occurred - updating... (live nodes size: [3])
   [junit4]   2> 1625221 INFO  (zkCallback-10367-thread-1) [    ] o.a.s.c.c.ZkStateReader A cluster state change: [WatchedEvent state:SyncConnected type:NodeDataChanged path:/collections/authCollection/state.json] for collection [authCollection] has occurred - updating... (live nodes size: [3])
   [junit4]   2> 1625221 INFO  (zkCallback-10389-thread-2) [    ] o.a.s.c.c.ZkStateReader A cluster state change: [WatchedEvent state:SyncConnected type:NodeDataChanged path:/collections/authCollection/state.json] for collection [authCollection] has occurred - updating... (live nodes size: [3])
   [junit4]   2> 1625221 INFO  (zkCallback-10389-thread-1) [    ] o.a.s.c.c.ZkStateReader A cluster state change: [WatchedEvent state:SyncConnected type:NodeDataChanged path:/collections/authCollection/state.json] for collection [authCollection] has occurred - updating... (live nodes size: [3])
   [junit4]   2> 1625221 INFO  (qtp340882069-26896) [n:127.0.0.1:57793_solr    ] o.a.s.s.HttpSolrCall [admin] webapp=null path=/admin/collections params={collection.configName=conf&name=authCollection&nrtReplicas=1&action=CREATE&numShards=3&wt=javabin&version=2} status=0 QTime=1777
   [junit4]   2> 1625221 INFO  (zkCallback-10389-thread-3) [    ] o.a.s.c.c.ZkStateReader A cluster state change: [WatchedEvent state:SyncConnected type:NodeDataChanged path:/collections/authCollection/state.json] for collection [authCollection] has occurred - updating... (live nodes size: [3])
   [junit4]   2> 1625221 INFO  (zkCallback-10358-thread-3) [    ] o.a.s.c.c.ZkStateReader A cluster state change: [WatchedEvent state:SyncConnected type:NodeDataChanged path:/collections/authCollection/state.json] for collection [authCollection] has occurred - updating... (live nodes size: [3])
   [junit4]   2> 1625221 INFO  (qtp340882069-26900) [n:127.0.0.1:57793_solr    ] o.a.s.s.HttpSolrCall [admin] webapp=null path=/admin/authentication params={} status=0 QTime=0
   [junit4]   2> 1625221 INFO  (qtp340882069-26920) [n:127.0.0.1:57793_solr    ] o.a.s.s.HttpSolrCall [admin] webapp=null path=/admin/authentication params={} status=0 QTime=0
   [junit4]   2> 1625221 INFO  (zkCallback-10367-thread-4) [    ] o.a.s.c.CoreContainer Security node changed, reloading security.json
   [junit4]   2> 1625221 INFO  (zkCallback-10367-thread-4) [    ] o.a.s.c.CoreContainer Initializing authorization plugin: solr.RuleBasedAuthorizationPlugin
   [junit4]   2> 1625221 INFO  (zkCallback-10367-thread-4) [    ] o.a.s.c.CoreContainer Initializing authentication plugin: solr.BasicAuthPlugin
   [junit4]   2> 1625221 INFO  (zkCallback-10358-thread-3) [    ] o.a.s.c.CoreContainer Security node changed, reloading security.json
   [junit4]   2> 1625221 INFO  (zkCallback-10358-thread-3) [    ] o.a.s.c.CoreContainer Initializing authorization plugin: solr.RuleBasedAuthorizationPlugin
   [junit4]   2> 1625221 INFO  (zkCallback-10389-thread-3) [    ] o.a.s.c.CoreContainer Security node changed, reloading security.json
   [junit4]   2> 1625221 INFO  (zkCallback-10389-thread-3) [    ] o.a.s.c.CoreContainer Initializing authorization plugin: solr.RuleBasedAuthorizationPlugin
   [junit4]   2> 1625221 INFO  (zkCallback-10358-thread-3) [    ] o.a.s.c.CoreContainer Initializing authentication plugin: solr.BasicAuthPlugin
   [junit4]   2> 1625221 INFO  (zkCallback-10389-thread-3) [    ] o.a.s.c.CoreContainer Initializing authentication plugin: solr.BasicAuthPlugin
   [junit4]   2> 1625283 INFO  (qtp340882069-26923) [n:127.0.0.1:57793_solr    ] o.a.s.s.HttpSolrCall [admin] webapp=null path=/admin/authentication params={} status=0 QTime=0
   [junit4]   2> 1625283 INFO  (TEST-BasicAuthIntegrationTest.testBasicAuth-seed#[1E0750AD432CAC1A]) [    ] o.a.s.c.CoreContainer Shutting down CoreContainer instance=287780287
   [junit4]   2> 1625283 INFO  (TEST-BasicAuthIntegrationTest.testBasicAuth-seed#[1E0750AD432CAC1A]) [    ] o.a.s.c.ZkController Remove node as live in ZooKeeper:/live_nodes/127.0.0.1:57793_solr
   [junit4]   2> 1625283 INFO  (TEST-BasicAuthIntegrationTest.testBasicAuth-seed#[1E0750AD432CAC1A]) [    ] o.a.s.c.ZkController Publish this node as DOWN...
   [junit4]   2> 1625283 INFO  (TEST-BasicAuthIntegrationTest.testBasicAuth-seed#[1E0750AD432CAC1A]) [    ] o.a.s.c.ZkController Publish node=127.0.0.1:57793_solr as DOWN
   [junit4]   2> 1625283 INFO  (coreCloseExecutor-8446-thread-1) [n:127.0.0.1:57793_solr c:authCollection s:shard1 r:core_node3 x:authCollection_shard1_replica_n1] o.a.s.c.SolrCore [authCollection_shard1_replica_n1]  CLOSING SolrCore org.apache.solr.core.SolrCore@f6ac3e
   [junit4]   2> 1625283 INFO  (coreCloseExecutor-8446-thread-1) [n:127.0.0.1:57793_solr c:authCollection s:shard1 r:core_node3 x:authCollection_shard1_replica_n1] o.a.s.m.SolrMetricManager Closing metric reporters for registry=solr.core.authCollection.shard1.replica_n1, tag=f6ac3e
   [junit4]   2> 1625283 INFO  (coreCloseExecutor-8446-thread-1) [n:127.0.0.1:57793_solr c:authCollection s:shard1 r:core_node3 x:authCollection_shard1_replica_n1] o.a.s.m.r.SolrJmxReporter Closing reporter [org.apache.solr.metrics.reporters.SolrJmxReporter@7cecf36e: rootName = solr_57793, domain = solr.core.authCollection.shard1.replica_n1, service url = null, agent id = null] for registry solr.core.authCollection.shard1.replica_n1 / com.codahale.metrics.MetricRegistry@495096b2
   [junit4]   2> 1625283 INFO  (coreCloseExecutor-8446-thread-1) [n:127.0.0.1:57793_solr c:authCollection s:shard1 r:core_node3 x:authCollection_shard1_replica_n1] o.a.s.m.SolrMetricManager Closing metric reporters for registry=solr.collection.authCollection.shard1.leader, tag=f6ac3e
   [junit4]   2> 1625283 INFO  (TEST-BasicAuthIntegrationTest.testBasicAuth-seed#[1E0750AD432CAC1A]) [    ] o.a.s.m.SolrMetricManager Closing metric reporters for registry=solr.node, tag=null
   [junit4]   2> 1625283 INFO  (TEST-BasicAuthIntegrationTest.testBasicAuth-seed#[1E0750AD432CAC1A]) [    ] o.a.s.m.r.SolrJmxReporter Closing reporter [org.apache.solr.metrics.reporters.SolrJmxReporter@7a45f21e: rootName = solr_57793, domain = solr.node, service url = null, agent id = null] for registry solr.node / com.codahale.metrics.MetricRegistry@74d20a2
   [junit4]   2> 1625299 INFO  (TEST-BasicAuthIntegrationTest.testBasicAuth-seed#[1E0750AD432CAC1A]) [    ] o.a.s.m.SolrMetricManager Closing metric reporters for registry=solr.jvm, tag=null
   [junit4]   2> 1625299 INFO  (TEST-BasicAuthIntegrationTest.testBasicAuth-seed#[1E0750AD432CAC1A]) [    ] o.a.s.m.r.SolrJmxReporter Closing reporter [org.apache.solr.metrics.reporters.SolrJmxReporter@220bc285: rootName = solr_57793, domain = solr.jvm, service url = null, agent id = null] for registry solr.jvm / com.codahale.metrics.MetricRegistry@3b3855e5
   [junit4]   2> 1625299 INFO  (TEST-BasicAuthIntegrationTest.testBasicAuth-seed#[1E0750AD432CAC1A]) [    ] o.a.s.m.SolrMetricManager Closing metric reporters for registry=solr.jetty, tag=null
   [junit4]   2> 1625299 INFO  (TEST-BasicAuthIntegrationTest.testBasicAuth-seed#[1E0750AD432CAC1A]) [    ] o.a.s.m.r.SolrJmxReporter Closing reporter [org.apache.solr.metrics.reporters.SolrJmxReporter@2c72458d: rootName = solr_57793, domain = solr.jetty, service url = null, agent id = null] for registry solr.jetty / com.codahale.metrics.MetricRegistry@60535b2c
   [junit4]   2> 1625299 INFO  (TEST-BasicAuthIntegrationTest.testBasicAuth-seed#[1E0750AD432CAC1A]) [    ] o.a.s.m.SolrMetricManager Closing metric reporters for registry=solr.cluster, tag=null
   [junit4]   2> 1625299 WARN  (NIOServerCxn.Factory:0.0.0.0/0.0.0.0:0) [    ] o.a.z.s.NIOServerCnxn Unable to read additional data from client sessionid 0x1001a3a0b770007, likely client has closed socket
   [junit4]   2> 1625299 INFO  (zkCallback-10374-thread-1) [    ] o.a.s.c.c.ZkStateReader Updated live nodes from ZooKeeper... (3) -> (2)
   [junit4]   2> 1625299 INFO  (zkCallback-10389-thread-3) [    ] o.a.s.c.c.ZkStateReader Updated live nodes from ZooKeeper... (3) -> (2)
   [junit4]   2> 1625299 INFO  (zkCallback-10379-thread-1) [    ] o.a.s.c.c.ZkStateReader Updated live nodes from ZooKeeper... (3) -> (2)
   [junit4]   2> 1625299 INFO  (zkCallback-10367-thread-4) [    ] o.a.s.c.c.ZkStateReader Updated live nodes from ZooKeeper... (3) -> (2)
   [junit4]   2> 1625299 INFO  (zkCallback-10396-thread-1) [    ] o.a.s.c.c.ZkStateReader Updated live nodes from ZooKeeper... (3) -> (2)
   [junit4]   2> 1625299 INFO  (zkCallback-10402-thread-1) [    ] o.a.s.c.c.ZkStateReader Updated live nodes from ZooKeeper... (3) -> (2)
   [junit4]   2> 1625299 INFO  (TEST-BasicAuthIntegrationTest.testBasicAuth-seed#[1E0750AD432CAC1A]) [    ] o.e.j.s.AbstractConnector Stopped ServerConnector@1b9cb6e{HTTP/1.1,[http/1.1, h2c]}{127.0.0.1:0}
   [junit4]   2> 1625299 INFO  (TEST-BasicAuthIntegrationTest.testBasicAuth-seed#[1E0750AD432CAC1A]) [    ] o.e.j.s.h.ContextHandler Stopped o.e.j.s.ServletContextHandler@7ee46886{/solr,null,UNAVAILABLE}
   [junit4]   2> 1625299 INFO  (TEST-BasicAuthIntegrationTest.testBasicAuth-seed#[1E0750AD432CAC1A]) [    ] o.e.j.s.session node0 Stopped scavenging
   [junit4]   2> 1625299 INFO  (TEST-BasicAuthIntegrationTest.testBasicAuth-seed#[1E0750AD432CAC1A]) [    ] o.a.s.c.s.e.JettySolrRunner Start Jetty (original configured port=0)
   [junit4]   2> 1625299 WARN  (TEST-BasicAuthIntegrationTest.testBasicAuth-seed#[1E0750AD432CAC1A]) [    ] o.e.j.s.AbstractConnector Ignoring deprecated socket close linger time
   [junit4]   2> 1625299 INFO  (TEST-BasicAuthIntegrationTest.testBasicAuth-seed#[1E0750AD432CAC1A]) [    ] o.a.s.c.s.e.JettySolrRunner Trying to start Jetty on port 57793 try number 1 ...
   [junit4]   2> 1625299 INFO  (TEST-BasicAuthIntegrationTest.testBasicAuth-seed#[1E0750AD432CAC1A]) [    ] o.e.j.s.Server jetty-9.4.14.v20181114; built: 2018-11-14T21:20:31.478Z; git: c4550056e785fb5665914545889f21dc136ad9e6; jvm 11.0.2+9
   [junit4]   2> 1625299 INFO  (TEST-BasicAuthIntegrationTest.testBasicAuth-seed#[1E0750AD432CAC1A]) [    ] o.e.j.s.session DefaultSessionIdManager workerName=node0
   [junit4]   2> 1625299 INFO  (TEST-BasicAuthIntegrationTest.testBasicAuth-seed#[1E0750AD432CAC1A]) [    ] o.e.j.s.session No SessionScavenger set, using defaults
   [junit4]   2> 1625299 INFO  (TEST-BasicAuthIntegrationTest.testBasicAuth-seed#[1E0750AD432CAC1A]) [    ] o.e.j.s.session node0 Scavenging every 660000ms
   [junit4]   2> 1625299 INFO  (TEST-BasicAuthIntegrationTest.testBasicAuth-seed#[1E0750AD432CAC1A]) [    ] o.e.j.s.h.ContextHandler Started o.e.j.s.ServletContextHandler@56f860e4{/solr,null,AVAILABLE}
   [junit4]   2> 1625299 INFO  (TEST-BasicAuthIntegrationTest.testBasicAuth-seed#[1E0750AD432CAC1A]) [    ] o.e.j.s.AbstractConnector Started ServerConnector@65704836{HTTP/1.1,[http/1.1, h2c]}{127.0.0.1:57793}
   [junit4]   2> 1625299 INFO  (TEST-BasicAuthIntegrationTest.testBasicAuth-seed#[1E0750AD432CAC1A]) [    ] o.e.j.s.Server Started @1625349ms
   [junit4]   2> 1625299 INFO  (TEST-BasicAuthIntegrationTest.testBasicAuth-seed#[1E0750AD432CAC1A]) [    ] o.a.s.c.s.e.JettySolrRunner Jetty properties: {hostContext=/solr, hostPort=57793}
   [junit4]   2> 1625299 ERROR (TEST-BasicAuthIntegrationTest.testBasicAuth-seed#[1E0750AD432CAC1A]) [    ] o.a.s.u.StartupLoggingUtils Missing Java Option solr.log.dir. Logging may be missing or incomplete.
   [junit4]   2> 1625299 INFO  (TEST-BasicAuthIntegrationTest.testBasicAuth-seed#[1E0750AD432CAC1A]) [    ] o.a.s.s.SolrDispatchFilter Using logger factory org.apache.logging.slf4j.Log4jLoggerFactory
   [junit4]   2> 1625314 INFO  (TEST-BasicAuthIntegrationTest.testBasicAuth-seed#[1E0750AD432CAC1A]) [    ] o.a.s.s.SolrDispatchFilter  ___      _       Welcome to Apache Solr? version 9.0.0
   [junit4]   2> 1625314 INFO  (TEST-BasicAuthIntegrationTest.testBasicAuth-seed#[1E0750AD432CAC1A]) [    ] o.a.s.s.SolrDispatchFilter / __| ___| |_ _   Starting in cloud mode on port null
   [junit4]   2> 1625314 INFO  (TEST-BasicAuthIntegrationTest.testBasicAuth-seed#[1E0750AD432CAC1A]) [    ] o.a.s.s.SolrDispatchFilter \__ \/ _ \ | '_|  Install dir: null
   [junit4]   2> 1625314 INFO  (TEST-BasicAuthIntegrationTest.testBasicAuth-seed#[1E0750AD432CAC1A]) [    ] o.a.s.s.SolrDispatchFilter |___/\___/_|_|    Start time: 2019-05-09T02:04:19.925783Z
   [junit4]   2> 1625314 INFO  (zkConnectionManagerCallback-10412-thread-1) [    ] o.a.s.c.c.ConnectionManager zkClient has connected
   [junit4]   2> 1625314 INFO  (TEST-BasicAuthIntegrationTest.testBasicAuth-seed#[1E0750AD432CAC1A]) [    ] o.a.s.s.SolrDispatchFilter solr.xml found in ZooKeeper. Loading...
   [junit4]   2> 1625392 INFO  (zkCallback-10367-thread-3) [    ] o.a.s.c.c.ZkStateReader A cluster state change: [WatchedEvent state:SyncConnected type:NodeDataChanged path:/collections/authCollection/state.json] for collection [authCollection] has occurred - updating... (live nodes size: [2])
   [junit4]   2> 1625392 INFO  (zkCallback-10367-thread-4) [    ] o.a.s.c.c.ZkStateReader A cluster state change: [WatchedEvent state:SyncConnected type:NodeDataChanged path:/collections/authCollection/state.json] for collection [authCollection] has occurred - updating... (live nodes size: [2])
   [junit4]   2> 1625392 INFO  (zkCallback-10367-thread-1) [    ] o.a.s.c.c.ZkStateReader A cluster state change: [WatchedEvent state:SyncConnected type:NodeDataChanged path:/collections/authCollection/state.json] for collection [authCollection] has occurred - updating... (live nodes size: [2])
   [junit4]   2> 1625392 INFO  (zkCallback-10389-thread-3) [    ] o.a.s.c.c.ZkStateReader A cluster state change: [WatchedEvent state:SyncConnected type:NodeDataChanged path:/collections/authCollection/state.json] for collection [authCollection] has occurred - updating... (live nodes size: [2])
   [junit4]   2> 1625392 INFO  (zkCallback-10389-thread-1) [    ] o.a.s.c.c.ZkStateReader A cluster state change: [WatchedEvent state:SyncConnected type:NodeDataChanged path:/collections/authCollection/state.json] for collection [authCollection] has occurred - updating... (live nodes size: [2])
   [junit4]   2> 1625392 INFO  (zkCallback-10389-thread-2) [    ] o.a.s.c.c.ZkStateReader A cluster state change: [WatchedEvent state:SyncConnected type:NodeDataChanged path:/collections/authCollection/state.json] for collection [authCollection] has occurred - updating... (live nodes size: [2])
   [junit4]   2> 1625455 INFO  (OverseerCollectionConfigSetProcessor-72086430640701449-127.0.0.1:57796_solr-n_0000000000) [n:127.0.0.1:57796_solr    ] o.a.s.c.OverseerTaskQueue Response ZK path: /overseer/collection-queue-work/qnr-0000000000 doesn't exist.  Requestor may have disconnected from ZooKeeper
   [junit4]   2> 1625564 INFO  (TEST-BasicAuthIntegrationTest.testBasicAuth-seed#[1E0750AD432CAC1A]) [    ] o.a.s.h.c.HttpShardHandlerFactory Host whitelist initialized: WhitelistHostChecker [whitelistHosts=null, whitelistHostCheckingEnabled=true]
   [junit4]   2> 1625564 WARN  (TEST-BasicAuthIntegrationTest.testBasicAuth-seed#[1E0750AD432CAC1A]) [    ] o.e.j.u.s.S.config No Client EndPointIdentificationAlgorithm configured for SslContextFactory@2941676e[provider=null,keyStore=null,trustStore=null]
   [junit4]   2> 1625564 WARN  (TEST-BasicAuthIntegrationTest.testBasicAuth-seed#[1E0750AD432CAC1A]) [    ] o.e.j.u.s.S.config No Client EndPointIdentificationAlgorithm configured for SslContextFactory@160cfdf7[provider=null,keyStore=null,trustStore=null]
   [junit4]   2> 1625564 INFO  (TEST-BasicAuthIntegrationTest.testBasicAuth-seed#[1E0750AD432CAC1A]) [    ] o.a.s.c.ZkContainer Zookeeper client=127.0.0.1:57768/solr
   [junit4]   2> 1625564 INFO  (zkConnectionManagerCallback-10419-thread-1) [    ] o.a.s.c.c.ConnectionManager zkClient has connected
   [junit4]   2> 1625564 INFO  (zkConnectionManagerCallback-10421-thread-1) [    ] o.a.s.c.c.ConnectionManager zkClient has connected
   [junit4]   2> 1625580 INFO  (TEST-BasicAuthIntegrationTest.testBasicAuth-seed#[1E0750AD432CAC1A]) [n:127.0.0.1:57793_solr    ] o.a.s.c.c.ZkStateReader Updated live nodes from ZooKeeper... (0) -> (2)
   [junit4]   2> 1625580 INFO  (TEST-BasicAuthIntegrationTest.testBasicAuth-seed#[1E0750AD432CAC1A]) [n:127.0.0.1:57793_solr    ] o.a.s.c.ZkController Publish node=127.0.0.1:57793_solr as DOWN
   [junit4]   2> 1625580 INFO  (TEST-BasicAuthIntegrationTest.testBasicAuth-seed#[1E0750AD432CAC1A]) [n:127.0.0.1:57793_solr    ] o.a.s.c.TransientSolrCoreCacheDefault Allocating transient cache for 2147483647 transient cores
   [junit4]   2> 1625580 INFO  (TEST-BasicAuthIntegrationTest.testBasicAuth-seed#[1E0750AD432CAC1A]) [n:127.0.0.1:57793_solr    ] o.a.s.c.ZkController Register node as live in ZooKeeper:/live_nodes/127.0.0.1:57793_solr
   [junit4]   2> 1625580 INFO  (zkCallback-10374-thread-1) [    ] o.a.s.c.c.ZkStateReader Updated live nodes from ZooKeeper... (2) -> (3)
   [junit4]   2> 1625580 INFO  (zkCallback-10402-thread-1) [    ] o.a.s.c.c.ZkStateReader Updated live nodes from ZooKeeper... (2) -> (3)
   [junit4]   2> 1625580 INFO  (zkCallback-10389-thread-2) [    ] o.a.s.c.c.ZkStateReader Updated live nodes from ZooKeeper... (2) -> (3)
   [junit4]   2> 1625580 INFO  (zkCallback-10396-thread-1) [    ] o.a.s.c.c.ZkStateReader Updated live nodes from ZooKeeper... (2) -> (3)
   [junit4]   2> 1625580 INFO  (zkCallback-10367-thread-4) [    ] o.a.s.c.c.ZkStateReader Updated live nodes from ZooKeeper... (2) -> (3)
   [junit4]   2> 1625580 INFO  (zkCallback-10420-thread-1) [    ] o.a.s.c.c.ZkStateReader Updated live nodes from ZooKeeper... (2) -> (3)
   [junit4]   2> 1625580 INFO  (zkConnectionManagerCallback-10428-thread-1) [    ] o.a.s.c.c.ConnectionManager zkClient has connected
   [junit4]   2> 1625580 INFO  (TEST-BasicAuthIntegrationTest.testBasicAuth-seed#[1E0750AD432CAC1A]) [n:127.0.0.1:57793_solr    ] o.a.s.c.c.ZkStateReader Updated live nodes from ZooKeeper... (0) -> (3)
   [junit4]   2> 1625595 INFO  (TEST-BasicAuthIntegrationTest.testBasicAuth-seed#[1E0750AD432CAC1A]) [n:127.0.0.1:57793_solr    ] o.a.s.c.s.i.ZkClientClusterStateProvider Cluster at 127.0.0.1:57768/solr ready
   [junit4]   2> 1625596 INFO  (TEST-BasicAuthIntegrationTest.testBasicAuth-seed#[1E0750AD432CAC1A]) [n:127.0.0.1:57793_solr    ] o.a.s.c.CoreContainer Initializing authorization plugin: solr.RuleBasedAuthorizationPlugin
   [junit4]   2> 1625596 INFO  (TEST-BasicAuthIntegrationTest.testBasicAuth-seed#[1E0750AD432CAC1A]) [n:127.0.0.1:57793_solr    ] o.a.s.c.CoreContainer Initializing authentication plugin: solr.BasicAuthPlugin
   [junit4]   2> 1625611 INFO  (TEST-BasicAuthIntegrationTest.testBasicAuth-seed#[1E0750AD432CAC1A]) [n:127.0.0.1:57793_solr    ] o.a.s.h.a.MetricsHistoryHandler No .system collection, keeping metrics history in memory.
   [junit4]   2> 1625627 INFO  (TEST-BasicAuthIntegrationTest.testBasicAuth-seed#[1E0750AD432CAC1A]) [n:127.0.0.1:57793_solr    ] o.a.s.m.r.SolrJmxReporter JMX monitoring for 'solr_57793.solr.node' (registry 'solr.node') enabled at server: com.sun.jmx.mbeanserver.JmxMBeanServer@3465033a
   [junit4]   2> 1625627 INFO  (TEST-BasicAuthIntegrationTest.testBasicAuth-seed#[1E0750AD432CAC1A]) [n:127.0.0.1:57793_solr    ] o.a.s.m.r.SolrJmxReporter JMX monitoring for 'solr_57793.solr.jvm' (registry 'solr.jvm') enabled at server: com.sun.jmx.mbeanserver.JmxMBeanServer@3465033a
   [junit4]   2> 1625627 INFO  (TEST-BasicAuthIntegrationTest.testBasicAuth-seed#[1E0750AD432CAC1A]) [n:127.0.0.1:57793_solr    ] o.a.s.m.r.SolrJmxReporter JMX monitoring for 'solr_57793.solr.jetty' (registry 'solr.jetty') enabled at server: com.sun.jmx.mbeanserver.JmxMBeanServer@3465033a
   [junit4]   2> 1625627 INFO  (TEST-BasicAuthIntegrationTest.testBasicAuth-seed#[1E0750AD432CAC1A]) [n:127.0.0.1:57793_solr    ] o.a.s.c.CorePropertiesLocator Found 1 core definitions underneath C:\Users\jenkins\workspace\Lucene-Solr-master-Windows\solr\build\solr-core\test\J0\temp\solr.security.BasicAuthIntegrationTest_1E0750AD432CAC1A-001\tempDir-001\node1\.
   [junit4]   2> 1625627 INFO  (TEST-BasicAuthIntegrationTest.testBasicAuth-seed#[1E0750AD432CAC1A]) [n:127.0.0.1:57793_solr    ] o.a.s.c.CorePropertiesLocator Cores are: [authCollection_shard1_replica_n1]
   [junit4]   2> 1625643 INFO  (coreLoadExecutor-8456-thread-1-processing-n:127.0.0.1:57793_solr) [n:127.0.0.1:57793_solr    ] o.a.s.c.SolrConfig Using Lucene MatchVersion: 9.0.0
   [junit4]   2> 1625643 INFO  (coreLoadExecutor-8456-thread-1-processing-n:127.0.0.1:57793_solr) [n:127.0.0.1:57793_solr    ] o.a.s.s.IndexSchema [authCollection_shard1_replica_n1] Schema name=minimal
   [junit4]   2> 1625674 INFO  (coreLoadExecutor-8456-thread-1-processing-n:127.0.0.1:57793_solr) [n:127.0.0.1:57793_solr    ] o.a.s.s.IndexSchema Loaded schema minimal/1.1 with uniqueid field id
   [junit4]   2> 1625674 INFO  (coreLoadExecutor-8456-thread-1-processing-n:127.0.0.1:57793_solr) [n:127.0.0.1:57793_solr c:authCollection s:shard1 r:core_node3 x:authCollection_shard1_replica_n1] o.a.s.c.SolrConfig Using Lucene MatchVersion: 9.0.0
   [junit4]   2> 1625690 INFO  (coreLoadExecutor-8456-thread-1-processing-n:127.0.0.1:57793_solr) [n:127.0.0.1:57793_solr c:authCollection s:shard1 r:core_node3 x:authCollection_shard1_replica_n1] o.a.s.s.IndexSchema [authCollection_shard1_replica_n1] Schema name=minimal
   [junit4]   2> 1625690 INFO  (zkCallback-10367-thread-4) [    ] o.a.s.c.c.ZkStateReader A cluster state change: [WatchedEvent state:SyncConnected type:NodeDataChanged path:/collections/authCollection/state.json] for collection [authCollection] has occurred - updating... (live nodes size: [3])
   [junit4]   2> 1625690 INFO  (zkCallback-10367-thread-1) [    ] o.a.s.c.c.ZkStateReader A cluster state change: [WatchedEvent state:SyncConnected type:NodeDataChanged path:/collections/authCollection/state.json] for collection [authCollection] has occurred - updating... (live nodes size: [3])
   [junit4]   2> 1625690 INFO  (zkCallback-10367-thread-2) [    ] o.a.s.c.c.ZkStateReader A cluster state change: [WatchedEvent state:SyncConnected type:NodeDataChanged path:/collections/authCollection/state.json] for collection [authCollection] has occurred - updating... (live nodes size: [3])
   [junit4]   2> 1625690 INFO  (zkCallback-10389-thread-2) [    ] o.a.s.c.c.ZkStateReader A cluster state change: [WatchedEvent state:SyncConnected type:NodeDataChanged path:/collections/authCollection/state.json] for collection [authCollection] has occurred - updating... (live nodes size: [3])
   [junit4]   2> 1625690 INFO  (zkCallback-10389-thread-1) [    ] o.a.s.c.c.ZkStateReader A cluster state change: [WatchedEvent state:SyncConnected type:NodeDataChanged path:/collections/authCollection/state.json] for collection [authCollection] has occurred - updating... (live nodes size: [3])
   [junit4]   2> 1625690 INFO  (zkCallback-10389-thread-3) [    ] o.a.s.c.c.ZkStateReader A cluster state change: [WatchedEvent state:SyncConnected type:NodeDataChanged path:/collections/authCollection/state.json] for collection [authCollection] has occurred - updating... (live nodes size: [3])
   [junit4]   2> 1625690 INFO  (coreLoadExecutor-8456-thread-1-processing-n:127.0.0.1:57793_solr) [n:127.0.0.1:57793_solr c:authCollection s:shard1 r:core_node3 x:authCollection_shard1_replica_n1] o.a.s.s.IndexSchema Loaded schema minimal/1.1 with uniqueid field id
   [junit4]   2> 1625690 INFO  (coreLoadExecutor-8456-thread-1-processing-n:127.0.0.1:57793_solr) [n:127.0.0.1:57793_solr c:authCollection s:shard1 r:core_node3 x:authCollection_shard1_replica_n1] o.a.s.c.CoreContainer Creating SolrCore 'authCollection_shard1_replica_n1' using configuration from collection authCollection, trusted=true
   [junit4]   2> 1625690 INFO  (coreLoadExecutor-8456-thread-1-processing-n:127.0.0.1:57793_solr) [n:127.0.0.1:57793_solr c:authCollection s:shard1 r:core_node3 x:authCollection_shard1_replica_n1] o.a.s.m.r.SolrJmxReporter JMX monitoring for 'solr_57793.solr.core.authCollection.shard1.replica_n1' (registry 'solr.core.authCollection.shard1.replica_n1') enabled at server: com.sun.jmx.mbeanserver.JmxMBeanServer@3465033a
   [junit4]   2> 1625690 INFO  (coreLoadExecutor-8456-thread-1-processing-n:127.0.0.1:57793_solr) [n:127.0.0.1:57793_solr c:authCollection s:shard1 r:core_node3 x:authCollection_shard1_replica_n1] o.a.s.c.SolrCore [[authCollection_shard1_replica_n1] ] Opening new SolrCore at [C:\Users\jenkins\workspace\Lucene-Solr-master-Windows\solr\build\solr-core\test\J0\temp\solr.security.BasicAuthIntegrationTest_1E0750AD432CAC1A-001\tempDir-001\node1\authCollection_shard1_replica_n1], dataDir=[C:\Users\jenkins\workspace\Lucene-Solr-master-Windows\solr\build\solr-core\test\J0\temp\solr.security.BasicAuthIntegrationTest_1E0750AD432CAC1A-001\tempDir-001\node1\.\authCollection_shard1_replica_n1\data\]
   [junit4]   2> 1625736 INFO  (coreLoadExecutor-8456-thread-1-processing-n:127.0.0.1:57793_solr) [n:127.0.0.1:57793_solr c:authCollection s:shard1 r:core_node3 x:authCollection_shard1_replica_n1] o.a.s.u.UpdateHandler Using UpdateLog implementation: org.apache.solr.update.UpdateLog
   [junit4]   2> 1625736 INFO  (coreLoadExecutor-8456-thread-1-processing-n:127.0.0.1:57793_solr) [n:127.0.0.1:57793_solr c:authCollection s:shard1 r:core_node3 x:authCollection_shard1_replica_n1] o.a.s.u.UpdateLog Initializing UpdateLog: dataDir=null defaultSyncLevel=FLUSH numRecordsToKeep=100 maxNumLogsToKeep=10 numVersionBuckets=65536
   [junit4]   2> 1625736 INFO  (coreLoadExecutor-8456-thread-1-processing-n:127.0.0.1:57793_solr) [n:127.0.0.1:57793_solr c:authCollection s:shard1 r:core_node3 x:authCollection_shard1_replica_n1] o.a.s.u.CommitTracker Hard AutoCommit: disabled
   [junit4]   2> 1625736 INFO  (coreLoadExecutor-8456-thread-1-processing-n:127.0.0.1:57793_solr) [n:127.0.0.1:57793_solr c:authCollection s:shard1 r:core_node3 x:authCollection_shard1_replica_n1] o.a.s.u.CommitTracker Soft AutoCommit: disabled
   [junit4]   2> 1625736 INFO  (coreLoadExecutor-8456-thread-1-processing-n:127.0.0.1:57793_solr) [n:127.0.0.1:57793_solr c:authCollection s:shard1 r:core_node3 x:authCollection_shard1_replica_n1] o.a.s.s.SolrIndexSearcher Opening [Searcher@99c5a0f[authCollection_shard1_replica_n1] main]
   [junit4]   2> 1625736 INFO  (coreLoadExecutor-8456-thread-1-processing-n:127.0.0.1:57793_solr) [n:127.0.0.1:57793_solr c:authCollection s:shard1 r:core_node3 x:authCollection_shard1_replica_n1] o.a.s.r.ManagedResourceStorage Configured ZooKeeperStorageIO with znodeBase: /configs/conf
   [junit4]   2> 1625736 INFO  (coreLoadExecutor-8456-thread-1-processing-n:127.0.0.1:57793_solr) [n:127.0.0.1:57793_solr c:authCollection s:shard1 r:core_node3 x:authCollection_shard1_replica_n1] o.a.s.r.ManagedResourceStorage Loaded null at path _rest_managed.json using ZooKeeperStorageIO:path=/configs/conf
   [junit4]   2> 1625736 INFO  (coreLoadExecutor-8456-thread-1-processing-n:127.0.0.1:57793_solr) [n:127.0.0.1:57793_solr c:authCollection s:shard1 r:core_node3 x:authCollection_shard1_replica_n1] o.a.s.h.ReplicationHandler Commits will be reserved for 10000ms.
   [junit4]   2> 1625736 INFO  (coreLoadExecutor-8456-thread-1-processing-n:127.0.0.1:57793_solr) [n:127.0.0.1:57793_solr c:authCollection s:shard1 r:core_node3 x:authCollection_shard1_replica_n1] o.a.s.u.UpdateLog Could not find max version in index or recent updates, using new clock 1633018142100815872
   [junit4]   2> 1625736 INFO  (searcherExecutor-8457-thread-1-processing-n:127.0.0.1:57793_solr x:authCollection_shard1_replica_n1 c:authCollection s:shard1 r:core_node3) [n:127.0.0.1:57793_solr c:authCollection s:shard1 r:core_node3 x:authCollection_shard1_replica_n1] o.a.s.c.SolrCore [authCollection_shard1_replica_n1] Registered new searcher Searcher@99c5a0f[authCollection_shard1_replica_n1] main{ExitableDirectoryReader(UninvertingDirectoryReader())}
   [junit4]   2> 1625736 INFO  (coreZkRegister-8448-thread-1-processing-n:127.0.0.1:57793_solr x:authCollection_shard1_replica_n1 c:authCollection s:shard1 r:core_node3) [n:127.0.0.1:57793_solr c:authCollection s:shard1 r:core_node3 x:authCollection_shard1_replica_n1] o.a.s.c.ShardLeaderElectionContextBase make sure parent is created /collections/authCollection/leaders/shard1
   [junit4]   2> 1625736 INFO  (coreZkRegister-8448-thread-1-processing-n:127.0.0.1:57793_solr x:authCollection_shard1_replica_n1 c:authCollection s:shard1 r:core_node3) [n:127.0.0.1:57793_solr c:authCollection s:shard1 r:core_node3 x:authCollection_shard1_replica_n1] o.a.s.c.ShardLeaderElectionContext Enough replicas found to continue.
   [junit4]   2> 1625736 INFO  (coreZkRegister-8448-thread-1-processing-n:127.0.0.1:57793_solr x:authCollection_shard1_replica_n1 c:authCollection s:shard1 r:core_node3) [n:127.0.0.1:57793_solr c:authCollection s:shard1 r:core_node3 x:authCollection_shard1_replica_n1] o.a.s.c.ShardLeaderElectionContext I may be the new leader - try and sync
   [junit4]   2> 1625736 INFO  (coreZkRegister-8448-thread-1-processing-n:127.0.0.1:57793_solr x:authCollection_shard1_replica_n1 c:authCollection s:shard1 r:core_node3) [n:127.0.0.1:57793_solr c:authCollection s:shard1 r:core_node3 x:authCollection_shard1_replica_n1] o.a.s.c.SyncStrategy Sync replicas to http://127.0.0.1:57793/solr/authCollection_shard1_replica_n1/
   [junit4]   2> 1625736 INFO  (coreZkRegister-8448-thread-1-processing-n:127.0.0.1:57793_solr x:authCollection_shard1_replica_n1 c:authCollection s:shard1 r:core_node3) [n:127.0.0.1:57793_solr c:authCollection s:shard1 r:core_node3 x:authCollection_shard1_replica_n1] o.a.s.c.SyncStrategy Sync Success - now sync replicas to me
   [junit4]   2> 1625736 INFO  (coreZkRegister-8448-thread-1-processin

[...truncated too long message...]

install-junit4-taskdef:

ivy-availability-check:
[loadresource] Do not set property disallowed.ivy.jars.list as its length is 0.

-ivy-fail-disallowed-ivy-version:

ivy-fail:

resolve-groovy:
[ivy:cachepath] :: resolving dependencies :: org.codehaus.groovy#groovy-all-caller;working
[ivy:cachepath] 	confs: [default]
[ivy:cachepath] 	found org.codehaus.groovy#groovy-all;2.4.16 in public
[ivy:cachepath] :: resolution report :: resolve 29ms :: artifacts dl 1ms
	---------------------------------------------------------------------
	|                  |            modules            ||   artifacts   |
	|       conf       | number| search|dwnlded|evicted|| number|dwnlded|
	---------------------------------------------------------------------
	|      default     |   1   |   0   |   0   |   0   ||   1   |   0   |
	---------------------------------------------------------------------

-init-totals:

-test:
    [mkdir] Created dir: C:\Users\jenkins\workspace\Lucene-Solr-master-Windows\solr\build\solr-core\test
[junit4:pickseed] Seed property 'tests.seed' already defined: 1E0750AD432CAC1A
    [mkdir] Created dir: C:\Users\jenkins\workspace\Lucene-Solr-master-Windows\solr\build\solr-core\test\temp
   [junit4] <JUnit4> says ciao! Master seed: 1E0750AD432CAC1A
   [junit4] Your default console's encoding may not display certain unicode glyphs: windows-1252
   [junit4] Executing 5 suites with 2 JVMs.
   [junit4] 
   [junit4] Started J0 PID(6016@serv1-vm1).
   [junit4] Started J1 PID(9000@serv1-vm1).
   [junit4] Suite: org.apache.solr.security.BasicAuthIntegrationTest
   [junit4] OK      27.2s J1 | BasicAuthIntegrationTest.testBasicAuth
   [junit4] Completed [1/5] on J1 in 39.21s, 1 test
   [junit4] 
   [junit4] Suite: org.apache.solr.security.BasicAuthIntegrationTest
   [junit4] OK      27.8s J0 | BasicAuthIntegrationTest.testBasicAuth
   [junit4] Completed [2/5] on J0 in 39.69s, 1 test
   [junit4] 
   [junit4] Suite: org.apache.solr.security.BasicAuthIntegrationTest
   [junit4] OK      13.7s J0 | BasicAuthIntegrationTest.testBasicAuth
   [junit4] Completed [3/5] on J0 in 14.06s, 1 test
   [junit4] 
   [junit4] Suite: org.apache.solr.security.BasicAuthIntegrationTest
   [junit4] OK      14.9s J1 | BasicAuthIntegrationTest.testBasicAuth
   [junit4] Completed [4/5] on J1 in 15.09s, 1 test
   [junit4] 
   [junit4] Suite: org.apache.solr.security.BasicAuthIntegrationTest
   [junit4] OK      9.44s J0 | BasicAuthIntegrationTest.testBasicAuth
   [junit4] Completed [5/5] on J0 in 9.66s, 1 test
   [junit4] 
   [junit4] JVM J0:     2.04 ..    66.53 =    64.49s
   [junit4] JVM J1:     2.05 ..    57.58 =    55.53s
   [junit4] Execution time total: 1 minute 6 seconds
   [junit4] Tests summary: 5 suites, 5 tests
   [junit4] Could not remove temporary path: C:\Users\jenkins\workspace\Lucene-Solr-master-Windows\solr\build\solr-core\test\J1 (java.nio.file.DirectoryNotEmptyException: Remaining files: [C:\Users\jenkins\workspace\Lucene-Solr-master-Windows\solr\build\solr-core\test\J1\temp])
   [junit4] Could not remove temporary path: C:\Users\jenkins\workspace\Lucene-Solr-master-Windows\solr\build\solr-core\test\J0 (java.nio.file.DirectoryNotEmptyException: Remaining files: [C:\Users\jenkins\workspace\Lucene-Solr-master-Windows\solr\build\solr-core\test\J0\temp])
     [echo] 5 slowest tests:
[junit4:tophints] 200.48s | org.apache.solr.cloud.api.collections.ShardSplitTest
[junit4:tophints] 125.23s | org.apache.solr.cloud.CollectionsAPISolrJTest
[junit4:tophints] 116.11s | org.apache.solr.cloud.ReplicationFactorTest
[junit4:tophints] 113.40s | org.apache.solr.cloud.HttpPartitionWithTlogReplicasTest
[junit4:tophints] 110.80s | org.apache.solr.cloud.HttpPartitionTest

-check-totals:
WARNING: An illegal reflective access operation has occurred
WARNING: Illegal reflective access by org.codehaus.groovy.reflection.CachedClass (file:/C:/Users/jenkins/.ivy2/cache/org.codehaus.groovy/groovy-all/jars/groovy-all-2.4.16.jar) to method java.lang.Object.finalize()
WARNING: Please consider reporting this to the maintainers of org.codehaus.groovy.reflection.CachedClass
WARNING: Use --illegal-access=warn to enable warnings of further illegal reflective access operations
WARNING: All illegal access operations will be denied in a future release

test-nocompile:

BUILD SUCCESSFUL
Total time: 1 minute 11 seconds
[repro] Failures:
[repro]   0/5 failed: org.apache.solr.security.BasicAuthIntegrationTest
[repro] Exiting with code 0

C:\Users\jenkins\workspace\Lucene-Solr-master-Windows>IF EXIST lucene\build move /y lucene\build lucene\build.repro 
        1 dir(s) moved.

C:\Users\jenkins\workspace\Lucene-Solr-master-Windows>IF EXIST solr\build move /y solr\build solr\build.repro 
        1 dir(s) moved.

C:\Users\jenkins\workspace\Lucene-Solr-master-Windows>IF EXIST lucene\build.orig move /y lucene\build.orig lucene\build 
        1 dir(s) moved.

C:\Users\jenkins\workspace\Lucene-Solr-master-Windows>IF EXIST solr\build.orig move /y solr\build.orig solr\build 
        1 dir(s) moved.

C:\Users\jenkins\workspace\Lucene-Solr-master-Windows>exit 0 
Archiving artifacts
Setting ANT_1_8_2_HOME=C:\Users\jenkins\tools\hudson.tasks.Ant_AntInstallation\ANT_1.8.2
java.lang.InterruptedException: no matches found within 10000
	at hudson.FilePath$ValidateAntFileMask.hasMatch(FilePath.java:2802)
	at hudson.FilePath$ValidateAntFileMask.invoke(FilePath.java:2681)
	at hudson.FilePath$ValidateAntFileMask.invoke(FilePath.java:2662)
	at hudson.FilePath$FileCallableWrapper.call(FilePath.java:3040)
Also:   hudson.remoting.Channel$CallSiteStackTrace: Remote call to Windows VBOX
		at hudson.remoting.Channel.attachCallSiteStackTrace(Channel.java:1743)
		at hudson.remoting.UserRequest$ExceptionResponse.retrieve(UserRequest.java:357)
		at hudson.remoting.Channel.call(Channel.java:957)
		at hudson.FilePath.act(FilePath.java:1069)
		at hudson.FilePath.act(FilePath.java:1058)
		at hudson.FilePath.validateAntFileMask(FilePath.java:2660)
		at hudson.tasks.ArtifactArchiver.perform(ArtifactArchiver.java:243)
		at hudson.tasks.BuildStepCompatibilityLayer.perform(BuildStepCompatibilityLayer.java:79)
		at hudson.tasks.BuildStepMonitor$1.perform(BuildStepMonitor.java:20)
		at hudson.model.AbstractBuild$AbstractBuildExecution.perform(AbstractBuild.java:741)
		at hudson.model.AbstractBuild$AbstractBuildExecution.performAllBuildSteps(AbstractBuild.java:690)
		at hudson.model.Build$BuildExecution.post2(Build.java:186)
		at hudson.model.AbstractBuild$AbstractBuildExecution.post(AbstractBuild.java:635)
		at hudson.model.Run.execute(Run.java:1843)
		at hudson.model.FreeStyleBuild.run(FreeStyleBuild.java:43)
		at hudson.model.ResourceController.execute(ResourceController.java:97)
		at hudson.model.Executor.run(Executor.java:429)
Caused: hudson.FilePath$TunneledInterruptedException
	at hudson.FilePath$FileCallableWrapper.call(FilePath.java:3042)
	at hudson.remoting.UserRequest.perform(UserRequest.java:212)
	at hudson.remoting.UserRequest.perform(UserRequest.java:54)
	at hudson.remoting.Request$2.run(Request.java:369)
	at hudson.remoting.InterceptingExecutorService$1.call(InterceptingExecutorService.java:72)
	at java.util.concurrent.FutureTask.run(Unknown Source)
	at java.util.concurrent.ThreadPoolExecutor.runWorker(Unknown Source)
	at java.util.concurrent.ThreadPoolExecutor$Worker.run(Unknown Source)
	at java.lang.Thread.run(Unknown Source)
Caused: java.lang.InterruptedException: java.lang.InterruptedException: no matches found within 10000
	at hudson.FilePath.act(FilePath.java:1071)
	at hudson.FilePath.act(FilePath.java:1058)
	at hudson.FilePath.validateAntFileMask(FilePath.java:2660)
	at hudson.tasks.ArtifactArchiver.perform(ArtifactArchiver.java:243)
	at hudson.tasks.BuildStepCompatibilityLayer.perform(BuildStepCompatibilityLayer.java:79)
	at hudson.tasks.BuildStepMonitor$1.perform(BuildStepMonitor.java:20)
	at hudson.model.AbstractBuild$AbstractBuildExecution.perform(AbstractBuild.java:741)
	at hudson.model.AbstractBuild$AbstractBuildExecution.performAllBuildSteps(AbstractBuild.java:690)
	at hudson.model.Build$BuildExecution.post2(Build.java:186)
	at hudson.model.AbstractBuild$AbstractBuildExecution.post(AbstractBuild.java:635)
	at hudson.model.Run.execute(Run.java:1843)
	at hudson.model.FreeStyleBuild.run(FreeStyleBuild.java:43)
	at hudson.model.ResourceController.execute(ResourceController.java:97)
	at hudson.model.Executor.run(Executor.java:429)
No artifacts found that match the file pattern "**/*.events,heapdumps/**,**/*_pid*.log". Configuration error?
[WARNINGS] Parsing warnings in console log with parser Java Compiler (javac)
Setting ANT_1_8_2_HOME=C:\Users\jenkins\tools\hudson.tasks.Ant_AntInstallation\ANT_1.8.2
No credentials specified
Setting ANT_1_8_2_HOME=C:\Users\jenkins\tools\hudson.tasks.Ant_AntInstallation\ANT_1.8.2
<Git Blamer> Using GitBlamer to create author and commit information for all warnings.
<Git Blamer> GIT_COMMIT=cde00b9a84f3d57252d34daaa77f2b56cf9802cb, workspace=C:\Users\jenkins\workspace\Lucene-Solr-master-Windows
[WARNINGS] Computing warning deltas based on reference build #7929
Recording test results
Setting ANT_1_8_2_HOME=C:\Users\jenkins\tools\hudson.tasks.Ant_AntInstallation\ANT_1.8.2
Build step 'Publish JUnit test result report' changed build result to UNSTABLE
Email was triggered for: Unstable (Test Failures)
Sending email for trigger: Unstable (Test Failures)
Setting ANT_1_8_2_HOME=C:\Users\jenkins\tools\hudson.tasks.Ant_AntInstallation\ANT_1.8.2
Setting ANT_1_8_2_HOME=C:\Users\jenkins\tools\hudson.tasks.Ant_AntInstallation\ANT_1.8.2
Setting ANT_1_8_2_HOME=C:\Users\jenkins\tools\hudson.tasks.Ant_AntInstallation\ANT_1.8.2
Setting ANT_1_8_2_HOME=C:\Users\jenkins\tools\hudson.tasks.Ant_AntInstallation\ANT_1.8.2
Setting ANT_1_8_2_HOME=C:\Users\jenkins\tools\hudson.tasks.Ant_AntInstallation\ANT_1.8.2
Setting ANT_1_8_2_HOME=C:\Users\jenkins\tools\hudson.tasks.Ant_AntInstallation\ANT_1.8.2

Mime
View raw message