lucene-dev mailing list archives

Site index · List index
Message view « Date » · « Thread »
Top « Date » · « Thread »
From Policeman Jenkins Server <jenk...@thetaphi.de>
Subject [JENKINS-EA] Lucene-Solr-BadApples-master-Linux (64bit/jdk-13-ea+shipilev-fastdebug) - Build # 206 - Still Failing!
Date Thu, 16 May 2019 06:14:03 GMT
Build: https://jenkins.thetaphi.de/job/Lucene-Solr-BadApples-master-Linux/206/
Java: 64bit/jdk-13-ea+shipilev-fastdebug -XX:-UseCompressedOops -XX:+UseConcMarkSweepGC

1 tests failed.
FAILED:  org.apache.solr.handler.component.TestDistributedStatsComponentCardinality.test

Error Message:
.responseHeader.status:200!=0

Stack Trace:
junit.framework.AssertionFailedError: .responseHeader.status:200!=0
	at __randomizedtesting.SeedInfo.seed([352B531224281502:BD7F6CC88AD478FA]:0)
	at junit.framework.Assert.fail(Assert.java:57)
	at org.apache.solr.BaseDistributedSearchTestCase.compareSolrResponses(BaseDistributedSearchTestCase.java:999)
	at org.apache.solr.BaseDistributedSearchTestCase.compareResponses(BaseDistributedSearchTestCase.java:1026)
	at org.apache.solr.BaseDistributedSearchTestCase.query(BaseDistributedSearchTestCase.java:680)
	at org.apache.solr.BaseDistributedSearchTestCase.query(BaseDistributedSearchTestCase.java:643)
	at org.apache.solr.handler.component.TestDistributedStatsComponentCardinality.test(TestDistributedStatsComponentCardinality.java:194)
	at java.base/jdk.internal.reflect.NativeMethodAccessorImpl.invoke0(Native Method)
	at java.base/jdk.internal.reflect.NativeMethodAccessorImpl.invoke(NativeMethodAccessorImpl.java:62)
	at java.base/jdk.internal.reflect.DelegatingMethodAccessorImpl.invoke(DelegatingMethodAccessorImpl.java:43)
	at java.base/java.lang.reflect.Method.invoke(Method.java:567)
	at com.carrotsearch.randomizedtesting.RandomizedRunner.invoke(RandomizedRunner.java:1750)
	at com.carrotsearch.randomizedtesting.RandomizedRunner$8.evaluate(RandomizedRunner.java:938)
	at com.carrotsearch.randomizedtesting.RandomizedRunner$9.evaluate(RandomizedRunner.java:974)
	at com.carrotsearch.randomizedtesting.RandomizedRunner$10.evaluate(RandomizedRunner.java:988)
	at org.apache.solr.BaseDistributedSearchTestCase$ShardsRepeatRule$ShardsFixedStatement.callStatement(BaseDistributedSearchTestCase.java:1082)
	at org.apache.solr.BaseDistributedSearchTestCase$ShardsRepeatRule$ShardsStatement.evaluate(BaseDistributedSearchTestCase.java:1054)
	at com.carrotsearch.randomizedtesting.rules.SystemPropertiesRestoreRule$1.evaluate(SystemPropertiesRestoreRule.java:57)
	at org.apache.lucene.util.TestRuleSetupTeardownChained$1.evaluate(TestRuleSetupTeardownChained.java:49)
	at org.apache.lucene.util.AbstractBeforeAfterRule$1.evaluate(AbstractBeforeAfterRule.java:45)
	at org.apache.lucene.util.TestRuleThreadAndTestName$1.evaluate(TestRuleThreadAndTestName.java:48)
	at org.apache.lucene.util.TestRuleIgnoreAfterMaxFailures$1.evaluate(TestRuleIgnoreAfterMaxFailures.java:64)
	at org.apache.lucene.util.TestRuleMarkFailure$1.evaluate(TestRuleMarkFailure.java:47)
	at com.carrotsearch.randomizedtesting.rules.StatementAdapter.evaluate(StatementAdapter.java:36)
	at com.carrotsearch.randomizedtesting.ThreadLeakControl$StatementRunner.run(ThreadLeakControl.java:368)
	at com.carrotsearch.randomizedtesting.ThreadLeakControl.forkTimeoutingTask(ThreadLeakControl.java:817)
	at com.carrotsearch.randomizedtesting.ThreadLeakControl$3.evaluate(ThreadLeakControl.java:468)
	at com.carrotsearch.randomizedtesting.RandomizedRunner.runSingleTest(RandomizedRunner.java:947)
	at com.carrotsearch.randomizedtesting.RandomizedRunner$5.evaluate(RandomizedRunner.java:832)
	at com.carrotsearch.randomizedtesting.RandomizedRunner$6.evaluate(RandomizedRunner.java:883)
	at com.carrotsearch.randomizedtesting.RandomizedRunner$7.evaluate(RandomizedRunner.java:894)
	at com.carrotsearch.randomizedtesting.rules.StatementAdapter.evaluate(StatementAdapter.java:36)
	at com.carrotsearch.randomizedtesting.rules.SystemPropertiesRestoreRule$1.evaluate(SystemPropertiesRestoreRule.java:57)
	at org.apache.lucene.util.AbstractBeforeAfterRule$1.evaluate(AbstractBeforeAfterRule.java:45)
	at com.carrotsearch.randomizedtesting.rules.StatementAdapter.evaluate(StatementAdapter.java:36)
	at org.apache.lucene.util.TestRuleStoreClassName$1.evaluate(TestRuleStoreClassName.java:41)
	at com.carrotsearch.randomizedtesting.rules.NoShadowingOrOverridesOnMethodsRule$1.evaluate(NoShadowingOrOverridesOnMethodsRule.java:40)
	at com.carrotsearch.randomizedtesting.rules.NoShadowingOrOverridesOnMethodsRule$1.evaluate(NoShadowingOrOverridesOnMethodsRule.java:40)
	at com.carrotsearch.randomizedtesting.rules.StatementAdapter.evaluate(StatementAdapter.java:36)
	at com.carrotsearch.randomizedtesting.rules.StatementAdapter.evaluate(StatementAdapter.java:36)
	at org.apache.lucene.util.TestRuleAssertionsRequired$1.evaluate(TestRuleAssertionsRequired.java:53)
	at org.apache.lucene.util.TestRuleMarkFailure$1.evaluate(TestRuleMarkFailure.java:47)
	at org.apache.lucene.util.TestRuleIgnoreAfterMaxFailures$1.evaluate(TestRuleIgnoreAfterMaxFailures.java:64)
	at org.apache.lucene.util.TestRuleIgnoreTestSuites$1.evaluate(TestRuleIgnoreTestSuites.java:54)
	at com.carrotsearch.randomizedtesting.rules.StatementAdapter.evaluate(StatementAdapter.java:36)
	at com.carrotsearch.randomizedtesting.ThreadLeakControl$StatementRunner.run(ThreadLeakControl.java:368)
	at java.base/java.lang.Thread.run(Thread.java:830)




Build Log:
[...truncated 2016 lines...]
   [junit4] JVM J1: stderr was not empty, see: /home/jenkins/workspace/Lucene-Solr-BadApples-master-Linux/lucene/build/core/test/temp/junit4-J1-20190516_032332_1098954065512127454118.syserr
   [junit4] >>> JVM J1 emitted unexpected output (verbatim) ----
   [junit4] Suite: org.apache.lucene.util.bkd.TestBKD
   [junit4] IGNOR/A 0.00s J0 | TestBKD.testRandomBinaryBig
   [junit4]    > Assumption #1: 'nightly' test group is disabled (@Nightly())
   [junit4] Completed [514/515] on J0 in 10.83s, 21 tests, 1 skipped
   [junit4] 
   [junit4] OpenJDK 64-Bit Server VM warning: Option UseConcMarkSweepGC was deprecated in version 9.0 and will likely be removed in a future release.
   [junit4] <<< JVM J1: EOF ----

   [junit4] JVM J0: stderr was not empty, see: /home/jenkins/workspace/Lucene-Solr-BadApples-master-Linux/lucene/build/core/test/temp/junit4-J0-20190516_032332_122932442628058477881.syserr
   [junit4] >>> JVM J0 emitted unexpected output (verbatim) ----
   [junit4] OpenJDK 64-Bit Server VM warning: Option UseConcMarkSweepGC was deprecated in version 9.0 and will likely be removed in a future release.
   [junit4] <<< JVM J0: EOF ----

[...truncated 5 lines...]
   [junit4] JVM J2: stderr was not empty, see: /home/jenkins/workspace/Lucene-Solr-BadApples-master-Linux/lucene/build/core/test/temp/junit4-J2-20190516_032332_1411445613892960489222.syserr
   [junit4] >>> JVM J2 emitted unexpected output (verbatim) ----
   [junit4] OpenJDK 64-Bit Server VM warning: Option UseConcMarkSweepGC was deprecated in version 9.0 and will likely be removed in a future release.
   [junit4] <<< JVM J2: EOF ----

[...truncated 301 lines...]
   [junit4] JVM J0: stderr was not empty, see: /home/jenkins/workspace/Lucene-Solr-BadApples-master-Linux/lucene/build/test-framework/test/temp/junit4-J0-20190516_034810_48017626022718400182961.syserr
   [junit4] >>> JVM J0 emitted unexpected output (verbatim) ----
   [junit4] OpenJDK 64-Bit Server VM warning: Option UseConcMarkSweepGC was deprecated in version 9.0 and will likely be removed in a future release.
   [junit4] <<< JVM J0: EOF ----

[...truncated 3 lines...]
   [junit4] JVM J1: stderr was not empty, see: /home/jenkins/workspace/Lucene-Solr-BadApples-master-Linux/lucene/build/test-framework/test/temp/junit4-J1-20190516_034810_48017192650223155128046.syserr
   [junit4] >>> JVM J1 emitted unexpected output (verbatim) ----
   [junit4] OpenJDK 64-Bit Server VM warning: Option UseConcMarkSweepGC was deprecated in version 9.0 and will likely be removed in a future release.
   [junit4] <<< JVM J1: EOF ----

[...truncated 3 lines...]
   [junit4] JVM J2: stderr was not empty, see: /home/jenkins/workspace/Lucene-Solr-BadApples-master-Linux/lucene/build/test-framework/test/temp/junit4-J2-20190516_034810_48014909230537863675395.syserr
   [junit4] >>> JVM J2 emitted unexpected output (verbatim) ----
   [junit4] OpenJDK 64-Bit Server VM warning: Option UseConcMarkSweepGC was deprecated in version 9.0 and will likely be removed in a future release.
   [junit4] <<< JVM J2: EOF ----

[...truncated 1078 lines...]
   [junit4] JVM J0: stderr was not empty, see: /home/jenkins/workspace/Lucene-Solr-BadApples-master-Linux/lucene/build/analysis/common/test/temp/junit4-J0-20190516_035238_1653564512047354765404.syserr
   [junit4] >>> JVM J0 emitted unexpected output (verbatim) ----
   [junit4] OpenJDK 64-Bit Server VM warning: Option UseConcMarkSweepGC was deprecated in version 9.0 and will likely be removed in a future release.
   [junit4] <<< JVM J0: EOF ----

   [junit4] JVM J2: stderr was not empty, see: /home/jenkins/workspace/Lucene-Solr-BadApples-master-Linux/lucene/build/analysis/common/test/temp/junit4-J2-20190516_035238_16511579610515697008358.syserr
   [junit4] >>> JVM J2 emitted unexpected output (verbatim) ----
   [junit4] OpenJDK 64-Bit Server VM warning: Option UseConcMarkSweepGC was deprecated in version 9.0 and will likely be removed in a future release.
   [junit4] <<< JVM J2: EOF ----

[...truncated 3 lines...]
   [junit4] JVM J1: stderr was not empty, see: /home/jenkins/workspace/Lucene-Solr-BadApples-master-Linux/lucene/build/analysis/common/test/temp/junit4-J1-20190516_035238_16514528282865879448989.syserr
   [junit4] >>> JVM J1 emitted unexpected output (verbatim) ----
   [junit4] OpenJDK 64-Bit Server VM warning: Option UseConcMarkSweepGC was deprecated in version 9.0 and will likely be removed in a future release.
   [junit4] <<< JVM J1: EOF ----

[...truncated 241 lines...]
   [junit4] JVM J1: stderr was not empty, see: /home/jenkins/workspace/Lucene-Solr-BadApples-master-Linux/lucene/build/analysis/icu/test/temp/junit4-J1-20190516_035729_21811036257469550275221.syserr
   [junit4] >>> JVM J1 emitted unexpected output (verbatim) ----
   [junit4] OpenJDK 64-Bit Server VM warning: Option UseConcMarkSweepGC was deprecated in version 9.0 and will likely be removed in a future release.
   [junit4] <<< JVM J1: EOF ----

[...truncated 3 lines...]
   [junit4] JVM J0: stderr was not empty, see: /home/jenkins/workspace/Lucene-Solr-BadApples-master-Linux/lucene/build/analysis/icu/test/temp/junit4-J0-20190516_035729_21811301666027156878411.syserr
   [junit4] >>> JVM J0 emitted unexpected output (verbatim) ----
   [junit4] OpenJDK 64-Bit Server VM warning: Option UseConcMarkSweepGC was deprecated in version 9.0 and will likely be removed in a future release.
   [junit4] <<< JVM J0: EOF ----

[...truncated 3 lines...]
   [junit4] JVM J2: stderr was not empty, see: /home/jenkins/workspace/Lucene-Solr-BadApples-master-Linux/lucene/build/analysis/icu/test/temp/junit4-J2-20190516_035729_21816826897263468268799.syserr
   [junit4] >>> JVM J2 emitted unexpected output (verbatim) ----
   [junit4] OpenJDK 64-Bit Server VM warning: Option UseConcMarkSweepGC was deprecated in version 9.0 and will likely be removed in a future release.
   [junit4] <<< JVM J2: EOF ----

[...truncated 247 lines...]
   [junit4] JVM J1: stderr was not empty, see: /home/jenkins/workspace/Lucene-Solr-BadApples-master-Linux/lucene/build/analysis/kuromoji/test/temp/junit4-J1-20190516_035759_75912615237312202143582.syserr
   [junit4] >>> JVM J1 emitted unexpected output (verbatim) ----
   [junit4] OpenJDK 64-Bit Server VM warning: Option UseConcMarkSweepGC was deprecated in version 9.0 and will likely be removed in a future release.
   [junit4] <<< JVM J1: EOF ----

[...truncated 3 lines...]
   [junit4] JVM J2: stderr was not empty, see: /home/jenkins/workspace/Lucene-Solr-BadApples-master-Linux/lucene/build/analysis/kuromoji/test/temp/junit4-J2-20190516_035759_7587751693878333297164.syserr
   [junit4] >>> JVM J2 emitted unexpected output (verbatim) ----
   [junit4] OpenJDK 64-Bit Server VM warning: Option UseConcMarkSweepGC was deprecated in version 9.0 and will likely be removed in a future release.
   [junit4] <<< JVM J2: EOF ----

[...truncated 5 lines...]
   [junit4] JVM J0: stderr was not empty, see: /home/jenkins/workspace/Lucene-Solr-BadApples-master-Linux/lucene/build/analysis/kuromoji/test/temp/junit4-J0-20190516_035759_7581412404634063417469.syserr
   [junit4] >>> JVM J0 emitted unexpected output (verbatim) ----
   [junit4] OpenJDK 64-Bit Server VM warning: Option UseConcMarkSweepGC was deprecated in version 9.0 and will likely be removed in a future release.
   [junit4] <<< JVM J0: EOF ----

[...truncated 157 lines...]
   [junit4] JVM J0: stderr was not empty, see: /home/jenkins/workspace/Lucene-Solr-BadApples-master-Linux/lucene/build/analysis/morfologik/test/temp/junit4-J0-20190516_035905_2865007703002458487602.syserr
   [junit4] JVM J1: stderr was not empty, see: /home/jenkins/workspace/Lucene-Solr-BadApples-master-Linux/lucene/build/analysis/morfologik/test/temp/junit4-J1-20190516_035905_2874057565909188865658.syserr
   [junit4] >>> JVM J1 emitted unexpected output (verbatim) ----
   [junit4] OpenJDK 64-Bit Server VM warning: Option UseConcMarkSweepGC was deprecated in version 9.0 and will likely be removed in a future release.
   [junit4] <<< JVM J1: EOF ----

[...truncated 6 lines...]
   [junit4] JVM J2: stderr was not empty, see: /home/jenkins/workspace/Lucene-Solr-BadApples-master-Linux/lucene/build/analysis/morfologik/test/temp/junit4-J2-20190516_035905_2872579419993510779946.syserr
   [junit4] >>> JVM J2 emitted unexpected output (verbatim) ----
   [junit4] OpenJDK 64-Bit Server VM warning: Option UseConcMarkSweepGC was deprecated in version 9.0 and will likely be removed in a future release.
   [junit4] <<< JVM J2: EOF ----

[...truncated 203 lines...]
   [junit4] JVM J2: stderr was not empty, see: /home/jenkins/workspace/Lucene-Solr-BadApples-master-Linux/lucene/build/analysis/nori/test/temp/junit4-J2-20190516_035922_38211588489884760235995.syserr
   [junit4] >>> JVM J2 emitted unexpected output (verbatim) ----
   [junit4] OpenJDK 64-Bit Server VM warning: Option UseConcMarkSweepGC was deprecated in version 9.0 and will likely be removed in a future release.
   [junit4] <<< JVM J2: EOF ----

[...truncated 3 lines...]
   [junit4] JVM J0: stderr was not empty, see: /home/jenkins/workspace/Lucene-Solr-BadApples-master-Linux/lucene/build/analysis/nori/test/temp/junit4-J0-20190516_035922_38218131563458754595706.syserr
   [junit4] >>> JVM J0 emitted unexpected output (verbatim) ----
   [junit4] OpenJDK 64-Bit Server VM warning: Option UseConcMarkSweepGC was deprecated in version 9.0 and will likely be removed in a future release.
   [junit4] <<< JVM J0: EOF ----

[...truncated 3 lines...]
   [junit4] JVM J1: stderr was not empty, see: /home/jenkins/workspace/Lucene-Solr-BadApples-master-Linux/lucene/build/analysis/nori/test/temp/junit4-J1-20190516_035922_3827103199154637766177.syserr
   [junit4] >>> JVM J1 emitted unexpected output (verbatim) ----
   [junit4] OpenJDK 64-Bit Server VM warning: Option UseConcMarkSweepGC was deprecated in version 9.0 and will likely be removed in a future release.
   [junit4] <<< JVM J1: EOF ----

[...truncated 160 lines...]
   [junit4] JVM J2: stderr was not empty, see: /home/jenkins/workspace/Lucene-Solr-BadApples-master-Linux/lucene/build/analysis/opennlp/test/temp/junit4-J2-20190516_035954_2714903481424675129689.syserr
   [junit4] >>> JVM J2 emitted unexpected output (verbatim) ----
   [junit4] OpenJDK 64-Bit Server VM warning: Option UseConcMarkSweepGC was deprecated in version 9.0 and will likely be removed in a future release.
   [junit4] <<< JVM J2: EOF ----

[...truncated 3 lines...]
   [junit4] JVM J1: stderr was not empty, see: /home/jenkins/workspace/Lucene-Solr-BadApples-master-Linux/lucene/build/analysis/opennlp/test/temp/junit4-J1-20190516_035954_27113933845760980825102.syserr
   [junit4] >>> JVM J1 emitted unexpected output (verbatim) ----
   [junit4] OpenJDK 64-Bit Server VM warning: Option UseConcMarkSweepGC was deprecated in version 9.0 and will likely be removed in a future release.
   [junit4] <<< JVM J1: EOF ----

[...truncated 3 lines...]
   [junit4] JVM J0: stderr was not empty, see: /home/jenkins/workspace/Lucene-Solr-BadApples-master-Linux/lucene/build/analysis/opennlp/test/temp/junit4-J0-20190516_035954_2719287645028577708540.syserr
   [junit4] >>> JVM J0 emitted unexpected output (verbatim) ----
   [junit4] OpenJDK 64-Bit Server VM warning: Option UseConcMarkSweepGC was deprecated in version 9.0 and will likely be removed in a future release.
   [junit4] <<< JVM J0: EOF ----

[...truncated 165 lines...]
   [junit4] JVM J2: stderr was not empty, see: /home/jenkins/workspace/Lucene-Solr-BadApples-master-Linux/lucene/build/analysis/phonetic/test/temp/junit4-J2-20190516_040009_3722937857525406829941.syserr
   [junit4] >>> JVM J2 emitted unexpected output (verbatim) ----
   [junit4] OpenJDK 64-Bit Server VM warning: Option UseConcMarkSweepGC was deprecated in version 9.0 and will likely be removed in a future release.
   [junit4] <<< JVM J2: EOF ----

[...truncated 3 lines...]
   [junit4] JVM J1: stderr was not empty, see: /home/jenkins/workspace/Lucene-Solr-BadApples-master-Linux/lucene/build/analysis/phonetic/test/temp/junit4-J1-20190516_040009_3722714353365140816540.syserr
   [junit4] >>> JVM J1 emitted unexpected output (verbatim) ----
   [junit4] OpenJDK 64-Bit Server VM warning: Option UseConcMarkSweepGC was deprecated in version 9.0 and will likely be removed in a future release.
   [junit4] <<< JVM J1: EOF ----

[...truncated 6 lines...]
   [junit4] JVM J0: stderr was not empty, see: /home/jenkins/workspace/Lucene-Solr-BadApples-master-Linux/lucene/build/analysis/phonetic/test/temp/junit4-J0-20190516_040009_3719079609961653289749.syserr
   [junit4] >>> JVM J0 emitted unexpected output (verbatim) ----
   [junit4] OpenJDK 64-Bit Server VM warning: Option UseConcMarkSweepGC was deprecated in version 9.0 and will likely be removed in a future release.
   [junit4] <<< JVM J0: EOF ----

[...truncated 153 lines...]
   [junit4] JVM J0: stderr was not empty, see: /home/jenkins/workspace/Lucene-Solr-BadApples-master-Linux/lucene/build/analysis/smartcn/test/temp/junit4-J0-20190516_040041_437938691566156790582.syserr
   [junit4] >>> JVM J0 emitted unexpected output (verbatim) ----
   [junit4] OpenJDK 64-Bit Server VM warning: Option UseConcMarkSweepGC was deprecated in version 9.0 and will likely be removed in a future release.
   [junit4] <<< JVM J0: EOF ----

[...truncated 3 lines...]
   [junit4] JVM J1: stderr was not empty, see: /home/jenkins/workspace/Lucene-Solr-BadApples-master-Linux/lucene/build/analysis/smartcn/test/temp/junit4-J1-20190516_040041_43814087453053658845418.syserr
   [junit4] >>> JVM J1 emitted unexpected output (verbatim) ----
   [junit4] OpenJDK 64-Bit Server VM warning: Option UseConcMarkSweepGC was deprecated in version 9.0 and will likely be removed in a future release.
   [junit4] <<< JVM J1: EOF ----

[...truncated 157 lines...]
   [junit4] JVM J0: stderr was not empty, see: /home/jenkins/workspace/Lucene-Solr-BadApples-master-Linux/lucene/build/analysis/stempel/test/temp/junit4-J0-20190516_040104_9506699770829412600008.syserr
   [junit4] >>> JVM J0 emitted unexpected output (verbatim) ----
   [junit4] JVM J1: stderr was not empty, see: /home/jenkins/workspace/Lucene-Solr-BadApples-master-Linux/lucene/build/analysis/stempel/test/temp/junit4-J1-20190516_040104_9515452988738300018674.syserr
   [junit4] OpenJDK 64-Bit Server VM warning: Option UseConcMarkSweepGC was deprecated in version 9.0 and will likely be removed in a future release.
   [junit4] <<< JVM J0: EOF ----

[...truncated 6 lines...]
   [junit4] JVM J2: stderr was not empty, see: /home/jenkins/workspace/Lucene-Solr-BadApples-master-Linux/lucene/build/analysis/stempel/test/temp/junit4-J2-20190516_040104_9516580447070953531849.syserr
   [junit4] >>> JVM J2 emitted unexpected output (verbatim) ----
   [junit4] OpenJDK 64-Bit Server VM warning: Option UseConcMarkSweepGC was deprecated in version 9.0 and will likely be removed in a future release.
   [junit4] <<< JVM J2: EOF ----

[...truncated 178 lines...]
   [junit4] JVM J0: stderr was not empty, see: /home/jenkins/workspace/Lucene-Solr-BadApples-master-Linux/lucene/build/backward-codecs/test/temp/junit4-J0-20190516_040121_81712900056617814213298.syserr
   [junit4] >>> JVM J0 emitted unexpected output (verbatim) ----
   [junit4] OpenJDK 64-Bit Server VM warning: Option UseConcMarkSweepGC was deprecated in version 9.0 and will likely be removed in a future release.
   [junit4] <<< JVM J0: EOF ----

[...truncated 9 lines...]
   [junit4] JVM J1: stderr was not empty, see: /home/jenkins/workspace/Lucene-Solr-BadApples-master-Linux/lucene/build/backward-codecs/test/temp/junit4-J1-20190516_040121_8176854044723569124470.syserr
   [junit4] >>> JVM J1 emitted unexpected output (verbatim) ----
   [junit4] OpenJDK 64-Bit Server VM warning: Option UseConcMarkSweepGC was deprecated in version 9.0 and will likely be removed in a future release.
   [junit4] <<< JVM J1: EOF ----

[...truncated 9 lines...]
   [junit4] JVM J2: stderr was not empty, see: /home/jenkins/workspace/Lucene-Solr-BadApples-master-Linux/lucene/build/backward-codecs/test/temp/junit4-J2-20190516_040121_8173441093813880428392.syserr
   [junit4] >>> JVM J2 emitted unexpected output (verbatim) ----
   [junit4] OpenJDK 64-Bit Server VM warning: Option UseConcMarkSweepGC was deprecated in version 9.0 and will likely be removed in a future release.
   [junit4] <<< JVM J2: EOF ----

[...truncated 1437 lines...]
   [junit4] JVM J1: stderr was not empty, see: /home/jenkins/workspace/Lucene-Solr-BadApples-master-Linux/lucene/build/benchmark/test/temp/junit4-J1-20190516_040625_4244442399851922612419.syserr
   [junit4] >>> JVM J1 emitted unexpected output (verbatim) ----
   [junit4] OpenJDK 64-Bit Server VM warning: Option UseConcMarkSweepGC was deprecated in version 9.0 and will likely be removed in a future release.
   [junit4] <<< JVM J1: EOF ----

[...truncated 3 lines...]
   [junit4] JVM J2: stderr was not empty, see: /home/jenkins/workspace/Lucene-Solr-BadApples-master-Linux/lucene/build/benchmark/test/temp/junit4-J2-20190516_040625_4241417080505179339365.syserr
   [junit4] >>> JVM J2 emitted unexpected output (verbatim) ----
   [junit4] OpenJDK 64-Bit Server VM warning: Option UseConcMarkSweepGC was deprecated in version 9.0 and will likely be removed in a future release.
   [junit4] <<< JVM J2: EOF ----

[...truncated 3 lines...]
   [junit4] JVM J0: stderr was not empty, see: /home/jenkins/workspace/Lucene-Solr-BadApples-master-Linux/lucene/build/benchmark/test/temp/junit4-J0-20190516_040625_4241631634526266820772.syserr
   [junit4] >>> JVM J0 emitted unexpected output (verbatim) ----
   [junit4] OpenJDK 64-Bit Server VM warning: Option UseConcMarkSweepGC was deprecated in version 9.0 and will likely be removed in a future release.
   [junit4] <<< JVM J0: EOF ----

[...truncated 235 lines...]
   [junit4] JVM J1: stderr was not empty, see: /home/jenkins/workspace/Lucene-Solr-BadApples-master-Linux/lucene/build/classification/test/temp/junit4-J1-20190516_040702_3504928578943539611133.syserr
   [junit4] >>> JVM J1 emitted unexpected output (verbatim) ----
   [junit4] OpenJDK 64-Bit Server VM warning: Option UseConcMarkSweepGC was deprecated in version 9.0 and will likely be removed in a future release.
   [junit4] <<< JVM J1: EOF ----

[...truncated 3 lines...]
   [junit4] JVM J2: stderr was not empty, see: /home/jenkins/workspace/Lucene-Solr-BadApples-master-Linux/lucene/build/classification/test/temp/junit4-J2-20190516_040702_350623690383190241180.syserr
   [junit4] >>> JVM J2 emitted unexpected output (verbatim) ----
   [junit4] OpenJDK 64-Bit Server VM warning: Option UseConcMarkSweepGC was deprecated in version 9.0 and will likely be removed in a future release.
   [junit4] <<< JVM J2: EOF ----

[...truncated 3 lines...]
   [junit4] JVM J0: stderr was not empty, see: /home/jenkins/workspace/Lucene-Solr-BadApples-master-Linux/lucene/build/classification/test/temp/junit4-J0-20190516_040702_35012134502199817483479.syserr
   [junit4] >>> JVM J0 emitted unexpected output (verbatim) ----
   [junit4] OpenJDK 64-Bit Server VM warning: Option UseConcMarkSweepGC was deprecated in version 9.0 and will likely be removed in a future release.
   [junit4] <<< JVM J0: EOF ----

[...truncated 249 lines...]
   [junit4] JVM J2: stderr was not empty, see: /home/jenkins/workspace/Lucene-Solr-BadApples-master-Linux/lucene/build/codecs/test/temp/junit4-J2-20190516_040744_32065217360850821359.syserr
   [junit4] >>> JVM J2 emitted unexpected output (verbatim) ----
   [junit4] OpenJDK 64-Bit Server VM warning: Option UseConcMarkSweepGC was deprecated in version 9.0 and will likely be removed in a future release.
   [junit4] <<< JVM J2: EOF ----

[...truncated 7 lines...]
   [junit4] JVM J1: stderr was not empty, see: /home/jenkins/workspace/Lucene-Solr-BadApples-master-Linux/lucene/build/codecs/test/temp/junit4-J1-20190516_040744_3201220530660389939911.syserr
   [junit4] >>> JVM J1 emitted unexpected output (verbatim) ----
   [junit4] OpenJDK 64-Bit Server VM warning: Option UseConcMarkSweepGC was deprecated in version 9.0 and will likely be removed in a future release.
   [junit4] <<< JVM J1: EOF ----

[...truncated 9 lines...]
   [junit4] JVM J0: stderr was not empty, see: /home/jenkins/workspace/Lucene-Solr-BadApples-master-Linux/lucene/build/codecs/test/temp/junit4-J0-20190516_040744_3192434407341881560997.syserr
   [junit4] >>> JVM J0 emitted unexpected output (verbatim) ----
   [junit4] OpenJDK 64-Bit Server VM warning: Option UseConcMarkSweepGC was deprecated in version 9.0 and will likely be removed in a future release.
   [junit4] <<< JVM J0: EOF ----

[...truncated 209 lines...]
   [junit4] JVM J0: stderr was not empty, see: /home/jenkins/workspace/Lucene-Solr-BadApples-master-Linux/lucene/build/demo/test/temp/junit4-J0-20190516_041249_4668061845960056146510.syserr
   [junit4] >>> JVM J0 emitted unexpected output (verbatim) ----
   [junit4] Suite: org.apache.lucene.demo.facet.TestDistanceFacetsExample
   [junit4] Completed [8/8] on J2 in 1.27s, 2 tests
   [junit4] 
   [junit4] OpenJDK 64-Bit Server VM warning: Option UseConcMarkSweepGC was deprecated in version 9.0 and will likely be removed in a future release.
   [junit4] <<< JVM J0: EOF ----

   [junit4] JVM J1: stderr was not empty, see: /home/jenkins/workspace/Lucene-Solr-BadApples-master-Linux/lucene/build/demo/test/temp/junit4-J1-20190516_041249_46716229926006681774767.syserr
   [junit4] >>> JVM J1 emitted unexpected output (verbatim) ----
   [junit4] OpenJDK 64-Bit Server VM warning: Option UseConcMarkSweepGC was deprecated in version 9.0 and will likely be removed in a future release.
   [junit4] <<< JVM J1: EOF ----

   [junit4] JVM J2: stderr was not empty, see: /home/jenkins/workspace/Lucene-Solr-BadApples-master-Linux/lucene/build/demo/test/temp/junit4-J2-20190516_041249_46713261238185761924729.syserr
   [junit4] >>> JVM J2 emitted unexpected output (verbatim) ----
   [junit4] OpenJDK 64-Bit Server VM warning: Option UseConcMarkSweepGC was deprecated in version 9.0 and will likely be removed in a future release.
   [junit4] <<< JVM J2: EOF ----

[...truncated 170 lines...]
   [junit4] JVM J2: stderr was not empty, see: /home/jenkins/workspace/Lucene-Solr-BadApples-master-Linux/lucene/build/expressions/test/temp/junit4-J2-20190516_041306_9754035533122796066343.syserr
   [junit4] >>> JVM J2 emitted unexpected output (verbatim) ----
   [junit4] JVM J1: stderr was not empty, see: /home/jenkins/workspace/Lucene-Solr-BadApples-master-Linux/lucene/build/expressions/test/temp/junit4-J1-20190516_041306_97510186706806038287543.syserr
   [junit4] OpenJDK 64-Bit Server VM warning: Option UseConcMarkSweepGC was deprecated in version 9.0 and will likely be removed in a future release.
   [junit4] <<< JVM J2: EOF ----

[...truncated 9 lines...]
   [junit4] JVM J0: stderr was not empty, see: /home/jenkins/workspace/Lucene-Solr-BadApples-master-Linux/lucene/build/expressions/test/temp/junit4-J0-20190516_041306_97511681213631437496481.syserr
   [junit4] >>> JVM J0 emitted unexpected output (verbatim) ----
   [junit4] OpenJDK 64-Bit Server VM warning: Option UseConcMarkSweepGC was deprecated in version 9.0 and will likely be removed in a future release.
   [junit4] <<< JVM J0: EOF ----

[...truncated 229 lines...]
   [junit4] JVM J2: stderr was not empty, see: /home/jenkins/workspace/Lucene-Solr-BadApples-master-Linux/lucene/build/facet/test/temp/junit4-J2-20190516_041339_0545538086792884799402.syserr
   [junit4] >>> JVM J2 emitted unexpected output (verbatim) ----
   [junit4] OpenJDK 64-Bit Server VM warning: Option UseConcMarkSweepGC was deprecated in version 9.0 and will likely be removed in a future release.
   [junit4] <<< JVM J2: EOF ----

[...truncated 3 lines...]
   [junit4] JVM J1: stderr was not empty, see: /home/jenkins/workspace/Lucene-Solr-BadApples-master-Linux/lucene/build/facet/test/temp/junit4-J1-20190516_041339_05414165847200960548991.syserr
   [junit4] >>> JVM J1 emitted unexpected output (verbatim) ----
   [junit4] OpenJDK 64-Bit Server VM warning: Option UseConcMarkSweepGC was deprecated in version 9.0 and will likely be removed in a future release.
   [junit4] <<< JVM J1: EOF ----

   [junit4] JVM J0: stderr was not empty, see: /home/jenkins/workspace/Lucene-Solr-BadApples-master-Linux/lucene/build/facet/test/temp/junit4-J0-20190516_041339_05415044707115301181085.syserr
   [junit4] >>> JVM J0 emitted unexpected output (verbatim) ----
   [junit4] OpenJDK 64-Bit Server VM warning: Option UseConcMarkSweepGC was deprecated in version 9.0 and will likely be removed in a future release.
   [junit4] <<< JVM J0: EOF ----

[...truncated 179 lines...]
   [junit4] JVM J2: stderr was not empty, see: /home/jenkins/workspace/Lucene-Solr-BadApples-master-Linux/lucene/build/grouping/test/temp/junit4-J2-20190516_041501_5551776035767467525326.syserr
   [junit4] >>> JVM J2 emitted unexpected output (verbatim) ----
   [junit4] OpenJDK 64-Bit Server VM warning: Option UseConcMarkSweepGC was deprecated in version 9.0 and will likely be removed in a future release.
   [junit4] <<< JVM J2: EOF ----

[...truncated 3 lines...]
   [junit4] JVM J0: stderr was not empty, see: /home/jenkins/workspace/Lucene-Solr-BadApples-master-Linux/lucene/build/grouping/test/temp/junit4-J0-20190516_041501_5554055275916888408860.syserr
   [junit4] >>> JVM J0 emitted unexpected output (verbatim) ----
   [junit4] OpenJDK 64-Bit Server VM warning: Option UseConcMarkSweepGC was deprecated in version 9.0 and will likely be removed in a future release.
   [junit4] <<< JVM J0: EOF ----

[...truncated 3 lines...]
   [junit4] JVM J1: stderr was not empty, see: /home/jenkins/workspace/Lucene-Solr-BadApples-master-Linux/lucene/build/grouping/test/temp/junit4-J1-20190516_041501_5557641657049408645243.syserr
   [junit4] >>> JVM J1 emitted unexpected output (verbatim) ----
   [junit4] OpenJDK 64-Bit Server VM warning: Option UseConcMarkSweepGC was deprecated in version 9.0 and will likely be removed in a future release.
   [junit4] <<< JVM J1: EOF ----

[...truncated 237 lines...]
   [junit4] JVM J1: stderr was not empty, see: /home/jenkins/workspace/Lucene-Solr-BadApples-master-Linux/lucene/build/highlighter/test/temp/junit4-J1-20190516_041532_56611642335095504786121.syserr
   [junit4] >>> JVM J1 emitted unexpected output (verbatim) ----
   [junit4] Suite: org.apache.lucene.search.vectorhighlight.WeightedFragListBuilderTest
   [junit4] Completed [26/29] on J0 in 0.28s, 2 tests
   [junit4] 
   [junit4] OpenJDK 64-Bit Server VM warning: Option UseConcMarkSweepGC was deprecated in version 9.0 and will likely be removed in a future release.
   [junit4] <<< JVM J1: EOF ----

   [junit4] JVM J0: stderr was not empty, see: /home/jenkins/workspace/Lucene-Solr-BadApples-master-Linux/lucene/build/highlighter/test/temp/junit4-J0-20190516_041532_5662077524621344158384.syserr
   [junit4] >>> JVM J0 emitted unexpected output (verbatim) ----
   [junit4] OpenJDK 64-Bit Server VM warning: Option UseConcMarkSweepGC was deprecated in version 9.0 and will likely be removed in a future release.
   [junit4] <<< JVM J0: EOF ----

[...truncated 9 lines...]
   [junit4] JVM J2: stderr was not empty, see: /home/jenkins/workspace/Lucene-Solr-BadApples-master-Linux/lucene/build/highlighter/test/temp/junit4-J2-20190516_041532_56612562980037913693244.syserr
   [junit4] >>> JVM J2 emitted unexpected output (verbatim) ----
   [junit4] OpenJDK 64-Bit Server VM warning: Option UseConcMarkSweepGC was deprecated in version 9.0 and will likely be removed in a future release.
   [junit4] <<< JVM J2: EOF ----

[...truncated 163 lines...]
   [junit4] JVM J1: stderr was not empty, see: /home/jenkins/workspace/Lucene-Solr-BadApples-master-Linux/lucene/build/join/test/temp/junit4-J1-20190516_041641_72310163473669507230441.syserr
   [junit4] >>> JVM J1 emitted unexpected output (verbatim) ----
   [junit4] OpenJDK 64-Bit Server VM warning: Option UseConcMarkSweepGC was deprecated in version 9.0 and will likely be removed in a future release.
   [junit4] <<< JVM J1: EOF ----

[...truncated 3 lines...]
   [junit4] JVM J2: stderr was not empty, see: /home/jenkins/workspace/Lucene-Solr-BadApples-master-Linux/lucene/build/join/test/temp/junit4-J2-20190516_041641_72314381138353879117820.syserr
   [junit4] >>> JVM J2 emitted unexpected output (verbatim) ----
   [junit4] OpenJDK 64-Bit Server VM warning: Option UseConcMarkSweepGC was deprecated in version 9.0 and will likely be removed in a future release.
   [junit4] <<< JVM J2: EOF ----

[...truncated 6 lines...]
   [junit4] JVM J0: stderr was not empty, see: /home/jenkins/workspace/Lucene-Solr-BadApples-master-Linux/lucene/build/join/test/temp/junit4-J0-20190516_041641_72318137834270435762542.syserr
   [junit4] >>> JVM J0 emitted unexpected output (verbatim) ----
   [junit4] OpenJDK 64-Bit Server VM warning: Option UseConcMarkSweepGC was deprecated in version 9.0 and will likely be removed in a future release.
   [junit4] <<< JVM J0: EOF ----

[...truncated 268 lines...]
   [junit4] JVM J0: stderr was not empty, see: /home/jenkins/workspace/Lucene-Solr-BadApples-master-Linux/lucene/build/luke/test/temp/junit4-J0-20190516_041756_49612140460130471035006.syserr
   [junit4] >>> JVM J0 emitted unexpected output (verbatim) ----
   [junit4] OpenJDK 64-Bit Server VM warning: Option UseConcMarkSweepGC was deprecated in version 9.0 and will likely be removed in a future release.
   [junit4] <<< JVM J0: EOF ----

[...truncated 3 lines...]
   [junit4] JVM J1: stderr was not empty, see: /home/jenkins/workspace/Lucene-Solr-BadApples-master-Linux/lucene/build/luke/test/temp/junit4-J1-20190516_041756_4963984351249432840051.syserr
   [junit4] >>> JVM J1 emitted unexpected output (verbatim) ----
   [junit4] OpenJDK 64-Bit Server VM warning: Option UseConcMarkSweepGC was deprecated in version 9.0 and will likely be removed in a future release.
   [junit4] <<< JVM J1: EOF ----

[...truncated 3 lines...]
   [junit4] JVM J2: stderr was not empty, see: /home/jenkins/workspace/Lucene-Solr-BadApples-master-Linux/lucene/build/luke/test/temp/junit4-J2-20190516_041756_496183471739842659422.syserr
   [junit4] >>> JVM J2 emitted unexpected output (verbatim) ----
   [junit4] OpenJDK 64-Bit Server VM warning: Option UseConcMarkSweepGC was deprecated in version 9.0 and will likely be removed in a future release.
   [junit4] <<< JVM J2: EOF ----

[...truncated 149 lines...]
   [junit4] JVM J0: stderr was not empty, see: /home/jenkins/workspace/Lucene-Solr-BadApples-master-Linux/lucene/build/memory/test/temp/junit4-J0-20190516_041825_62516561588907669978290.syserr
   [junit4] >>> JVM J0 emitted unexpected output (verbatim) ----
   [junit4] OpenJDK 64-Bit Server VM warning: Option UseConcMarkSweepGC was deprecated in version 9.0 and will likely be removed in a future release.
   [junit4] <<< JVM J0: EOF ----

[...truncated 3 lines...]
   [junit4] JVM J1: stderr was not empty, see: /home/jenkins/workspace/Lucene-Solr-BadApples-master-Linux/lucene/build/memory/test/temp/junit4-J1-20190516_041825_6258837683088852410354.syserr
   [junit4] >>> JVM J1 emitted unexpected output (verbatim) ----
   [junit4] OpenJDK 64-Bit Server VM warning: Option UseConcMarkSweepGC was deprecated in version 9.0 and will likely be removed in a future release.
   [junit4] <<< JVM J1: EOF ----

[...truncated 182 lines...]
   [junit4] JVM J2: stderr was not empty, see: /home/jenkins/workspace/Lucene-Solr-BadApples-master-Linux/lucene/build/misc/test/temp/junit4-J2-20190516_041857_7065396830913840429093.syserr
   [junit4] >>> JVM J2 emitted unexpected output (verbatim) ----
   [junit4] OpenJDK 64-Bit Server VM warning: Option UseConcMarkSweepGC was deprecated in version 9.0 and will likely be removed in a future release.
   [junit4] <<< JVM J2: EOF ----

[...truncated 3 lines...]
   [junit4] JVM J0: stderr was not empty, see: /home/jenkins/workspace/Lucene-Solr-BadApples-master-Linux/lucene/build/misc/test/temp/junit4-J0-20190516_041857_70610547012711028398646.syserr
   [junit4] >>> JVM J0 emitted unexpected output (verbatim) ----
   [junit4] OpenJDK 64-Bit Server VM warning: Option UseConcMarkSweepGC was deprecated in version 9.0 and will likely be removed in a future release.
   [junit4] <<< JVM J0: EOF ----

[...truncated 3 lines...]
   [junit4] JVM J1: stderr was not empty, see: /home/jenkins/workspace/Lucene-Solr-BadApples-master-Linux/lucene/build/misc/test/temp/junit4-J1-20190516_041857_70618010120364255554053.syserr
   [junit4] >>> JVM J1 emitted unexpected output (verbatim) ----
   [junit4] OpenJDK 64-Bit Server VM warning: Option UseConcMarkSweepGC was deprecated in version 9.0 and will likely be removed in a future release.
   [junit4] <<< JVM J1: EOF ----

[...truncated 301 lines...]
   [junit4] JVM J0: stderr was not empty, see: /home/jenkins/workspace/Lucene-Solr-BadApples-master-Linux/lucene/build/queries/test/temp/junit4-J0-20190516_042000_70614383248814695542109.syserr
   [junit4] >>> JVM J0 emitted unexpected output (verbatim) ----
   [junit4] OpenJDK 64-Bit Server VM warning: Option UseConcMarkSweepGC was deprecated in version 9.0 and will likely be removed in a future release.
   [junit4] <<< JVM J0: EOF ----

   [junit4] JVM J1: stderr was not empty, see: /home/jenkins/workspace/Lucene-Solr-BadApples-master-Linux/lucene/build/queries/test/temp/junit4-J1-20190516_042000_70613074231807602311902.syserr
   [junit4] >>> JVM J1 emitted unexpected output (verbatim) ----
   [junit4] OpenJDK 64-Bit Server VM warning: Option UseConcMarkSweepGC was deprecated in version 9.0 and will likely be removed in a future release.
   [junit4] <<< JVM J1: EOF ----

[...truncated 3 lines...]
   [junit4] JVM J2: stderr was not empty, see: /home/jenkins/workspace/Lucene-Solr-BadApples-master-Linux/lucene/build/queries/test/temp/junit4-J2-20190516_042000_70611856994065436744158.syserr
   [junit4] >>> JVM J2 emitted unexpected output (verbatim) ----
   [junit4] OpenJDK 64-Bit Server VM warning: Option UseConcMarkSweepGC was deprecated in version 9.0 and will likely be removed in a future release.
   [junit4] <<< JVM J2: EOF ----

[...truncated 223 lines...]
   [junit4] JVM J0: stderr was not empty, see: /home/jenkins/workspace/Lucene-Solr-BadApples-master-Linux/lucene/build/queryparser/test/temp/junit4-J0-20190516_042029_06613101861908087108666.syserr
   [junit4] >>> JVM J0 emitted unexpected output (verbatim) ----
   [junit4] OpenJDK 64-Bit Server VM warning: Option UseConcMarkSweepGC was deprecated in version 9.0 and will likely be removed in a future release.
   [junit4] <<< JVM J0: EOF ----

[...truncated 3 lines...]
   [junit4] JVM J2: stderr was not empty, see: /home/jenkins/workspace/Lucene-Solr-BadApples-master-Linux/lucene/build/queryparser/test/temp/junit4-J2-20190516_042029_06610871988419095981644.syserr
   [junit4] >>> JVM J2 emitted unexpected output (verbatim) ----
   [junit4] OpenJDK 64-Bit Server VM warning: Option UseConcMarkSweepGC was deprecated in version 9.0 and will likely be removed in a future release.
   [junit4] <<< JVM J2: EOF ----

[...truncated 3 lines...]
   [junit4] JVM J1: stderr was not empty, see: /home/jenkins/workspace/Lucene-Solr-BadApples-master-Linux/lucene/build/queryparser/test/temp/junit4-J1-20190516_042029_0668433738561857752014.syserr
   [junit4] >>> JVM J1 emitted unexpected output (verbatim) ----
   [junit4] OpenJDK 64-Bit Server VM warning: Option UseConcMarkSweepGC was deprecated in version 9.0 and will likely be removed in a future release.
   [junit4] <<< JVM J1: EOF ----

[...truncated 184 lines...]
   [junit4] JVM J2: stderr was not empty, see: /home/jenkins/workspace/Lucene-Solr-BadApples-master-Linux/lucene/build/replicator/test/temp/junit4-J2-20190516_042100_34813419549869147289736.syserr
   [junit4] >>> JVM J2 emitted unexpected output (verbatim) ----
   [junit4] OpenJDK 64-Bit Server VM warning: Option UseConcMarkSweepGC was deprecated in version 9.0 and will likely be removed in a future release.
   [junit4] <<< JVM J2: EOF ----

[...truncated 26 lines...]
   [junit4] JVM J0: stderr was not empty, see: /home/jenkins/workspace/Lucene-Solr-BadApples-master-Linux/lucene/build/replicator/test/temp/junit4-J0-20190516_042100_348384103215519810026.syserr
   [junit4] >>> JVM J0 emitted unexpected output (verbatim) ----
   [junit4] OpenJDK 64-Bit Server VM warning: Option UseConcMarkSweepGC was deprecated in version 9.0 and will likely be removed in a future release.
   [junit4] <<< JVM J0: EOF ----

[...truncated 3 lines...]
   [junit4] JVM J1: stderr was not empty, see: /home/jenkins/workspace/Lucene-Solr-BadApples-master-Linux/lucene/build/replicator/test/temp/junit4-J1-20190516_042100_3488845327092371216039.syserr
   [junit4] >>> JVM J1 emitted unexpected output (verbatim) ----
   [junit4] OpenJDK 64-Bit Server VM warning: Option UseConcMarkSweepGC was deprecated in version 9.0 and will likely be removed in a future release.
   [junit4] <<< JVM J1: EOF ----

[...truncated 240 lines...]
   [junit4] JVM J1: stderr was not empty, see: /home/jenkins/workspace/Lucene-Solr-BadApples-master-Linux/lucene/build/sandbox/test/temp/junit4-J1-20190516_042133_29211506272510098676207.syserr
   [junit4] >>> JVM J1 emitted unexpected output (verbatim) ----
   [junit4] OpenJDK 64-Bit Server VM warning: Option UseConcMarkSweepGC was deprecated in version 9.0 and will likely be removed in a future release.
   [junit4] <<< JVM J1: EOF ----

[...truncated 3 lines...]
   [junit4] JVM J0: stderr was not empty, see: /home/jenkins/workspace/Lucene-Solr-BadApples-master-Linux/lucene/build/sandbox/test/temp/junit4-J0-20190516_042133_29218325313948661065008.syserr
   [junit4] >>> JVM J0 emitted unexpected output (verbatim) ----
   [junit4] OpenJDK 64-Bit Server VM warning: Option UseConcMarkSweepGC was deprecated in version 9.0 and will likely be removed in a future release.
   [junit4] <<< JVM J0: EOF ----

[...truncated 10 lines...]
   [junit4] JVM J2: stderr was not empty, see: /home/jenkins/workspace/Lucene-Solr-BadApples-master-Linux/lucene/build/sandbox/test/temp/junit4-J2-20190516_042133_2922246007807935188211.syserr
   [junit4] >>> JVM J2 emitted unexpected output (verbatim) ----
   [junit4] OpenJDK 64-Bit Server VM warning: Option UseConcMarkSweepGC was deprecated in version 9.0 and will likely be removed in a future release.
   [junit4] <<< JVM J2: EOF ----

[...truncated 297 lines...]
   [junit4] JVM J0: stderr was not empty, see: /home/jenkins/workspace/Lucene-Solr-BadApples-master-Linux/lucene/build/spatial-extras/test/temp/junit4-J0-20190516_042337_9974547423544088690768.syserr
   [junit4] >>> JVM J0 emitted unexpected output (verbatim) ----
   [junit4] OpenJDK 64-Bit Server VM warning: Option UseConcMarkSweepGC was deprecated in version 9.0 and will likely be removed in a future release.
   [junit4] <<< JVM J0: EOF ----

[...truncated 3 lines...]
   [junit4] JVM J2: stderr was not empty, see: /home/jenkins/workspace/Lucene-Solr-BadApples-master-Linux/lucene/build/spatial-extras/test/temp/junit4-J2-20190516_042337_99712257628515354508664.syserr
   [junit4] >>> JVM J2 emitted unexpected output (verbatim) ----
   [junit4] OpenJDK 64-Bit Server VM warning: Option UseConcMarkSweepGC was deprecated in version 9.0 and will likely be removed in a future release.
   [junit4] <<< JVM J2: EOF ----

[...truncated 3 lines...]
   [junit4] JVM J1: stderr was not empty, see: /home/jenkins/workspace/Lucene-Solr-BadApples-master-Linux/lucene/build/spatial-extras/test/temp/junit4-J1-20190516_042337_99716544983076577984144.syserr
   [junit4] >>> JVM J1 emitted unexpected output (verbatim) ----
   [junit4] OpenJDK 64-Bit Server VM warning: Option UseConcMarkSweepGC was deprecated in version 9.0 and will likely be removed in a future release.
   [junit4] <<< JVM J1: EOF ----

[...truncated 148 lines...]
   [junit4] JVM J0: stderr was not empty, see: /home/jenkins/workspace/Lucene-Solr-BadApples-master-Linux/lucene/build/spatial/test/temp/junit4-J0-20190516_042438_0432338889633286416937.syserr
   [junit4] >>> JVM J0 emitted unexpected output (verbatim) ----
   [junit4] OpenJDK 64-Bit Server VM warning: Option UseConcMarkSweepGC was deprecated in version 9.0 and will likely be removed in a future release.
   [junit4] <<< JVM J0: EOF ----

[...truncated 181 lines...]
   [junit4] JVM J2: stderr was not empty, see: /home/jenkins/workspace/Lucene-Solr-BadApples-master-Linux/lucene/build/spatial3d/test/temp/junit4-J2-20190516_042449_09812720047700058797279.syserr
   [junit4] >>> JVM J2 emitted unexpected output (verbatim) ----
   [junit4] OpenJDK 64-Bit Server VM warning: Option UseConcMarkSweepGC was deprecated in version 9.0 and will likely be removed in a future release.
   [junit4] <<< JVM J2: EOF ----

[...truncated 3 lines...]
   [junit4] JVM J0: stderr was not empty, see: /home/jenkins/workspace/Lucene-Solr-BadApples-master-Linux/lucene/build/spatial3d/test/temp/junit4-J0-20190516_042449_0982720406291317127525.syserr
   [junit4] >>> JVM J0 emitted unexpected output (verbatim) ----
   [junit4] OpenJDK 64-Bit Server VM warning: Option UseConcMarkSweepGC was deprecated in version 9.0 and will likely be removed in a future release.
   [junit4] <<< JVM J0: EOF ----

[...truncated 6 lines...]
   [junit4] JVM J1: stderr was not empty, see: /home/jenkins/workspace/Lucene-Solr-BadApples-master-Linux/lucene/build/spatial3d/test/temp/junit4-J1-20190516_042449_0985154689204567799248.syserr
   [junit4] >>> JVM J1 emitted unexpected output (verbatim) ----
   [junit4] OpenJDK 64-Bit Server VM warning: Option UseConcMarkSweepGC was deprecated in version 9.0 and will likely be removed in a future release.
   [junit4] <<< JVM J1: EOF ----

[...truncated 242 lines...]
   [junit4] JVM J1: stderr was not empty, see: /home/jenkins/workspace/Lucene-Solr-BadApples-master-Linux/lucene/build/suggest/test/temp/junit4-J1-20190516_042712_06712759700625660749292.syserr
   [junit4] >>> JVM J1 emitted unexpected output (verbatim) ----
   [junit4] OpenJDK 64-Bit Server VM warning: Option UseConcMarkSweepGC was deprecated in version 9.0 and will likely be removed in a future release.
   [junit4] <<< JVM J1: EOF ----

[...truncated 12 lines...]
   [junit4] JVM J2: stderr was not empty, see: /home/jenkins/workspace/Lucene-Solr-BadApples-master-Linux/lucene/build/suggest/test/temp/junit4-J2-20190516_042712_0684703747944683398334.syserr
   [junit4] >>> JVM J2 emitted unexpected output (verbatim) ----
   [junit4] OpenJDK 64-Bit Server VM warning: Option UseConcMarkSweepGC was deprecated in version 9.0 and will likely be removed in a future release.
   [junit4] <<< JVM J2: EOF ----

[...truncated 3 lines...]
   [junit4] JVM J0: stderr was not empty, see: /home/jenkins/workspace/Lucene-Solr-BadApples-master-Linux/lucene/build/suggest/test/temp/junit4-J0-20190516_042712_0673018343604951955535.syserr
   [junit4] >>> JVM J0 emitted unexpected output (verbatim) ----
   [junit4] OpenJDK 64-Bit Server VM warning: Option UseConcMarkSweepGC was deprecated in version 9.0 and will likely be removed in a future release.
   [junit4] <<< JVM J0: EOF ----

[...truncated 3913 lines...]
   [junit4] Suite: org.apache.solr.handler.component.TestDistributedStatsComponentCardinality
   [junit4]   2> Creating dataDir: /home/jenkins/workspace/Lucene-Solr-BadApples-master-Linux/solr/build/solr-core/test/J1/temp/solr.handler.component.TestDistributedStatsComponentCardinality_352B531224281502-001/init-core-data-001
   [junit4]   2> 3646043 WARN  (SUITE-TestDistributedStatsComponentCardinality-seed#[352B531224281502]-worker) [    ] o.a.s.SolrTestCaseJ4 startTrackingSearchers: numOpens=42 numCloses=42
   [junit4]   2> 3646043 INFO  (SUITE-TestDistributedStatsComponentCardinality-seed#[352B531224281502]-worker) [    ] o.a.s.SolrTestCaseJ4 Using PointFields (NUMERIC_POINTS_SYSPROP=true) w/NUMERIC_DOCVALUES_SYSPROP=true
   [junit4]   2> 3646044 INFO  (SUITE-TestDistributedStatsComponentCardinality-seed#[352B531224281502]-worker) [    ] o.a.s.SolrTestCaseJ4 Randomized ssl (false) and clientAuth (false) via: @org.apache.solr.SolrTestCaseJ4$SuppressSSL(bugUrl="https://issues.apache.org/jira/browse/SOLR-9062")
   [junit4]   2> 3646044 INFO  (SUITE-TestDistributedStatsComponentCardinality-seed#[352B531224281502]-worker) [    ] o.a.s.SolrTestCaseJ4 SecureRandom sanity checks: test.solr.allowed.securerandom=null & java.security.egd=file:/dev/./urandom
   [junit4]   2> 3646044 INFO  (SUITE-TestDistributedStatsComponentCardinality-seed#[352B531224281502]-worker) [    ] o.a.s.BaseDistributedSearchTestCase Setting hostContext system property: /
   [junit4]   2> 3646511 INFO  (TEST-TestDistributedStatsComponentCardinality.test-seed#[352B531224281502]) [    ] o.a.s.SolrTestCaseJ4 Writing core.properties file to /home/jenkins/workspace/Lucene-Solr-BadApples-master-Linux/solr/build/solr-core/test/J1/temp/solr.handler.component.TestDistributedStatsComponentCardinality_352B531224281502-001/tempDir-001/control/cores/collection1
   [junit4]   2> 3646512 WARN  (TEST-TestDistributedStatsComponentCardinality.test-seed#[352B531224281502]) [    ] o.e.j.s.AbstractConnector Ignoring deprecated socket close linger time
   [junit4]   2> 3646512 INFO  (TEST-TestDistributedStatsComponentCardinality.test-seed#[352B531224281502]) [    ] o.a.s.c.s.e.JettySolrRunner Start Jetty (original configured port=0)
   [junit4]   2> 3646512 INFO  (TEST-TestDistributedStatsComponentCardinality.test-seed#[352B531224281502]) [    ] o.a.s.c.s.e.JettySolrRunner Trying to start Jetty on port 0 try number 1 ...
   [junit4]   2> 3646512 INFO  (TEST-TestDistributedStatsComponentCardinality.test-seed#[352B531224281502]) [    ] o.e.j.s.Server jetty-9.4.14.v20181114; built: 2018-11-14T21:20:31.478Z; git: c4550056e785fb5665914545889f21dc136ad9e6; jvm 13-testing+0-builds.shipilev.net-openjdk-jdk-b845-20190430-jdk-1318
   [junit4]   2> 3646518 INFO  (TEST-TestDistributedStatsComponentCardinality.test-seed#[352B531224281502]) [    ] o.e.j.s.session DefaultSessionIdManager workerName=node0
   [junit4]   2> 3646518 INFO  (TEST-TestDistributedStatsComponentCardinality.test-seed#[352B531224281502]) [    ] o.e.j.s.session No SessionScavenger set, using defaults
   [junit4]   2> 3646518 INFO  (TEST-TestDistributedStatsComponentCardinality.test-seed#[352B531224281502]) [    ] o.e.j.s.session node0 Scavenging every 660000ms
   [junit4]   2> 3646518 INFO  (TEST-TestDistributedStatsComponentCardinality.test-seed#[352B531224281502]) [    ] o.e.j.s.h.ContextHandler Started o.e.j.s.ServletContextHandler@339d3f93{/,null,AVAILABLE}
   [junit4]   2> 3646519 INFO  (TEST-TestDistributedStatsComponentCardinality.test-seed#[352B531224281502]) [    ] o.e.j.s.AbstractConnector Started ServerConnector@270ffdd4{HTTP/1.1,[http/1.1, h2c]}{127.0.0.1:37599}
   [junit4]   2> 3646519 INFO  (TEST-TestDistributedStatsComponentCardinality.test-seed#[352B531224281502]) [    ] o.e.j.s.Server Started @3646765ms
   [junit4]   2> 3646519 INFO  (TEST-TestDistributedStatsComponentCardinality.test-seed#[352B531224281502]) [    ] o.a.s.c.s.e.JettySolrRunner Jetty properties: {hostContext=/, hostPort=37599, coreRootDirectory=/home/jenkins/workspace/Lucene-Solr-BadApples-master-Linux/solr/build/solr-core/test/J1/temp/solr.handler.component.TestDistributedStatsComponentCardinality_352B531224281502-001/tempDir-001/control/cores}
   [junit4]   2> 3646520 ERROR (TEST-TestDistributedStatsComponentCardinality.test-seed#[352B531224281502]) [    ] o.a.s.u.StartupLoggingUtils Missing Java Option solr.log.dir. Logging may be missing or incomplete.
   [junit4]   2> 3646520 INFO  (TEST-TestDistributedStatsComponentCardinality.test-seed#[352B531224281502]) [    ] o.a.s.s.SolrDispatchFilter Using logger factory org.apache.logging.slf4j.Log4jLoggerFactory
   [junit4]   2> 3646520 INFO  (TEST-TestDistributedStatsComponentCardinality.test-seed#[352B531224281502]) [    ] o.a.s.s.SolrDispatchFilter  ___      _       Welcome to Apache Solr™ version 9.0.0
   [junit4]   2> 3646520 INFO  (TEST-TestDistributedStatsComponentCardinality.test-seed#[352B531224281502]) [    ] o.a.s.s.SolrDispatchFilter / __| ___| |_ _   Starting in standalone mode on port null
   [junit4]   2> 3646520 INFO  (TEST-TestDistributedStatsComponentCardinality.test-seed#[352B531224281502]) [    ] o.a.s.s.SolrDispatchFilter \__ \/ _ \ | '_|  Install dir: null
   [junit4]   2> 3646520 INFO  (TEST-TestDistributedStatsComponentCardinality.test-seed#[352B531224281502]) [    ] o.a.s.s.SolrDispatchFilter |___/\___/_|_|    Start time: 2019-05-16T05:30:57.550771Z
   [junit4]   2> 3646521 INFO  (TEST-TestDistributedStatsComponentCardinality.test-seed#[352B531224281502]) [    ] o.a.s.c.SolrXmlConfig Loading container configuration from /home/jenkins/workspace/Lucene-Solr-BadApples-master-Linux/solr/build/solr-core/test/J1/temp/solr.handler.component.TestDistributedStatsComponentCardinality_352B531224281502-001/tempDir-001/control/solr.xml
   [junit4]   2> 3646525 INFO  (TEST-TestDistributedStatsComponentCardinality.test-seed#[352B531224281502]) [    ] o.a.s.c.SolrXmlConfig Configuration parameter autoReplicaFailoverWorkLoopDelay is ignored
   [junit4]   2> 3646525 INFO  (TEST-TestDistributedStatsComponentCardinality.test-seed#[352B531224281502]) [    ] o.a.s.c.SolrXmlConfig Configuration parameter autoReplicaFailoverBadNodeExpiration is ignored
   [junit4]   2> 3646527 INFO  (TEST-TestDistributedStatsComponentCardinality.test-seed#[352B531224281502]) [    ] o.a.s.c.SolrXmlConfig MBean server found: com.sun.jmx.mbeanserver.JmxMBeanServer@2b4018a1, but no JMX reporters were configured - adding default JMX reporter.
   [junit4]   2> 3646599 INFO  (TEST-TestDistributedStatsComponentCardinality.test-seed#[352B531224281502]) [    ] o.a.s.h.c.HttpShardHandlerFactory Host whitelist initialized: WhitelistHostChecker [whitelistHosts=null, whitelistHostCheckingEnabled=false]
   [junit4]   2> 3646600 WARN  (TEST-TestDistributedStatsComponentCardinality.test-seed#[352B531224281502]) [    ] o.e.j.u.s.S.config No Client EndPointIdentificationAlgorithm configured for SslContextFactory@a4eab95[provider=null,keyStore=null,trustStore=null]
   [junit4]   2> 3646605 WARN  (TEST-TestDistributedStatsComponentCardinality.test-seed#[352B531224281502]) [    ] o.e.j.u.s.S.config No Client EndPointIdentificationAlgorithm configured for SslContextFactory@4adeda8b[provider=null,keyStore=null,trustStore=null]
   [junit4]   2> 3646637 INFO  (TEST-TestDistributedStatsComponentCardinality.test-seed#[352B531224281502]) [    ] o.a.s.c.TransientSolrCoreCacheDefault Allocating transient cache for 4 transient cores
   [junit4]   2> 3646637 INFO  (TEST-TestDistributedStatsComponentCardinality.test-seed#[352B531224281502]) [    ] o.a.s.h.a.MetricsHistoryHandler No .system collection, keeping metrics history in memory.
   [junit4]   2> 3646664 INFO  (TEST-TestDistributedStatsComponentCardinality.test-seed#[352B531224281502]) [    ] o.a.s.m.r.SolrJmxReporter JMX monitoring for 'solr.node' (registry 'solr.node') enabled at server: com.sun.jmx.mbeanserver.JmxMBeanServer@2b4018a1
   [junit4]   2> 3646695 INFO  (TEST-TestDistributedStatsComponentCardinality.test-seed#[352B531224281502]) [    ] o.a.s.m.r.SolrJmxReporter JMX monitoring for 'solr.jvm' (registry 'solr.jvm') enabled at server: com.sun.jmx.mbeanserver.JmxMBeanServer@2b4018a1
   [junit4]   2> 3646696 INFO  (TEST-TestDistributedStatsComponentCardinality.test-seed#[352B531224281502]) [    ] o.a.s.m.r.SolrJmxReporter JMX monitoring for 'solr.jetty' (registry 'solr.jetty') enabled at server: com.sun.jmx.mbeanserver.JmxMBeanServer@2b4018a1
   [junit4]   2> 3646699 INFO  (TEST-TestDistributedStatsComponentCardinality.test-seed#[352B531224281502]) [    ] o.a.s.c.CorePropertiesLocator Found 1 core definitions underneath /home/jenkins/workspace/Lucene-Solr-BadApples-master-Linux/solr/build/solr-core/test/J1/temp/solr.handler.component.TestDistributedStatsComponentCardinality_352B531224281502-001/tempDir-001/control/cores
   [junit4]   2> 3646699 INFO  (TEST-TestDistributedStatsComponentCardinality.test-seed#[352B531224281502]) [    ] o.a.s.c.CorePropertiesLocator Cores are: [collection1]
   [junit4]   2> 3646706 INFO  (coreLoadExecutor-12982-thread-1) [    x:collection1] o.a.s.c.SolrResourceLoader [null] Added 2 libs to classloader, from paths: [/home/jenkins/workspace/Lucene-Solr-BadApples-master-Linux/solr/core/src/test-files/solr/collection1/lib, /home/jenkins/workspace/Lucene-Solr-BadApples-master-Linux/solr/core/src/test-files/solr/collection1/lib/classes]
   [junit4]   2> 3646755 INFO  (coreLoadExecutor-12982-thread-1) [    x:collection1] o.a.s.c.SolrConfig Using Lucene MatchVersion: 9.0.0
   [junit4]   2> 3647046 INFO  (coreLoadExecutor-12982-thread-1) [    x:collection1] o.a.s.s.IndexSchema [collection1] Schema name=test
   [junit4]   2> 3647417 INFO  (coreLoadExecutor-12982-thread-1) [    x:collection1] o.a.s.s.IndexSchema Loaded schema test/1.0 with uniqueid field id
   [junit4]   2> 3647426 INFO  (coreLoadExecutor-12982-thread-1) [    x:collection1] o.a.s.c.CoreContainer Creating SolrCore 'collection1' using configuration from configset /home/jenkins/workspace/Lucene-Solr-BadApples-master-Linux/solr/core/src/test-files/solr/collection1, trusted=true
   [junit4]   2> 3647426 INFO  (coreLoadExecutor-12982-thread-1) [    x:collection1] o.a.s.m.r.SolrJmxReporter JMX monitoring for 'solr.core.collection1' (registry 'solr.core.collection1') enabled at server: com.sun.jmx.mbeanserver.JmxMBeanServer@2b4018a1
   [junit4]   2> 3647427 INFO  (coreLoadExecutor-12982-thread-1) [    x:collection1] o.a.s.c.SolrCore [[collection1] ] Opening new SolrCore at [/home/jenkins/workspace/Lucene-Solr-BadApples-master-Linux/solr/core/src/test-files/solr/collection1], dataDir=[/home/jenkins/workspace/Lucene-Solr-BadApples-master-Linux/solr/build/solr-core/test/J1/temp/solr.handler.component.TestDistributedStatsComponentCardinality_352B531224281502-001/tempDir-001/control/cores/collection1/data/]
   [junit4]   2> 3647429 INFO  (coreLoadExecutor-12982-thread-1) [    x:collection1] o.a.s.u.RandomMergePolicy RandomMergePolicy wrapping class org.apache.lucene.index.TieredMergePolicy: [TieredMergePolicy: maxMergeAtOnce=24, maxMergeAtOnceExplicit=19, maxMergedSegmentMB=36.3193359375, floorSegmentMB=1.7412109375, forceMergeDeletesPctAllowed=15.095245933995688, segmentsPerTier=42.0, maxCFSSegmentSizeMB=8.796093022207999E12, noCFSRatio=1.0, deletesPctAllowed=39.65615700967679
   [junit4]   2> 3647760 INFO  (coreLoadExecutor-12982-thread-1) [    x:collection1] o.a.s.u.UpdateHandler Using UpdateLog implementation: org.apache.solr.update.UpdateLog
   [junit4]   2> 3647760 INFO  (coreLoadExecutor-12982-thread-1) [    x:collection1] o.a.s.u.UpdateLog Initializing UpdateLog: dataDir= defaultSyncLevel=FLUSH numRecordsToKeep=100 maxNumLogsToKeep=10 numVersionBuckets=65536
   [junit4]   2> 3647762 INFO  (coreLoadExecutor-12982-thread-1) [    x:collection1] o.a.s.u.CommitTracker Hard AutoCommit: disabled
   [junit4]   2> 3647762 INFO  (coreLoadExecutor-12982-thread-1) [    x:collection1] o.a.s.u.CommitTracker Soft AutoCommit: disabled
   [junit4]   2> 3647763 INFO  (coreLoadExecutor-12982-thread-1) [    x:collection1] o.a.s.u.RandomMergePolicy RandomMergePolicy wrapping class org.apache.lucene.index.TieredMergePolicy: [TieredMergePolicy: maxMergeAtOnce=41, maxMergeAtOnceExplicit=13, maxMergedSegmentMB=65.57421875, floorSegmentMB=0.2568359375, forceMergeDeletesPctAllowed=9.97308958044041, segmentsPerTier=12.0, maxCFSSegmentSizeMB=8.796093022207999E12, noCFSRatio=0.8165953126561971, deletesPctAllowed=33.458322985773364
   [junit4]   2> 3647763 INFO  (coreLoadExecutor-12982-thread-1) [    x:collection1] o.a.s.s.SolrIndexSearcher Opening [Searcher@76e24bb6[collection1] main]
   [junit4]   2> 3647764 INFO  (coreLoadExecutor-12982-thread-1) [    x:collection1] o.a.s.h.c.SpellCheckComponent Initializing spell checkers
   [junit4]   2> 3647904 INFO  (coreLoadExecutor-12982-thread-1) [    x:collection1] o.a.s.s.DirectSolrSpellChecker init: {name=direct,classname=DirectSolrSpellChecker,field=lowerfilt,minQueryLength=3}
   [junit4]   2> 3647997 INFO  (coreLoadExecutor-12982-thread-1) [    x:collection1] o.a.s.h.ReplicationHandler Commits will be reserved for 10000ms.
   [junit4]   2> 3647997 INFO  (coreLoadExecutor-12982-thread-1) [    x:collection1] o.a.s.u.UpdateLog Could not find max version in index or recent updates, using new clock 1633665321823895552
   [junit4]   2> 3647998 INFO  (searcherExecutor-12983-thread-1-processing-x:collection1) [    x:collection1] o.a.s.h.c.SpellCheckComponent Loading spell index for spellchecker: default
   [junit4]   2> 3647999 INFO  (searcherExecutor-12983-thread-1-processing-x:collection1) [    x:collection1] o.a.s.h.c.SpellCheckComponent Loading spell index for spellchecker: direct
   [junit4]   2> 3647999 INFO  (searcherExecutor-12983-thread-1-processing-x:collection1) [    x:collection1] o.a.s.h.c.SpellCheckComponent Loading spell index for spellchecker: wordbreak
   [junit4]   2> 3647999 INFO  (searcherExecutor-12983-thread-1-processing-x:collection1) [    x:collection1] o.a.s.h.c.SpellCheckComponent Loading spell index for spellchecker: multipleFields
   [junit4]   2> 3647999 INFO  (searcherExecutor-12983-thread-1-processing-x:collection1) [    x:collection1] o.a.s.h.c.SpellCheckComponent Loading spell index for spellchecker: jarowinkler
   [junit4]   2> 3648000 INFO  (searcherExecutor-12983-thread-1-processing-x:collection1) [    x:collection1] o.a.s.h.c.SpellCheckComponent Loading spell index for spellchecker: external
   [junit4]   2> 3648000 INFO  (searcherExecutor-12983-thread-1-processing-x:collection1) [    x:collection1] o.a.s.h.c.SpellCheckComponent Loading spell index for spellchecker: freq
   [junit4]   2> 3648000 INFO  (searcherExecutor-12983-thread-1-processing-x:collection1) [    x:collection1] o.a.s.h.c.SpellCheckComponent Loading spell index for spellchecker: fqcn
   [junit4]   2> 3648000 INFO  (searcherExecutor-12983-thread-1-processing-x:collection1) [    x:collection1] o.a.s.h.c.SpellCheckComponent Loading spell index for spellchecker: perDict
   [junit4]   2> 3648002 INFO  (searcherExecutor-12983-thread-1-processing-x:collection1) [    x:collection1] o.a.s.c.SolrCore [collection1] Registered new searcher Searcher@76e24bb6[collection1] main{ExitableDirectoryReader(UninvertingDirectoryReader())}
   [junit4]   2> 3648164 INFO  (TEST-TestDistributedStatsComponentCardinality.test-seed#[352B531224281502]) [    ] o.a.s.SolrTestCaseJ4 Writing core.properties file to /home/jenkins/workspace/Lucene-Solr-BadApples-master-Linux/solr/build/solr-core/test/J1/temp/solr.handler.component.TestDistributedStatsComponentCardinality_352B531224281502-001/tempDir-001/shard0/cores/collection1
   [junit4]   2> 3648164 WARN  (TEST-TestDistributedStatsComponentCardinality.test-seed#[352B531224281502]) [    ] o.e.j.s.AbstractConnector Ignoring deprecated socket close linger time
   [junit4]   2> 3648165 INFO  (TEST-TestDistributedStatsComponentCardinality.test-seed#[352B531224281502]) [    ] o.a.s.c.s.e.JettySolrRunner Start Jetty (original configured port=0)
   [junit4]   2> 3648165 INFO  (TEST-TestDistributedStatsComponentCardinality.test-seed#[352B531224281502]) [    ] o.a.s.c.s.e.JettySolrRunner Trying to start Jetty on port 0 try number 1 ...
   [junit4]   2> 3648165 INFO  (TEST-TestDistributedStatsComponentCardinality.test-seed#[352B531224281502]) [    ] o.e.j.s.Server jetty-9.4.14.v20181114; built: 2018-11-14T21:20:31.478Z; git: c4550056e785fb5665914545889f21dc136ad9e6; jvm 13-testing+0-builds.shipilev.net-openjdk-jdk-b845-20190430-jdk-1318
   [junit4]   2> 3648182 INFO  (TEST-TestDistributedStatsComponentCardinality.test-seed#[352B531224281502]) [    ] o.e.j.s.session DefaultSessionIdManager workerName=node0
   [junit4]   2> 3648182 INFO  (TEST-TestDistributedStatsComponentCardinality.test-seed#[352B531224281502]) [    ] o.e.j.s.session No SessionScavenger set, using defaults
   [junit4]   2> 3648182 INFO  (TEST-TestDistributedStatsComponentCardinality.test-seed#[352B531224281502]) [    ] o.e.j.s.session node0 Scavenging every 660000ms
   [junit4]   2> 3648182 INFO  (TEST-TestDistributedStatsComponentCardinality.test-seed#[352B531224281502]) [    ] o.e.j.s.h.ContextHandler Started o.e.j.s.ServletContextHandler@259cb82{/,null,AVAILABLE}
   [junit4]   2> 3648183 INFO  (TEST-TestDistributedStatsComponentCardinality.test-seed#[352B531224281502]) [    ] o.e.j.s.AbstractConnector Started ServerConnector@4c60162b{HTTP/1.1,[http/1.1, h2c]}{127.0.0.1:38459}
   [junit4]   2> 3648183 INFO  (TEST-TestDistributedStatsComponentCardinality.test-seed#[352B531224281502]) [    ] o.e.j.s.Server Started @3648428ms
   [junit4]   2> 3648183 INFO  (TEST-TestDistributedStatsComponentCardinality.test-seed#[352B531224281502]) [    ] o.a.s.c.s.e.JettySolrRunner Jetty properties: {hostContext=/, hostPort=38459, coreRootDirectory=/home/jenkins/workspace/Lucene-Solr-BadApples-master-Linux/solr/build/solr-core/test/J1/temp/solr.handler.component.TestDistributedStatsComponentCardinality_352B531224281502-001/tempDir-001/shard0/cores}
   [junit4]   2> 3648183 ERROR (TEST-TestDistributedStatsComponentCardinality.test-seed#[352B531224281502]) [    ] o.a.s.u.StartupLoggingUtils Missing Java Option solr.log.dir. Logging may be missing or incomplete.
   [junit4]   2> 3648183 INFO  (TEST-TestDistributedStatsComponentCardinality.test-seed#[352B531224281502]) [    ] o.a.s.s.SolrDispatchFilter Using logger factory org.apache.logging.slf4j.Log4jLoggerFactory
   [junit4]   2> 3648184 INFO  (TEST-TestDistributedStatsComponentCardinality.test-seed#[352B531224281502]) [    ] o.a.s.s.SolrDispatchFilter  ___      _       Welcome to Apache Solr™ version 9.0.0
   [junit4]   2> 3648184 INFO  (TEST-TestDistributedStatsComponentCardinality.test-seed#[352B531224281502]) [    ] o.a.s.s.SolrDispatchFilter / __| ___| |_ _   Starting in standalone mode on port null
   [junit4]   2> 3648184 INFO  (TEST-TestDistributedStatsComponentCardinality.test-seed#[352B531224281502]) [    ] o.a.s.s.SolrDispatchFilter \__ \/ _ \ | '_|  Install dir: null
   [junit4]   2> 3648184 INFO  (TEST-TestDistributedStatsComponentCardinality.test-seed#[352B531224281502]) [    ] o.a.s.s.SolrDispatchFilter |___/\___/_|_|    Start time: 2019-05-16T05:30:59.214158Z
   [junit4]   2> 3648184 INFO  (TEST-TestDistributedStatsComponentCardinality.test-seed#[352B531224281502]) [    ] o.a.s.c.SolrXmlConfig Loading container configuration from /home/jenkins/workspace/Lucene-Solr-BadApples-master-Linux/solr/build/solr-core/test/J1/temp/solr.handler.component.TestDistributedStatsComponentCardinality_352B531224281502-001/tempDir-001/shard0/solr.xml
   [junit4]   2> 3648504 INFO  (TEST-TestDistributedStatsComponentCardinality.test-seed#[352B531224281502]) [    ] o.a.s.c.SolrXmlConfig Configuration parameter autoReplicaFailoverWorkLoopDelay is ignored
   [junit4]   2> 3648504 INFO  (TEST-TestDistributedStatsComponentCardinality.test-seed#[352B531224281502]) [    ] o.a.s.c.SolrXmlConfig Configuration parameter autoReplicaFailoverBadNodeExpiration is ignored
   [junit4]   2> 3648506 INFO  (TEST-TestDistributedStatsComponentCardinality.test-seed#[352B531224281502]) [    ] o.a.s.c.SolrXmlConfig MBean server found: com.sun.jmx.mbeanserver.JmxMBeanServer@2b4018a1, but no JMX reporters were configured - adding default JMX reporter.
   [junit4]   2> 3648629 INFO  (TEST-TestDistributedStatsComponentCardinality.test-seed#[352B531224281502]) [    ] o.a.s.h.c.HttpShardHandlerFactory Host whitelist initialized: WhitelistHostChecker [whitelistHosts=null, whitelistHostCheckingEnabled=false]
   [junit4]   2> 3648630 WARN  (TEST-TestDistributedStatsComponentCardinality.test-seed#[352B531224281502]) [    ] o.e.j.u.s.S.config No Client EndPointIdentificationAlgorithm configured for SslContextFactory@1e23e1a7[provider=null,keyStore=null,trustStore=null]
   [junit4]   2> 3648639 WARN  (TEST-TestDistributedStatsComponentCardinality.test-seed#[352B531224281502]) [    ] o.e.j.u.s.S.config No Client EndPointIdentificationAlgorithm configured for SslContextFactory@4071bdb2[provider=null,keyStore=null,trustStore=null]
   [junit4]   2> 3648665 INFO  (TEST-TestDistributedStatsComponentCardinality.test-seed#[352B531224281502]) [    ] o.a.s.c.TransientSolrCoreCacheDefault Allocating transient cache for 4 transient cores
   [junit4]   2> 3648665 INFO  (TEST-TestDistributedStatsComponentCardinality.test-seed#[352B531224281502]) [    ] o.a.s.h.a.MetricsHistoryHandler No .system collection, keeping metrics history in memory.
   [junit4]   2> 3648694 INFO  (TEST-TestDistributedStatsComponentCardinality.test-seed#[352B531224281502]) [    ] o.a.s.m.r.SolrJmxReporter JMX monitoring for 'solr.node' (registry 'solr.node') enabled at server: com.sun.jmx.mbeanserver.JmxMBeanServer@2b4018a1
   [junit4]   2> 3648719 INFO  (TEST-TestDistributedStatsComponentCardinality.test-seed#[352B531224281502]) [    ] o.a.s.m.r.SolrJmxReporter JMX monitoring for 'solr.jvm' (registry 'solr.jvm') enabled at server: com.sun.jmx.mbeanserver.JmxMBeanServer@2b4018a1
   [junit4]   2> 3648719 INFO  (TEST-TestDistributedStatsComponentCardinality.test-seed#[352B531224281502]) [    ] o.a.s.m.r.SolrJmxReporter JMX monitoring for 'solr.jetty' (registry 'solr.jetty') enabled at server: com.sun.jmx.mbeanserver.JmxMBeanServer@2b4018a1
   [junit4]   2> 3648722 INFO  (TEST-TestDistributedStatsComponentCardinality.test-seed#[352B531224281502]) [    ] o.a.s.c.CorePropertiesLocator Found 1 core definitions underneath /home/jenkins/workspace/Lucene-Solr-BadApples-master-Linux/solr/build/solr-core/test/J1/temp/solr.handler.component.TestDistributedStatsComponentCardinality_352B531224281502-001/tempDir-001/shard0/cores
   [junit4]   2> 3648722 INFO  (TEST-TestDistributedStatsComponentCardinality.test-seed#[352B531224281502]) [    ] o.a.s.c.CorePropertiesLocator Cores are: [collection1]
   [junit4]   2> 3648723 INFO  (coreLoadExecutor-12996-thread-1) [    x:collection1] o.a.s.c.SolrResourceLoader [null] Added 2 libs to classloader, from paths: [/home/jenkins/workspace/Lucene-Solr-BadApples-master-Linux/solr/core/src/test-files/solr/collection1/lib, /home/jenkins/workspace/Lucene-Solr-BadApples-master-Linux/solr/core/src/test-files/solr/collection1/lib/classes]
   [junit4]   2> 3648758 INFO  (coreLoadExecutor-12996-thread-1) [    x:collection1] o.a.s.c.SolrConfig Using Lucene MatchVersion: 9.0.0
   [junit4]   2> 3648793 INFO  (coreLoadExecutor-12996-thread-1) [    x:collection1] o.a.s.s.IndexSchema [collection1] Schema name=test
   [junit4]   2> 3649441 INFO  (coreLoadExecutor-12996-thread-1) [    x:collection1] o.a.s.s.IndexSchema Loaded schema test/1.0 with uniqueid field id
   [junit4]   2> 3649454 INFO  (coreLoadExecutor-12996-thread-1) [    x:collection1] o.a.s.c.CoreContainer Creating SolrCore 'collection1' using configuration from configset /home/jenkins/workspace/Lucene-Solr-BadApples-master-Linux/solr/core/src/test-files/solr/collection1, trusted=true
   [junit4]   2> 3649455 INFO  (coreLoadExecutor-12996-thread-1) [    x:collection1] o.a.s.m.r.SolrJmxReporter JMX monitoring for 'solr.core.collection1' (registry 'solr.core.collection1') enabled at server: com.sun.jmx.mbeanserver.JmxMBeanServer@2b4018a1
   [junit4]   2> 3649455 INFO  (coreLoadExecutor-12996-thread-1) [    x:collection1] o.a.s.c.SolrCore [[collection1] ] Opening new SolrCore at [/home/jenkins/workspace/Lucene-Solr-BadApples-master-Linux/solr/core/src/test-files/solr/collection1], dataDir=[/home/jenkins/workspace/Lucene-Solr-BadApples-master-Linux/solr/build/solr-core/test/J1/temp/solr.handler.component.TestDistributedStatsComponentCardinality_352B531224281502-001/tempDir-001/shard0/cores/collection1/data/]
   [junit4]   2> 3649458 INFO  (coreLoadExecutor-12996-thread-1) [    x:collection1] o.a.s.u.RandomMergePolicy RandomMergePolicy wrapping class org.apache.lucene.index.TieredMergePolicy: [TieredMergePolicy: maxMergeAtOnce=24, maxMergeAtOnceExplicit=19, maxMergedSegmentMB=36.3193359375, floorSegmentMB=1.7412109375, forceMergeDeletesPctAllowed=15.095245933995688, segmentsPerTier=42.0, maxCFSSegmentSizeMB=8.796093022207999E12, noCFSRatio=1.0, deletesPctAllowed=39.65615700967679
   [junit4]   2> 3649557 INFO  (coreLoadExecutor-12996-thread-1) [    x:collection1] o.a.s.u.UpdateHandler Using UpdateLog implementation: org.apache.solr.update.UpdateLog
   [junit4]   2> 3649557 INFO  (coreLoadExecutor-12996-thread-1) [    x:collection1] o.a.s.u.UpdateLog Initializing UpdateLog: dataDir= defaultSyncLevel=FLUSH numRecordsToKeep=100 maxNumLogsToKeep=10 numVersionBuckets=65536
   [junit4]   2> 3649560 INFO  (coreLoadExecutor-12996-thread-1) [    x:collection1] o.a.s.u.CommitTracker Hard AutoCommit: disabled
   [junit4]   2> 3649560 INFO  (coreLoadExecutor-12996-thread-1) [    x:collection1] o.a.s.u.CommitTracker Soft AutoCommit: disabled
   [junit4]   2> 3649562 INFO  (coreLoadExecutor-12996-thread-1) [    x:collection1] o.a.s.u.RandomMergePolicy RandomMergePolicy wrapping class org.apache.lucene.index.TieredMergePolicy: [TieredMergePolicy: maxMergeAtOnce=41, maxMergeAtOnceExplicit=13, maxMergedSegmentMB=65.57421875, floorSegmentMB=0.2568359375, forceMergeDeletesPctAllowed=9.97308958044041, segmentsPerTier=12.0, maxCFSSegmentSizeMB=8.796093022207999E12, noCFSRatio=0.8165953126561971, deletesPctAllowed=33.458322985773364
   [junit4]   2> 3649562 INFO  (coreLoadExecutor-12996-thread-1) [    x:collection1] o.a.s.s.SolrIndexSearcher Opening [Searcher@569ba82[collection1] main]
   [junit4]   2> 3649563 INFO  (coreLoadExecutor-12996-thread-1) [    x:collection1] o.a.s.h.c.SpellCheckComponent Initializing spell checkers
   [junit4]   2> 3649904 INFO  (coreLoadExecutor-12996-thread-1) [    x:collection1] o.a.s.s.DirectSolrSpellChecker init: {name=direct,classname=DirectSolrSpellChecker,field=lowerfilt,minQueryLength=3}
   [junit4]   2> 3650295 INFO  (coreLoadExecutor-12996-thread-1) [    x:collection1] o.a.s.h.ReplicationHandler Commits will be reserved for 10000ms.
   [junit4]   2> 3650295 INFO  (coreLoadExecutor-12996-thread-1) [    x:collection1] o.a.s.u.UpdateLog Could not find max version in index or recent updates, using new clock 1633665324233523200
   [junit4]   2> 3650296 INFO  (searcherExecutor-12997-thread-1-processing-x:collection1) [    x:collection1] o.a.s.h.c.SpellCheckComponent Loading spell index for spellchecker: default
   [junit4]   2> 3650297 INFO  (searcherExecutor-12997-thread-1-processing-x:collection1) [    x:collection1] o.a.s.h.c.SpellCheckComponent Loading spell index for spellchecker: direct
   [junit4]   2> 3650297 INFO  (searcherExecutor-12997-thread-1-processing-x:collection1) [    x:collection1] o.a.s.h.c.SpellCheckComponent Loading spell index for spellchecker: wordbreak
   [junit4]   2> 3650297 INFO  (searcherExecutor-12997-thread-1-processing-x:collection1) [    x:collection1] o.a.s.h.c.SpellCheckComponent Loading spell index for spellchecker: multipleFields
   [junit4]   2> 3650297 INFO  (searcherExecutor-12997-thread-1-processing-x:collection1) [    x:collection1] o.a.s.h.c.SpellCheckComponent Loading spell index for spellchecker: jarowinkler
   [junit4]   2> 3650297 INFO  (searcherExecutor-12997-thread-1-processing-x:collection1) [    x:collection1] o.a.s.h.c.SpellCheckComponent Loading spell index for spellchecker: external
   [junit4]   2> 3650298 INFO  (searcherExecutor-12997-thread-1-processing-x:collection1) [    x:collection1] o.a.s.h.c.SpellCheckComponent Loading spell index for spellchecker: freq
   [junit4]   2> 3650298 INFO  (searcherExecutor-12997-thread-1-processing-x:collection1) [    x:collection1] o.a.s.h.c.SpellCheckComponent Loading spell index for spellchecker: fqcn
   [junit4]   2> 3650298 INFO  (searcherExecutor-12997-thread-1-processing-x:collection1) [    x:collection1] o.a.s.h.c.SpellCheckComponent Loading spell index for spellchecker: perDict
   [junit4]   2> 3650300 INFO  (searcherExecutor-12997-thread-1-processing-x:collection1) [    x:collection1] o.a.s.c.SolrCore [collection1] Registered new searcher Searcher@569ba82[collection1] main{ExitableDirectoryReader(UninvertingDirectoryReader())}
   [junit4]   2> 3650435 INFO  (TEST-TestDistributedStatsComponentCardinality.test-seed#[352B531224281502]) [    ] o.a.s.SolrTestCaseJ4 Writing core.properties file to /home/jenkins/workspace/Lucene-Solr-BadApples-master-Linux/solr/build/solr-core/test/J1/temp/solr.handler.component.TestDistributedStatsComponentCardinality_352B531224281502-001/tempDir-001/shard1/cores/collection1
   [junit4]   2> 3650436 WARN  (TEST-TestDistributedStatsComponentCardinality.test-seed#[352B531224281502]) [    ] o.e.j.s.AbstractConnector Ignoring deprecated socket close linger time
   [junit4]   2> 3650436 INFO  (TEST-TestDistributedStatsComponentCardinality.test-seed#[352B531224281502]) [    ] o.a.s.c.s.e.JettySolrRunner Start Jetty (original configured port=0)
   [junit4]   2> 3650436 INFO  (TEST-TestDistributedStatsComponentCardinality.test-seed#[352B531224281502]) [    ] o.a.s.c.s.e.JettySolrRunner Trying to start Jetty on port 0 try number 1 ...
   [junit4]   2> 3650436 INFO  (TEST-TestDistributedStatsComponentCardinality.test-seed#[352B531224281502]) [    ] o.e.j.s.Server jetty-9.4.14.v20181114; built: 2018-11-14T21:20:31.478Z; git: c4550056e785fb5665914545889f21dc136ad9e6; jvm 13-testing+0-builds.shipilev.net-openjdk-jdk-b845-20190430-jdk-1318
   [junit4]   2> 3650451 INFO  (TEST-TestDistributedStatsComponentCardinality.test-seed#[352B531224281502]) [    ] o.e.j.s.session DefaultSessionIdManager workerName=node0
   [junit4]   2> 3650451 INFO  (TEST-TestDistributedStatsComponentCardinality.test-seed#[352B531224281502]) [    ] o.e.j.s.session No SessionScavenger set, using defaults
   [junit4]   2> 3650451 INFO  (TEST-TestDistributedStatsComponentCardinality.test-seed#[352B531224281502]) [    ] o.e.j.s.session node0 Scavenging every 600000ms
   [junit4]   2> 3650451 INFO  (TEST-TestDistributedStatsComponentCardinality.test-seed#[352B531224281502]) [    ] o.e.j.s.h.ContextHandler Started o.e.j.s.ServletContextHandler@56a51be{/,null,AVAILABLE}
   [junit4]   2> 3650451 INFO  (TEST-TestDistributedStatsComponentCardinality.test-seed#[352B531224281502]) [    ] o.e.j.s.AbstractConnector Started ServerConnector@6085e61d{HTTP/1.1,[http/1.1, h2c]}{127.0.0.1:44179}
   [junit4]   2> 3650451 INFO  (TEST-TestDistributedStatsComponentCardinality.test-seed#[352B531224281502]) [    ] o.e.j.s.Server Started @3650697ms
   [junit4]   2> 3650451 INFO  (TEST-TestDistributedStatsComponentCardinality.test-seed#[352B531224281502]) [    ] o.a.s.c.s.e.JettySolrRunner Jetty properties: {hostContext=/, hostPort=44179, coreRootDirectory=/home/jenkins/workspace/Lucene-Solr-BadApples-master-Linux/solr/build/solr-core/test/J1/temp/solr.handler.component.TestDistributedStatsComponentCardinality_352B531224281502-001/tempDir-001/shard1/cores}
   [junit4]   2> 3650452 ERROR (TEST-TestDistributedStatsComponentCardinality.test-seed#[352B531224281502]) [    ] o.a.s.u.StartupLoggingUtils Missing Java Option solr.log.dir. Logging may be missing or incomplete.
   [junit4]   2> 3650452 INFO  (TEST-TestDistributedStatsComponentCardinality.test-seed#[352B531224281502]) [    ] o.a.s.s.SolrDispatchFilter Using logger factory org.apache.logging.slf4j.Log4jLoggerFactory
   [junit4]   2> 3650452 INFO  (TEST-TestDistributedStatsComponentCardinality.test-seed#[352B531224281502]) [    ] o.a.s.s.SolrDispatchFilter  ___      _       Welcome to Apache Solr™ version 9.0.0
   [junit4]   2> 3650452 INFO  (TEST-TestDistributedStatsComponentCardinality.test-seed#[352B531224281502]) [    ] o.a.s.s.SolrDispatchFilter / __| ___| |_ _   Starting in standalone mode on port null
   [junit4]   2> 3650452 INFO  (TEST-TestDistributedStatsComponentCardinality.test-seed#[352B531224281502]) [    ] o.a.s.s.SolrDispatchFilter \__ \/ _ \ | '_|  Install dir: null
   [junit4]   2> 3650452 INFO  (TEST-TestDistributedStatsComponentCardinality.test-seed#[352B531224281502]) [    ] o.a.s.s.SolrDispatchFilter |___/\___/_|_|    Start time: 2019-05-16T05:31:01.482580Z
   [junit4]   2> 3650452 INFO  (TEST-TestDistributedStatsComponentCardinality.test-seed#[352B531224281502]) [    ] o.a.s.c.SolrXmlConfig Loading container configuration from /home/jenkins/workspace/Lucene-Solr-BadApples-master-Linux/solr/build/solr-core/test/J1/temp/solr.handler.component.TestDistributedStatsComponentCardinality_352B531224281502-001/tempDir-001/shard1/solr.xml
   [junit4]   2> 3650455 INFO  (TEST-TestDistributedStatsComponentCardinality.test-seed#[352B531224281502]) [    ] o.a.s.c.SolrXmlConfig Configuration parameter autoReplicaFailoverWorkLoopDelay is ignored
   [junit4]   2> 3650456 INFO  (TEST-TestDistributedStatsComponentCardinality.test-seed#[352B531224281502]) [    ] o.a.s.c.SolrXmlConfig Configuration parameter autoReplicaFailoverBadNodeExpiration is ignored
   [junit4]   2> 3650457 INFO  (TEST-TestDistributedStatsComponentCardinality.test-seed#[352B531224281502]) [    ] o.a.s.c.SolrXmlConfig MBean server found: com.sun.jmx.mbeanserver.JmxMBeanServer@2b4018a1, but no JMX reporters were configured - adding default JMX reporter.
   [junit4]   2> 3650511 INFO  (TEST-TestDistributedStatsComponentCardinality.test-seed#[352B531224281502]) [    ] o.a.s.h.c.HttpShardHandlerFactory Host whitelist initialized: WhitelistHostChecker [whitelistHosts=null, whitelistHostCheckingEnabled=false]
   [junit4]   2> 3650512 WARN  (TEST-TestDistributedStatsComponentCardinality.test-seed#[352B531224281502]) [    ] o.e.j.u.s.S.config No Client EndPointIdentificationAlgorithm configured for SslContextFactory@5a131845[provider=null,keyStore=null,trustStore=null]
   [junit4]   2> 3650516 WARN  (TEST-TestDistributedStatsComponentCardinality.test-seed#[352B531224281502]) [    ] o.e.j.u.s.S.config No Client EndPointIdentificationAlgorithm configured for SslContextFactory@799fb2e5[provider=null,keyStore=null,trustStore=null]
   [junit4]   2> 3650541 INFO  (TEST-TestDistributedStatsComponentCardinality.test-seed#[352B531224281502]) [    ] o.a.s.c.TransientSolrCoreCacheDefault Allocating transient cache for 4 transient cores
   [junit4]   2> 3650541 INFO  (TEST-TestDistributedStatsComponentCardinality.test-seed#[352B531224281502]) [    ] o.a.s.h.a.MetricsHistoryHandler No .system collection, keeping metrics history in memory.
   [junit4]   2> 3650837 INFO  (TEST-TestDistributedStatsComponentCardinality.test-seed#[352B531224281502]) [    ] o.a.s.m.r.SolrJmxReporter JMX monitoring for 'solr.node' (registry 'solr.node') enabled at server: com.sun.jmx.mbeanserver.JmxMBeanServer@2b4018a1
   [junit4]   2> 3650883 INFO  (TEST-TestDistributedStatsComponentCardinality.test-seed#[352B531224281502]) [    ] o.a.s.m.r.SolrJmxReporter JMX monitoring for 'solr.jvm' (registry 'solr.jvm') enabled at server: com.sun.jmx.mbeanserver.JmxMBeanServer@2b4018a1
   [junit4]   2> 3650884 INFO  (TEST-TestDistributedStatsComponentCardinality.test-seed#[352B531224281502]) [    ] o.a.s.m.r.SolrJmxReporter JMX monitoring for 'solr.jetty' (registry 'solr.jetty') enabled at server: com.sun.jmx.mbeanserver.JmxMBeanServer@2b4018a1
   [junit4]   2> 3650887 INFO  (TEST-TestDistributedStatsComponentCardinality.test-seed#[352B531224281502]) [    ] o.a.s.c.CorePropertiesLocator Found 1 core definitions underneath /home/jenkins/workspace/Lucene-Solr-BadApples-master-Linux/solr/build/solr-core/test/J1/temp/solr.handler.component.TestDistributedStatsComponentCardinality_352B531224281502-001/tempDir-001/shard1/cores
   [junit4]   2> 3650887 INFO  (TEST-TestDistributedStatsComponentCardinality.test-seed#[352B531224281502]) [    ] o.a.s.c.CorePropertiesLocator Cores are: [collection1]
   [junit4]   2> 3650888 INFO  (coreLoadExecutor-13010-thread-1) [    x:collection1] o.a.s.c.SolrResourceLoader [null] Added 2 libs to classloader, from paths: [/home/jenkins/workspace/Lucene-Solr-BadApples-master-Linux/solr/core/src/test-files/solr/collection1/lib, /home/jenkins/workspace/Lucene-Solr-BadApples-master-Linux/solr/core/src/test-files/solr/collection1/lib/classes]
   [junit4]   2> 3650922 INFO  (coreLoadExecutor-13010-thread-1) [    x:collection1] o.a.s.c.SolrConfig Using Lucene MatchVersion: 9.0.0
   [junit4]   2> 3650961 INFO  (coreLoadExecutor-13010-thread-1) [    x:collection1] o.a.s.s.IndexSchema [collection1] Schema name=test
   [junit4]   2> 3651596 INFO  (coreLoadExecutor-13010-thread-1) [    x:collection1] o.a.s.s.IndexSchema Loaded schema test/1.0 with uniqueid field id
   [junit4]   2> 3651613 INFO  (coreLoadExecutor-13010-thread-1) [    x:collection1] o.a.s.c.CoreContainer Creating SolrCore 'collection1' using configuration from configset /home/jenkins/workspace/Lucene-Solr-BadApples-master-Linux/solr/core/src/test-files/solr/collection1, trusted=true
   [junit4]   2> 3651614 INFO  (coreLoadExecutor-13010-thread-1) [    x:collection1] o.a.s.m.r.SolrJmxReporter JMX monitoring for 'solr.core.collection1' (registry 'solr.core.collection1') enabled at server: com.sun.jmx.mbeanserver.JmxMBeanServer@2b4018a1
   [junit4]   2> 3651614 INFO  (coreLoadExecutor-13010-thread-1) [    x:collection1] o.a.s.c.SolrCore [[collection1] ] Opening new SolrCore at [/home/jenkins/workspace/Lucene-Solr-BadApples-master-Linux/solr/core/src/test-files/solr/collection1], dataDir=[/home/jenkins/workspace/Lucene-Solr-BadApples-master-Linux/solr/build/solr-core/test/J1/temp/solr.handler.component.TestDistributedStatsComponentCardinality_352B531224281502-001/tempDir-001/shard1/cores/collection1/data/]
   [junit4]   2> 3651616 INFO  (coreLoadExecutor-13010-thread-1) [    x:collection1] o.a.s.u.RandomMergePolicy RandomMergePolicy wrapping class org.apache.lucene.index.TieredMergePolicy: [TieredMergePolicy: maxMergeAtOnce=24, maxMergeAtOnceExplicit=19, maxMergedSegmentMB=36.3193359375, floorSegmentMB=1.7412109375, forceMergeDeletesPctAllowed=15.095245933995688, segmentsPerTier=42.0, maxCFSSegmentSizeMB=8.796093022207999E12, noCFSRatio=1.0, deletesPctAllowed=39.65615700967679
   [junit4]   2> 3651697 INFO  (coreLoadExecutor-13010-thread-1) [    x:collection1] o.a.s.u.UpdateHandler Using UpdateLog implementation: org.apache.solr.update.UpdateLog
   [junit4]   2> 3651697 INFO  (coreLoadExecutor-13010-thread-1) [    x:collection1] o.a.s.u.UpdateLog Initializing UpdateLog: dataDir= defaultSyncLevel=FLUSH numRecordsToKeep=100 maxNumLogsToKeep=10 numVersionBuckets=65536
   [junit4]   2> 3651699 INFO  (coreLoadExecutor-13010-thread-1) [    x:collection1] o.a.s.u.CommitTracker Hard AutoCommit: disabled
   [junit4]   2> 3651699 INFO  (coreLoadExecutor-13010-thread-1) [    x:collection1] o.a.s.u.CommitTracker Soft AutoCommit: disabled
   [junit4]   2> 3651700 INFO  (coreLoadExecutor-13010-thread-1) [    x:collection1] o.a.s.u.RandomMergePolicy RandomMergePolicy wrapping class org.apache.lucene.index.TieredMergePolicy: [TieredMergePolicy: maxMergeAtOnce=41, maxMergeAtOnceExplicit=13, maxMergedSegmentMB=65.57421875, floorSegmentMB=0.2568359375, forceMergeDeletesPctAllowed=9.97308958044041, segmentsPerTier=12.0, maxCFSSegmentSizeMB=8.796093022207999E12, noCFSRatio=0.8165953126561971, deletesPctAllowed=33.458322985773364
   [junit4]   2> 3651700 INFO  (coreLoadExecutor-13010-thread-1) [    x:collection1] o.a.s.s.SolrIndexSearcher Opening [Searcher@7e43abae[collection1] main]
   [junit4]   2> 3651701 INFO  (coreLoadExecutor-13010-thread-1) [    x:collection1] o.a.s.h.c.SpellCheckComponent Initializing spell checkers
   [junit4]   2> 3651763 INFO  (coreLoadExecutor-13010-thread-1) [    x:collection1] o.a.s.s.DirectSolrSpellChecker init: {name=direct,classname=DirectSolrSpellChecker,field=lowerfilt,minQueryLength=3}
   [junit4]   2> 3651850 INFO  (coreLoadExecutor-13010-thread-1) [    x:collection1] o.a.s.h.ReplicationHandler Commits will be reserved for 10000ms.
   [junit4]   2> 3651850 INFO  (coreLoadExecutor-13010-thread-1) [    x:collection1] o.a.s.u.UpdateLog Could not find max version in index or recent updates, using new clock 1633665325864058880
   [junit4]   2> 3651851 INFO  (searcherExecutor-13011-thread-1-processing-x:collection1) [    x:collection1] o.a.s.h.c.SpellCheckComponent Loading spell index for spellchecker: default
   [junit4]   2> 3651852 INFO  (searcherExecutor-13011-thread-1-processing-x:collection1) [    x:collection1] o.a.s.h.c.SpellCheckComponent Loading spell index for spellchecker: direct
   [junit4]   2> 3651852 INFO  (searcherExecutor-13011-thread-1-processing-x:collection1) [    x:collection1] o.a.s.h.c.SpellCheckComponent Loading spell index for spellchecker: wordbreak
   [junit4]   2> 3651852 INFO  (searcherExecutor-13011-thread-1-processing-x:collection1) [    x:collection1] o.a.s.h.c.SpellCheckComponent Loading spell index for spellchecker: multipleFields
   [junit4]   2> 3651852 INFO  (searcherExecutor-13011-thread-1-processing-x:collection1) [    x:collection1] o.a.s.h.c.SpellCheckComponent Loading spell index for spellchecker: jarowinkler


[...truncated too long message...]

M warning: Option UseConcMarkSweepGC was deprecated in version 9.0 and will likely be removed in a future release.
   [junit4] <<< JVM J1: EOF ----

[...truncated 1301 lines...]
   [junit4] JVM J0: stderr was not empty, see: /home/jenkins/workspace/Lucene-Solr-BadApples-master-Linux/solr/build/contrib/solr-dataimporthandler-extras/test/temp/junit4-J0-20190516_060213_7799676802210151302044.syserr
   [junit4] >>> JVM J0 emitted unexpected output (verbatim) ----
   [junit4] OpenJDK 64-Bit Server VM warning: Option UseConcMarkSweepGC was deprecated in version 9.0 and will likely be removed in a future release.
   [junit4] <<< JVM J0: EOF ----

[...truncated 3 lines...]
   [junit4] JVM J1: stderr was not empty, see: /home/jenkins/workspace/Lucene-Solr-BadApples-master-Linux/solr/build/contrib/solr-dataimporthandler-extras/test/temp/junit4-J1-20190516_060213_7796113735470375780122.syserr
   [junit4] >>> JVM J1 emitted unexpected output (verbatim) ----
   [junit4] OpenJDK 64-Bit Server VM warning: Option UseConcMarkSweepGC was deprecated in version 9.0 and will likely be removed in a future release.
   [junit4] <<< JVM J1: EOF ----

[...truncated 666 lines...]
   [junit4] JVM J0: stderr was not empty, see: /home/jenkins/workspace/Lucene-Solr-BadApples-master-Linux/solr/build/contrib/solr-dataimporthandler/test/temp/junit4-J0-20190516_060251_7574506714355753060246.syserr
   [junit4] JVM J2: stderr was not empty, see: /home/jenkins/workspace/Lucene-Solr-BadApples-master-Linux/solr/build/contrib/solr-dataimporthandler/test/temp/junit4-J2-20190516_060251_75817453287528618186461.syserr
   [junit4] >>> JVM J2 emitted unexpected output (verbatim) ----
   [junit4] OpenJDK 64-Bit Server VM warning: Option UseConcMarkSweepGC was deprecated in version 9.0 and will likely be removed in a future release.
   [junit4] <<< JVM J2: EOF ----

[...truncated 6 lines...]
   [junit4] JVM J1: stderr was not empty, see: /home/jenkins/workspace/Lucene-Solr-BadApples-master-Linux/solr/build/contrib/solr-dataimporthandler/test/temp/junit4-J1-20190516_060251_7581892339330594292785.syserr
   [junit4] >>> JVM J1 emitted unexpected output (verbatim) ----
   [junit4] OpenJDK 64-Bit Server VM warning: Option UseConcMarkSweepGC was deprecated in version 9.0 and will likely be removed in a future release.
   [junit4] <<< JVM J1: EOF ----

[...truncated 572 lines...]
   [junit4] JVM J1: stderr was not empty, see: /home/jenkins/workspace/Lucene-Solr-BadApples-master-Linux/solr/build/contrib/solr-cell/test/temp/junit4-J1-20190516_060413_4772620264887493615536.syserr
   [junit4] >>> JVM J1 emitted unexpected output (verbatim) ----
   [junit4] OpenJDK 64-Bit Server VM warning: Option UseConcMarkSweepGC was deprecated in version 9.0 and will likely be removed in a future release.
   [junit4] <<< JVM J1: EOF ----

[...truncated 3 lines...]
   [junit4] JVM J2: stderr was not empty, see: /home/jenkins/workspace/Lucene-Solr-BadApples-master-Linux/solr/build/contrib/solr-cell/test/temp/junit4-J2-20190516_060413_47714957778793226163858.syserr
   [junit4] >>> JVM J2 emitted unexpected output (verbatim) ----
   [junit4] OpenJDK 64-Bit Server VM warning: Option UseConcMarkSweepGC was deprecated in version 9.0 and will likely be removed in a future release.
   [junit4] <<< JVM J2: EOF ----

[...truncated 3 lines...]
   [junit4] JVM J0: stderr was not empty, see: /home/jenkins/workspace/Lucene-Solr-BadApples-master-Linux/solr/build/contrib/solr-cell/test/temp/junit4-J0-20190516_060413_4777647186528743331558.syserr
   [junit4] >>> JVM J0 emitted unexpected output (verbatim) ----
   [junit4] OpenJDK 64-Bit Server VM warning: Option UseConcMarkSweepGC was deprecated in version 9.0 and will likely be removed in a future release.
   [junit4] <<< JVM J0: EOF ----

[...truncated 580 lines...]
   [junit4] JVM J0: stderr was not empty, see: /home/jenkins/workspace/Lucene-Solr-BadApples-master-Linux/solr/build/contrib/solr-langid/test/temp/junit4-J0-20190516_060508_0821740103402918574979.syserr
   [junit4] >>> JVM J0 emitted unexpected output (verbatim) ----
   [junit4] OpenJDK 64-Bit Server VM warning: Option UseConcMarkSweepGC was deprecated in version 9.0 and will likely be removed in a future release.
   [junit4] <<< JVM J0: EOF ----

[...truncated 3 lines...]
   [junit4] JVM J1: stderr was not empty, see: /home/jenkins/workspace/Lucene-Solr-BadApples-master-Linux/solr/build/contrib/solr-langid/test/temp/junit4-J1-20190516_060508_08217209244010564027234.syserr
   [junit4] >>> JVM J1 emitted unexpected output (verbatim) ----
   [junit4] OpenJDK 64-Bit Server VM warning: Option UseConcMarkSweepGC was deprecated in version 9.0 and will likely be removed in a future release.
   [junit4] <<< JVM J1: EOF ----

[...truncated 3 lines...]
   [junit4] JVM J2: stderr was not empty, see: /home/jenkins/workspace/Lucene-Solr-BadApples-master-Linux/solr/build/contrib/solr-langid/test/temp/junit4-J2-20190516_060508_082993812173176788471.syserr
   [junit4] >>> JVM J2 emitted unexpected output (verbatim) ----
   [junit4] OpenJDK 64-Bit Server VM warning: Option UseConcMarkSweepGC was deprecated in version 9.0 and will likely be removed in a future release.
   [junit4] <<< JVM J2: EOF ----

[...truncated 689 lines...]
   [junit4] JVM J1: stderr was not empty, see: /home/jenkins/workspace/Lucene-Solr-BadApples-master-Linux/solr/build/contrib/solr-ltr/test/temp/junit4-J1-20190516_060555_7605945088904868993061.syserr
   [junit4] >>> JVM J1 emitted unexpected output (verbatim) ----
   [junit4] OpenJDK 64-Bit Server VM warning: Option UseConcMarkSweepGC was deprecated in version 9.0 and will likely be removed in a future release.
   [junit4] <<< JVM J1: EOF ----

   [junit4] JVM J0: stderr was not empty, see: /home/jenkins/workspace/Lucene-Solr-BadApples-master-Linux/solr/build/contrib/solr-ltr/test/temp/junit4-J0-20190516_060555_76018229785916073470803.syserr
   [junit4] >>> JVM J0 emitted unexpected output (verbatim) ----
   [junit4] OpenJDK 64-Bit Server VM warning: Option UseConcMarkSweepGC was deprecated in version 9.0 and will likely be removed in a future release.
   [junit4] <<< JVM J0: EOF ----

   [junit4] JVM J2: stderr was not empty, see: /home/jenkins/workspace/Lucene-Solr-BadApples-master-Linux/solr/build/contrib/solr-ltr/test/temp/junit4-J2-20190516_060555_76017939171010795470384.syserr
   [junit4] >>> JVM J2 emitted unexpected output (verbatim) ----
   [junit4] OpenJDK 64-Bit Server VM warning: Option UseConcMarkSweepGC was deprecated in version 9.0 and will likely be removed in a future release.
   [junit4] <<< JVM J2: EOF ----

[...truncated 580 lines...]
   [junit4] JVM J1: stderr was not empty, see: /home/jenkins/workspace/Lucene-Solr-BadApples-master-Linux/solr/build/contrib/solr-prometheus-exporter/test/temp/junit4-J1-20190516_060730_1631248300422479535031.syserr
   [junit4] >>> JVM J1 emitted unexpected output (verbatim) ----
   [junit4] OpenJDK 64-Bit Server VM warning: Option UseConcMarkSweepGC was deprecated in version 9.0 and will likely be removed in a future release.
   [junit4] <<< JVM J1: EOF ----

[...truncated 3 lines...]
   [junit4] JVM J0: stderr was not empty, see: /home/jenkins/workspace/Lucene-Solr-BadApples-master-Linux/solr/build/contrib/solr-prometheus-exporter/test/temp/junit4-J0-20190516_060730_1638631081171691318462.syserr
   [junit4] >>> JVM J0 emitted unexpected output (verbatim) ----
   [junit4] OpenJDK 64-Bit Server VM warning: Option UseConcMarkSweepGC was deprecated in version 9.0 and will likely be removed in a future release.
   [junit4] <<< JVM J0: EOF ----

[...truncated 3 lines...]
   [junit4] JVM J2: stderr was not empty, see: /home/jenkins/workspace/Lucene-Solr-BadApples-master-Linux/solr/build/contrib/solr-prometheus-exporter/test/temp/junit4-J2-20190516_060730_1637853995952216466338.syserr
   [junit4] >>> JVM J2 emitted unexpected output (verbatim) ----
   [junit4] OpenJDK 64-Bit Server VM warning: Option UseConcMarkSweepGC was deprecated in version 9.0 and will likely be removed in a future release.
   [junit4] <<< JVM J2: EOF ----

[...truncated 568 lines...]
   [junit4] JVM J0: stderr was not empty, see: /home/jenkins/workspace/Lucene-Solr-BadApples-master-Linux/solr/build/contrib/solr-velocity/test/temp/junit4-J0-20190516_060841_7742287162476049268699.syserr
   [junit4] >>> JVM J0 emitted unexpected output (verbatim) ----
   [junit4] OpenJDK 64-Bit Server VM warning: Option UseConcMarkSweepGC was deprecated in version 9.0 and will likely be removed in a future release.
   [junit4] <<< JVM J0: EOF ----

[...truncated 34216 lines...]
BUILD FAILED
/home/jenkins/workspace/Lucene-Solr-BadApples-master-Linux/build.xml:643: The following error occurred while executing this line:
/home/jenkins/workspace/Lucene-Solr-BadApples-master-Linux/build.xml:507: The following error occurred while executing this line:
/home/jenkins/workspace/Lucene-Solr-BadApples-master-Linux/build.xml:494: Source checkout is dirty (unversioned/missing files) after running tests!!! Offending files:
* solr/licenses/noggit-0.8.jar.sha1

Total time: 171 minutes 31 seconds
Build step 'Invoke Ant' marked build as failure
Archiving artifacts
Setting ANT_1_8_2_HOME=/home/jenkins/tools/hudson.tasks.Ant_AntInstallation/ANT_1.8.2
[WARNINGS] Skipping publisher since build result is FAILURE
Recording test results
Setting ANT_1_8_2_HOME=/home/jenkins/tools/hudson.tasks.Ant_AntInstallation/ANT_1.8.2
Email was triggered for: Failure - Any
Sending email for trigger: Failure - Any
Setting ANT_1_8_2_HOME=/home/jenkins/tools/hudson.tasks.Ant_AntInstallation/ANT_1.8.2
Setting ANT_1_8_2_HOME=/home/jenkins/tools/hudson.tasks.Ant_AntInstallation/ANT_1.8.2
Setting ANT_1_8_2_HOME=/home/jenkins/tools/hudson.tasks.Ant_AntInstallation/ANT_1.8.2
Setting ANT_1_8_2_HOME=/home/jenkins/tools/hudson.tasks.Ant_AntInstallation/ANT_1.8.2
Setting ANT_1_8_2_HOME=/home/jenkins/tools/hudson.tasks.Ant_AntInstallation/ANT_1.8.2
Setting ANT_1_8_2_HOME=/home/jenkins/tools/hudson.tasks.Ant_AntInstallation/ANT_1.8.2

Mime
View raw message