lucene-dev mailing list archives

Site index · List index
Message view « Date » · « Thread »
Top « Date » · « Thread »
From Policeman Jenkins Server <jenk...@thetaphi.de>
Subject [JENKINS] Lucene-Solr-8.x-Linux (64bit/jdk1.8.0_201) - Build # 499 - Still Failing!
Date Thu, 02 May 2019 08:34:57 GMT
Build: https://jenkins.thetaphi.de/job/Lucene-Solr-8.x-Linux/499/
Java: 64bit/jdk1.8.0_201 -XX:+UseCompressedOops -XX:+UseParallelGC

3 tests failed.
FAILED:  org.apache.solr.update.TestInPlaceUpdatesDistrib.test

Error Message:
Thread pool didn't terminate within 15 secs

Stack Trace:
java.lang.AssertionError: Thread pool didn't terminate within 15 secs
	at __randomizedtesting.SeedInfo.seed([6DFDF5AD0784DD43:E5A9CA77A978B0BB]:0)
	at org.junit.Assert.fail(Assert.java:88)
	at org.junit.Assert.assertTrue(Assert.java:41)
	at org.apache.solr.update.TestInPlaceUpdatesDistrib.reorderedDBQsResurrectionTest(TestInPlaceUpdatesDistrib.java:852)
	at org.apache.solr.update.TestInPlaceUpdatesDistrib.test(TestInPlaceUpdatesDistrib.java:179)
	at sun.reflect.NativeMethodAccessorImpl.invoke0(Native Method)
	at sun.reflect.NativeMethodAccessorImpl.invoke(NativeMethodAccessorImpl.java:62)
	at sun.reflect.DelegatingMethodAccessorImpl.invoke(DelegatingMethodAccessorImpl.java:43)
	at java.lang.reflect.Method.invoke(Method.java:498)
	at com.carrotsearch.randomizedtesting.RandomizedRunner.invoke(RandomizedRunner.java:1750)
	at com.carrotsearch.randomizedtesting.RandomizedRunner$8.evaluate(RandomizedRunner.java:938)
	at com.carrotsearch.randomizedtesting.RandomizedRunner$9.evaluate(RandomizedRunner.java:974)
	at com.carrotsearch.randomizedtesting.RandomizedRunner$10.evaluate(RandomizedRunner.java:988)
	at org.apache.solr.BaseDistributedSearchTestCase$ShardsRepeatRule$ShardsFixedStatement.callStatement(BaseDistributedSearchTestCase.java:1082)
	at org.apache.solr.BaseDistributedSearchTestCase$ShardsRepeatRule$ShardsStatement.evaluate(BaseDistributedSearchTestCase.java:1054)
	at com.carrotsearch.randomizedtesting.rules.SystemPropertiesRestoreRule$1.evaluate(SystemPropertiesRestoreRule.java:57)
	at org.apache.lucene.util.TestRuleSetupTeardownChained$1.evaluate(TestRuleSetupTeardownChained.java:49)
	at org.apache.lucene.util.AbstractBeforeAfterRule$1.evaluate(AbstractBeforeAfterRule.java:45)
	at org.apache.lucene.util.TestRuleThreadAndTestName$1.evaluate(TestRuleThreadAndTestName.java:48)
	at org.apache.lucene.util.TestRuleIgnoreAfterMaxFailures$1.evaluate(TestRuleIgnoreAfterMaxFailures.java:64)
	at org.apache.lucene.util.TestRuleMarkFailure$1.evaluate(TestRuleMarkFailure.java:47)
	at com.carrotsearch.randomizedtesting.rules.StatementAdapter.evaluate(StatementAdapter.java:36)
	at com.carrotsearch.randomizedtesting.ThreadLeakControl$StatementRunner.run(ThreadLeakControl.java:368)
	at com.carrotsearch.randomizedtesting.ThreadLeakControl.forkTimeoutingTask(ThreadLeakControl.java:817)
	at com.carrotsearch.randomizedtesting.ThreadLeakControl$3.evaluate(ThreadLeakControl.java:468)
	at com.carrotsearch.randomizedtesting.RandomizedRunner.runSingleTest(RandomizedRunner.java:947)
	at com.carrotsearch.randomizedtesting.RandomizedRunner$5.evaluate(RandomizedRunner.java:832)
	at com.carrotsearch.randomizedtesting.RandomizedRunner$6.evaluate(RandomizedRunner.java:883)
	at com.carrotsearch.randomizedtesting.RandomizedRunner$7.evaluate(RandomizedRunner.java:894)
	at com.carrotsearch.randomizedtesting.rules.StatementAdapter.evaluate(StatementAdapter.java:36)
	at com.carrotsearch.randomizedtesting.rules.SystemPropertiesRestoreRule$1.evaluate(SystemPropertiesRestoreRule.java:57)
	at org.apache.lucene.util.AbstractBeforeAfterRule$1.evaluate(AbstractBeforeAfterRule.java:45)
	at com.carrotsearch.randomizedtesting.rules.StatementAdapter.evaluate(StatementAdapter.java:36)
	at org.apache.lucene.util.TestRuleStoreClassName$1.evaluate(TestRuleStoreClassName.java:41)
	at com.carrotsearch.randomizedtesting.rules.NoShadowingOrOverridesOnMethodsRule$1.evaluate(NoShadowingOrOverridesOnMethodsRule.java:40)
	at com.carrotsearch.randomizedtesting.rules.NoShadowingOrOverridesOnMethodsRule$1.evaluate(NoShadowingOrOverridesOnMethodsRule.java:40)
	at com.carrotsearch.randomizedtesting.rules.StatementAdapter.evaluate(StatementAdapter.java:36)
	at com.carrotsearch.randomizedtesting.rules.StatementAdapter.evaluate(StatementAdapter.java:36)
	at com.carrotsearch.randomizedtesting.rules.StatementAdapter.evaluate(StatementAdapter.java:36)
	at org.apache.lucene.util.TestRuleAssertionsRequired$1.evaluate(TestRuleAssertionsRequired.java:53)
	at org.apache.lucene.util.TestRuleMarkFailure$1.evaluate(TestRuleMarkFailure.java:47)
	at org.apache.lucene.util.TestRuleIgnoreAfterMaxFailures$1.evaluate(TestRuleIgnoreAfterMaxFailures.java:64)
	at org.apache.lucene.util.TestRuleIgnoreTestSuites$1.evaluate(TestRuleIgnoreTestSuites.java:54)
	at com.carrotsearch.randomizedtesting.rules.StatementAdapter.evaluate(StatementAdapter.java:36)
	at com.carrotsearch.randomizedtesting.ThreadLeakControl$StatementRunner.run(ThreadLeakControl.java:368)
	at java.lang.Thread.run(Thread.java:748)


FAILED:  org.apache.solr.update.PeerSyncTest.test

Error Message:
Unexpected exception type, expected SolrException but got org.apache.solr.client.solrj.SolrServerException: Timeout occurred while waiting response from server at: http://127.0.0.1:33079/collection1

Stack Trace:
junit.framework.AssertionFailedError: Unexpected exception type, expected SolrException but got org.apache.solr.client.solrj.SolrServerException: Timeout occurred while waiting response from server at: http://127.0.0.1:33079/collection1
	at __randomizedtesting.SeedInfo.seed([6DFDF5AD0784DD43:E5A9CA77A978B0BB]:0)
	at org.apache.lucene.util.LuceneTestCase.expectThrows(LuceneTestCase.java:2700)
	at org.apache.lucene.util.LuceneTestCase.expectThrows(LuceneTestCase.java:2689)
	at org.apache.solr.update.PeerSyncTest.test(PeerSyncTest.java:279)
	at sun.reflect.NativeMethodAccessorImpl.invoke0(Native Method)
	at sun.reflect.NativeMethodAccessorImpl.invoke(NativeMethodAccessorImpl.java:62)
	at sun.reflect.DelegatingMethodAccessorImpl.invoke(DelegatingMethodAccessorImpl.java:43)
	at java.lang.reflect.Method.invoke(Method.java:498)
	at com.carrotsearch.randomizedtesting.RandomizedRunner.invoke(RandomizedRunner.java:1750)
	at com.carrotsearch.randomizedtesting.RandomizedRunner$8.evaluate(RandomizedRunner.java:938)
	at com.carrotsearch.randomizedtesting.RandomizedRunner$9.evaluate(RandomizedRunner.java:974)
	at com.carrotsearch.randomizedtesting.RandomizedRunner$10.evaluate(RandomizedRunner.java:988)
	at org.apache.solr.BaseDistributedSearchTestCase$ShardsRepeatRule$ShardsFixedStatement.callStatement(BaseDistributedSearchTestCase.java:1082)
	at org.apache.solr.BaseDistributedSearchTestCase$ShardsRepeatRule$ShardsStatement.evaluate(BaseDistributedSearchTestCase.java:1054)
	at com.carrotsearch.randomizedtesting.rules.SystemPropertiesRestoreRule$1.evaluate(SystemPropertiesRestoreRule.java:57)
	at org.apache.lucene.util.TestRuleSetupTeardownChained$1.evaluate(TestRuleSetupTeardownChained.java:49)
	at org.apache.lucene.util.AbstractBeforeAfterRule$1.evaluate(AbstractBeforeAfterRule.java:45)
	at org.apache.lucene.util.TestRuleThreadAndTestName$1.evaluate(TestRuleThreadAndTestName.java:48)
	at org.apache.lucene.util.TestRuleIgnoreAfterMaxFailures$1.evaluate(TestRuleIgnoreAfterMaxFailures.java:64)
	at org.apache.lucene.util.TestRuleMarkFailure$1.evaluate(TestRuleMarkFailure.java:47)
	at com.carrotsearch.randomizedtesting.rules.StatementAdapter.evaluate(StatementAdapter.java:36)
	at com.carrotsearch.randomizedtesting.ThreadLeakControl$StatementRunner.run(ThreadLeakControl.java:368)
	at com.carrotsearch.randomizedtesting.ThreadLeakControl.forkTimeoutingTask(ThreadLeakControl.java:817)
	at com.carrotsearch.randomizedtesting.ThreadLeakControl$3.evaluate(ThreadLeakControl.java:468)
	at com.carrotsearch.randomizedtesting.RandomizedRunner.runSingleTest(RandomizedRunner.java:947)
	at com.carrotsearch.randomizedtesting.RandomizedRunner$5.evaluate(RandomizedRunner.java:832)
	at com.carrotsearch.randomizedtesting.RandomizedRunner$6.evaluate(RandomizedRunner.java:883)
	at com.carrotsearch.randomizedtesting.RandomizedRunner$7.evaluate(RandomizedRunner.java:894)
	at com.carrotsearch.randomizedtesting.rules.StatementAdapter.evaluate(StatementAdapter.java:36)
	at com.carrotsearch.randomizedtesting.rules.SystemPropertiesRestoreRule$1.evaluate(SystemPropertiesRestoreRule.java:57)
	at org.apache.lucene.util.AbstractBeforeAfterRule$1.evaluate(AbstractBeforeAfterRule.java:45)
	at com.carrotsearch.randomizedtesting.rules.StatementAdapter.evaluate(StatementAdapter.java:36)
	at org.apache.lucene.util.TestRuleStoreClassName$1.evaluate(TestRuleStoreClassName.java:41)
	at com.carrotsearch.randomizedtesting.rules.NoShadowingOrOverridesOnMethodsRule$1.evaluate(NoShadowingOrOverridesOnMethodsRule.java:40)
	at com.carrotsearch.randomizedtesting.rules.NoShadowingOrOverridesOnMethodsRule$1.evaluate(NoShadowingOrOverridesOnMethodsRule.java:40)
	at com.carrotsearch.randomizedtesting.rules.StatementAdapter.evaluate(StatementAdapter.java:36)
	at com.carrotsearch.randomizedtesting.rules.StatementAdapter.evaluate(StatementAdapter.java:36)
	at com.carrotsearch.randomizedtesting.rules.StatementAdapter.evaluate(StatementAdapter.java:36)
	at org.apache.lucene.util.TestRuleAssertionsRequired$1.evaluate(TestRuleAssertionsRequired.java:53)
	at org.apache.lucene.util.TestRuleMarkFailure$1.evaluate(TestRuleMarkFailure.java:47)
	at org.apache.lucene.util.TestRuleIgnoreAfterMaxFailures$1.evaluate(TestRuleIgnoreAfterMaxFailures.java:64)
	at org.apache.lucene.util.TestRuleIgnoreTestSuites$1.evaluate(TestRuleIgnoreTestSuites.java:54)
	at com.carrotsearch.randomizedtesting.rules.StatementAdapter.evaluate(StatementAdapter.java:36)
	at com.carrotsearch.randomizedtesting.ThreadLeakControl$StatementRunner.run(ThreadLeakControl.java:368)
	at java.lang.Thread.run(Thread.java:748)
Caused by: org.apache.solr.client.solrj.SolrServerException: Timeout occurred while waiting response from server at: http://127.0.0.1:33079/collection1
	at org.apache.solr.client.solrj.impl.HttpSolrClient.executeMethod(HttpSolrClient.java:660)
	at org.apache.solr.client.solrj.impl.HttpSolrClient.request(HttpSolrClient.java:255)
	at org.apache.solr.client.solrj.impl.HttpSolrClient.request(HttpSolrClient.java:244)
	at org.apache.solr.client.solrj.SolrRequest.process(SolrRequest.java:207)
	at org.apache.solr.client.solrj.SolrRequest.process(SolrRequest.java:224)
	at org.apache.solr.BaseDistributedSearchTestCase.add(BaseDistributedSearchTestCase.java:576)
	at org.apache.solr.update.PeerSyncTest.lambda$test$0(PeerSyncTest.java:281)
	at org.apache.lucene.util.LuceneTestCase.expectThrows(LuceneTestCase.java:2695)
	... 43 more
Caused by: java.net.SocketTimeoutException: Read timed out
	at java.net.SocketInputStream.socketRead0(Native Method)
	at java.net.SocketInputStream.socketRead(SocketInputStream.java:116)
	at java.net.SocketInputStream.read(SocketInputStream.java:171)
	at java.net.SocketInputStream.read(SocketInputStream.java:141)
	at org.apache.http.impl.io.SessionInputBufferImpl.streamRead(SessionInputBufferImpl.java:137)
	at org.apache.http.impl.io.SessionInputBufferImpl.fillBuffer(SessionInputBufferImpl.java:153)
	at org.apache.http.impl.io.SessionInputBufferImpl.readLine(SessionInputBufferImpl.java:282)
	at org.apache.http.impl.conn.DefaultHttpResponseParser.parseHead(DefaultHttpResponseParser.java:138)
	at org.apache.http.impl.conn.DefaultHttpResponseParser.parseHead(DefaultHttpResponseParser.java:56)
	at org.apache.http.impl.io.AbstractMessageParser.parse(AbstractMessageParser.java:259)
	at org.apache.http.impl.DefaultBHttpClientConnection.receiveResponseHeader(DefaultBHttpClientConnection.java:163)
	at org.apache.http.impl.conn.CPoolProxy.receiveResponseHeader(CPoolProxy.java:165)
	at org.apache.http.protocol.HttpRequestExecutor.doReceiveResponse(HttpRequestExecutor.java:273)
	at org.apache.http.protocol.HttpRequestExecutor.execute(HttpRequestExecutor.java:125)
	at org.apache.http.impl.execchain.MainClientExec.execute(MainClientExec.java:272)
	at org.apache.http.impl.execchain.ProtocolExec.execute(ProtocolExec.java:185)
	at org.apache.http.impl.execchain.RetryExec.execute(RetryExec.java:89)
	at org.apache.http.impl.execchain.RedirectExec.execute(RedirectExec.java:110)
	at org.apache.http.impl.client.InternalHttpClient.doExecute(InternalHttpClient.java:185)
	at org.apache.http.impl.client.CloseableHttpClient.execute(CloseableHttpClient.java:83)
	at org.apache.http.impl.client.CloseableHttpClient.execute(CloseableHttpClient.java:56)
	at org.apache.solr.client.solrj.impl.HttpSolrClient.executeMethod(HttpSolrClient.java:548)
	... 50 more


FAILED:  org.apache.solr.update.PeerSyncWithLeaderTest.test

Error Message:
Unexpected exception type, expected SolrException but got org.apache.solr.client.solrj.SolrServerException: Timeout occurred while waiting response from server at: http://127.0.0.1:34785/gc/j/collection1

Stack Trace:
junit.framework.AssertionFailedError: Unexpected exception type, expected SolrException but got org.apache.solr.client.solrj.SolrServerException: Timeout occurred while waiting response from server at: http://127.0.0.1:34785/gc/j/collection1
	at __randomizedtesting.SeedInfo.seed([6DFDF5AD0784DD43:E5A9CA77A978B0BB]:0)
	at org.apache.lucene.util.LuceneTestCase.expectThrows(LuceneTestCase.java:2700)
	at org.apache.lucene.util.LuceneTestCase.expectThrows(LuceneTestCase.java:2689)
	at org.apache.solr.update.PeerSyncTest.test(PeerSyncTest.java:279)
	at sun.reflect.NativeMethodAccessorImpl.invoke0(Native Method)
	at sun.reflect.NativeMethodAccessorImpl.invoke(NativeMethodAccessorImpl.java:62)
	at sun.reflect.DelegatingMethodAccessorImpl.invoke(DelegatingMethodAccessorImpl.java:43)
	at java.lang.reflect.Method.invoke(Method.java:498)
	at com.carrotsearch.randomizedtesting.RandomizedRunner.invoke(RandomizedRunner.java:1750)
	at com.carrotsearch.randomizedtesting.RandomizedRunner$8.evaluate(RandomizedRunner.java:938)
	at com.carrotsearch.randomizedtesting.RandomizedRunner$9.evaluate(RandomizedRunner.java:974)
	at com.carrotsearch.randomizedtesting.RandomizedRunner$10.evaluate(RandomizedRunner.java:988)
	at org.apache.solr.BaseDistributedSearchTestCase$ShardsRepeatRule$ShardsFixedStatement.callStatement(BaseDistributedSearchTestCase.java:1082)
	at org.apache.solr.BaseDistributedSearchTestCase$ShardsRepeatRule$ShardsStatement.evaluate(BaseDistributedSearchTestCase.java:1054)
	at com.carrotsearch.randomizedtesting.rules.SystemPropertiesRestoreRule$1.evaluate(SystemPropertiesRestoreRule.java:57)
	at org.apache.lucene.util.TestRuleSetupTeardownChained$1.evaluate(TestRuleSetupTeardownChained.java:49)
	at org.apache.lucene.util.AbstractBeforeAfterRule$1.evaluate(AbstractBeforeAfterRule.java:45)
	at org.apache.lucene.util.TestRuleThreadAndTestName$1.evaluate(TestRuleThreadAndTestName.java:48)
	at org.apache.lucene.util.TestRuleIgnoreAfterMaxFailures$1.evaluate(TestRuleIgnoreAfterMaxFailures.java:64)
	at org.apache.lucene.util.TestRuleMarkFailure$1.evaluate(TestRuleMarkFailure.java:47)
	at com.carrotsearch.randomizedtesting.rules.StatementAdapter.evaluate(StatementAdapter.java:36)
	at com.carrotsearch.randomizedtesting.ThreadLeakControl$StatementRunner.run(ThreadLeakControl.java:368)
	at com.carrotsearch.randomizedtesting.ThreadLeakControl.forkTimeoutingTask(ThreadLeakControl.java:817)
	at com.carrotsearch.randomizedtesting.ThreadLeakControl$3.evaluate(ThreadLeakControl.java:468)
	at com.carrotsearch.randomizedtesting.RandomizedRunner.runSingleTest(RandomizedRunner.java:947)
	at com.carrotsearch.randomizedtesting.RandomizedRunner$5.evaluate(RandomizedRunner.java:832)
	at com.carrotsearch.randomizedtesting.RandomizedRunner$6.evaluate(RandomizedRunner.java:883)
	at com.carrotsearch.randomizedtesting.RandomizedRunner$7.evaluate(RandomizedRunner.java:894)
	at com.carrotsearch.randomizedtesting.rules.StatementAdapter.evaluate(StatementAdapter.java:36)
	at com.carrotsearch.randomizedtesting.rules.SystemPropertiesRestoreRule$1.evaluate(SystemPropertiesRestoreRule.java:57)
	at org.apache.lucene.util.AbstractBeforeAfterRule$1.evaluate(AbstractBeforeAfterRule.java:45)
	at com.carrotsearch.randomizedtesting.rules.StatementAdapter.evaluate(StatementAdapter.java:36)
	at org.apache.lucene.util.TestRuleStoreClassName$1.evaluate(TestRuleStoreClassName.java:41)
	at com.carrotsearch.randomizedtesting.rules.NoShadowingOrOverridesOnMethodsRule$1.evaluate(NoShadowingOrOverridesOnMethodsRule.java:40)
	at com.carrotsearch.randomizedtesting.rules.NoShadowingOrOverridesOnMethodsRule$1.evaluate(NoShadowingOrOverridesOnMethodsRule.java:40)
	at com.carrotsearch.randomizedtesting.rules.StatementAdapter.evaluate(StatementAdapter.java:36)
	at com.carrotsearch.randomizedtesting.rules.StatementAdapter.evaluate(StatementAdapter.java:36)
	at com.carrotsearch.randomizedtesting.rules.StatementAdapter.evaluate(StatementAdapter.java:36)
	at org.apache.lucene.util.TestRuleAssertionsRequired$1.evaluate(TestRuleAssertionsRequired.java:53)
	at org.apache.lucene.util.TestRuleMarkFailure$1.evaluate(TestRuleMarkFailure.java:47)
	at org.apache.lucene.util.TestRuleIgnoreAfterMaxFailures$1.evaluate(TestRuleIgnoreAfterMaxFailures.java:64)
	at org.apache.lucene.util.TestRuleIgnoreTestSuites$1.evaluate(TestRuleIgnoreTestSuites.java:54)
	at com.carrotsearch.randomizedtesting.rules.StatementAdapter.evaluate(StatementAdapter.java:36)
	at com.carrotsearch.randomizedtesting.ThreadLeakControl$StatementRunner.run(ThreadLeakControl.java:368)
	at java.lang.Thread.run(Thread.java:748)
Caused by: org.apache.solr.client.solrj.SolrServerException: Timeout occurred while waiting response from server at: http://127.0.0.1:34785/gc/j/collection1
	at org.apache.solr.client.solrj.impl.HttpSolrClient.executeMethod(HttpSolrClient.java:660)
	at org.apache.solr.client.solrj.impl.HttpSolrClient.request(HttpSolrClient.java:255)
	at org.apache.solr.client.solrj.impl.HttpSolrClient.request(HttpSolrClient.java:244)
	at org.apache.solr.client.solrj.SolrRequest.process(SolrRequest.java:207)
	at org.apache.solr.client.solrj.SolrRequest.process(SolrRequest.java:224)
	at org.apache.solr.BaseDistributedSearchTestCase.add(BaseDistributedSearchTestCase.java:576)
	at org.apache.solr.update.PeerSyncTest.lambda$test$0(PeerSyncTest.java:281)
	at org.apache.lucene.util.LuceneTestCase.expectThrows(LuceneTestCase.java:2695)
	... 43 more
Caused by: java.net.SocketTimeoutException: Read timed out
	at java.net.SocketInputStream.socketRead0(Native Method)
	at java.net.SocketInputStream.socketRead(SocketInputStream.java:116)
	at java.net.SocketInputStream.read(SocketInputStream.java:171)
	at java.net.SocketInputStream.read(SocketInputStream.java:141)
	at org.apache.http.impl.io.SessionInputBufferImpl.streamRead(SessionInputBufferImpl.java:137)
	at org.apache.http.impl.io.SessionInputBufferImpl.fillBuffer(SessionInputBufferImpl.java:153)
	at org.apache.http.impl.io.SessionInputBufferImpl.readLine(SessionInputBufferImpl.java:282)
	at org.apache.http.impl.conn.DefaultHttpResponseParser.parseHead(DefaultHttpResponseParser.java:138)
	at org.apache.http.impl.conn.DefaultHttpResponseParser.parseHead(DefaultHttpResponseParser.java:56)
	at org.apache.http.impl.io.AbstractMessageParser.parse(AbstractMessageParser.java:259)
	at org.apache.http.impl.DefaultBHttpClientConnection.receiveResponseHeader(DefaultBHttpClientConnection.java:163)
	at org.apache.http.impl.conn.CPoolProxy.receiveResponseHeader(CPoolProxy.java:165)
	at org.apache.http.protocol.HttpRequestExecutor.doReceiveResponse(HttpRequestExecutor.java:273)
	at org.apache.http.protocol.HttpRequestExecutor.execute(HttpRequestExecutor.java:125)
	at org.apache.http.impl.execchain.MainClientExec.execute(MainClientExec.java:272)
	at org.apache.http.impl.execchain.ProtocolExec.execute(ProtocolExec.java:185)
	at org.apache.http.impl.execchain.RetryExec.execute(RetryExec.java:89)
	at org.apache.http.impl.execchain.RedirectExec.execute(RedirectExec.java:110)
	at org.apache.http.impl.client.InternalHttpClient.doExecute(InternalHttpClient.java:185)
	at org.apache.http.impl.client.CloseableHttpClient.execute(CloseableHttpClient.java:83)
	at org.apache.http.impl.client.CloseableHttpClient.execute(CloseableHttpClient.java:56)
	at org.apache.solr.client.solrj.impl.HttpSolrClient.executeMethod(HttpSolrClient.java:548)
	... 50 more




Build Log:
[...truncated 13078 lines...]
   [junit4] Suite: org.apache.solr.update.PeerSyncTest
   [junit4]   2> Creating dataDir: /home/jenkins/workspace/Lucene-Solr-8.x-Linux/solr/build/solr-core/test/J1/temp/solr.update.PeerSyncTest_6DFDF5AD0784DD43-001/init-core-data-001
   [junit4]   2> 19543 WARN  (SUITE-PeerSyncTest-seed#[6DFDF5AD0784DD43]-worker) [    ] o.a.s.SolrTestCaseJ4 startTrackingSearchers: numOpens=5 numCloses=5
   [junit4]   2> 19543 INFO  (SUITE-PeerSyncTest-seed#[6DFDF5AD0784DD43]-worker) [    ] o.a.s.SolrTestCaseJ4 Using PointFields (NUMERIC_POINTS_SYSPROP=true) w/NUMERIC_DOCVALUES_SYSPROP=true
   [junit4]   2> 19545 INFO  (SUITE-PeerSyncTest-seed#[6DFDF5AD0784DD43]-worker) [    ] o.a.s.SolrTestCaseJ4 Randomized ssl (false) and clientAuth (false) via: @org.apache.solr.SolrTestCaseJ4$SuppressSSL(bugUrl=https://issues.apache.org/jira/browse/SOLR-5776)
   [junit4]   2> 19545 INFO  (SUITE-PeerSyncTest-seed#[6DFDF5AD0784DD43]-worker) [    ] o.a.s.SolrTestCaseJ4 SecureRandom sanity checks: test.solr.allowed.securerandom=null & java.security.egd=file:/dev/./urandom
   [junit4]   2> 19545 INFO  (SUITE-PeerSyncTest-seed#[6DFDF5AD0784DD43]-worker) [    ] o.a.s.BaseDistributedSearchTestCase Setting hostContext system property: /
   [junit4]   2> 19547 INFO  (TEST-PeerSyncTest.test-seed#[6DFDF5AD0784DD43]) [    ] o.a.s.SolrTestCaseJ4 ####initCore
   [junit4]   2> 19548 INFO  (TEST-PeerSyncTest.test-seed#[6DFDF5AD0784DD43]) [    ] o.a.s.c.SolrResourceLoader [null] Added 2 libs to classloader, from paths: [/home/jenkins/workspace/Lucene-Solr-8.x-Linux/solr/core/src/test-files/solr/collection1/lib, /home/jenkins/workspace/Lucene-Solr-8.x-Linux/solr/core/src/test-files/solr/collection1/lib/classes]
   [junit4]   2> 19569 INFO  (TEST-PeerSyncTest.test-seed#[6DFDF5AD0784DD43]) [    ] o.a.s.c.SolrConfig Using Lucene MatchVersion: 8.2.0
   [junit4]   2> 19607 INFO  (TEST-PeerSyncTest.test-seed#[6DFDF5AD0784DD43]) [    ] o.a.s.s.IndexSchema [null] Schema name=test
   [junit4]   2> 19735 INFO  (TEST-PeerSyncTest.test-seed#[6DFDF5AD0784DD43]) [    ] o.a.s.s.IndexSchema Loaded schema test/1.0 with uniqueid field id
   [junit4]   2> 19870 INFO  (TEST-PeerSyncTest.test-seed#[6DFDF5AD0784DD43]) [    ] o.a.s.h.c.HttpShardHandlerFactory Host whitelist initialized: WhitelistHostChecker [whitelistHosts=null, whitelistHostCheckingEnabled=false]
   [junit4]   2> 19904 WARN  (TEST-PeerSyncTest.test-seed#[6DFDF5AD0784DD43]) [    ] o.e.j.u.s.S.config No Client EndPointIdentificationAlgorithm configured for SslContextFactory@71ef43a5[provider=null,keyStore=null,trustStore=null]
   [junit4]   2> 19943 WARN  (TEST-PeerSyncTest.test-seed#[6DFDF5AD0784DD43]) [    ] o.e.j.u.s.S.config No Client EndPointIdentificationAlgorithm configured for SslContextFactory@2bfa0974[provider=null,keyStore=null,trustStore=null]
   [junit4]   2> 19996 INFO  (TEST-PeerSyncTest.test-seed#[6DFDF5AD0784DD43]) [    ] o.a.s.c.TransientSolrCoreCacheDefault Allocating transient cache for 2147483647 transient cores
   [junit4]   2> 19996 INFO  (TEST-PeerSyncTest.test-seed#[6DFDF5AD0784DD43]) [    ] o.a.s.h.a.MetricsHistoryHandler No .system collection, keeping metrics history in memory.
   [junit4]   2> 20060 INFO  (TEST-PeerSyncTest.test-seed#[6DFDF5AD0784DD43]) [    ] o.a.s.m.r.SolrJmxReporter JMX monitoring for 'solr.node' (registry 'solr.node') enabled at server: com.sun.jmx.mbeanserver.JmxMBeanServer@24be75cd
   [junit4]   2> 20069 INFO  (TEST-PeerSyncTest.test-seed#[6DFDF5AD0784DD43]) [    ] o.a.s.m.r.SolrJmxReporter JMX monitoring for 'solr.jvm' (registry 'solr.jvm') enabled at server: com.sun.jmx.mbeanserver.JmxMBeanServer@24be75cd
   [junit4]   2> 20069 INFO  (TEST-PeerSyncTest.test-seed#[6DFDF5AD0784DD43]) [    ] o.a.s.m.r.SolrJmxReporter JMX monitoring for 'solr.jetty' (registry 'solr.jetty') enabled at server: com.sun.jmx.mbeanserver.JmxMBeanServer@24be75cd
   [junit4]   2> 20086 INFO  (coreLoadExecutor-79-thread-1) [    x:collection1] o.a.s.c.SolrResourceLoader [null] Added 2 libs to classloader, from paths: [/home/jenkins/workspace/Lucene-Solr-8.x-Linux/solr/core/src/test-files/solr/collection1/lib, /home/jenkins/workspace/Lucene-Solr-8.x-Linux/solr/core/src/test-files/solr/collection1/lib/classes]
   [junit4]   2> 20150 INFO  (coreLoadExecutor-79-thread-1) [    x:collection1] o.a.s.c.SolrConfig Using Lucene MatchVersion: 8.2.0
   [junit4]   2> 20173 INFO  (coreLoadExecutor-79-thread-1) [    x:collection1] o.a.s.s.IndexSchema [collection1] Schema name=test
   [junit4]   2> 20308 INFO  (coreLoadExecutor-79-thread-1) [    x:collection1] o.a.s.s.IndexSchema Loaded schema test/1.0 with uniqueid field id
   [junit4]   2> 20343 INFO  (coreLoadExecutor-79-thread-1) [    x:collection1] o.a.s.c.CoreContainer Creating SolrCore 'collection1' using configuration from instancedir /home/jenkins/workspace/Lucene-Solr-8.x-Linux/solr/core/src/test-files/solr/collection1, trusted=true
   [junit4]   2> 20351 INFO  (coreLoadExecutor-79-thread-1) [    x:collection1] o.a.s.m.r.SolrJmxReporter JMX monitoring for 'solr.core.collection1' (registry 'solr.core.collection1') enabled at server: com.sun.jmx.mbeanserver.JmxMBeanServer@24be75cd
   [junit4]   2> 20353 INFO  (coreLoadExecutor-79-thread-1) [    x:collection1] o.a.s.c.SolrCore [[collection1] ] Opening new SolrCore at [/home/jenkins/workspace/Lucene-Solr-8.x-Linux/solr/core/src/test-files/solr/collection1], dataDir=[/home/jenkins/workspace/Lucene-Solr-8.x-Linux/solr/build/solr-core/test/J1/temp/solr.update.PeerSyncTest_6DFDF5AD0784DD43-001/init-core-data-001/]
   [junit4]   2> 20355 INFO  (coreLoadExecutor-79-thread-1) [    x:collection1] o.a.s.u.RandomMergePolicy RandomMergePolicy wrapping class org.apache.lucene.index.TieredMergePolicy: [TieredMergePolicy: maxMergeAtOnce=36, maxMergeAtOnceExplicit=34, maxMergedSegmentMB=87.068359375, floorSegmentMB=0.5556640625, forceMergeDeletesPctAllowed=18.066744849168334, segmentsPerTier=38.0, maxCFSSegmentSizeMB=8.796093022207999E12, noCFSRatio=0.49922519231271945, deletesPctAllowed=47.847509482883986
   [junit4]   2> 20409 WARN  (coreLoadExecutor-79-thread-1) [    x:collection1] o.a.s.c.RequestHandlers INVALID paramSet a in requestHandler {type = requestHandler,name = /dump,class = DumpRequestHandler,attributes = {initParams=a, name=/dump, class=DumpRequestHandler},args = {defaults={a=A,b=B}}}
   [junit4]   2> 20467 INFO  (coreLoadExecutor-79-thread-1) [    x:collection1] o.a.s.u.UpdateHandler Using UpdateLog implementation: org.apache.solr.update.UpdateLog
   [junit4]   2> 20467 INFO  (coreLoadExecutor-79-thread-1) [    x:collection1] o.a.s.u.UpdateLog Initializing UpdateLog: dataDir= defaultSyncLevel=FLUSH numRecordsToKeep=100 maxNumLogsToKeep=10 numVersionBuckets=65536
   [junit4]   2> 20468 INFO  (coreLoadExecutor-79-thread-1) [    x:collection1] o.a.s.u.CommitTracker Hard AutoCommit: disabled
   [junit4]   2> 20469 INFO  (coreLoadExecutor-79-thread-1) [    x:collection1] o.a.s.u.CommitTracker Soft AutoCommit: disabled
   [junit4]   2> 20470 INFO  (coreLoadExecutor-79-thread-1) [    x:collection1] o.a.s.u.RandomMergePolicy RandomMergePolicy wrapping class org.apache.lucene.index.LogByteSizeMergePolicy: [LogByteSizeMergePolicy: minMergeSize=1677721, mergeFactor=36, maxMergeSize=2147483648, maxMergeSizeForForcedMerge=9223372036854775807, calibrateSizeByDeletes=false, maxMergeDocs=2147483647, maxCFSSegmentSizeMB=8.796093022207999E12, noCFSRatio=0.33157689554684366]
   [junit4]   2> 20470 INFO  (coreLoadExecutor-79-thread-1) [    x:collection1] o.a.s.s.SolrIndexSearcher Opening [Searcher@5d115320[collection1] main]
   [junit4]   2> 20471 WARN  (coreLoadExecutor-79-thread-1) [    x:collection1] o.a.s.r.ManagedResourceStorage Cannot write to config directory /home/jenkins/workspace/Lucene-Solr-8.x-Linux/solr/core/src/test-files/solr/collection1/conf; switching to use InMemory storage instead.
   [junit4]   2> 20473 INFO  (coreLoadExecutor-79-thread-1) [    x:collection1] o.a.s.h.ReplicationHandler Commits will be reserved for 10000ms.
   [junit4]   2> 20474 INFO  (coreLoadExecutor-79-thread-1) [    x:collection1] o.a.s.u.UpdateLog Could not find max version in index or recent updates, using new clock 1632405715337347072
   [junit4]   2> 20486 INFO  (searcherExecutor-80-thread-1-processing-x:collection1) [    x:collection1] o.a.s.c.SolrCore [collection1] Registered new searcher Searcher@5d115320[collection1] main{ExitableDirectoryReader(UninvertingDirectoryReader())}
   [junit4]   2> 20487 INFO  (TEST-PeerSyncTest.test-seed#[6DFDF5AD0784DD43]) [    ] o.a.s.SolrTestCaseJ4 ####initCore end
   [junit4]   2> 20640 INFO  (TEST-PeerSyncTest.test-seed#[6DFDF5AD0784DD43]) [    ] o.a.s.SolrTestCaseJ4 Writing core.properties file to /home/jenkins/workspace/Lucene-Solr-8.x-Linux/solr/build/solr-core/test/J1/temp/solr.update.PeerSyncTest_6DFDF5AD0784DD43-001/tempDir-001/control/cores/collection1
   [junit4]   2> 20641 WARN  (TEST-PeerSyncTest.test-seed#[6DFDF5AD0784DD43]) [    ] o.e.j.s.AbstractConnector Ignoring deprecated socket close linger time
   [junit4]   2> 20642 INFO  (TEST-PeerSyncTest.test-seed#[6DFDF5AD0784DD43]) [    ] o.a.s.c.s.e.JettySolrRunner Start Jetty (original configured port=0)
   [junit4]   2> 20642 INFO  (TEST-PeerSyncTest.test-seed#[6DFDF5AD0784DD43]) [    ] o.a.s.c.s.e.JettySolrRunner Trying to start Jetty on port 0 try number 1 ...
   [junit4]   2> 20642 INFO  (TEST-PeerSyncTest.test-seed#[6DFDF5AD0784DD43]) [    ] o.e.j.s.Server jetty-9.4.14.v20181114; built: 2018-11-14T21:20:31.478Z; git: c4550056e785fb5665914545889f21dc136ad9e6; jvm 1.8.0_201-b09
   [junit4]   2> 20696 INFO  (TEST-PeerSyncTest.test-seed#[6DFDF5AD0784DD43]) [    ] o.e.j.s.session DefaultSessionIdManager workerName=node0
   [junit4]   2> 20696 INFO  (TEST-PeerSyncTest.test-seed#[6DFDF5AD0784DD43]) [    ] o.e.j.s.session No SessionScavenger set, using defaults
   [junit4]   2> 20696 INFO  (TEST-PeerSyncTest.test-seed#[6DFDF5AD0784DD43]) [    ] o.e.j.s.session node0 Scavenging every 660000ms
   [junit4]   2> 20698 INFO  (TEST-PeerSyncTest.test-seed#[6DFDF5AD0784DD43]) [    ] o.e.j.s.h.ContextHandler Started o.e.j.s.ServletContextHandler@46d4ff87{/,null,AVAILABLE}
   [junit4]   2> 20712 INFO  (TEST-PeerSyncTest.test-seed#[6DFDF5AD0784DD43]) [    ] o.e.j.s.AbstractConnector Started ServerConnector@22441e13{HTTP/1.1,[http/1.1, h2c]}{127.0.0.1:34153}
   [junit4]   2> 20712 INFO  (TEST-PeerSyncTest.test-seed#[6DFDF5AD0784DD43]) [    ] o.e.j.s.Server Started @20753ms
   [junit4]   2> 20712 INFO  (TEST-PeerSyncTest.test-seed#[6DFDF5AD0784DD43]) [    ] o.a.s.c.s.e.JettySolrRunner Jetty properties: {schema=schema.xml, solrconfig=solrconfig-tlog.xml, hostContext=/, hostPort=34153, coreRootDirectory=/home/jenkins/workspace/Lucene-Solr-8.x-Linux/solr/build/solr-core/test/J1/temp/solr.update.PeerSyncTest_6DFDF5AD0784DD43-001/tempDir-001/control/cores}
   [junit4]   2> 20715 ERROR (TEST-PeerSyncTest.test-seed#[6DFDF5AD0784DD43]) [    ] o.a.s.u.StartupLoggingUtils Missing Java Option solr.log.dir. Logging may be missing or incomplete.
   [junit4]   2> 20715 INFO  (TEST-PeerSyncTest.test-seed#[6DFDF5AD0784DD43]) [    ] o.a.s.s.SolrDispatchFilter Using logger factory org.apache.logging.slf4j.Log4jLoggerFactory
   [junit4]   2> 20715 INFO  (TEST-PeerSyncTest.test-seed#[6DFDF5AD0784DD43]) [    ] o.a.s.s.SolrDispatchFilter  ___      _       Welcome to Apache Solr? version 8.2.0
   [junit4]   2> 20715 INFO  (TEST-PeerSyncTest.test-seed#[6DFDF5AD0784DD43]) [    ] o.a.s.s.SolrDispatchFilter / __| ___| |_ _   Starting in standalone mode on port null
   [junit4]   2> 20715 INFO  (TEST-PeerSyncTest.test-seed#[6DFDF5AD0784DD43]) [    ] o.a.s.s.SolrDispatchFilter \__ \/ _ \ | '_|  Install dir: null
   [junit4]   2> 20715 INFO  (TEST-PeerSyncTest.test-seed#[6DFDF5AD0784DD43]) [    ] o.a.s.s.SolrDispatchFilter |___/\___/_|_|    Start time: 2019-05-02T07:50:04.913Z
   [junit4]   2> 20715 INFO  (TEST-PeerSyncTest.test-seed#[6DFDF5AD0784DD43]) [    ] o.a.s.c.SolrXmlConfig Loading container configuration from /home/jenkins/workspace/Lucene-Solr-8.x-Linux/solr/build/solr-core/test/J1/temp/solr.update.PeerSyncTest_6DFDF5AD0784DD43-001/tempDir-001/control/solr.xml
   [junit4]   2> 20719 INFO  (TEST-PeerSyncTest.test-seed#[6DFDF5AD0784DD43]) [    ] o.a.s.c.SolrXmlConfig Configuration parameter autoReplicaFailoverWorkLoopDelay is ignored
   [junit4]   2> 20719 INFO  (TEST-PeerSyncTest.test-seed#[6DFDF5AD0784DD43]) [    ] o.a.s.c.SolrXmlConfig Configuration parameter autoReplicaFailoverBadNodeExpiration is ignored
   [junit4]   2> 20778 INFO  (TEST-PeerSyncTest.test-seed#[6DFDF5AD0784DD43]) [    ] o.a.s.c.SolrXmlConfig MBean server found: com.sun.jmx.mbeanserver.JmxMBeanServer@24be75cd, but no JMX reporters were configured - adding default JMX reporter.
   [junit4]   2> 20850 INFO  (TEST-PeerSyncTest.test-seed#[6DFDF5AD0784DD43]) [    ] o.a.s.h.c.HttpShardHandlerFactory Host whitelist initialized: WhitelistHostChecker [whitelistHosts=null, whitelistHostCheckingEnabled=false]
   [junit4]   2> 20858 WARN  (TEST-PeerSyncTest.test-seed#[6DFDF5AD0784DD43]) [    ] o.e.j.u.s.S.config No Client EndPointIdentificationAlgorithm configured for SslContextFactory@509a32ce[provider=null,keyStore=null,trustStore=null]
   [junit4]   2> 20895 WARN  (TEST-PeerSyncTest.test-seed#[6DFDF5AD0784DD43]) [    ] o.e.j.u.s.S.config No Client EndPointIdentificationAlgorithm configured for SslContextFactory@2a72c140[provider=null,keyStore=null,trustStore=null]
   [junit4]   2> 20953 INFO  (TEST-PeerSyncTest.test-seed#[6DFDF5AD0784DD43]) [    ] o.a.s.c.TransientSolrCoreCacheDefault Allocating transient cache for 4 transient cores
   [junit4]   2> 20953 INFO  (TEST-PeerSyncTest.test-seed#[6DFDF5AD0784DD43]) [    ] o.a.s.h.a.MetricsHistoryHandler No .system collection, keeping metrics history in memory.
   [junit4]   2> 20974 INFO  (TEST-PeerSyncTest.test-seed#[6DFDF5AD0784DD43]) [    ] o.a.s.m.r.SolrJmxReporter JMX monitoring for 'solr.node' (registry 'solr.node') enabled at server: com.sun.jmx.mbeanserver.JmxMBeanServer@24be75cd
   [junit4]   2> 20999 INFO  (TEST-PeerSyncTest.test-seed#[6DFDF5AD0784DD43]) [    ] o.a.s.m.r.SolrJmxReporter JMX monitoring for 'solr.jvm' (registry 'solr.jvm') enabled at server: com.sun.jmx.mbeanserver.JmxMBeanServer@24be75cd
   [junit4]   2> 20999 INFO  (TEST-PeerSyncTest.test-seed#[6DFDF5AD0784DD43]) [    ] o.a.s.m.r.SolrJmxReporter JMX monitoring for 'solr.jetty' (registry 'solr.jetty') enabled at server: com.sun.jmx.mbeanserver.JmxMBeanServer@24be75cd
   [junit4]   2> 21001 INFO  (TEST-PeerSyncTest.test-seed#[6DFDF5AD0784DD43]) [    ] o.a.s.c.CorePropertiesLocator Found 1 core definitions underneath /home/jenkins/workspace/Lucene-Solr-8.x-Linux/solr/build/solr-core/test/J1/temp/solr.update.PeerSyncTest_6DFDF5AD0784DD43-001/tempDir-001/control/cores
   [junit4]   2> 21001 INFO  (TEST-PeerSyncTest.test-seed#[6DFDF5AD0784DD43]) [    ] o.a.s.c.CorePropertiesLocator Cores are: [collection1]
   [junit4]   2> 21011 INFO  (coreLoadExecutor-93-thread-1) [    x:collection1] o.a.s.c.SolrResourceLoader [null] Added 2 libs to classloader, from paths: [/home/jenkins/workspace/Lucene-Solr-8.x-Linux/solr/core/src/test-files/solr/collection1/lib, /home/jenkins/workspace/Lucene-Solr-8.x-Linux/solr/core/src/test-files/solr/collection1/lib/classes]
   [junit4]   2> 21084 INFO  (coreLoadExecutor-93-thread-1) [    x:collection1] o.a.s.c.SolrConfig Using Lucene MatchVersion: 8.2.0
   [junit4]   2> 21130 INFO  (coreLoadExecutor-93-thread-1) [    x:collection1] o.a.s.s.IndexSchema [collection1] Schema name=test
   [junit4]   2> 21304 INFO  (coreLoadExecutor-93-thread-1) [    x:collection1] o.a.s.s.IndexSchema Loaded schema test/1.0 with uniqueid field id
   [junit4]   2> 21316 INFO  (coreLoadExecutor-93-thread-1) [    x:collection1] o.a.s.c.CoreContainer Creating SolrCore 'collection1' using configuration from configset /home/jenkins/workspace/Lucene-Solr-8.x-Linux/solr/core/src/test-files/solr/collection1, trusted=true
   [junit4]   2> 21316 INFO  (coreLoadExecutor-93-thread-1) [    x:collection1] o.a.s.m.r.SolrJmxReporter JMX monitoring for 'solr.core.collection1' (registry 'solr.core.collection1') enabled at server: com.sun.jmx.mbeanserver.JmxMBeanServer@24be75cd
   [junit4]   2> 21316 INFO  (coreLoadExecutor-93-thread-1) [    x:collection1] o.a.s.c.SolrCore [[collection1] ] Opening new SolrCore at [/home/jenkins/workspace/Lucene-Solr-8.x-Linux/solr/core/src/test-files/solr/collection1], dataDir=[/home/jenkins/workspace/Lucene-Solr-8.x-Linux/solr/build/solr-core/test/J1/temp/solr.update.PeerSyncTest_6DFDF5AD0784DD43-001/tempDir-001/control/cores/collection1/data/]
   [junit4]   2> 21319 INFO  (coreLoadExecutor-93-thread-1) [    x:collection1] o.a.s.u.RandomMergePolicy RandomMergePolicy wrapping class org.apache.lucene.index.TieredMergePolicy: [TieredMergePolicy: maxMergeAtOnce=36, maxMergeAtOnceExplicit=34, maxMergedSegmentMB=87.068359375, floorSegmentMB=0.5556640625, forceMergeDeletesPctAllowed=18.066744849168334, segmentsPerTier=38.0, maxCFSSegmentSizeMB=8.796093022207999E12, noCFSRatio=0.49922519231271945, deletesPctAllowed=47.847509482883986
   [junit4]   2> 21321 WARN  (coreLoadExecutor-93-thread-1) [    x:collection1] o.a.s.c.RequestHandlers INVALID paramSet a in requestHandler {type = requestHandler,name = /dump,class = DumpRequestHandler,attributes = {initParams=a, name=/dump, class=DumpRequestHandler},args = {defaults={a=A,b=B}}}
   [junit4]   2> 21361 INFO  (coreLoadExecutor-93-thread-1) [    x:collection1] o.a.s.u.UpdateHandler Using UpdateLog implementation: org.apache.solr.update.UpdateLog
   [junit4]   2> 21361 INFO  (coreLoadExecutor-93-thread-1) [    x:collection1] o.a.s.u.UpdateLog Initializing UpdateLog: dataDir= defaultSyncLevel=FLUSH numRecordsToKeep=100 maxNumLogsToKeep=10 numVersionBuckets=65536
   [junit4]   2> 21371 INFO  (coreLoadExecutor-93-thread-1) [    x:collection1] o.a.s.u.CommitTracker Hard AutoCommit: disabled
   [junit4]   2> 21371 INFO  (coreLoadExecutor-93-thread-1) [    x:collection1] o.a.s.u.CommitTracker Soft AutoCommit: disabled
   [junit4]   2> 21371 INFO  (coreLoadExecutor-93-thread-1) [    x:collection1] o.a.s.u.RandomMergePolicy RandomMergePolicy wrapping class org.apache.lucene.index.LogByteSizeMergePolicy: [LogByteSizeMergePolicy: minMergeSize=1677721, mergeFactor=36, maxMergeSize=2147483648, maxMergeSizeForForcedMerge=9223372036854775807, calibrateSizeByDeletes=false, maxMergeDocs=2147483647, maxCFSSegmentSizeMB=8.796093022207999E12, noCFSRatio=0.33157689554684366]
   [junit4]   2> 21372 INFO  (coreLoadExecutor-93-thread-1) [    x:collection1] o.a.s.s.SolrIndexSearcher Opening [Searcher@626a334[collection1] main]
   [junit4]   2> 21372 WARN  (coreLoadExecutor-93-thread-1) [    x:collection1] o.a.s.r.ManagedResourceStorage Cannot write to config directory /home/jenkins/workspace/Lucene-Solr-8.x-Linux/solr/core/src/test-files/solr/collection1/conf; switching to use InMemory storage instead.
   [junit4]   2> 21373 INFO  (coreLoadExecutor-93-thread-1) [    x:collection1] o.a.s.h.ReplicationHandler Commits will be reserved for 10000ms.
   [junit4]   2> 21373 INFO  (coreLoadExecutor-93-thread-1) [    x:collection1] o.a.s.u.UpdateLog Could not find max version in index or recent updates, using new clock 1632405716280016896
   [junit4]   2> 21382 INFO  (searcherExecutor-94-thread-1-processing-x:collection1) [    x:collection1] o.a.s.c.SolrCore [collection1] Registered new searcher Searcher@626a334[collection1] main{ExitableDirectoryReader(UninvertingDirectoryReader())}
   [junit4]   2> 21989 INFO  (TEST-PeerSyncTest.test-seed#[6DFDF5AD0784DD43]) [    ] o.a.s.SolrTestCaseJ4 Writing core.properties file to /home/jenkins/workspace/Lucene-Solr-8.x-Linux/solr/build/solr-core/test/J1/temp/solr.update.PeerSyncTest_6DFDF5AD0784DD43-001/tempDir-001/shard0/cores/collection1
   [junit4]   2> 21990 WARN  (TEST-PeerSyncTest.test-seed#[6DFDF5AD0784DD43]) [    ] o.e.j.s.AbstractConnector Ignoring deprecated socket close linger time
   [junit4]   2> 21991 INFO  (TEST-PeerSyncTest.test-seed#[6DFDF5AD0784DD43]) [    ] o.a.s.c.s.e.JettySolrRunner Start Jetty (original configured port=0)
   [junit4]   2> 21991 INFO  (TEST-PeerSyncTest.test-seed#[6DFDF5AD0784DD43]) [    ] o.a.s.c.s.e.JettySolrRunner Trying to start Jetty on port 0 try number 1 ...
   [junit4]   2> 21991 INFO  (TEST-PeerSyncTest.test-seed#[6DFDF5AD0784DD43]) [    ] o.e.j.s.Server jetty-9.4.14.v20181114; built: 2018-11-14T21:20:31.478Z; git: c4550056e785fb5665914545889f21dc136ad9e6; jvm 1.8.0_201-b09
   [junit4]   2> 22014 INFO  (TEST-PeerSyncTest.test-seed#[6DFDF5AD0784DD43]) [    ] o.e.j.s.session DefaultSessionIdManager workerName=node0
   [junit4]   2> 22014 INFO  (TEST-PeerSyncTest.test-seed#[6DFDF5AD0784DD43]) [    ] o.e.j.s.session No SessionScavenger set, using defaults
   [junit4]   2> 22014 INFO  (TEST-PeerSyncTest.test-seed#[6DFDF5AD0784DD43]) [    ] o.e.j.s.session node0 Scavenging every 660000ms
   [junit4]   2> 22014 INFO  (TEST-PeerSyncTest.test-seed#[6DFDF5AD0784DD43]) [    ] o.e.j.s.h.ContextHandler Started o.e.j.s.ServletContextHandler@452e71e5{/,null,AVAILABLE}
   [junit4]   2> 22015 INFO  (TEST-PeerSyncTest.test-seed#[6DFDF5AD0784DD43]) [    ] o.e.j.s.AbstractConnector Started ServerConnector@3152aad1{HTTP/1.1,[http/1.1, h2c]}{127.0.0.1:33079}
   [junit4]   2> 22015 INFO  (TEST-PeerSyncTest.test-seed#[6DFDF5AD0784DD43]) [    ] o.e.j.s.Server Started @22056ms
   [junit4]   2> 22015 INFO  (TEST-PeerSyncTest.test-seed#[6DFDF5AD0784DD43]) [    ] o.a.s.c.s.e.JettySolrRunner Jetty properties: {schema=schema.xml, solrconfig=solrconfig-tlog.xml, hostContext=/, hostPort=33079, coreRootDirectory=/home/jenkins/workspace/Lucene-Solr-8.x-Linux/solr/build/solr-core/test/J1/temp/solr.update.PeerSyncTest_6DFDF5AD0784DD43-001/tempDir-001/shard0/cores}
   [junit4]   2> 22016 ERROR (TEST-PeerSyncTest.test-seed#[6DFDF5AD0784DD43]) [    ] o.a.s.u.StartupLoggingUtils Missing Java Option solr.log.dir. Logging may be missing or incomplete.
   [junit4]   2> 22016 INFO  (TEST-PeerSyncTest.test-seed#[6DFDF5AD0784DD43]) [    ] o.a.s.s.SolrDispatchFilter Using logger factory org.apache.logging.slf4j.Log4jLoggerFactory
   [junit4]   2> 22016 INFO  (TEST-PeerSyncTest.test-seed#[6DFDF5AD0784DD43]) [    ] o.a.s.s.SolrDispatchFilter  ___      _       Welcome to Apache Solr? version 8.2.0
   [junit4]   2> 22016 INFO  (TEST-PeerSyncTest.test-seed#[6DFDF5AD0784DD43]) [    ] o.a.s.s.SolrDispatchFilter / __| ___| |_ _   Starting in standalone mode on port null
   [junit4]   2> 22016 INFO  (TEST-PeerSyncTest.test-seed#[6DFDF5AD0784DD43]) [    ] o.a.s.s.SolrDispatchFilter \__ \/ _ \ | '_|  Install dir: null
   [junit4]   2> 22016 INFO  (TEST-PeerSyncTest.test-seed#[6DFDF5AD0784DD43]) [    ] o.a.s.s.SolrDispatchFilter |___/\___/_|_|    Start time: 2019-05-02T07:50:06.214Z
   [junit4]   2> 22016 INFO  (TEST-PeerSyncTest.test-seed#[6DFDF5AD0784DD43]) [    ] o.a.s.c.SolrXmlConfig Loading container configuration from /home/jenkins/workspace/Lucene-Solr-8.x-Linux/solr/build/solr-core/test/J1/temp/solr.update.PeerSyncTest_6DFDF5AD0784DD43-001/tempDir-001/shard0/solr.xml
   [junit4]   2> 22020 INFO  (TEST-PeerSyncTest.test-seed#[6DFDF5AD0784DD43]) [    ] o.a.s.c.SolrXmlConfig Configuration parameter autoReplicaFailoverWorkLoopDelay is ignored
   [junit4]   2> 22020 INFO  (TEST-PeerSyncTest.test-seed#[6DFDF5AD0784DD43]) [    ] o.a.s.c.SolrXmlConfig Configuration parameter autoReplicaFailoverBadNodeExpiration is ignored
   [junit4]   2> 22021 INFO  (TEST-PeerSyncTest.test-seed#[6DFDF5AD0784DD43]) [    ] o.a.s.c.SolrXmlConfig MBean server found: com.sun.jmx.mbeanserver.JmxMBeanServer@24be75cd, but no JMX reporters were configured - adding default JMX reporter.
   [junit4]   2> 22191 INFO  (TEST-PeerSyncTest.test-seed#[6DFDF5AD0784DD43]) [    ] o.a.s.h.c.HttpShardHandlerFactory Host whitelist initialized: WhitelistHostChecker [whitelistHosts=null, whitelistHostCheckingEnabled=false]
   [junit4]   2> 22215 WARN  (TEST-PeerSyncTest.test-seed#[6DFDF5AD0784DD43]) [    ] o.e.j.u.s.S.config No Client EndPointIdentificationAlgorithm configured for SslContextFactory@1344c38a[provider=null,keyStore=null,trustStore=null]
   [junit4]   2> 22237 WARN  (TEST-PeerSyncTest.test-seed#[6DFDF5AD0784DD43]) [    ] o.e.j.u.s.S.config No Client EndPointIdentificationAlgorithm configured for SslContextFactory@38a4b801[provider=null,keyStore=null,trustStore=null]
   [junit4]   2> 22287 INFO  (TEST-PeerSyncTest.test-seed#[6DFDF5AD0784DD43]) [    ] o.a.s.c.TransientSolrCoreCacheDefault Allocating transient cache for 4 transient cores
   [junit4]   2> 22287 INFO  (TEST-PeerSyncTest.test-seed#[6DFDF5AD0784DD43]) [    ] o.a.s.h.a.MetricsHistoryHandler No .system collection, keeping metrics history in memory.
   [junit4]   2> 22306 INFO  (TEST-PeerSyncTest.test-seed#[6DFDF5AD0784DD43]) [    ] o.a.s.m.r.SolrJmxReporter JMX monitoring for 'solr.node' (registry 'solr.node') enabled at server: com.sun.jmx.mbeanserver.JmxMBeanServer@24be75cd
   [junit4]   2> 22316 INFO  (TEST-PeerSyncTest.test-seed#[6DFDF5AD0784DD43]) [    ] o.a.s.m.r.SolrJmxReporter JMX monitoring for 'solr.jvm' (registry 'solr.jvm') enabled at server: com.sun.jmx.mbeanserver.JmxMBeanServer@24be75cd
   [junit4]   2> 22316 INFO  (TEST-PeerSyncTest.test-seed#[6DFDF5AD0784DD43]) [    ] o.a.s.m.r.SolrJmxReporter JMX monitoring for 'solr.jetty' (registry 'solr.jetty') enabled at server: com.sun.jmx.mbeanserver.JmxMBeanServer@24be75cd
   [junit4]   2> 22319 INFO  (TEST-PeerSyncTest.test-seed#[6DFDF5AD0784DD43]) [    ] o.a.s.c.CorePropertiesLocator Found 1 core definitions underneath /home/jenkins/workspace/Lucene-Solr-8.x-Linux/solr/build/solr-core/test/J1/temp/solr.update.PeerSyncTest_6DFDF5AD0784DD43-001/tempDir-001/shard0/cores
   [junit4]   2> 22319 INFO  (TEST-PeerSyncTest.test-seed#[6DFDF5AD0784DD43]) [    ] o.a.s.c.CorePropertiesLocator Cores are: [collection1]
   [junit4]   2> 22364 INFO  (coreLoadExecutor-107-thread-1) [    x:collection1] o.a.s.c.SolrResourceLoader [null] Added 2 libs to classloader, from paths: [/home/jenkins/workspace/Lucene-Solr-8.x-Linux/solr/core/src/test-files/solr/collection1/lib, /home/jenkins/workspace/Lucene-Solr-8.x-Linux/solr/core/src/test-files/solr/collection1/lib/classes]
   [junit4]   2> 22417 INFO  (coreLoadExecutor-107-thread-1) [    x:collection1] o.a.s.c.SolrConfig Using Lucene MatchVersion: 8.2.0
   [junit4]   2> 22450 INFO  (coreLoadExecutor-107-thread-1) [    x:collection1] o.a.s.s.IndexSchema [collection1] Schema name=test
   [junit4]   2> 22721 INFO  (coreLoadExecutor-107-thread-1) [    x:collection1] o.a.s.s.IndexSchema Loaded schema test/1.0 with uniqueid field id
   [junit4]   2> 22732 INFO  (coreLoadExecutor-107-thread-1) [    x:collection1] o.a.s.c.CoreContainer Creating SolrCore 'collection1' using configuration from configset /home/jenkins/workspace/Lucene-Solr-8.x-Linux/solr/core/src/test-files/solr/collection1, trusted=true
   [junit4]   2> 22733 INFO  (coreLoadExecutor-107-thread-1) [    x:collection1] o.a.s.m.r.SolrJmxReporter JMX monitoring for 'solr.core.collection1' (registry 'solr.core.collection1') enabled at server: com.sun.jmx.mbeanserver.JmxMBeanServer@24be75cd
   [junit4]   2> 22733 INFO  (coreLoadExecutor-107-thread-1) [    x:collection1] o.a.s.c.SolrCore [[collection1] ] Opening new SolrCore at [/home/jenkins/workspace/Lucene-Solr-8.x-Linux/solr/core/src/test-files/solr/collection1], dataDir=[/home/jenkins/workspace/Lucene-Solr-8.x-Linux/solr/build/solr-core/test/J1/temp/solr.update.PeerSyncTest_6DFDF5AD0784DD43-001/tempDir-001/shard0/cores/collection1/data/]
   [junit4]   2> 22735 INFO  (coreLoadExecutor-107-thread-1) [    x:collection1] o.a.s.u.RandomMergePolicy RandomMergePolicy wrapping class org.apache.lucene.index.TieredMergePolicy: [TieredMergePolicy: maxMergeAtOnce=36, maxMergeAtOnceExplicit=34, maxMergedSegmentMB=87.068359375, floorSegmentMB=0.5556640625, forceMergeDeletesPctAllowed=18.066744849168334, segmentsPerTier=38.0, maxCFSSegmentSizeMB=8.796093022207999E12, noCFSRatio=0.49922519231271945, deletesPctAllowed=47.847509482883986
   [junit4]   2> 22751 WARN  (coreLoadExecutor-107-thread-1) [    x:collection1] o.a.s.c.RequestHandlers INVALID paramSet a in requestHandler {type = requestHandler,name = /dump,class = DumpRequestHandler,attributes = {initParams=a, name=/dump, class=DumpRequestHandler},args = {defaults={a=A,b=B}}}
   [junit4]   2> 22815 INFO  (coreLoadExecutor-107-thread-1) [    x:collection1] o.a.s.u.UpdateHandler Using UpdateLog implementation: org.apache.solr.update.UpdateLog
   [junit4]   2> 22815 INFO  (coreLoadExecutor-107-thread-1) [    x:collection1] o.a.s.u.UpdateLog Initializing UpdateLog: dataDir= defaultSyncLevel=FLUSH numRecordsToKeep=100 maxNumLogsToKeep=10 numVersionBuckets=65536
   [junit4]   2> 22816 INFO  (coreLoadExecutor-107-thread-1) [    x:collection1] o.a.s.u.CommitTracker Hard AutoCommit: disabled
   [junit4]   2> 22816 INFO  (coreLoadExecutor-107-thread-1) [    x:collection1] o.a.s.u.CommitTracker Soft AutoCommit: disabled
   [junit4]   2> 22817 INFO  (coreLoadExecutor-107-thread-1) [    x:collection1] o.a.s.u.RandomMergePolicy RandomMergePolicy wrapping class org.apache.lucene.index.LogByteSizeMergePolicy: [LogByteSizeMergePolicy: minMergeSize=1677721, mergeFactor=36, maxMergeSize=2147483648, maxMergeSizeForForcedMerge=9223372036854775807, calibrateSizeByDeletes=false, maxMergeDocs=2147483647, maxCFSSegmentSizeMB=8.796093022207999E12, noCFSRatio=0.33157689554684366]
   [junit4]   2> 22821 INFO  (coreLoadExecutor-107-thread-1) [    x:collection1] o.a.s.s.SolrIndexSearcher Opening [Searcher@4f486899[collection1] main]
   [junit4]   2> 22821 WARN  (coreLoadExecutor-107-thread-1) [    x:collection1] o.a.s.r.ManagedResourceStorage Cannot write to config directory /home/jenkins/workspace/Lucene-Solr-8.x-Linux/solr/core/src/test-files/solr/collection1/conf; switching to use InMemory storage instead.
   [junit4]   2> 22821 INFO  (coreLoadExecutor-107-thread-1) [    x:collection1] o.a.s.h.ReplicationHandler Commits will be reserved for 10000ms.
   [junit4]   2> 22821 INFO  (coreLoadExecutor-107-thread-1) [    x:collection1] o.a.s.u.UpdateLog Could not find max version in index or recent updates, using new clock 1632405717798354944
   [junit4]   2> 22825 INFO  (searcherExecutor-108-thread-1-processing-x:collection1) [    x:collection1] o.a.s.c.SolrCore [collection1] Registered new searcher Searcher@4f486899[collection1] main{ExitableDirectoryReader(UninvertingDirectoryReader())}
   [junit4]   2> 22943 INFO  (TEST-PeerSyncTest.test-seed#[6DFDF5AD0784DD43]) [    ] o.a.s.SolrTestCaseJ4 Writing core.properties file to /home/jenkins/workspace/Lucene-Solr-8.x-Linux/solr/build/solr-core/test/J1/temp/solr.update.PeerSyncTest_6DFDF5AD0784DD43-001/tempDir-001/shard1/cores/collection1
   [junit4]   2> 22944 WARN  (TEST-PeerSyncTest.test-seed#[6DFDF5AD0784DD43]) [    ] o.e.j.s.AbstractConnector Ignoring deprecated socket close linger time
   [junit4]   2> 22944 INFO  (TEST-PeerSyncTest.test-seed#[6DFDF5AD0784DD43]) [    ] o.a.s.c.s.e.JettySolrRunner Start Jetty (original configured port=0)
   [junit4]   2> 22945 INFO  (TEST-PeerSyncTest.test-seed#[6DFDF5AD0784DD43]) [    ] o.a.s.c.s.e.JettySolrRunner Trying to start Jetty on port 0 try number 1 ...
   [junit4]   2> 22946 INFO  (TEST-PeerSyncTest.test-seed#[6DFDF5AD0784DD43]) [    ] o.e.j.s.Server jetty-9.4.14.v20181114; built: 2018-11-14T21:20:31.478Z; git: c4550056e785fb5665914545889f21dc136ad9e6; jvm 1.8.0_201-b09
   [junit4]   2> 23013 INFO  (TEST-PeerSyncTest.test-seed#[6DFDF5AD0784DD43]) [    ] o.e.j.s.session DefaultSessionIdManager workerName=node0
   [junit4]   2> 23013 INFO  (TEST-PeerSyncTest.test-seed#[6DFDF5AD0784DD43]) [    ] o.e.j.s.session No SessionScavenger set, using defaults
   [junit4]   2> 23013 INFO  (TEST-PeerSyncTest.test-seed#[6DFDF5AD0784DD43]) [    ] o.e.j.s.session node0 Scavenging every 600000ms
   [junit4]   2> 23021 INFO  (TEST-PeerSyncTest.test-seed#[6DFDF5AD0784DD43]) [    ] o.e.j.s.h.ContextHandler Started o.e.j.s.ServletContextHandler@6fc5def6{/,null,AVAILABLE}
   [junit4]   2> 23030 INFO  (TEST-PeerSyncTest.test-seed#[6DFDF5AD0784DD43]) [    ] o.e.j.s.AbstractConnector Started ServerConnector@5c0c66f{HTTP/1.1,[http/1.1, h2c]}{127.0.0.1:36141}
   [junit4]   2> 23030 INFO  (TEST-PeerSyncTest.test-seed#[6DFDF5AD0784DD43]) [    ] o.e.j.s.Server Started @23071ms
   [junit4]   2> 23030 INFO  (TEST-PeerSyncTest.test-seed#[6DFDF5AD0784DD43]) [    ] o.a.s.c.s.e.JettySolrRunner Jetty properties: {schema=schema.xml, solrconfig=solrconfig-tlog.xml, hostContext=/, hostPort=36141, coreRootDirectory=/home/jenkins/workspace/Lucene-Solr-8.x-Linux/solr/build/solr-core/test/J1/temp/solr.update.PeerSyncTest_6DFDF5AD0784DD43-001/tempDir-001/shard1/cores}
   [junit4]   2> 23031 ERROR (TEST-PeerSyncTest.test-seed#[6DFDF5AD0784DD43]) [    ] o.a.s.u.StartupLoggingUtils Missing Java Option solr.log.dir. Logging may be missing or incomplete.
   [junit4]   2> 23031 INFO  (TEST-PeerSyncTest.test-seed#[6DFDF5AD0784DD43]) [    ] o.a.s.s.SolrDispatchFilter Using logger factory org.apache.logging.slf4j.Log4jLoggerFactory
   [junit4]   2> 23031 INFO  (TEST-PeerSyncTest.test-seed#[6DFDF5AD0784DD43]) [    ] o.a.s.s.SolrDispatchFilter  ___      _       Welcome to Apache Solr? version 8.2.0
   [junit4]   2> 23031 INFO  (TEST-PeerSyncTest.test-seed#[6DFDF5AD0784DD43]) [    ] o.a.s.s.SolrDispatchFilter / __| ___| |_ _   Starting in standalone mode on port null
   [junit4]   2> 23031 INFO  (TEST-PeerSyncTest.test-seed#[6DFDF5AD0784DD43]) [    ] o.a.s.s.SolrDispatchFilter \__ \/ _ \ | '_|  Install dir: null
   [junit4]   2> 23031 INFO  (TEST-PeerSyncTest.test-seed#[6DFDF5AD0784DD43]) [    ] o.a.s.s.SolrDispatchFilter |___/\___/_|_|    Start time: 2019-05-02T07:50:07.229Z
   [junit4]   2> 23031 INFO  (TEST-PeerSyncTest.test-seed#[6DFDF5AD0784DD43]) [    ] o.a.s.c.SolrXmlConfig Loading container configuration from /home/jenkins/workspace/Lucene-Solr-8.x-Linux/solr/build/solr-core/test/J1/temp/solr.update.PeerSyncTest_6DFDF5AD0784DD43-001/tempDir-001/shard1/solr.xml
   [junit4]   2> 23035 INFO  (TEST-PeerSyncTest.test-seed#[6DFDF5AD0784DD43]) [    ] o.a.s.c.SolrXmlConfig Configuration parameter autoReplicaFailoverWorkLoopDelay is ignored
   [junit4]   2> 23035 INFO  (TEST-PeerSyncTest.test-seed#[6DFDF5AD0784DD43]) [    ] o.a.s.c.SolrXmlConfig Configuration parameter autoReplicaFailoverBadNodeExpiration is ignored
   [junit4]   2> 23036 INFO  (TEST-PeerSyncTest.test-seed#[6DFDF5AD0784DD43]) [    ] o.a.s.c.SolrXmlConfig MBean server found: com.sun.jmx.mbeanserver.JmxMBeanServer@24be75cd, but no JMX reporters were configured - adding default JMX reporter.
   [junit4]   2> 23161 INFO  (TEST-PeerSyncTest.test-seed#[6DFDF5AD0784DD43]) [    ] o.a.s.h.c.HttpShardHandlerFactory Host whitelist initialized: WhitelistHostChecker [whitelistHosts=null, whitelistHostCheckingEnabled=false]
   [junit4]   2> 23163 WARN  (TEST-PeerSyncTest.test-seed#[6DFDF5AD0784DD43]) [    ] o.e.j.u.s.S.config No Client EndPointIdentificationAlgorithm configured for SslContextFactory@6b7ad60[provider=null,keyStore=null,trustStore=null]
   [junit4]   2> 23172 WARN  (TEST-PeerSyncTest.test-seed#[6DFDF5AD0784DD43]) [    ] o.e.j.u.s.S.config No Client EndPointIdentificationAlgorithm configured for SslContextFactory@7635269[provider=null,keyStore=null,trustStore=null]
   [junit4]   2> 23209 INFO  (TEST-PeerSyncTest.test-seed#[6DFDF5AD0784DD43]) [    ] o.a.s.c.TransientSolrCoreCacheDefault Allocating transient cache for 4 transient cores
   [junit4]   2> 23209 INFO  (TEST-PeerSyncTest.test-seed#[6DFDF5AD0784DD43]) [    ] o.a.s.h.a.MetricsHistoryHandler No .system collection, keeping metrics history in memory.
   [junit4]   2> 23227 INFO  (TEST-PeerSyncTest.test-seed#[6DFDF5AD0784DD43]) [    ] o.a.s.m.r.SolrJmxReporter JMX monitoring for 'solr.node' (registry 'solr.node') enabled at server: com.sun.jmx.mbeanserver.JmxMBeanServer@24be75cd
   [junit4]   2> 23235 INFO  (TEST-PeerSyncTest.test-seed#[6DFDF5AD0784DD43]) [    ] o.a.s.m.r.SolrJmxReporter JMX monitoring for 'solr.jvm' (registry 'solr.jvm') enabled at server: com.sun.jmx.mbeanserver.JmxMBeanServer@24be75cd
   [junit4]   2> 23235 INFO  (TEST-PeerSyncTest.test-seed#[6DFDF5AD0784DD43]) [    ] o.a.s.m.r.SolrJmxReporter JMX monitoring for 'solr.jetty' (registry 'solr.jetty') enabled at server: com.sun.jmx.mbeanserver.JmxMBeanServer@24be75cd
   [junit4]   2> 23330 INFO  (TEST-PeerSyncTest.test-seed#[6DFDF5AD0784DD43]) [    ] o.a.s.c.CorePropertiesLocator Found 1 core definitions underneath /home/jenkins/workspace/Lucene-Solr-8.x-Linux/solr/build/solr-core/test/J1/temp/solr.update.PeerSyncTest_6DFDF5AD0784DD43-001/tempDir-001/shard1/cores
   [junit4]   2> 23330 INFO  (TEST-PeerSyncTest.test-seed#[6DFDF5AD0784DD43]) [    ] o.a.s.c.CorePropertiesLocator Cores are: [collection1]
   [junit4]   2> 23370 INFO  (coreLoadExecutor-121-thread-1) [    x:collection1] o.a.s.c.SolrResourceLoader [null] Added 2 libs to classloader, from paths: [/home/jenkins/workspace/Lucene-Solr-8.x-Linux/solr/core/src/test-files/solr/collection1/lib, /home/jenkins/workspace/Lucene-Solr-8.x-Linux/solr/core/src/test-files/solr/collection1/lib/classes]
   [junit4]   2> 23443 INFO  (coreLoadExecutor-121-thread-1) [    x:collection1] o.a.s.c.SolrConfig Using Lucene MatchVersion: 8.2.0
   [junit4]   2> 23504 INFO  (coreLoadExecutor-121-thread-1) [    x:collection1] o.a.s.s.IndexSchema [collection1] Schema name=test
   [junit4]   2> 23661 INFO  (coreLoadExecutor-121-thread-1) [    x:collection1] o.a.s.s.IndexSchema Loaded schema test/1.0 with uniqueid field id
   [junit4]   2> 23677 INFO  (coreLoadExecutor-121-thread-1) [    x:collection1] o.a.s.c.CoreContainer Creating SolrCore 'collection1' using configuration from configset /home/jenkins/workspace/Lucene-Solr-8.x-Linux/solr/core/src/test-files/solr/collection1, trusted=true
   [junit4]   2> 23678 INFO  (coreLoadExecutor-121-thread-1) [    x:collection1] o.a.s.m.r.SolrJmxReporter JMX monitoring for 'solr.core.collection1' (registry 'solr.core.collection1') enabled at server: com.sun.jmx.mbeanserver.JmxMBeanServer@24be75cd
   [junit4]   2> 23678 INFO  (coreLoadExecutor-121-thread-1) [    x:collection1] o.a.s.c.SolrCore [[collection1] ] Opening new SolrCore at [/home/jenkins/workspace/Lucene-Solr-8.x-Linux/solr/core/src/test-files/solr/collection1], dataDir=[/home/jenkins/workspace/Lucene-Solr-8.x-Linux/solr/build/solr-core/test/J1/temp/solr.update.PeerSyncTest_6DFDF5AD0784DD43-001/tempDir-001/shard1/cores/collection1/data/]
   [junit4]   2> 23680 INFO  (coreLoadExecutor-121-thread-1) [    x:collection1] o.a.s.u.RandomMergePolicy RandomMergePolicy wrapping class org.apache.lucene.index.TieredMergePolicy: [TieredMergePolicy: maxMergeAtOnce=36, maxMergeAtOnceExplicit=34, maxMergedSegmentMB=87.068359375, floorSegmentMB=0.5556640625, forceMergeDeletesPctAllowed=18.066744849168334, segmentsPerTier=38.0, maxCFSSegmentSizeMB=8.796093022207999E12, noCFSRatio=0.49922519231271945, deletesPctAllowed=47.847509482883986
   [junit4]   2> 23698 WARN  (coreLoadExecutor-121-thread-1) [    x:collection1] o.a.s.c.RequestHandlers INVALID paramSet a in requestHandler {type = requestHandler,name = /dump,class = DumpRequestHandler,attributes = {initParams=a, name=/dump, class=DumpRequestHandler},args = {defaults={a=A,b=B}}}
   [junit4]   2> 23769 INFO  (coreLoadExecutor-121-thread-1) [    x:collection1] o.a.s.u.UpdateHandler Using UpdateLog implementation: org.apache.solr.update.UpdateLog
   [junit4]   2> 23769 INFO  (coreLoadExecutor-121-thread-1) [    x:collection1] o.a.s.u.UpdateLog Initializing UpdateLog: dataDir= defaultSyncLevel=FLUSH numRecordsToKeep=100 maxNumLogsToKeep=10 numVersionBuckets=65536
   [junit4]   2> 23771 INFO  (coreLoadExecutor-121-thread-1) [    x:collection1] o.a.s.u.CommitTracker Hard AutoCommit: disabled
   [junit4]   2> 23771 INFO  (coreLoadExecutor-121-thread-1) [    x:collection1] o.a.s.u.CommitTracker Soft AutoCommit: disabled
   [junit4]   2> 23772 INFO  (coreLoadExecutor-121-thread-1) [    x:collection1] o.a.s.u.RandomMergePolicy RandomMergePolicy wrapping class org.apache.lucene.index.LogByteSizeMergePolicy: [LogByteSizeMergePolicy: minMergeSize=1677721, mergeFactor=36, maxMergeSize=2147483648, maxMergeSizeForForcedMerge=9223372036854775807, calibrateSizeByDeletes=false, maxMergeDocs=2147483647, maxCFSSegmentSizeMB=8.796093022207999E12, noCFSRatio=0.33157689554684366]
   [junit4]   2> 23775 INFO  (coreLoadExecutor-121-thread-1) [    x:collection1] o.a.s.s.SolrIndexSearcher Opening [Searcher@7a73503f[collection1] main]
   [junit4]   2> 23775 WARN  (coreLoadExecutor-121-thread-1) [    x:collection1] o.a.s.r.ManagedResourceStorage Cannot write to config directory /home/jenkins/workspace/Lucene-Solr-8.x-Linux/solr/core/src/test-files/solr/collection1/conf; switching to use InMemory storage instead.
   [junit4]   2> 23776 INFO  (coreLoadExecutor-121-thread-1) [    x:collection1] o.a.s.h.ReplicationHandler Commits will be reserved for 10000ms.
   [junit4]   2> 23776 INFO  (coreLoadExecutor-121-thread-1) [    x:collection1] o.a.s.u.UpdateLog Could not find max version in index or recent updates, using new clock 1632405718799745024
   [junit4]   2> 23800 INFO  (searcherExecutor-122-thread-1-processing-x:collection1) [    x:collection1] o.a.s.c.SolrCore [collection1] Registered new searcher Searcher@7a73503f[collection1] main{ExitableDirectoryReader(UninvertingDirectoryReader())}
   [junit4]   2> 23938 INFO  (TEST-PeerSyncTest.test-seed#[6DFDF5AD0784DD43]) [    ] o.a.s.SolrTestCaseJ4 Writing core.properties file to /home/jenkins/workspace/Lucene-Solr-8.x-Linux/solr/build/solr-core/test/J1/temp/solr.update.PeerSyncTest_6DFDF5AD0784DD43-001/tempDir-001/shard2/cores/collection1
   [junit4]   2> 23939 WARN  (TEST-PeerSyncTest.test-seed#[6DFDF5AD0784DD43]) [    ] o.e.j.s.AbstractConnector Ignoring deprecated socket close linger time
   [junit4]   2> 23939 INFO  (TEST-PeerSyncTest.test-seed#[6DFDF5AD0784DD43]) [    ] o.a.s.c.s.e.JettySolrRunner Start Jetty (original configured port=0)
   [junit4]   2> 23939 INFO  (TEST-PeerSyncTest.test-seed#[6DFDF5AD0784DD43]) [    ] o.a.s.c.s.e.JettySolrRunner Trying to start Jetty on port 0 try number 1 ...
   [junit4]   2> 23939 INFO  (TEST-PeerSyncTest.test-seed#[6DFDF5AD0784DD43]) [    ] o.e.j.s.Server jetty-9.4.14.v20181114; built: 2018-11-14T21:20:31.478Z; git: c4550056e785fb5665914545889f21dc136ad9e6; jvm 1.8.0_201-b09
   [junit4]   2> 24029 INFO  (TEST-PeerSyncTest.test-seed#[6DFDF5AD0784DD43]) [    ] o.e.j.s.session DefaultSessionIdManager workerName=node0
   [junit4]   2> 24029 INFO  (TEST-PeerSyncTest.test-seed#[6DFDF5AD0784DD43]) [    ] o.e.j.s.session No SessionScavenger set, using defaults
   [junit4]   2> 24029 INFO  (TEST-PeerSyncTest.test-seed#[6DFDF5AD0784DD43]) [    ] o.e.j.s.session node0 Scavenging every 600000ms
   [junit4]   2> 24033 INFO  (TEST-PeerSyncTest.test-seed#[6DFDF5AD0784DD43]) [    ] o.e.j.s.h.ContextHandler Started o.e.j.s.ServletContextHandler@20381bc8{/,null,AVAILABLE}
   [junit4]   2> 24038 INFO  (TEST-PeerSyncTest.test-seed#[6DFDF5AD0784DD43]) [    ] o.e.j.s.AbstractConnector Started ServerConnector@2d8076cc{HTTP/1.1,[http/1.1, h2c]}{127.0.0.1:43985}
   [junit4]   2> 24038 INFO  (TEST-PeerSyncTest.test-seed#[6DFDF5AD0784DD43]) [    ] o.e.j.s.Server Started @24078ms
   [junit4]   2> 24038 INFO  (TEST-PeerSyncTest.test-seed#[6DFDF5AD0784DD43]) [    ] o.a.s.c.s.e.JettySolrRunner Jetty properties: {schema=schema.xml, solrconfig=solrconfig-tlog.xml, hostContext=/, hostPort=43985, coreRootDirectory=/home/jenkins/workspace/Lucene-Solr-8.x-Linux/solr/build/solr-core/test/J1/temp/solr.update.PeerSyncTest_6DFDF5AD0784DD43-001/tempDir-001/shard2/cores}
   [junit4]   2> 24038 ERROR (TEST-PeerSyncTest.test-seed#[6DFDF5AD0784DD43]) [    ] o.a.s.u.StartupLoggingUtils Missing Java Option solr.log.dir. Logging may be missing or incomplete.
   [junit4]   2> 24038 INFO  (TEST-PeerSyncTest.test-seed#[6DFDF5AD0784DD43]) [    ] o.a.s.s.SolrDispatchFilter Using logger factory org.apache.logging.slf4j.Log4jLoggerFactory
   [junit4]   2> 24038 INFO  (TEST-PeerSyncTest.test-seed#[6DFDF5AD0784DD43]) [    ] o.a.s.s.SolrDispatchFilter  ___      _       Welcome to Apache Solr? version 8.2.0
   [junit4]   2> 24038 INFO  (TEST-PeerSyncTest.test-seed#[6DFDF5AD0784DD43]) [    ] o.a.s.s.SolrDispatchFilter / __| ___| |_ _   Starting in standalone mode on port null
   [junit4]   2> 24038 INFO  (TEST-PeerSyncTest.test-seed#[6DFDF5AD0784DD43]) [    ] o.a.s.s.SolrDispatchFilter \__ \/ _ \ | '_|  Install dir: null
   [junit4]   2> 24039 INFO  (TEST-PeerSyncTest.test-seed#[6DFDF5AD0784DD43]) [    ] o.a.s.s.SolrDispatchFilter |___/\___/_|_|    Start time: 2019-05-02T07:50:08.236Z
   [junit4]   2> 24039 INFO  (TEST-PeerSyncTest.test-seed#[6DFDF5AD0784DD43]) [    ] o.a.s.c.SolrXmlConfig Loading container configuration from /home/jenkins/workspace/Lucene-Solr-8.x-Linux/solr/build/solr-core/test/J1/temp/solr.update.PeerSyncTest_6DFDF5AD0784DD43-001/tempDir-001/shard2/solr.xml
   [junit4]   2> 24042 INFO  (TEST-PeerSyncTest.test-seed#[6DFDF5AD0784DD43]) [    ] o.a.s.c.SolrXmlConfig Configuration parameter autoReplicaFailoverWorkLoopDelay is ignored
   [junit4]   2> 24042 INFO  (TEST-PeerSyncTest.test-seed#[6DFDF5AD0784DD43]) [    ] o.a.s.c.SolrXmlConfig Configuration parameter autoReplicaFailoverBadNodeExpiration is ignored
   [junit4]   2> 24042 INFO  (TEST-PeerSyncTest.test-seed#[6DFDF5AD0784DD43]) [    ] o.a.s.c.SolrXmlConfig MBean server found: com.sun.jmx.mbeanserver.JmxMBeanServer@24be75cd, but no JMX reporters were configured - adding default JMX reporter.
   [junit4]   2> 24292 INFO  (TEST-PeerSyncTest.test-seed#[6DFDF5AD0784DD43]) [    ] o.a.s.h.c.HttpShardHandlerFactory Host whitelist initialized: WhitelistHostChecker [whitelistHosts=null, whitelistHostCheckingEnabled=false]
   [junit4]   2> 24294 WARN  (TEST-PeerSyncTest.test-seed#[6DFDF5AD0784DD43]) [    ] o.e.j.u.s.S.config No Client EndPointIdentificationAlgorithm configured for SslContextFactory@607547b[provider=null,keyStore=null,trustStore=null]
   [junit4]   2> 24299 WARN  (TEST-PeerSyncTest.test-seed#[6DFDF5AD0784DD43]) [    ] o.e.j.u.s.S.config No Client EndPointIdentificationAlgorithm configured for SslContextFactory@718863a6[provider=null,keyStore=null,trustStore=null]
   [junit4]   2> 24313 INFO  (TEST-PeerSyncTest.test-seed#[6DFDF5AD0784DD43]) [    ] o.a.s.c.TransientSolrCoreCacheDefault Allocating transient cache for 4 transient cores
   [junit4]   2> 24313 INFO  (TEST-PeerSyncTest.test-seed#[6DFDF5AD0784DD43]) [    ] o.a.s.h.a.MetricsHistoryHandler No .system collection, keeping metrics history in memory.
   [junit4]   2> 24326 INFO  (TEST-PeerSyncTest.test-seed#[6DFDF5AD0784DD43]) [    ] o.a.s.m.r.SolrJmxReporter JMX monitoring for 'solr.node' (registry 'solr.node') enabled at server: com.sun.jmx.mbeanserver.JmxMBeanServer@24be75cd
   [junit4]   2> 24336 INFO  (TEST-PeerSyncTest.test-seed#[6DFDF5AD0784DD43]) [    ] o.a.s.m.r.SolrJmxReporter JMX monitoring for 'solr.jvm' (registry 'solr.jvm') enabled at server: com.sun.jmx.mbeanserver.JmxMBeanServer@24be75cd
   [junit4]   2> 24336 INFO  (TEST-PeerSyncTest.test-seed#[6DFDF5AD0784DD43]) [    ] o.a.s.m.r.SolrJmxReporter JMX monitoring for 'solr.jetty' (registry 'solr.jetty') enabled at server: com.sun.jmx.mbeanserver.JmxMBeanServer@24be75cd
   [junit4]   2> 24338 INFO  (TEST-PeerSyncTest.test-seed#[6DFDF5AD0784DD43]) [    ] o.a.s.c.CorePropertiesLocator Found 1 core definitions underneath /home/jenkins/workspace/Lucene-Solr-8.x-Linux/solr/build/solr-core/test/J1/temp/solr.update.PeerSyncTest_6DFDF5AD0784DD43-001/tempDir-001/shard2/cores
   [junit4]   2> 24338 INFO  (TEST-PeerSyncTest.test-seed#[6DFDF5AD0784DD43]) [    ] o.a.s.c.CorePropertiesLocator Cores are: [collection1]
   [junit4]   2> 24350 INFO  (coreLoadExecutor-135-thread-1) [    x:collection1] o.a.s.c.SolrResourceLoader [null] Added 2 libs to classloader, from paths: [/home/jenkins/workspace/Lucene-Solr-8.x-Linux/solr/core/src/test-files/solr/collection1/lib, /home/jenkins/workspace/Lucene-Solr-8.x-Linux/solr/core/src/test-files/solr/collection1/lib/classes]
   [junit4]   2> 24379 INFO  (coreLoadExecutor-135-thread-1) [    x:collection1] o.a.s.c.SolrConfig Using Lucene MatchVersion: 8.2.0
   [junit4]   2> 24420 INFO  (coreLoadExecutor-135-thread-1) [    x:collection1] o.a.s.s.IndexSchema [collection1] Schema name=test
   [junit4]   2> 24578 INFO  (coreLoadExecutor-135-thread-1) [    x:collection1] o.a.s.s.IndexSchema Loaded schema test/1.0 with uniqueid field id
   [junit4]   2> 24588 INFO  (coreLoadExecutor-135-thread-1) [    x:collection1] o.a.s.c.CoreContainer Creating SolrCore 'collection1' using configuration from configset /home/jenkins/workspace/Lucene-Solr-8.x-Linux/solr/core/src/test-files/solr/collection1, trusted=true
   [junit4]   2> 24588 INFO  (coreLoadExecutor-135-thread-1) [    x:collection1] o.a.s.m.r.SolrJmxReporter JMX monitoring for 'solr.core.collection1' (registry 'solr.core.collection1') enabled at server: com.sun.jmx.mbeanserver.JmxMBeanServer@24be75cd
   [junit4]   2> 24588 INFO  (coreLoadExecutor-135-thread-1) [    x:collection1] o.a.s.c.SolrCore [[collection1] ] Opening new SolrCore at [/home/jenkins/workspace/Lucene-Solr-8.x-Linux/solr/core/src/test-files/solr/collection1], dataDir=[/home/jenkins/workspace/Lucene-Solr-8.x-Linux/solr/build/solr-core/test/J1/temp/solr.update.PeerSyncTest_6DFDF5AD0784DD43-001/tempDir-001/shard2/cores/collection1/data/]
   [junit4]   2> 24632 INFO  (coreLoadExecutor-135-thread-1) [    x:collection1] o.a.s.u.RandomMergePolicy RandomMergePolicy wrapping class org.apache.lucene.index.TieredMergePolicy: [TieredMergePolicy: maxMergeAtOnce=36, maxMergeAtOnceExplicit=34, maxMergedSegmentMB=87.068359375, floorSegmentMB=0.5556640625, forceMergeDeletesPctAllowed=18.066744849168334, segmentsPerTier=38.0, maxCFSSegmentSizeMB=8.796093022207999E12, noCFSRatio=0.49922519231271945, deletesPctAllowed=47.847509482883986
   [junit4]   2> 24647 WARN  (coreLoadExecutor-135-thread-1) [    x:collection1] o.a.s.c.RequestHandlers INVALID paramSet a in requestHandler {type = requestHandler,name = /dump,class = DumpRequestHandler,attributes = {initParams=a, name=/dump, class=DumpRequestHandler},args = {defaults={a=A,b=B}}}
   [junit4]   2> 24740 INFO  (coreLoadExecutor-135-thread-1) [    x:collection1] o.a.s.u.UpdateHandler Using UpdateLog implementation: org.apache.solr.update.UpdateLog
   [junit4]   2> 24740 INFO  (coreLoadExecutor-135-thread-1) [    x:collection1] o.a.s.u.UpdateLog Initializing UpdateLog: dataDir= defaultSyncLevel=FLUSH numRecordsToKeep=100 maxNumLogsToKeep=10 numVersionBuckets=65536
   [junit4]   2> 24742 INFO  (coreLoadExecutor-135-thread-1) [    x:collection1] o.a.s.u.CommitTracker Hard AutoCommit: disabled
   [junit4]   2> 24742 INFO  (coreLoadExecutor-135-thread-1) [    x:collection1] o.a.s.u.CommitTracker Soft AutoCommit: disabled
   [junit4]   2> 24743 INFO  (coreLoadExecutor-135-thread-1) [    x:collection1] o.a.s.u.RandomMergePolicy RandomMergePolicy wrapping class org.apache.lucene.index.LogByteSizeMergePolicy: [LogByteSizeMergePolicy: minMergeSize=1677721, mergeFactor=36, maxMergeSize=2147483648, maxMergeSizeForForcedMerge=9223372036854775807, calibrateSizeByDeletes=false, maxMergeDocs=2147483647, maxCFSSegmentSizeMB=8.796093022207999E12, noCFSRatio=0.33157689554684366]
   [junit4]   2> 24743 INFO  (coreLoadExecutor-135-thread-1) [    x:collection1] o.a.s.s.SolrIndexSearcher Opening [Searcher@30e603e5[collection1] main]
   [junit4]   2> 24744 WARN  (coreLoadExecutor-135-thread-1) [    x:collection1] o.a.s.r.ManagedResourceStorage Cannot write to config directory /home/jenkins/workspace/Lucene-Solr-8.x-Linux/solr/core/src/test-files/solr/collection1/conf; switching to use InMemory storage instead.
   [junit4]   2> 24744 INFO  (coreLoadExecutor-135-thread-1) [    x:collection1] o.a.s.h.ReplicationHandler Commits will be reserved for 10000ms.
   [junit4]   2> 24744 INFO  (coreLoadExecutor-135-thread-1) [    x:collection1] o.a.s.u.UpdateLog Could not find max version in index or recent updates, using new clock 1632405719814766592
   [junit4]   2> 24766 INFO  (TEST-PeerSyncTest.test-seed#[6DFDF5AD0784DD43]) [    ] o.a.s.SolrTestCaseJ4 ###Starting test
   [junit4]   2> 24766 INFO  (searcherExecutor-136-thread-1-processing-x:collection1) [    x:collection1] o.a.s.c.SolrCore [collection1] Registered new searcher Searcher@30e603e5[collection1] main{ExitableDirectoryReader(UninvertingDirectoryReader())}
   [junit4]   2> 24826 INFO  (qtp2087249044-222) [    x:collection1] o.a.s.u.p.LogUpdateProcessorFactory [collection1]  webapp= path=/update params={update.distrib=FROMLEADER&wt=javabin&version=2}{add=[1 (1)]} 0 48
   [junit4]   2> 24834 INFO  (qtp539432374-243) [    x:collection1] o.a.s.u.PeerSync PeerSync: core=collection1 url= START replicas=[http://127.0.0.1:33079/collection1] nUpdates=100
   [junit4]   2> 24872 INFO  (qtp2087249044-221) [    x:collection1] o.a.s.s.SolrIndexSearcher Opening [Searcher@181c5f58[collection1] realtime]
   [junit4]   2> 24882 INFO  (qtp2087249044-221) [    x:collection1] o.a.s.u.IndexFingerprint IndexFingerprint millis:41.0 result:{maxVersionSpecified=9223372036854775807, maxVersionEncountered=1, maxInHash=1, versionsHash=-5451962507482445012, numVersions=1, numDocs=1, maxDoc=1}
   [junit4]   2> 24882 INFO  (qtp2087249044-221) [    x:collection1] o.a.s.c.S.Request [collection1]  webapp= path=/get params={distrib=false&qt=/get&getFingerprint=9223372036854775807&wt=javabin&version=2} status=0 QTime=43
   [junit4]   2> 24884 INFO  (qtp539432374-243) [    x:collection1] o.a.s.u.IndexFingerprint IndexFingerprint millis:0.0 result:{maxVersionSpecified=9223372036854775807, maxVersionEncountered=0, maxInHash=0, versionsHash=0, numVersions=0, numDocs=0, maxDoc=0}
   [junit4]   2> 24884 INFO  (qtp539432374-243) [    x:collection1] o.a.s.u.PeerSync PeerSync: core=collection1 url= DONE.  We have no versions.  sync failed.
   [junit4]   2> 24893 INFO  (qtp2087249044-222) [    x:collection1] o.a.s.u.IndexFingerprint IndexFingerprint millis:2.0 result:{maxVersionSpecified=9223372036854775807, maxVersionEncountered=1, maxInHash=1, versionsHash=-5451962507482445012, numVersions=1, numDocs=1, maxDoc=1}
   [junit4]   2> 24895 INFO  (qtp2087249044-222) [    x:collection1] o.a.s.c.S.Request [collection1]  webapp= path=/get params={distrib=false&qt=/get&fingerprint=true&getVersions=100&wt=javabin&version=2} status=0 QTime=4
   [junit4]   2> 24901 INFO  (qtp539432374-243) [    x:collection1] o.a.s.c.S.Request [collection1]  webapp= path=/get params={qt=/get&getVersions=100&sync=http://127.0.0.1:33079/collection1&wt=javabin&version=2} status=0 QTime=72
   [junit4]   2> 24906 INFO  (qtp539432374-244) [    x:collection1] o.a.s.u.p.LogUpdateProcessorFactory [collection1]  webapp= path=/update params={update.distrib=FROMLEADER&wt=javabin&version=2}{add=[1 (1)]} 0 2
   [junit4]   2> 24908 INFO  (qtp539432374-241) [    x:collection1] o.a.s.u.PeerSync PeerSync: core=collection1 url= START replicas=[http://127.0.0.1:33079/collection1] nUpdates=100
   [junit4]   2> 24911 INFO  (qtp2087249044-223) [    x:collection1] o.a.s.u.IndexFingerprint IndexFingerprint millis:0.0 result:{maxVersionSpecified=9223372036854775807, maxVersionEncountered=1, maxInHash=1, versionsHash=-5451962507482445012, numVersions=1, numDocs=1, maxDoc=1}
   [junit4]   2> 24911 INFO  (qtp2087249044-223) [    x:collection1] o.a.s.c.S.Request [collection1]  webapp= path=/get params={distrib=false&qt=/get&getFingerprint=9223372036854775807&wt=javabin&version=2} status=0 QTime=0
   [junit4]   2> 24924 INFO  (qtp539432374-241) [    x:collection1] o.a.s.s.SolrIndexSearcher Opening [Searcher@2fa69c6d[collection1] realtime]
   [junit4]   2> 24924 INFO  (qtp539432374-241) [    x:collection1] o.a.s.u.IndexFingerprint IndexFingerprint millis:12.0 result:{maxVersionSpecified=9223372036854775807, maxVersionEncountered=1, maxInHash=1, versionsHash=-5451962507482445012, numVersions=1, numDocs=1, maxDoc=1}
   [junit4]   2> 24924 INFO  (qtp539432374-241) [    x:collection1] o.a.s.u.PeerSync We are already in sync. No need to do a PeerSync 
   [junit4]   2> 24924 INFO  (qtp539432374-241) [    x:collection1] o.a.s.c.S.Request [collection1]  webapp= path=/get params={qt=/get&getVersions=100&sync=http://127.0.0.1:33079/collection1&wt=javabin&version=2} status=0 QTime=16
   [junit4]   2> 24926 INFO  (qtp2087249044-221) [    x:collection1] o.a.s.u.DirectUpdateHandler2 start commit{_version_=1632405720005607424,optimize=false,openSearcher=true,waitSearcher=true,expungeDeletes=false,softCommit=false,prepareCommit=false}
   [junit4]   2> 24926 INFO  (qtp2087249044-221) [    x:collection1] o.a.s.u.SolrIndexWriter Calling setCommitData with IW:org.apache.solr.update.SolrIndexWriter@22ebe627 commitCommandVersion:1632405720005607424
   [junit4]   2> 24927 INFO  (qtp2087249044-221) [    x:collection1] o.a.s.s.SolrIndexSearcher Opening [Searcher@6ee4592d[collection1] main]
   [junit4]   2> 24929 INFO  (qtp2087249044-221) [    x:collection1] o.a.s.u.DirectUpdateHandler2 end_commit_flush
   [junit4]   2> 24930 INFO  (searcherExecutor-108-thread-1-processing-x:collection1) [    x:collection1] o.a.s.c.SolrCore [collection1] Registered new searcher Searcher@6ee4592d[collection1] main{ExitableDirectoryReader(UninvertingDirectoryReader(Uninverting(_0(8.2.0):c1:[diagnostics={os=Linux, java.vendor=Oracle Corporation, java.version=1.8.0_201, java.vm.version=25.201-b09, lucene.version=8.2.0, os.arch=amd64, java.runtime.version=1.8.0_201-b09, source=flush, os.version=4.18.0-17-generic, timestamp=1556783409057}]:[attributes={Lucene50StoredFieldsFormat.mode=BEST_COMPRESSION}])))}
   [junit4]   2> 24930 INFO  (qtp2087249044-221) [    x:collection1] o.a.s.u.p.LogUpdateProcessorFactory [collection1]  webapp= path=/update params={waitSearcher=true&commit=true&softCommit=false&wt=javabin&version=2}{commit=} 0 4
   [junit4]   2> 24932 INFO  (qtp539432374-243) [    x:collection1] o.a.s.u.DirectUpdateHandler2 start commit{_version_=1632405720011898880,optimize=false,openSearcher=true,waitSearcher=true,expungeDeletes=false,softCommit=false,prepareCommit=false}
   [junit4]   2> 24932 INFO  (qtp539432374-243) [    x:collection1] o.a.s.u.SolrIndexWriter Calling setCommitData with IW:org.apache.solr.update.SolrIndexWriter@175ff57d commitCommandVersion:1632405720011898880
   [junit4]   2> 24934 INFO  (qtp539432374-243) [    x:collection1] o.a.s.s.SolrIndexSearcher Opening [Searcher@707fdf25[collection1] main]
   [junit4]   2> 24935 INFO  (qtp539432374-243) [    x:collection1] o.a.s.u.DirectUpdateHandler2 end_commit_flush
   [junit4]   2> 24939 INFO  (searcherExecutor-122-thread-1-processing-x:collection1) [    x:collection1] o.a.s.c.SolrCore [collection1] Registered new searcher Searcher@707fdf25[collection1] main{ExitableDirectoryReader(UninvertingDirectoryReader(Uninverting(_0(8.2.0):c1:[diagnostics={os=Linux, java.vendor=Oracle Corporation, java.version=1.8.0_201, java.vm.version=25.201-b09, lucene.version=8.2.0, os.arch=amd64, java.runtime.version=1.8.0_201-b09, source=flush, os.version=4.18.0-17-generic, timestamp=1556783409117}]:[attributes={Lucene50StoredFieldsFormat.mode=BEST_COMPRESSION}])))}
   [junit4]   2> 24940 INFO  (qtp539432374-243) [    x:collection1] o.a.s.u.p.LogUpdateProcessorFactory [collection1]  webapp= path=/update params={waitSearcher=true&commit=true&softCommit=false&wt=javabin&version=2}{commit=} 0 7
   [junit4]   2> 24944 INFO  (qtp2087249044-222) [    x:collection1] o.a.s.c.S.Request [collection1]  webapp= path=/select params={q=*:*&wt=javabin&version=2} hits=1 status=0 QTime=3
   [junit4]   2> 24955 INFO  (qtp539432374-244) [    x:collection1] o.a.s.c.S.Request [collection1]  webapp= path=/select params={q=*:*&wt=javabin&version=2} hits=1 status=0 QTime=0
   [junit4]   2> 24970 INFO  (qtp2087249044-223) [    x:collection1] o.a.s.u.p.LogUpdateProcessorFactory [collection1]  webapp= path=/update params={update.distrib=FROMLEADER&wt=javabin&version=2}{add=[2 (2)]} 0 11
   [junit4]   2> 24972 INFO  (qtp539432374-241) [    x:collection1] o.a.s.u.PeerSync PeerSync: core=collection1 url= START replicas=[http://127.0.0.1:33079/collection1] nUpdates=100
   [junit4]   2> 24981 INFO  (qtp2087249044-221) [    x:collection1] o.a.s.s.SolrIndexSearcher Opening [Searcher@1ad7ff76[collection1] realtime]
   [junit4]   2> 24982 INFO  (qtp2087249044-221) [    x:collection1] o.a.s.u.IndexFingerprint IndexFingerprint millis:7.0 result:{maxVersionSpecified=9223372036854775807, maxVersionEncountered=2, maxInHash=2, versionsHash=-1218814014108643565, numVersions=2, numDocs=2, maxDoc=1}
   [junit4]   2> 24982 INFO  (qtp2087249044-221) [    x:collection1] o.a.s.c.S.Request [collection1]  webapp= path=/get params={distrib=false&qt=/get&getFingerprint=9223372036854775807&wt=javabin&version=2} status=0 QTime=8
   [junit4]   2> 24983 INFO  (qtp539432374-241) [    x:collection1] o.a.s.u.IndexFingerprint IndexFingerprint millis:0.0 result:{maxVersionSpecified=9223372036854775807, maxVersionEncountered=1, maxInHash=1, versionsHash=-5451962507482445012, numVersions=1, numDocs=1, maxDoc=1}
   [junit4]   2> 24987 INFO  (qtp2087249044-222) [    x:collection1] o.a.s.u.IndexFingerprint IndexFingerprint millis:0.0 result:{maxVersionSpecified=9223372036854775807, maxVersionEncountered=2, maxInHash=2, versionsHash=-1218814014108643565, numVersions=2, numDocs=2, maxDoc=1}
   [junit4]   2> 24987 INFO  (qtp2087249044-222) [    x:collection1] o.a.s.c.S.Request [collection1]  webapp= path=/get params={distrib=false&qt=/get&fingerprint=true&getVersions=100&wt=javabin&version=2} status=0 QTime=1
   [junit4]   2> 24988 INFO  (qtp539432374-241) [    x:collection1] o.a.s.u.PeerSync PeerSync: core=collection1 url=  Received 2 versions from http://127.0.0.1:33079/collection1 fingerprint:{maxVersionSpecified=9223372036854775807, maxVersionEncountered=2, maxInHash=2, versionsHash=-1218814014108643565, numVersions=2, numDocs=2, maxDoc=1}
   [junit4]   2> 24990 INFO  (qtp2087249044-223) [    x:collection1] o.a.s.c.S.Request [collection1]  webapp= path=/get params={distrib=false&qt=/get&checkCanHandleVersionRanges=false&wt=javabin&version=2} status=0 QTime=0
   [junit4]   2> 24992 INFO  (qtp539432374-241) [    x:collection1] o.a.s.u.PeerSync PeerSync: core=collection1 url= Requesting updates from http://127.0.0.1:33079/collection1n=1 versions=2...2
   [junit4]   2> 24994 INFO  (qtp2087249044-221) [    x:collection1] o.a.s.u.IndexFingerprint IndexFingerprint millis:0.0 result:{maxVersionSpecified=2, maxVersionEncountered=2, maxInHash=2, versionsHash=-1218814014108643565, numVersions=2, numDocs=2, maxDoc=1}
   [junit4]   2> 24995 INFO  (qtp2087249044-221) [    x:collection1] o.a.s.c.S.Request [collection1]  webapp= path=/get params={getUpdates=2...2&distrib=false&qt=/get&fingerprint=true&onlyIfActive=false&wt=javabin&version=2} status=0 QTime=1
   [junit4]   2> 25005 INFO  (qtp539432374-241) [    x:collection1] o.a.s.u.p.LogUpdateProcessorFactory [collection1] {add=[2 (2)]} 0 3
   [junit4]   2> 25011 INFO  (qtp539432374-241) [    x:collection1] o.a.s.s.SolrIndexSearcher Opening [Searcher@d1deff6[collection1] realtime]
   [junit4]   2> 25012 INFO  (qtp539432374-241) [    x:collection1] o.a.s.u.IndexFingerprint IndexFingerprint millis:6.0 result:{maxVersionSpecified=2, maxVersionEncountered=2, maxInHash=2, versionsHash=-1218814014108643565, numVersions=2, numDocs=2, maxDoc=1}
   [junit4]   2> 25012 INFO  (qtp539432374-241) [    x:collection1] o.a.s.u.PeerSync Fingerprint comparison: 0
   [junit4]   2> 25012 INFO  (qtp539432374-241) [    x:collection1] o.a.s.u.PeerSync PeerSync: core=collection1 url= DONE. sync succeeded
   [junit4]   2> 25012 INFO  (qtp539432374-241) [    x:collection1] o.a.s.c.S.Request [collection1]  webapp= path=/get params={qt=/get&getVersions=100&sync=http://127.0.0.1:33079/collection1&wt=javabin&version=2} status=0 QTime=39
   [junit4]   2> 25014 INFO  (qtp2087249044-222) [    x:collection1] o.a.s.u.DirectUpdateHandler2 start commit{_version_=1632405720097882112,optimize=false,openSearcher=true,waitSearcher=true,expungeDeletes=false,softCommit=false,prepareCommit=false}
   [junit4]   2> 25019 INFO  (qtp2087249044-222) [    x:collection1] o.a.s.u.SolrIndexWriter Calling setCommitData with IW:org.apache.solr.update.SolrIndexWriter@22ebe627 commitCommandVersion:1632405720097882112
   [junit4]   2> 25023 INFO  (qtp2087249044-222) [    x:collection1] o.a.s.s.SolrIndexSearcher Opening [Searcher@25ce1d2b[collection1] main]
   [junit4]   2> 25023 INFO  (qtp2087249044-222) [    x:collection1] o.a.s.u.DirectUpdateHandler2 end_commit_flush
   [junit4]   2> 25030 INFO  (searcherExecutor-108-thread-1-processing-x:collection1) [    x:collection1] o.a.s.c.SolrCore [collection1] Registered new searcher Searcher@25ce1d2b[collection1] main{ExitableDirectoryReader(UninvertingDirectoryReader(Uninverting(_0(8.2.0):c1:[diagnostics={os=Linux, java.vendor=Oracle Corporation, java.version=1.8.0_201, java.vm.version=25.201-b09, lucene.version=8.2.0, os.arch=amd64, java.runtime.version=1.8.0_201-b09, source=flush, os.version=4.18.0-17-generic, timestamp=1556783409057}]:[attributes={Lucene50StoredFieldsFormat.mode=BEST_COMPRESSION}]) Uninverting(_1(8.2.0):c1:[diagnostics={os=Linux, java.vendor=Oracle Corporation, java.version=1.8.0_201, java.vm.version=25.201-b09, lucene.version=8.2.0, os.arch=amd64, java.runtime.version=1.8.0_201-b09, source=flush, os.version=4.18.0-17-generic, timestamp=1556783409175}]:[attributes={Lucene50StoredFieldsFormat.mode=BEST_COMPRESSION}])))}
   [junit4]   2> 25036 INFO  (qtp2087249044-222) [    x:collection1] o.a.s.u.p.LogUpdateProcessorFactory [collection1]  webapp= path=/update params={waitSearcher=true&commit=true&softCommit=false&wt=javabin&version=2}{commit=} 0 22
   [junit4]   2> 25038 INFO  (qtp539432374-243) [    x:collection1] o.a.s.u.DirectUpdateHandler2 start commit{_version_=1632405720123047936,optimize=false,openSearcher=true,waitSearcher=true,expungeDeletes=false,softCommit=false,prepareCommit=false}
   [junit4]   2> 25038 INFO  (qtp539432374-243) [    x:collection1] o.a.s.u.SolrIndexWriter Calling setCommitData with IW:org.apache.solr.update.SolrIndexWriter@175ff57d commitCommandVersion:1632405720123047936
   [junit4]   2> 25039 INFO  (qtp539432374-243) [    x:collection1] o.a.s.s.SolrIndexSearcher Opening [Searcher@25c19df3[collection1] main]
   [junit4]   2> 25041 INFO  (qtp539432374-243) [    x:collection1] o.a.s.u.DirectUpdateHandler2 end_commit_flush
   [junit4]   2> 25044 INFO  (searcherExecutor-122-thread-1-processing-x:collection1) [    x:collection1] o.a.s.c.SolrCore [collection1] Registered new searcher Searcher@25c19df3[collection1] main{ExitableDirectoryReader(UninvertingDirectoryReader(Uninverting(_0(8.2.0):c1:[diagnostics={os=Linux, java.vendor=Oracle Corporation, java.version=1.8.0_201, java.vm.version=25.201-b09, lucene.version=8.2.0, os.arch=amd64, java.runtime.version=1.8.0_201-b09, source=flush, os.version=4.18.0-17-generic, timestamp=1556783409117}]:[attributes={Lucene50StoredFieldsFormat.mode=BEST_COMPRESSION}]) Uninverting(_1(8.2.0):c1:[diagnostics={os=Linux, java.vendor=Oracle Corporation, java.version=1.8.0_201, java.vm.version=25.201-b09, lucene.version=8.2.0, os.arch=amd64, java.runtime.version=1.8.0_201-b09, source=flush, os.version=4.18.0-17-generic, timestamp=1556783409206}]:[attributes={Lucene50StoredFieldsFormat.mode=BEST_COMPRESSION}])))}
   [junit4]   2> 25044 INFO  (qtp539432374-243) [    x:collection1] o.a.s.u.p.LogUpdateProcessorFactory [collection1]  webapp= path=/update params={waitSearcher=true&commit=true&softCommit=false&wt=javabin&version=2}{commit=} 0 6
   [junit4]   2> 25050 INFO  (qtp2087249044-223) [    x:collection1] o.a.s.c.S.Request [collection1]  webapp= path=/select params={q=*:*&wt=javabin&version=2} hits=2 status=0 QTime=0
   [junit4]   2> 25054 INFO  (qtp539432374-244) [    x:collection1] o.a.s.c.S.Request [collection1]  webapp= path=/select params={q=*:*&wt=javabin&version=2} hits=2 status=0 QTime=0
   [junit4]   2> 25060 INFO  (qtp2087249044-221) [    x:collection1] o.a.s.u.p.LogUpdateProcessorFactory [collection1]  webapp= path=/update params={update.distrib=FROMLEADER&wt=javabin&version=2}{add=[3 (3)]} 0 2
   [junit4]   2> 25071 INFO  (qtp2087249044-222) [    x:collection1] o.a.s.u.p.LogUpdateProcessorFactory [collection1]  webapp= path=/update params={update.distrib=FROMLEADER&wt=javabin&version=2}{add=[4 (4)]} 0 9
   [junit4]   2> 25074 INFO  (qtp2087249044-223) [    x:collection1] o.a.s.u.p.LogUpdateProcessorFactory [collection1]  webapp= path=/update params={update.distrib=FROMLEADER&wt=javabin&version=2}{add=[5 (5)]} 0 1
   [junit4]   2> 25078 INFO  (qtp2087249044-221) [    x:collection1] o.a.s.u.p.LogUpdateProcessorFactory [collection1]  webapp= path=/update params={update.distrib=FROMLEADER&wt=javabin&version=2}{add=[6 (6)]} 0 1
   [junit4]   2> 25082 INFO  (qtp2087249044-221) [    x:collection1] o.a.s.u.p.LogUpdateProcessorFactory [collection1]  webapp= path=/update params={update.distrib=FROMLEADER&wt=javabin&version=2}{add=[7 (7)]} 0 2
   [junit4]   2> 25088 INFO  (qtp2087249044-221) [    x:collection1] o.a.s.u.p.LogUpdateProcessorFactory [collection1]  webapp= path=/update params={update.distrib=FROMLEADER&wt=javabin&version=2}{add=[8 (8)]} 0 3
   [junit4]   2> 25091 INFO  (qtp2087249044-221) [    x:collection1] o.a.s.u.p.LogUpdateProcessorFactory [collection1]  webapp= path=/update params={update.distrib=FROMLEADER&wt=javabin&version=2}{add=[9 (9)]} 0 1
   [junit4]   2> 25096 INFO  (qtp2087249044-221) [    x:collection1] o.a.s.u.p.LogUpdateProcessorFactory [collection1]  webapp= path=/update params={update.distrib=FROMLEADER&wt=javabin&version=2}{add=[10 (10)]} 0 1
   [junit4

[...truncated too long message...]

tricManager Closing metric reporters for registry=solr.core.collection1.shard1.replica_n3, tag=135fadf0
   [junit4]   2> 421235 INFO  (qtp1330236560-7019) [n:127.0.0.1:36095__a c:collection1 s:shard1 r:core_node4 x:collection1_shard1_replica_n3] o.a.s.m.r.SolrJmxReporter Closing reporter [org.apache.solr.metrics.reporters.SolrJmxReporter@1dae4cd7: rootName = null, domain = solr.core.collection1.shard1.replica_n3, service url = null, agent id = null] for registry solr.core.collection1.shard1.replica_n3 / com.codahale.metrics.MetricRegistry@177f3935
   [junit4]   2> 421241 INFO  (qtp1330236560-7019) [n:127.0.0.1:36095__a c:collection1 s:shard1 r:core_node4 x:collection1_shard1_replica_n3] o.a.s.m.SolrMetricManager Closing metric reporters for registry=solr.collection.collection1.shard1.leader, tag=135fadf0
   [junit4]   2> 421242 INFO  (qtp1330236560-7019) [n:127.0.0.1:36095__a c:collection1 s:shard1 r:core_node4 x:collection1_shard1_replica_n3] o.a.s.u.DirectUpdateHandler2 Committing on IndexWriter close.
   [junit4]   2> 421242 INFO  (qtp1330236560-7019) [n:127.0.0.1:36095__a c:collection1 s:shard1 r:core_node4 x:collection1_shard1_replica_n3] o.a.s.u.SolrIndexWriter Calling setCommitData with IW:org.apache.solr.update.SolrIndexWriter@6f503ce9 commitCommandVersion:0
   [junit4]   2> 421243 INFO  (TEST-TestInPlaceUpdatesDistrib.test-seed#[6DFDF5AD0784DD43]) [    ] o.a.s.c.ZkTestServer Shutting down ZkTestServer.
   [junit4]   2> 421244 WARN  (ZkTestServer Run Thread) [    ] o.a.s.c.ZkTestServer Watch limit violations: 
   [junit4]   2> Maximum concurrent create/delete watches above limit:
   [junit4]   2> 
   [junit4]   2> 	12	/solr/collections/collection1/terms/shard1
   [junit4]   2> 	10	/solr/aliases.json
   [junit4]   2> 	4	/solr/security.json
   [junit4]   2> 	4	/solr/configs/conf1
   [junit4]   2> 	3	/solr/collections/control_collection/terms/shard1
   [junit4]   2> 
   [junit4]   2> Maximum concurrent data watches above limit:
   [junit4]   2> 
   [junit4]   2> 	47	/solr/collections/collection1/state.json
   [junit4]   2> 	10	/solr/clusterstate.json
   [junit4]   2> 	10	/solr/clusterprops.json
   [junit4]   2> 	5	/solr/collections/control_collection/state.json
   [junit4]   2> 
   [junit4]   2> Maximum concurrent children watches above limit:
   [junit4]   2> 
   [junit4]   2> 	10	/solr/live_nodes
   [junit4]   2> 	10	/solr/collections
   [junit4]   2> 
   [junit4]   2> 421245 INFO  (TEST-TestInPlaceUpdatesDistrib.test-seed#[6DFDF5AD0784DD43]) [    ] o.a.s.c.ZkTestServer parse host and port list: 127.0.0.1:41647
   [junit4]   2> 421245 INFO  (TEST-TestInPlaceUpdatesDistrib.test-seed#[6DFDF5AD0784DD43]) [    ] o.a.s.c.ZkTestServer connecting to 127.0.0.1 41647
   [junit4]   2> NOTE: reproduce with: ant test  -Dtestcase=TestInPlaceUpdatesDistrib -Dtests.method=test -Dtests.seed=6DFDF5AD0784DD43 -Dtests.multiplier=3 -Dtests.slow=true -Dtests.locale=es-ES -Dtests.timezone=Europe/Samara -Dtests.asserts=true -Dtests.file.encoding=ISO-8859-1
   [junit4] FAILURE 67.7s J1 | TestInPlaceUpdatesDistrib.test <<<
   [junit4]    > Throwable #1: java.lang.AssertionError: Thread pool didn't terminate within 15 secs
   [junit4]    > 	at __randomizedtesting.SeedInfo.seed([6DFDF5AD0784DD43:E5A9CA77A978B0BB]:0)
   [junit4]    > 	at org.apache.solr.update.TestInPlaceUpdatesDistrib.reorderedDBQsResurrectionTest(TestInPlaceUpdatesDistrib.java:852)
   [junit4]    > 	at org.apache.solr.update.TestInPlaceUpdatesDistrib.test(TestInPlaceUpdatesDistrib.java:179)
   [junit4]    > 	at org.apache.solr.BaseDistributedSearchTestCase$ShardsRepeatRule$ShardsFixedStatement.callStatement(BaseDistributedSearchTestCase.java:1082)
   [junit4]    > 	at org.apache.solr.BaseDistributedSearchTestCase$ShardsRepeatRule$ShardsStatement.evaluate(BaseDistributedSearchTestCase.java:1054)
   [junit4]    > 	at java.lang.Thread.run(Thread.java:748)
   [junit4]   2> 421246 INFO  (SUITE-TestInPlaceUpdatesDistrib-seed#[6DFDF5AD0784DD43]-worker) [    ] o.a.s.SolrTestCaseJ4 ###deleteCore
   [junit4]   2> 421246 INFO  (SUITE-TestInPlaceUpdatesDistrib-seed#[6DFDF5AD0784DD43]-worker) [    ] o.a.s.c.CoreContainer Shutting down CoreContainer instance=1212612441
   [junit4]   2> 421246 INFO  (coreCloseExecutor-2007-thread-1) [    x:collection1] o.a.s.c.SolrCore [collection1]  CLOSING SolrCore org.apache.solr.core.SolrCore@62456845
   [junit4]   2> 421246 INFO  (coreCloseExecutor-2007-thread-1) [    x:collection1] o.a.s.m.SolrMetricManager Closing metric reporters for registry=solr.core.collection1, tag=62456845
   [junit4]   2> 421246 INFO  (coreCloseExecutor-2007-thread-1) [    x:collection1] o.a.s.m.r.SolrJmxReporter Closing reporter [org.apache.solr.metrics.reporters.SolrJmxReporter@6749fe0e: rootName = null, domain = solr.core.collection1, service url = null, agent id = null] for registry solr.core.collection1 / com.codahale.metrics.MetricRegistry@4ef2e639
   [junit4]   2> 421252 INFO  (SUITE-TestInPlaceUpdatesDistrib-seed#[6DFDF5AD0784DD43]-worker) [    ] o.a.s.m.SolrMetricManager Closing metric reporters for registry=solr.node, tag=null
   [junit4]   2> 421252 INFO  (SUITE-TestInPlaceUpdatesDistrib-seed#[6DFDF5AD0784DD43]-worker) [    ] o.a.s.m.r.SolrJmxReporter Closing reporter [org.apache.solr.metrics.reporters.SolrJmxReporter@7cff05ef: rootName = null, domain = solr.node, service url = null, agent id = null] for registry solr.node / com.codahale.metrics.MetricRegistry@43f28ce
   [junit4]   2> 421252 INFO  (SUITE-TestInPlaceUpdatesDistrib-seed#[6DFDF5AD0784DD43]-worker) [    ] o.a.s.m.SolrMetricManager Closing metric reporters for registry=solr.jvm, tag=null
   [junit4]   2> 421252 INFO  (SUITE-TestInPlaceUpdatesDistrib-seed#[6DFDF5AD0784DD43]-worker) [    ] o.a.s.m.r.SolrJmxReporter Closing reporter [org.apache.solr.metrics.reporters.SolrJmxReporter@13f03a2f: rootName = null, domain = solr.jvm, service url = null, agent id = null] for registry solr.jvm / com.codahale.metrics.MetricRegistry@51b072a5
   [junit4]   2> 421253 INFO  (SUITE-TestInPlaceUpdatesDistrib-seed#[6DFDF5AD0784DD43]-worker) [    ] o.a.s.m.SolrMetricManager Closing metric reporters for registry=solr.jetty, tag=null
   [junit4]   2> 421253 INFO  (SUITE-TestInPlaceUpdatesDistrib-seed#[6DFDF5AD0784DD43]-worker) [    ] o.a.s.m.r.SolrJmxReporter Closing reporter [org.apache.solr.metrics.reporters.SolrJmxReporter@14107f8d: rootName = null, domain = solr.jetty, service url = null, agent id = null] for registry solr.jetty / com.codahale.metrics.MetricRegistry@16967a5c
   [junit4]   2> NOTE: leaving temporary files on disk at: /home/jenkins/workspace/Lucene-Solr-8.x-Linux/solr/build/solr-core/test/J1/temp/solr.update.TestInPlaceUpdatesDistrib_6DFDF5AD0784DD43-001
   [junit4]   2> May 02, 2019 7:56:45 AM com.carrotsearch.randomizedtesting.ThreadLeakControl checkThreadLeaks
   [junit4]   2> WARNING: Will linger awaiting termination of 1 leaked thread(s).
   [junit4]   2> NOTE: test params are: codec=Asserting(Lucene80): {id_i=Lucene50(blocksize=128), title_s=PostingsFormat(name=LuceneVarGapDocFreqInterval), id=PostingsFormat(name=LuceneFixedGap), id_field_copy_that_does_not_support_in_place_update_s=Lucene50(blocksize=128)}, docValues:{inplace_updatable_float=DocValuesFormat(name=Lucene80), id_i=DocValuesFormat(name=Direct), _version_=DocValuesFormat(name=Asserting), id=DocValuesFormat(name=Lucene80), inplace_updatable_int_with_default=DocValuesFormat(name=Lucene80), inplace_updatable_int=DocValuesFormat(name=Direct), inplace_updatable_float_with_default=DocValuesFormat(name=Direct)}, maxPointsInLeafNode=1035, maxMBSortInHeap=7.533822033698043, sim=Asserting(org.apache.lucene.search.similarities.AssertingSimilarity@24980be6), locale=es-ES, timezone=Europe/Samara
   [junit4]   2> NOTE: Linux 4.18.0-17-generic amd64/Oracle Corporation 1.8.0_201 (64-bit)/cpus=8,threads=1,free=237640048,total=524288000
   [junit4]   2> NOTE: All tests run in this JVM: [TestDFRSimilarityFactory, SchemaApiFailureTest, IgnoreLargeDocumentProcessorFactoryTest, TestTolerantSearch, PeerSyncTest, InfixSuggestersTest, LargeFieldTest, TestRestManager, TestSimLargeCluster, RemoteQueryErrorTest, TokenizerChainTest, TestPivotHelperCode, OverseerModifyCollectionTest, TestExactSharedStatsCache, TestReload, TestSolr4Spatial, RegexBytesRefFilterTest, TestSolrConfigHandlerConcurrent, TestMiniSolrCloudClusterSSL, TestCollectionsAPIViaSolrCloudCluster, TestSolrCoreSnapshots, BasicAuthStandaloneTest, OverseerTaskQueueTest, HighlighterMaxOffsetTest, TestMergePolicyConfig, ShardsWhitelistTest, HdfsBasicDistributedZkTest, TestSolrFieldCacheBean, TestSimPolicyCloud, TestMaxScoreQueryParser, TestInPlaceUpdatesDistrib]
   [junit4] Completed [161/855 (3!)] on J1 in 68.33s, 1 test, 1 failure <<< FAILURES!

[...truncated 11424 lines...]
BUILD FAILED
/home/jenkins/workspace/Lucene-Solr-8.x-Linux/build.xml:634: The following error occurred while executing this line:
/home/jenkins/workspace/Lucene-Solr-8.x-Linux/build.xml:128: Found 1 violations in source files (File uses Mockito but has no assumeWorkingMockito() call).

Total time: 76 minutes 38 seconds
Build step 'Invoke Ant' marked build as failure
Archiving artifacts
Setting ANT_1_8_2_HOME=/home/jenkins/tools/hudson.tasks.Ant_AntInstallation/ANT_1.8.2
[WARNINGS] Skipping publisher since build result is FAILURE
Recording test results
Setting ANT_1_8_2_HOME=/home/jenkins/tools/hudson.tasks.Ant_AntInstallation/ANT_1.8.2
Email was triggered for: Failure - Any
Sending email for trigger: Failure - Any
Setting ANT_1_8_2_HOME=/home/jenkins/tools/hudson.tasks.Ant_AntInstallation/ANT_1.8.2
Setting ANT_1_8_2_HOME=/home/jenkins/tools/hudson.tasks.Ant_AntInstallation/ANT_1.8.2
Setting ANT_1_8_2_HOME=/home/jenkins/tools/hudson.tasks.Ant_AntInstallation/ANT_1.8.2
Setting ANT_1_8_2_HOME=/home/jenkins/tools/hudson.tasks.Ant_AntInstallation/ANT_1.8.2
Setting ANT_1_8_2_HOME=/home/jenkins/tools/hudson.tasks.Ant_AntInstallation/ANT_1.8.2
Setting ANT_1_8_2_HOME=/home/jenkins/tools/hudson.tasks.Ant_AntInstallation/ANT_1.8.2

Mime
View raw message