lucene-dev mailing list archives

Site index · List index
Message view « Date » · « Thread »
Top « Date » · « Thread »
From Policeman Jenkins Server <jenk...@thetaphi.de>
Subject [JENKINS] Lucene-Solr-master-Linux (64bit/jdk-12) - Build # 24049 - Still Unstable!
Date Tue, 07 May 2019 20:56:12 GMT
Build: https://jenkins.thetaphi.de/job/Lucene-Solr-master-Linux/24049/
Java: 64bit/jdk-12 -XX:-UseCompressedOops -XX:+UseG1GC

10 tests failed.
FAILED:  org.apache.solr.security.JWTAuthPluginIntegrationTest.createCollectionUpdateAndQueryDistributed

Error Message:
Expected metric minimums for prefix SECURITY./authentication/pki.: {failMissingCredentials=0, authenticated=12, passThrough=0, failWrongCredentials=0, requests=12, errors=0}, but got: {failMissingCredentials=0, authenticated=4, passThrough=0, totalTime=9042480, failWrongCredentials=0, requestTimes=384, requests=4, errors=0}

Stack Trace:
java.lang.AssertionError: Expected metric minimums for prefix SECURITY./authentication/pki.: {failMissingCredentials=0, authenticated=12, passThrough=0, failWrongCredentials=0, requests=12, errors=0}, but got: {failMissingCredentials=0, authenticated=4, passThrough=0, totalTime=9042480, failWrongCredentials=0, requestTimes=384, requests=4, errors=0}
	at __randomizedtesting.SeedInfo.seed([2DB4A588D46E332D:2B9CA7E6B6D9A59E]:0)
	at org.junit.Assert.fail(Assert.java:88)
	at org.junit.Assert.assertTrue(Assert.java:41)
	at org.apache.solr.cloud.SolrCloudAuthTestCase.assertAuthMetricsMinimums(SolrCloudAuthTestCase.java:129)
	at org.apache.solr.cloud.SolrCloudAuthTestCase.assertPkiAuthMetricsMinimums(SolrCloudAuthTestCase.java:74)
	at org.apache.solr.security.JWTAuthPluginIntegrationTest.createCollectionUpdateAndQueryDistributed(JWTAuthPluginIntegrationTest.java:173)
	at java.base/jdk.internal.reflect.NativeMethodAccessorImpl.invoke0(Native Method)
	at java.base/jdk.internal.reflect.NativeMethodAccessorImpl.invoke(NativeMethodAccessorImpl.java:62)
	at java.base/jdk.internal.reflect.DelegatingMethodAccessorImpl.invoke(DelegatingMethodAccessorImpl.java:43)
	at java.base/java.lang.reflect.Method.invoke(Method.java:567)
	at com.carrotsearch.randomizedtesting.RandomizedRunner.invoke(RandomizedRunner.java:1750)
	at com.carrotsearch.randomizedtesting.RandomizedRunner$8.evaluate(RandomizedRunner.java:938)
	at com.carrotsearch.randomizedtesting.RandomizedRunner$9.evaluate(RandomizedRunner.java:974)
	at com.carrotsearch.randomizedtesting.RandomizedRunner$10.evaluate(RandomizedRunner.java:988)
	at com.carrotsearch.randomizedtesting.rules.SystemPropertiesRestoreRule$1.evaluate(SystemPropertiesRestoreRule.java:57)
	at org.apache.lucene.util.TestRuleSetupTeardownChained$1.evaluate(TestRuleSetupTeardownChained.java:49)
	at org.apache.lucene.util.AbstractBeforeAfterRule$1.evaluate(AbstractBeforeAfterRule.java:45)
	at org.apache.lucene.util.TestRuleThreadAndTestName$1.evaluate(TestRuleThreadAndTestName.java:48)
	at org.apache.lucene.util.TestRuleIgnoreAfterMaxFailures$1.evaluate(TestRuleIgnoreAfterMaxFailures.java:64)
	at org.apache.lucene.util.TestRuleMarkFailure$1.evaluate(TestRuleMarkFailure.java:47)
	at com.carrotsearch.randomizedtesting.rules.StatementAdapter.evaluate(StatementAdapter.java:36)
	at com.carrotsearch.randomizedtesting.ThreadLeakControl$StatementRunner.run(ThreadLeakControl.java:368)
	at com.carrotsearch.randomizedtesting.ThreadLeakControl.forkTimeoutingTask(ThreadLeakControl.java:817)
	at com.carrotsearch.randomizedtesting.ThreadLeakControl$3.evaluate(ThreadLeakControl.java:468)
	at com.carrotsearch.randomizedtesting.RandomizedRunner.runSingleTest(RandomizedRunner.java:947)
	at com.carrotsearch.randomizedtesting.RandomizedRunner$5.evaluate(RandomizedRunner.java:832)
	at com.carrotsearch.randomizedtesting.RandomizedRunner$6.evaluate(RandomizedRunner.java:883)
	at com.carrotsearch.randomizedtesting.RandomizedRunner$7.evaluate(RandomizedRunner.java:894)
	at com.carrotsearch.randomizedtesting.rules.StatementAdapter.evaluate(StatementAdapter.java:36)
	at com.carrotsearch.randomizedtesting.rules.SystemPropertiesRestoreRule$1.evaluate(SystemPropertiesRestoreRule.java:57)
	at org.apache.lucene.util.AbstractBeforeAfterRule$1.evaluate(AbstractBeforeAfterRule.java:45)
	at com.carrotsearch.randomizedtesting.rules.StatementAdapter.evaluate(StatementAdapter.java:36)
	at org.apache.lucene.util.TestRuleStoreClassName$1.evaluate(TestRuleStoreClassName.java:41)
	at com.carrotsearch.randomizedtesting.rules.NoShadowingOrOverridesOnMethodsRule$1.evaluate(NoShadowingOrOverridesOnMethodsRule.java:40)
	at com.carrotsearch.randomizedtesting.rules.NoShadowingOrOverridesOnMethodsRule$1.evaluate(NoShadowingOrOverridesOnMethodsRule.java:40)
	at com.carrotsearch.randomizedtesting.rules.StatementAdapter.evaluate(StatementAdapter.java:36)
	at com.carrotsearch.randomizedtesting.rules.StatementAdapter.evaluate(StatementAdapter.java:36)
	at org.apache.lucene.util.TestRuleAssertionsRequired$1.evaluate(TestRuleAssertionsRequired.java:53)
	at org.apache.lucene.util.TestRuleMarkFailure$1.evaluate(TestRuleMarkFailure.java:47)
	at org.apache.lucene.util.TestRuleIgnoreAfterMaxFailures$1.evaluate(TestRuleIgnoreAfterMaxFailures.java:64)
	at org.apache.lucene.util.TestRuleIgnoreTestSuites$1.evaluate(TestRuleIgnoreTestSuites.java:54)
	at com.carrotsearch.randomizedtesting.rules.StatementAdapter.evaluate(StatementAdapter.java:36)
	at com.carrotsearch.randomizedtesting.ThreadLeakControl$StatementRunner.run(ThreadLeakControl.java:368)
	at java.base/java.lang.Thread.run(Thread.java:835)


FAILED:  org.apache.solr.security.JWTAuthPluginIntegrationTest.createCollectionUpdateAndQueryDistributed

Error Message:
Expected metric minimums for prefix SECURITY./authentication/pki.: {failMissingCredentials=0, authenticated=12, passThrough=0, failWrongCredentials=0, requests=12, errors=0}, but got: {failMissingCredentials=0, authenticated=4, passThrough=0, totalTime=5814652, failWrongCredentials=0, requestTimes=452, requests=4, errors=0}

Stack Trace:
java.lang.AssertionError: Expected metric minimums for prefix SECURITY./authentication/pki.: {failMissingCredentials=0, authenticated=12, passThrough=0, failWrongCredentials=0, requests=12, errors=0}, but got: {failMissingCredentials=0, authenticated=4, passThrough=0, totalTime=5814652, failWrongCredentials=0, requestTimes=452, requests=4, errors=0}
	at __randomizedtesting.SeedInfo.seed([2DB4A588D46E332D:2B9CA7E6B6D9A59E]:0)
	at org.junit.Assert.fail(Assert.java:88)
	at org.junit.Assert.assertTrue(Assert.java:41)
	at org.apache.solr.cloud.SolrCloudAuthTestCase.assertAuthMetricsMinimums(SolrCloudAuthTestCase.java:129)
	at org.apache.solr.cloud.SolrCloudAuthTestCase.assertPkiAuthMetricsMinimums(SolrCloudAuthTestCase.java:74)
	at org.apache.solr.security.JWTAuthPluginIntegrationTest.createCollectionUpdateAndQueryDistributed(JWTAuthPluginIntegrationTest.java:173)
	at java.base/jdk.internal.reflect.NativeMethodAccessorImpl.invoke0(Native Method)
	at java.base/jdk.internal.reflect.NativeMethodAccessorImpl.invoke(NativeMethodAccessorImpl.java:62)
	at java.base/jdk.internal.reflect.DelegatingMethodAccessorImpl.invoke(DelegatingMethodAccessorImpl.java:43)
	at java.base/java.lang.reflect.Method.invoke(Method.java:567)
	at com.carrotsearch.randomizedtesting.RandomizedRunner.invoke(RandomizedRunner.java:1750)
	at com.carrotsearch.randomizedtesting.RandomizedRunner$8.evaluate(RandomizedRunner.java:938)
	at com.carrotsearch.randomizedtesting.RandomizedRunner$9.evaluate(RandomizedRunner.java:974)
	at com.carrotsearch.randomizedtesting.RandomizedRunner$10.evaluate(RandomizedRunner.java:988)
	at com.carrotsearch.randomizedtesting.rules.SystemPropertiesRestoreRule$1.evaluate(SystemPropertiesRestoreRule.java:57)
	at org.apache.lucene.util.TestRuleSetupTeardownChained$1.evaluate(TestRuleSetupTeardownChained.java:49)
	at org.apache.lucene.util.AbstractBeforeAfterRule$1.evaluate(AbstractBeforeAfterRule.java:45)
	at org.apache.lucene.util.TestRuleThreadAndTestName$1.evaluate(TestRuleThreadAndTestName.java:48)
	at org.apache.lucene.util.TestRuleIgnoreAfterMaxFailures$1.evaluate(TestRuleIgnoreAfterMaxFailures.java:64)
	at org.apache.lucene.util.TestRuleMarkFailure$1.evaluate(TestRuleMarkFailure.java:47)
	at com.carrotsearch.randomizedtesting.rules.StatementAdapter.evaluate(StatementAdapter.java:36)
	at com.carrotsearch.randomizedtesting.ThreadLeakControl$StatementRunner.run(ThreadLeakControl.java:368)
	at com.carrotsearch.randomizedtesting.ThreadLeakControl.forkTimeoutingTask(ThreadLeakControl.java:817)
	at com.carrotsearch.randomizedtesting.ThreadLeakControl$3.evaluate(ThreadLeakControl.java:468)
	at com.carrotsearch.randomizedtesting.RandomizedRunner.runSingleTest(RandomizedRunner.java:947)
	at com.carrotsearch.randomizedtesting.RandomizedRunner$5.evaluate(RandomizedRunner.java:832)
	at com.carrotsearch.randomizedtesting.RandomizedRunner$6.evaluate(RandomizedRunner.java:883)
	at com.carrotsearch.randomizedtesting.RandomizedRunner$7.evaluate(RandomizedRunner.java:894)
	at com.carrotsearch.randomizedtesting.rules.StatementAdapter.evaluate(StatementAdapter.java:36)
	at com.carrotsearch.randomizedtesting.rules.SystemPropertiesRestoreRule$1.evaluate(SystemPropertiesRestoreRule.java:57)
	at org.apache.lucene.util.AbstractBeforeAfterRule$1.evaluate(AbstractBeforeAfterRule.java:45)
	at com.carrotsearch.randomizedtesting.rules.StatementAdapter.evaluate(StatementAdapter.java:36)
	at org.apache.lucene.util.TestRuleStoreClassName$1.evaluate(TestRuleStoreClassName.java:41)
	at com.carrotsearch.randomizedtesting.rules.NoShadowingOrOverridesOnMethodsRule$1.evaluate(NoShadowingOrOverridesOnMethodsRule.java:40)
	at com.carrotsearch.randomizedtesting.rules.NoShadowingOrOverridesOnMethodsRule$1.evaluate(NoShadowingOrOverridesOnMethodsRule.java:40)
	at com.carrotsearch.randomizedtesting.rules.StatementAdapter.evaluate(StatementAdapter.java:36)
	at com.carrotsearch.randomizedtesting.rules.StatementAdapter.evaluate(StatementAdapter.java:36)
	at org.apache.lucene.util.TestRuleAssertionsRequired$1.evaluate(TestRuleAssertionsRequired.java:53)
	at org.apache.lucene.util.TestRuleMarkFailure$1.evaluate(TestRuleMarkFailure.java:47)
	at org.apache.lucene.util.TestRuleIgnoreAfterMaxFailures$1.evaluate(TestRuleIgnoreAfterMaxFailures.java:64)
	at org.apache.lucene.util.TestRuleIgnoreTestSuites$1.evaluate(TestRuleIgnoreTestSuites.java:54)
	at com.carrotsearch.randomizedtesting.rules.StatementAdapter.evaluate(StatementAdapter.java:36)
	at com.carrotsearch.randomizedtesting.ThreadLeakControl$StatementRunner.run(ThreadLeakControl.java:368)
	at java.base/java.lang.Thread.run(Thread.java:835)


FAILED:  org.apache.solr.security.JWTAuthPluginIntegrationTest.createCollectionUpdateAndQueryDistributed

Error Message:
Expected metric minimums for prefix SECURITY./authentication/pki.: {failMissingCredentials=0, authenticated=12, passThrough=0, failWrongCredentials=0, requests=12, errors=0}, but got: {failMissingCredentials=0, authenticated=4, passThrough=0, totalTime=8257380, failWrongCredentials=0, requestTimes=450, requests=4, errors=0}

Stack Trace:
java.lang.AssertionError: Expected metric minimums for prefix SECURITY./authentication/pki.: {failMissingCredentials=0, authenticated=12, passThrough=0, failWrongCredentials=0, requests=12, errors=0}, but got: {failMissingCredentials=0, authenticated=4, passThrough=0, totalTime=8257380, failWrongCredentials=0, requestTimes=450, requests=4, errors=0}
	at __randomizedtesting.SeedInfo.seed([2DB4A588D46E332D:2B9CA7E6B6D9A59E]:0)
	at org.junit.Assert.fail(Assert.java:88)
	at org.junit.Assert.assertTrue(Assert.java:41)
	at org.apache.solr.cloud.SolrCloudAuthTestCase.assertAuthMetricsMinimums(SolrCloudAuthTestCase.java:129)
	at org.apache.solr.cloud.SolrCloudAuthTestCase.assertPkiAuthMetricsMinimums(SolrCloudAuthTestCase.java:74)
	at org.apache.solr.security.JWTAuthPluginIntegrationTest.createCollectionUpdateAndQueryDistributed(JWTAuthPluginIntegrationTest.java:173)
	at java.base/jdk.internal.reflect.NativeMethodAccessorImpl.invoke0(Native Method)
	at java.base/jdk.internal.reflect.NativeMethodAccessorImpl.invoke(NativeMethodAccessorImpl.java:62)
	at java.base/jdk.internal.reflect.DelegatingMethodAccessorImpl.invoke(DelegatingMethodAccessorImpl.java:43)
	at java.base/java.lang.reflect.Method.invoke(Method.java:567)
	at com.carrotsearch.randomizedtesting.RandomizedRunner.invoke(RandomizedRunner.java:1750)
	at com.carrotsearch.randomizedtesting.RandomizedRunner$8.evaluate(RandomizedRunner.java:938)
	at com.carrotsearch.randomizedtesting.RandomizedRunner$9.evaluate(RandomizedRunner.java:974)
	at com.carrotsearch.randomizedtesting.RandomizedRunner$10.evaluate(RandomizedRunner.java:988)
	at com.carrotsearch.randomizedtesting.rules.SystemPropertiesRestoreRule$1.evaluate(SystemPropertiesRestoreRule.java:57)
	at org.apache.lucene.util.TestRuleSetupTeardownChained$1.evaluate(TestRuleSetupTeardownChained.java:49)
	at org.apache.lucene.util.AbstractBeforeAfterRule$1.evaluate(AbstractBeforeAfterRule.java:45)
	at org.apache.lucene.util.TestRuleThreadAndTestName$1.evaluate(TestRuleThreadAndTestName.java:48)
	at org.apache.lucene.util.TestRuleIgnoreAfterMaxFailures$1.evaluate(TestRuleIgnoreAfterMaxFailures.java:64)
	at org.apache.lucene.util.TestRuleMarkFailure$1.evaluate(TestRuleMarkFailure.java:47)
	at com.carrotsearch.randomizedtesting.rules.StatementAdapter.evaluate(StatementAdapter.java:36)
	at com.carrotsearch.randomizedtesting.ThreadLeakControl$StatementRunner.run(ThreadLeakControl.java:368)
	at com.carrotsearch.randomizedtesting.ThreadLeakControl.forkTimeoutingTask(ThreadLeakControl.java:817)
	at com.carrotsearch.randomizedtesting.ThreadLeakControl$3.evaluate(ThreadLeakControl.java:468)
	at com.carrotsearch.randomizedtesting.RandomizedRunner.runSingleTest(RandomizedRunner.java:947)
	at com.carrotsearch.randomizedtesting.RandomizedRunner$5.evaluate(RandomizedRunner.java:832)
	at com.carrotsearch.randomizedtesting.RandomizedRunner$6.evaluate(RandomizedRunner.java:883)
	at com.carrotsearch.randomizedtesting.RandomizedRunner$7.evaluate(RandomizedRunner.java:894)
	at com.carrotsearch.randomizedtesting.rules.StatementAdapter.evaluate(StatementAdapter.java:36)
	at com.carrotsearch.randomizedtesting.rules.SystemPropertiesRestoreRule$1.evaluate(SystemPropertiesRestoreRule.java:57)
	at org.apache.lucene.util.AbstractBeforeAfterRule$1.evaluate(AbstractBeforeAfterRule.java:45)
	at com.carrotsearch.randomizedtesting.rules.StatementAdapter.evaluate(StatementAdapter.java:36)
	at org.apache.lucene.util.TestRuleStoreClassName$1.evaluate(TestRuleStoreClassName.java:41)
	at com.carrotsearch.randomizedtesting.rules.NoShadowingOrOverridesOnMethodsRule$1.evaluate(NoShadowingOrOverridesOnMethodsRule.java:40)
	at com.carrotsearch.randomizedtesting.rules.NoShadowingOrOverridesOnMethodsRule$1.evaluate(NoShadowingOrOverridesOnMethodsRule.java:40)
	at com.carrotsearch.randomizedtesting.rules.StatementAdapter.evaluate(StatementAdapter.java:36)
	at com.carrotsearch.randomizedtesting.rules.StatementAdapter.evaluate(StatementAdapter.java:36)
	at org.apache.lucene.util.TestRuleAssertionsRequired$1.evaluate(TestRuleAssertionsRequired.java:53)
	at org.apache.lucene.util.TestRuleMarkFailure$1.evaluate(TestRuleMarkFailure.java:47)
	at org.apache.lucene.util.TestRuleIgnoreAfterMaxFailures$1.evaluate(TestRuleIgnoreAfterMaxFailures.java:64)
	at org.apache.lucene.util.TestRuleIgnoreTestSuites$1.evaluate(TestRuleIgnoreTestSuites.java:54)
	at com.carrotsearch.randomizedtesting.rules.StatementAdapter.evaluate(StatementAdapter.java:36)
	at com.carrotsearch.randomizedtesting.ThreadLeakControl$StatementRunner.run(ThreadLeakControl.java:368)
	at java.base/java.lang.Thread.run(Thread.java:835)


FAILED:  org.apache.solr.security.JWTAuthPluginIntegrationTest.createCollectionUpdateAndQueryDistributed

Error Message:
Expected metric minimums for prefix SECURITY./authentication/pki.: {failMissingCredentials=0, authenticated=12, passThrough=0, failWrongCredentials=0, requests=12, errors=0}, but got: {failMissingCredentials=0, authenticated=4, passThrough=0, totalTime=17032671, failWrongCredentials=0, requestTimes=362, requests=4, errors=0}

Stack Trace:
java.lang.AssertionError: Expected metric minimums for prefix SECURITY./authentication/pki.: {failMissingCredentials=0, authenticated=12, passThrough=0, failWrongCredentials=0, requests=12, errors=0}, but got: {failMissingCredentials=0, authenticated=4, passThrough=0, totalTime=17032671, failWrongCredentials=0, requestTimes=362, requests=4, errors=0}
	at __randomizedtesting.SeedInfo.seed([2DB4A588D46E332D:2B9CA7E6B6D9A59E]:0)
	at org.junit.Assert.fail(Assert.java:88)
	at org.junit.Assert.assertTrue(Assert.java:41)
	at org.apache.solr.cloud.SolrCloudAuthTestCase.assertAuthMetricsMinimums(SolrCloudAuthTestCase.java:129)
	at org.apache.solr.cloud.SolrCloudAuthTestCase.assertPkiAuthMetricsMinimums(SolrCloudAuthTestCase.java:74)
	at org.apache.solr.security.JWTAuthPluginIntegrationTest.createCollectionUpdateAndQueryDistributed(JWTAuthPluginIntegrationTest.java:173)
	at java.base/jdk.internal.reflect.NativeMethodAccessorImpl.invoke0(Native Method)
	at java.base/jdk.internal.reflect.NativeMethodAccessorImpl.invoke(NativeMethodAccessorImpl.java:62)
	at java.base/jdk.internal.reflect.DelegatingMethodAccessorImpl.invoke(DelegatingMethodAccessorImpl.java:43)
	at java.base/java.lang.reflect.Method.invoke(Method.java:567)
	at com.carrotsearch.randomizedtesting.RandomizedRunner.invoke(RandomizedRunner.java:1750)
	at com.carrotsearch.randomizedtesting.RandomizedRunner$8.evaluate(RandomizedRunner.java:938)
	at com.carrotsearch.randomizedtesting.RandomizedRunner$9.evaluate(RandomizedRunner.java:974)
	at com.carrotsearch.randomizedtesting.RandomizedRunner$10.evaluate(RandomizedRunner.java:988)
	at com.carrotsearch.randomizedtesting.rules.SystemPropertiesRestoreRule$1.evaluate(SystemPropertiesRestoreRule.java:57)
	at org.apache.lucene.util.TestRuleSetupTeardownChained$1.evaluate(TestRuleSetupTeardownChained.java:49)
	at org.apache.lucene.util.AbstractBeforeAfterRule$1.evaluate(AbstractBeforeAfterRule.java:45)
	at org.apache.lucene.util.TestRuleThreadAndTestName$1.evaluate(TestRuleThreadAndTestName.java:48)
	at org.apache.lucene.util.TestRuleIgnoreAfterMaxFailures$1.evaluate(TestRuleIgnoreAfterMaxFailures.java:64)
	at org.apache.lucene.util.TestRuleMarkFailure$1.evaluate(TestRuleMarkFailure.java:47)
	at com.carrotsearch.randomizedtesting.rules.StatementAdapter.evaluate(StatementAdapter.java:36)
	at com.carrotsearch.randomizedtesting.ThreadLeakControl$StatementRunner.run(ThreadLeakControl.java:368)
	at com.carrotsearch.randomizedtesting.ThreadLeakControl.forkTimeoutingTask(ThreadLeakControl.java:817)
	at com.carrotsearch.randomizedtesting.ThreadLeakControl$3.evaluate(ThreadLeakControl.java:468)
	at com.carrotsearch.randomizedtesting.RandomizedRunner.runSingleTest(RandomizedRunner.java:947)
	at com.carrotsearch.randomizedtesting.RandomizedRunner$5.evaluate(RandomizedRunner.java:832)
	at com.carrotsearch.randomizedtesting.RandomizedRunner$6.evaluate(RandomizedRunner.java:883)
	at com.carrotsearch.randomizedtesting.RandomizedRunner$7.evaluate(RandomizedRunner.java:894)
	at com.carrotsearch.randomizedtesting.rules.StatementAdapter.evaluate(StatementAdapter.java:36)
	at com.carrotsearch.randomizedtesting.rules.SystemPropertiesRestoreRule$1.evaluate(SystemPropertiesRestoreRule.java:57)
	at org.apache.lucene.util.AbstractBeforeAfterRule$1.evaluate(AbstractBeforeAfterRule.java:45)
	at com.carrotsearch.randomizedtesting.rules.StatementAdapter.evaluate(StatementAdapter.java:36)
	at org.apache.lucene.util.TestRuleStoreClassName$1.evaluate(TestRuleStoreClassName.java:41)
	at com.carrotsearch.randomizedtesting.rules.NoShadowingOrOverridesOnMethodsRule$1.evaluate(NoShadowingOrOverridesOnMethodsRule.java:40)
	at com.carrotsearch.randomizedtesting.rules.NoShadowingOrOverridesOnMethodsRule$1.evaluate(NoShadowingOrOverridesOnMethodsRule.java:40)
	at com.carrotsearch.randomizedtesting.rules.StatementAdapter.evaluate(StatementAdapter.java:36)
	at com.carrotsearch.randomizedtesting.rules.StatementAdapter.evaluate(StatementAdapter.java:36)
	at org.apache.lucene.util.TestRuleAssertionsRequired$1.evaluate(TestRuleAssertionsRequired.java:53)
	at org.apache.lucene.util.TestRuleMarkFailure$1.evaluate(TestRuleMarkFailure.java:47)
	at org.apache.lucene.util.TestRuleIgnoreAfterMaxFailures$1.evaluate(TestRuleIgnoreAfterMaxFailures.java:64)
	at org.apache.lucene.util.TestRuleIgnoreTestSuites$1.evaluate(TestRuleIgnoreTestSuites.java:54)
	at com.carrotsearch.randomizedtesting.rules.StatementAdapter.evaluate(StatementAdapter.java:36)
	at com.carrotsearch.randomizedtesting.ThreadLeakControl$StatementRunner.run(ThreadLeakControl.java:368)
	at java.base/java.lang.Thread.run(Thread.java:835)


FAILED:  org.apache.solr.security.JWTAuthPluginIntegrationTest.createCollectionUpdateAndQueryDistributed

Error Message:
Expected metric minimums for prefix SECURITY./authentication/pki.: {failMissingCredentials=0, authenticated=12, passThrough=0, failWrongCredentials=0, requests=12, errors=0}, but got: {failMissingCredentials=0, authenticated=4, passThrough=0, totalTime=2802104, failWrongCredentials=0, requestTimes=444, requests=4, errors=0}

Stack Trace:
java.lang.AssertionError: Expected metric minimums for prefix SECURITY./authentication/pki.: {failMissingCredentials=0, authenticated=12, passThrough=0, failWrongCredentials=0, requests=12, errors=0}, but got: {failMissingCredentials=0, authenticated=4, passThrough=0, totalTime=2802104, failWrongCredentials=0, requestTimes=444, requests=4, errors=0}
	at __randomizedtesting.SeedInfo.seed([2DB4A588D46E332D:2B9CA7E6B6D9A59E]:0)
	at org.junit.Assert.fail(Assert.java:88)
	at org.junit.Assert.assertTrue(Assert.java:41)
	at org.apache.solr.cloud.SolrCloudAuthTestCase.assertAuthMetricsMinimums(SolrCloudAuthTestCase.java:129)
	at org.apache.solr.cloud.SolrCloudAuthTestCase.assertPkiAuthMetricsMinimums(SolrCloudAuthTestCase.java:74)
	at org.apache.solr.security.JWTAuthPluginIntegrationTest.createCollectionUpdateAndQueryDistributed(JWTAuthPluginIntegrationTest.java:173)
	at java.base/jdk.internal.reflect.NativeMethodAccessorImpl.invoke0(Native Method)
	at java.base/jdk.internal.reflect.NativeMethodAccessorImpl.invoke(NativeMethodAccessorImpl.java:62)
	at java.base/jdk.internal.reflect.DelegatingMethodAccessorImpl.invoke(DelegatingMethodAccessorImpl.java:43)
	at java.base/java.lang.reflect.Method.invoke(Method.java:567)
	at com.carrotsearch.randomizedtesting.RandomizedRunner.invoke(RandomizedRunner.java:1750)
	at com.carrotsearch.randomizedtesting.RandomizedRunner$8.evaluate(RandomizedRunner.java:938)
	at com.carrotsearch.randomizedtesting.RandomizedRunner$9.evaluate(RandomizedRunner.java:974)
	at com.carrotsearch.randomizedtesting.RandomizedRunner$10.evaluate(RandomizedRunner.java:988)
	at com.carrotsearch.randomizedtesting.rules.SystemPropertiesRestoreRule$1.evaluate(SystemPropertiesRestoreRule.java:57)
	at org.apache.lucene.util.TestRuleSetupTeardownChained$1.evaluate(TestRuleSetupTeardownChained.java:49)
	at org.apache.lucene.util.AbstractBeforeAfterRule$1.evaluate(AbstractBeforeAfterRule.java:45)
	at org.apache.lucene.util.TestRuleThreadAndTestName$1.evaluate(TestRuleThreadAndTestName.java:48)
	at org.apache.lucene.util.TestRuleIgnoreAfterMaxFailures$1.evaluate(TestRuleIgnoreAfterMaxFailures.java:64)
	at org.apache.lucene.util.TestRuleMarkFailure$1.evaluate(TestRuleMarkFailure.java:47)
	at com.carrotsearch.randomizedtesting.rules.StatementAdapter.evaluate(StatementAdapter.java:36)
	at com.carrotsearch.randomizedtesting.ThreadLeakControl$StatementRunner.run(ThreadLeakControl.java:368)
	at com.carrotsearch.randomizedtesting.ThreadLeakControl.forkTimeoutingTask(ThreadLeakControl.java:817)
	at com.carrotsearch.randomizedtesting.ThreadLeakControl$3.evaluate(ThreadLeakControl.java:468)
	at com.carrotsearch.randomizedtesting.RandomizedRunner.runSingleTest(RandomizedRunner.java:947)
	at com.carrotsearch.randomizedtesting.RandomizedRunner$5.evaluate(RandomizedRunner.java:832)
	at com.carrotsearch.randomizedtesting.RandomizedRunner$6.evaluate(RandomizedRunner.java:883)
	at com.carrotsearch.randomizedtesting.RandomizedRunner$7.evaluate(RandomizedRunner.java:894)
	at com.carrotsearch.randomizedtesting.rules.StatementAdapter.evaluate(StatementAdapter.java:36)
	at com.carrotsearch.randomizedtesting.rules.SystemPropertiesRestoreRule$1.evaluate(SystemPropertiesRestoreRule.java:57)
	at org.apache.lucene.util.AbstractBeforeAfterRule$1.evaluate(AbstractBeforeAfterRule.java:45)
	at com.carrotsearch.randomizedtesting.rules.StatementAdapter.evaluate(StatementAdapter.java:36)
	at org.apache.lucene.util.TestRuleStoreClassName$1.evaluate(TestRuleStoreClassName.java:41)
	at com.carrotsearch.randomizedtesting.rules.NoShadowingOrOverridesOnMethodsRule$1.evaluate(NoShadowingOrOverridesOnMethodsRule.java:40)
	at com.carrotsearch.randomizedtesting.rules.NoShadowingOrOverridesOnMethodsRule$1.evaluate(NoShadowingOrOverridesOnMethodsRule.java:40)
	at com.carrotsearch.randomizedtesting.rules.StatementAdapter.evaluate(StatementAdapter.java:36)
	at com.carrotsearch.randomizedtesting.rules.StatementAdapter.evaluate(StatementAdapter.java:36)
	at org.apache.lucene.util.TestRuleAssertionsRequired$1.evaluate(TestRuleAssertionsRequired.java:53)
	at org.apache.lucene.util.TestRuleMarkFailure$1.evaluate(TestRuleMarkFailure.java:47)
	at org.apache.lucene.util.TestRuleIgnoreAfterMaxFailures$1.evaluate(TestRuleIgnoreAfterMaxFailures.java:64)
	at org.apache.lucene.util.TestRuleIgnoreTestSuites$1.evaluate(TestRuleIgnoreTestSuites.java:54)
	at com.carrotsearch.randomizedtesting.rules.StatementAdapter.evaluate(StatementAdapter.java:36)
	at com.carrotsearch.randomizedtesting.ThreadLeakControl$StatementRunner.run(ThreadLeakControl.java:368)
	at java.base/java.lang.Thread.run(Thread.java:835)


FAILED:  org.apache.solr.security.hadoop.TestSolrCloudWithHadoopAuthPlugin.testBasics

Error Message:
Expected metric minimums for prefix SECURITY./authentication.: {failMissingCredentials=0, authenticated=8, passThrough=0, failWrongCredentials=8, requests=16, errors=0}, but got: {failMissingCredentials=0, authenticated=8, passThrough=0, totalTime=246105980, failWrongCredentials=6, requestTimes=1605, requests=14, errors=0}

Stack Trace:
java.lang.AssertionError: Expected metric minimums for prefix SECURITY./authentication.: {failMissingCredentials=0, authenticated=8, passThrough=0, failWrongCredentials=8, requests=16, errors=0}, but got: {failMissingCredentials=0, authenticated=8, passThrough=0, totalTime=246105980, failWrongCredentials=6, requestTimes=1605, requests=14, errors=0}
	at __randomizedtesting.SeedInfo.seed([2DB4A588D46E332D:106C0BA4EC806D5D]:0)
	at org.junit.Assert.fail(Assert.java:88)
	at org.junit.Assert.assertTrue(Assert.java:41)
	at org.apache.solr.cloud.SolrCloudAuthTestCase.assertAuthMetricsMinimums(SolrCloudAuthTestCase.java:129)
	at org.apache.solr.cloud.SolrCloudAuthTestCase.assertAuthMetricsMinimums(SolrCloudAuthTestCase.java:83)
	at org.apache.solr.security.hadoop.TestSolrCloudWithHadoopAuthPlugin.testCollectionCreateSearchDelete(TestSolrCloudWithHadoopAuthPlugin.java:139)
	at org.apache.solr.security.hadoop.TestSolrCloudWithHadoopAuthPlugin.testBasics(TestSolrCloudWithHadoopAuthPlugin.java:108)
	at java.base/jdk.internal.reflect.NativeMethodAccessorImpl.invoke0(Native Method)
	at java.base/jdk.internal.reflect.NativeMethodAccessorImpl.invoke(NativeMethodAccessorImpl.java:62)
	at java.base/jdk.internal.reflect.DelegatingMethodAccessorImpl.invoke(DelegatingMethodAccessorImpl.java:43)
	at java.base/java.lang.reflect.Method.invoke(Method.java:567)
	at com.carrotsearch.randomizedtesting.RandomizedRunner.invoke(RandomizedRunner.java:1750)
	at com.carrotsearch.randomizedtesting.RandomizedRunner$8.evaluate(RandomizedRunner.java:938)
	at com.carrotsearch.randomizedtesting.RandomizedRunner$9.evaluate(RandomizedRunner.java:974)
	at com.carrotsearch.randomizedtesting.RandomizedRunner$10.evaluate(RandomizedRunner.java:988)
	at com.carrotsearch.randomizedtesting.rules.SystemPropertiesRestoreRule$1.evaluate(SystemPropertiesRestoreRule.java:57)
	at org.apache.lucene.util.TestRuleSetupTeardownChained$1.evaluate(TestRuleSetupTeardownChained.java:49)
	at org.apache.lucene.util.AbstractBeforeAfterRule$1.evaluate(AbstractBeforeAfterRule.java:45)
	at org.apache.lucene.util.TestRuleThreadAndTestName$1.evaluate(TestRuleThreadAndTestName.java:48)
	at org.apache.lucene.util.TestRuleIgnoreAfterMaxFailures$1.evaluate(TestRuleIgnoreAfterMaxFailures.java:64)
	at org.apache.lucene.util.TestRuleMarkFailure$1.evaluate(TestRuleMarkFailure.java:47)
	at com.carrotsearch.randomizedtesting.rules.StatementAdapter.evaluate(StatementAdapter.java:36)
	at com.carrotsearch.randomizedtesting.ThreadLeakControl$StatementRunner.run(ThreadLeakControl.java:368)
	at com.carrotsearch.randomizedtesting.ThreadLeakControl.forkTimeoutingTask(ThreadLeakControl.java:817)
	at com.carrotsearch.randomizedtesting.ThreadLeakControl$3.evaluate(ThreadLeakControl.java:468)
	at com.carrotsearch.randomizedtesting.RandomizedRunner.runSingleTest(RandomizedRunner.java:947)
	at com.carrotsearch.randomizedtesting.RandomizedRunner$5.evaluate(RandomizedRunner.java:832)
	at com.carrotsearch.randomizedtesting.RandomizedRunner$6.evaluate(RandomizedRunner.java:883)
	at com.carrotsearch.randomizedtesting.RandomizedRunner$7.evaluate(RandomizedRunner.java:894)
	at com.carrotsearch.randomizedtesting.rules.StatementAdapter.evaluate(StatementAdapter.java:36)
	at com.carrotsearch.randomizedtesting.rules.SystemPropertiesRestoreRule$1.evaluate(SystemPropertiesRestoreRule.java:57)
	at org.apache.lucene.util.AbstractBeforeAfterRule$1.evaluate(AbstractBeforeAfterRule.java:45)
	at com.carrotsearch.randomizedtesting.rules.StatementAdapter.evaluate(StatementAdapter.java:36)
	at org.apache.lucene.util.TestRuleStoreClassName$1.evaluate(TestRuleStoreClassName.java:41)
	at com.carrotsearch.randomizedtesting.rules.NoShadowingOrOverridesOnMethodsRule$1.evaluate(NoShadowingOrOverridesOnMethodsRule.java:40)
	at com.carrotsearch.randomizedtesting.rules.NoShadowingOrOverridesOnMethodsRule$1.evaluate(NoShadowingOrOverridesOnMethodsRule.java:40)
	at com.carrotsearch.randomizedtesting.rules.StatementAdapter.evaluate(StatementAdapter.java:36)
	at com.carrotsearch.randomizedtesting.rules.StatementAdapter.evaluate(StatementAdapter.java:36)
	at org.apache.lucene.util.TestRuleAssertionsRequired$1.evaluate(TestRuleAssertionsRequired.java:53)
	at org.apache.lucene.util.TestRuleMarkFailure$1.evaluate(TestRuleMarkFailure.java:47)
	at org.apache.lucene.util.TestRuleIgnoreAfterMaxFailures$1.evaluate(TestRuleIgnoreAfterMaxFailures.java:64)
	at org.apache.lucene.util.TestRuleIgnoreTestSuites$1.evaluate(TestRuleIgnoreTestSuites.java:54)
	at com.carrotsearch.randomizedtesting.rules.StatementAdapter.evaluate(StatementAdapter.java:36)
	at com.carrotsearch.randomizedtesting.ThreadLeakControl$StatementRunner.run(ThreadLeakControl.java:368)
	at java.base/java.lang.Thread.run(Thread.java:835)


FAILED:  org.apache.solr.security.hadoop.TestSolrCloudWithHadoopAuthPlugin.testBasics

Error Message:
Expected metric minimums for prefix SECURITY./authentication.: {failMissingCredentials=0, authenticated=8, passThrough=0, failWrongCredentials=8, requests=16, errors=0}, but got: {failMissingCredentials=0, authenticated=8, passThrough=0, totalTime=91796012, failWrongCredentials=6, requestTimes=2614, requests=14, errors=0}

Stack Trace:
java.lang.AssertionError: Expected metric minimums for prefix SECURITY./authentication.: {failMissingCredentials=0, authenticated=8, passThrough=0, failWrongCredentials=8, requests=16, errors=0}, but got: {failMissingCredentials=0, authenticated=8, passThrough=0, totalTime=91796012, failWrongCredentials=6, requestTimes=2614, requests=14, errors=0}
	at __randomizedtesting.SeedInfo.seed([2DB4A588D46E332D:106C0BA4EC806D5D]:0)
	at org.junit.Assert.fail(Assert.java:88)
	at org.junit.Assert.assertTrue(Assert.java:41)
	at org.apache.solr.cloud.SolrCloudAuthTestCase.assertAuthMetricsMinimums(SolrCloudAuthTestCase.java:129)
	at org.apache.solr.cloud.SolrCloudAuthTestCase.assertAuthMetricsMinimums(SolrCloudAuthTestCase.java:83)
	at org.apache.solr.security.hadoop.TestSolrCloudWithHadoopAuthPlugin.testCollectionCreateSearchDelete(TestSolrCloudWithHadoopAuthPlugin.java:139)
	at org.apache.solr.security.hadoop.TestSolrCloudWithHadoopAuthPlugin.testBasics(TestSolrCloudWithHadoopAuthPlugin.java:108)
	at java.base/jdk.internal.reflect.NativeMethodAccessorImpl.invoke0(Native Method)
	at java.base/jdk.internal.reflect.NativeMethodAccessorImpl.invoke(NativeMethodAccessorImpl.java:62)
	at java.base/jdk.internal.reflect.DelegatingMethodAccessorImpl.invoke(DelegatingMethodAccessorImpl.java:43)
	at java.base/java.lang.reflect.Method.invoke(Method.java:567)
	at com.carrotsearch.randomizedtesting.RandomizedRunner.invoke(RandomizedRunner.java:1750)
	at com.carrotsearch.randomizedtesting.RandomizedRunner$8.evaluate(RandomizedRunner.java:938)
	at com.carrotsearch.randomizedtesting.RandomizedRunner$9.evaluate(RandomizedRunner.java:974)
	at com.carrotsearch.randomizedtesting.RandomizedRunner$10.evaluate(RandomizedRunner.java:988)
	at com.carrotsearch.randomizedtesting.rules.SystemPropertiesRestoreRule$1.evaluate(SystemPropertiesRestoreRule.java:57)
	at org.apache.lucene.util.TestRuleSetupTeardownChained$1.evaluate(TestRuleSetupTeardownChained.java:49)
	at org.apache.lucene.util.AbstractBeforeAfterRule$1.evaluate(AbstractBeforeAfterRule.java:45)
	at org.apache.lucene.util.TestRuleThreadAndTestName$1.evaluate(TestRuleThreadAndTestName.java:48)
	at org.apache.lucene.util.TestRuleIgnoreAfterMaxFailures$1.evaluate(TestRuleIgnoreAfterMaxFailures.java:64)
	at org.apache.lucene.util.TestRuleMarkFailure$1.evaluate(TestRuleMarkFailure.java:47)
	at com.carrotsearch.randomizedtesting.rules.StatementAdapter.evaluate(StatementAdapter.java:36)
	at com.carrotsearch.randomizedtesting.ThreadLeakControl$StatementRunner.run(ThreadLeakControl.java:368)
	at com.carrotsearch.randomizedtesting.ThreadLeakControl.forkTimeoutingTask(ThreadLeakControl.java:817)
	at com.carrotsearch.randomizedtesting.ThreadLeakControl$3.evaluate(ThreadLeakControl.java:468)
	at com.carrotsearch.randomizedtesting.RandomizedRunner.runSingleTest(RandomizedRunner.java:947)
	at com.carrotsearch.randomizedtesting.RandomizedRunner$5.evaluate(RandomizedRunner.java:832)
	at com.carrotsearch.randomizedtesting.RandomizedRunner$6.evaluate(RandomizedRunner.java:883)
	at com.carrotsearch.randomizedtesting.RandomizedRunner$7.evaluate(RandomizedRunner.java:894)
	at com.carrotsearch.randomizedtesting.rules.StatementAdapter.evaluate(StatementAdapter.java:36)
	at com.carrotsearch.randomizedtesting.rules.SystemPropertiesRestoreRule$1.evaluate(SystemPropertiesRestoreRule.java:57)
	at org.apache.lucene.util.AbstractBeforeAfterRule$1.evaluate(AbstractBeforeAfterRule.java:45)
	at com.carrotsearch.randomizedtesting.rules.StatementAdapter.evaluate(StatementAdapter.java:36)
	at org.apache.lucene.util.TestRuleStoreClassName$1.evaluate(TestRuleStoreClassName.java:41)
	at com.carrotsearch.randomizedtesting.rules.NoShadowingOrOverridesOnMethodsRule$1.evaluate(NoShadowingOrOverridesOnMethodsRule.java:40)
	at com.carrotsearch.randomizedtesting.rules.NoShadowingOrOverridesOnMethodsRule$1.evaluate(NoShadowingOrOverridesOnMethodsRule.java:40)
	at com.carrotsearch.randomizedtesting.rules.StatementAdapter.evaluate(StatementAdapter.java:36)
	at com.carrotsearch.randomizedtesting.rules.StatementAdapter.evaluate(StatementAdapter.java:36)
	at org.apache.lucene.util.TestRuleAssertionsRequired$1.evaluate(TestRuleAssertionsRequired.java:53)
	at org.apache.lucene.util.TestRuleMarkFailure$1.evaluate(TestRuleMarkFailure.java:47)
	at org.apache.lucene.util.TestRuleIgnoreAfterMaxFailures$1.evaluate(TestRuleIgnoreAfterMaxFailures.java:64)
	at org.apache.lucene.util.TestRuleIgnoreTestSuites$1.evaluate(TestRuleIgnoreTestSuites.java:54)
	at com.carrotsearch.randomizedtesting.rules.StatementAdapter.evaluate(StatementAdapter.java:36)
	at com.carrotsearch.randomizedtesting.ThreadLeakControl$StatementRunner.run(ThreadLeakControl.java:368)
	at java.base/java.lang.Thread.run(Thread.java:835)


FAILED:  org.apache.solr.security.hadoop.TestSolrCloudWithHadoopAuthPlugin.testBasics

Error Message:
Expected metric minimums for prefix SECURITY./authentication.: {failMissingCredentials=0, authenticated=8, passThrough=0, failWrongCredentials=8, requests=16, errors=0}, but got: {failMissingCredentials=0, authenticated=8, passThrough=0, totalTime=51227351, failWrongCredentials=6, requestTimes=3346, requests=14, errors=0}

Stack Trace:
java.lang.AssertionError: Expected metric minimums for prefix SECURITY./authentication.: {failMissingCredentials=0, authenticated=8, passThrough=0, failWrongCredentials=8, requests=16, errors=0}, but got: {failMissingCredentials=0, authenticated=8, passThrough=0, totalTime=51227351, failWrongCredentials=6, requestTimes=3346, requests=14, errors=0}
	at __randomizedtesting.SeedInfo.seed([2DB4A588D46E332D:106C0BA4EC806D5D]:0)
	at org.junit.Assert.fail(Assert.java:88)
	at org.junit.Assert.assertTrue(Assert.java:41)
	at org.apache.solr.cloud.SolrCloudAuthTestCase.assertAuthMetricsMinimums(SolrCloudAuthTestCase.java:129)
	at org.apache.solr.cloud.SolrCloudAuthTestCase.assertAuthMetricsMinimums(SolrCloudAuthTestCase.java:83)
	at org.apache.solr.security.hadoop.TestSolrCloudWithHadoopAuthPlugin.testCollectionCreateSearchDelete(TestSolrCloudWithHadoopAuthPlugin.java:139)
	at org.apache.solr.security.hadoop.TestSolrCloudWithHadoopAuthPlugin.testBasics(TestSolrCloudWithHadoopAuthPlugin.java:108)
	at java.base/jdk.internal.reflect.NativeMethodAccessorImpl.invoke0(Native Method)
	at java.base/jdk.internal.reflect.NativeMethodAccessorImpl.invoke(NativeMethodAccessorImpl.java:62)
	at java.base/jdk.internal.reflect.DelegatingMethodAccessorImpl.invoke(DelegatingMethodAccessorImpl.java:43)
	at java.base/java.lang.reflect.Method.invoke(Method.java:567)
	at com.carrotsearch.randomizedtesting.RandomizedRunner.invoke(RandomizedRunner.java:1750)
	at com.carrotsearch.randomizedtesting.RandomizedRunner$8.evaluate(RandomizedRunner.java:938)
	at com.carrotsearch.randomizedtesting.RandomizedRunner$9.evaluate(RandomizedRunner.java:974)
	at com.carrotsearch.randomizedtesting.RandomizedRunner$10.evaluate(RandomizedRunner.java:988)
	at com.carrotsearch.randomizedtesting.rules.SystemPropertiesRestoreRule$1.evaluate(SystemPropertiesRestoreRule.java:57)
	at org.apache.lucene.util.TestRuleSetupTeardownChained$1.evaluate(TestRuleSetupTeardownChained.java:49)
	at org.apache.lucene.util.AbstractBeforeAfterRule$1.evaluate(AbstractBeforeAfterRule.java:45)
	at org.apache.lucene.util.TestRuleThreadAndTestName$1.evaluate(TestRuleThreadAndTestName.java:48)
	at org.apache.lucene.util.TestRuleIgnoreAfterMaxFailures$1.evaluate(TestRuleIgnoreAfterMaxFailures.java:64)
	at org.apache.lucene.util.TestRuleMarkFailure$1.evaluate(TestRuleMarkFailure.java:47)
	at com.carrotsearch.randomizedtesting.rules.StatementAdapter.evaluate(StatementAdapter.java:36)
	at com.carrotsearch.randomizedtesting.ThreadLeakControl$StatementRunner.run(ThreadLeakControl.java:368)
	at com.carrotsearch.randomizedtesting.ThreadLeakControl.forkTimeoutingTask(ThreadLeakControl.java:817)
	at com.carrotsearch.randomizedtesting.ThreadLeakControl$3.evaluate(ThreadLeakControl.java:468)
	at com.carrotsearch.randomizedtesting.RandomizedRunner.runSingleTest(RandomizedRunner.java:947)
	at com.carrotsearch.randomizedtesting.RandomizedRunner$5.evaluate(RandomizedRunner.java:832)
	at com.carrotsearch.randomizedtesting.RandomizedRunner$6.evaluate(RandomizedRunner.java:883)
	at com.carrotsearch.randomizedtesting.RandomizedRunner$7.evaluate(RandomizedRunner.java:894)
	at com.carrotsearch.randomizedtesting.rules.StatementAdapter.evaluate(StatementAdapter.java:36)
	at com.carrotsearch.randomizedtesting.rules.SystemPropertiesRestoreRule$1.evaluate(SystemPropertiesRestoreRule.java:57)
	at org.apache.lucene.util.AbstractBeforeAfterRule$1.evaluate(AbstractBeforeAfterRule.java:45)
	at com.carrotsearch.randomizedtesting.rules.StatementAdapter.evaluate(StatementAdapter.java:36)
	at org.apache.lucene.util.TestRuleStoreClassName$1.evaluate(TestRuleStoreClassName.java:41)
	at com.carrotsearch.randomizedtesting.rules.NoShadowingOrOverridesOnMethodsRule$1.evaluate(NoShadowingOrOverridesOnMethodsRule.java:40)
	at com.carrotsearch.randomizedtesting.rules.NoShadowingOrOverridesOnMethodsRule$1.evaluate(NoShadowingOrOverridesOnMethodsRule.java:40)
	at com.carrotsearch.randomizedtesting.rules.StatementAdapter.evaluate(StatementAdapter.java:36)
	at com.carrotsearch.randomizedtesting.rules.StatementAdapter.evaluate(StatementAdapter.java:36)
	at org.apache.lucene.util.TestRuleAssertionsRequired$1.evaluate(TestRuleAssertionsRequired.java:53)
	at org.apache.lucene.util.TestRuleMarkFailure$1.evaluate(TestRuleMarkFailure.java:47)
	at org.apache.lucene.util.TestRuleIgnoreAfterMaxFailures$1.evaluate(TestRuleIgnoreAfterMaxFailures.java:64)
	at org.apache.lucene.util.TestRuleIgnoreTestSuites$1.evaluate(TestRuleIgnoreTestSuites.java:54)
	at com.carrotsearch.randomizedtesting.rules.StatementAdapter.evaluate(StatementAdapter.java:36)
	at com.carrotsearch.randomizedtesting.ThreadLeakControl$StatementRunner.run(ThreadLeakControl.java:368)
	at java.base/java.lang.Thread.run(Thread.java:835)


FAILED:  org.apache.solr.security.hadoop.TestSolrCloudWithHadoopAuthPlugin.testBasics

Error Message:
Expected metric minimums for prefix SECURITY./authentication.: {failMissingCredentials=0, authenticated=8, passThrough=0, failWrongCredentials=8, requests=16, errors=0}, but got: {failMissingCredentials=0, authenticated=8, passThrough=0, totalTime=27426511, failWrongCredentials=6, requestTimes=3478, requests=14, errors=0}

Stack Trace:
java.lang.AssertionError: Expected metric minimums for prefix SECURITY./authentication.: {failMissingCredentials=0, authenticated=8, passThrough=0, failWrongCredentials=8, requests=16, errors=0}, but got: {failMissingCredentials=0, authenticated=8, passThrough=0, totalTime=27426511, failWrongCredentials=6, requestTimes=3478, requests=14, errors=0}
	at __randomizedtesting.SeedInfo.seed([2DB4A588D46E332D:106C0BA4EC806D5D]:0)
	at org.junit.Assert.fail(Assert.java:88)
	at org.junit.Assert.assertTrue(Assert.java:41)
	at org.apache.solr.cloud.SolrCloudAuthTestCase.assertAuthMetricsMinimums(SolrCloudAuthTestCase.java:129)
	at org.apache.solr.cloud.SolrCloudAuthTestCase.assertAuthMetricsMinimums(SolrCloudAuthTestCase.java:83)
	at org.apache.solr.security.hadoop.TestSolrCloudWithHadoopAuthPlugin.testCollectionCreateSearchDelete(TestSolrCloudWithHadoopAuthPlugin.java:139)
	at org.apache.solr.security.hadoop.TestSolrCloudWithHadoopAuthPlugin.testBasics(TestSolrCloudWithHadoopAuthPlugin.java:108)
	at java.base/jdk.internal.reflect.NativeMethodAccessorImpl.invoke0(Native Method)
	at java.base/jdk.internal.reflect.NativeMethodAccessorImpl.invoke(NativeMethodAccessorImpl.java:62)
	at java.base/jdk.internal.reflect.DelegatingMethodAccessorImpl.invoke(DelegatingMethodAccessorImpl.java:43)
	at java.base/java.lang.reflect.Method.invoke(Method.java:567)
	at com.carrotsearch.randomizedtesting.RandomizedRunner.invoke(RandomizedRunner.java:1750)
	at com.carrotsearch.randomizedtesting.RandomizedRunner$8.evaluate(RandomizedRunner.java:938)
	at com.carrotsearch.randomizedtesting.RandomizedRunner$9.evaluate(RandomizedRunner.java:974)
	at com.carrotsearch.randomizedtesting.RandomizedRunner$10.evaluate(RandomizedRunner.java:988)
	at com.carrotsearch.randomizedtesting.rules.SystemPropertiesRestoreRule$1.evaluate(SystemPropertiesRestoreRule.java:57)
	at org.apache.lucene.util.TestRuleSetupTeardownChained$1.evaluate(TestRuleSetupTeardownChained.java:49)
	at org.apache.lucene.util.AbstractBeforeAfterRule$1.evaluate(AbstractBeforeAfterRule.java:45)
	at org.apache.lucene.util.TestRuleThreadAndTestName$1.evaluate(TestRuleThreadAndTestName.java:48)
	at org.apache.lucene.util.TestRuleIgnoreAfterMaxFailures$1.evaluate(TestRuleIgnoreAfterMaxFailures.java:64)
	at org.apache.lucene.util.TestRuleMarkFailure$1.evaluate(TestRuleMarkFailure.java:47)
	at com.carrotsearch.randomizedtesting.rules.StatementAdapter.evaluate(StatementAdapter.java:36)
	at com.carrotsearch.randomizedtesting.ThreadLeakControl$StatementRunner.run(ThreadLeakControl.java:368)
	at com.carrotsearch.randomizedtesting.ThreadLeakControl.forkTimeoutingTask(ThreadLeakControl.java:817)
	at com.carrotsearch.randomizedtesting.ThreadLeakControl$3.evaluate(ThreadLeakControl.java:468)
	at com.carrotsearch.randomizedtesting.RandomizedRunner.runSingleTest(RandomizedRunner.java:947)
	at com.carrotsearch.randomizedtesting.RandomizedRunner$5.evaluate(RandomizedRunner.java:832)
	at com.carrotsearch.randomizedtesting.RandomizedRunner$6.evaluate(RandomizedRunner.java:883)
	at com.carrotsearch.randomizedtesting.RandomizedRunner$7.evaluate(RandomizedRunner.java:894)
	at com.carrotsearch.randomizedtesting.rules.StatementAdapter.evaluate(StatementAdapter.java:36)
	at com.carrotsearch.randomizedtesting.rules.SystemPropertiesRestoreRule$1.evaluate(SystemPropertiesRestoreRule.java:57)
	at org.apache.lucene.util.AbstractBeforeAfterRule$1.evaluate(AbstractBeforeAfterRule.java:45)
	at com.carrotsearch.randomizedtesting.rules.StatementAdapter.evaluate(StatementAdapter.java:36)
	at org.apache.lucene.util.TestRuleStoreClassName$1.evaluate(TestRuleStoreClassName.java:41)
	at com.carrotsearch.randomizedtesting.rules.NoShadowingOrOverridesOnMethodsRule$1.evaluate(NoShadowingOrOverridesOnMethodsRule.java:40)
	at com.carrotsearch.randomizedtesting.rules.NoShadowingOrOverridesOnMethodsRule$1.evaluate(NoShadowingOrOverridesOnMethodsRule.java:40)
	at com.carrotsearch.randomizedtesting.rules.StatementAdapter.evaluate(StatementAdapter.java:36)
	at com.carrotsearch.randomizedtesting.rules.StatementAdapter.evaluate(StatementAdapter.java:36)
	at org.apache.lucene.util.TestRuleAssertionsRequired$1.evaluate(TestRuleAssertionsRequired.java:53)
	at org.apache.lucene.util.TestRuleMarkFailure$1.evaluate(TestRuleMarkFailure.java:47)
	at org.apache.lucene.util.TestRuleIgnoreAfterMaxFailures$1.evaluate(TestRuleIgnoreAfterMaxFailures.java:64)
	at org.apache.lucene.util.TestRuleIgnoreTestSuites$1.evaluate(TestRuleIgnoreTestSuites.java:54)
	at com.carrotsearch.randomizedtesting.rules.StatementAdapter.evaluate(StatementAdapter.java:36)
	at com.carrotsearch.randomizedtesting.ThreadLeakControl$StatementRunner.run(ThreadLeakControl.java:368)
	at java.base/java.lang.Thread.run(Thread.java:835)


FAILED:  org.apache.solr.security.hadoop.TestSolrCloudWithHadoopAuthPlugin.testBasics

Error Message:
Expected metric minimums for prefix SECURITY./authentication.: {failMissingCredentials=0, authenticated=8, passThrough=0, failWrongCredentials=8, requests=16, errors=0}, but got: {failMissingCredentials=0, authenticated=8, passThrough=0, totalTime=45650455, failWrongCredentials=6, requestTimes=3340, requests=14, errors=0}

Stack Trace:
java.lang.AssertionError: Expected metric minimums for prefix SECURITY./authentication.: {failMissingCredentials=0, authenticated=8, passThrough=0, failWrongCredentials=8, requests=16, errors=0}, but got: {failMissingCredentials=0, authenticated=8, passThrough=0, totalTime=45650455, failWrongCredentials=6, requestTimes=3340, requests=14, errors=0}
	at __randomizedtesting.SeedInfo.seed([2DB4A588D46E332D:106C0BA4EC806D5D]:0)
	at org.junit.Assert.fail(Assert.java:88)
	at org.junit.Assert.assertTrue(Assert.java:41)
	at org.apache.solr.cloud.SolrCloudAuthTestCase.assertAuthMetricsMinimums(SolrCloudAuthTestCase.java:129)
	at org.apache.solr.cloud.SolrCloudAuthTestCase.assertAuthMetricsMinimums(SolrCloudAuthTestCase.java:83)
	at org.apache.solr.security.hadoop.TestSolrCloudWithHadoopAuthPlugin.testCollectionCreateSearchDelete(TestSolrCloudWithHadoopAuthPlugin.java:139)
	at org.apache.solr.security.hadoop.TestSolrCloudWithHadoopAuthPlugin.testBasics(TestSolrCloudWithHadoopAuthPlugin.java:108)
	at java.base/jdk.internal.reflect.NativeMethodAccessorImpl.invoke0(Native Method)
	at java.base/jdk.internal.reflect.NativeMethodAccessorImpl.invoke(NativeMethodAccessorImpl.java:62)
	at java.base/jdk.internal.reflect.DelegatingMethodAccessorImpl.invoke(DelegatingMethodAccessorImpl.java:43)
	at java.base/java.lang.reflect.Method.invoke(Method.java:567)
	at com.carrotsearch.randomizedtesting.RandomizedRunner.invoke(RandomizedRunner.java:1750)
	at com.carrotsearch.randomizedtesting.RandomizedRunner$8.evaluate(RandomizedRunner.java:938)
	at com.carrotsearch.randomizedtesting.RandomizedRunner$9.evaluate(RandomizedRunner.java:974)
	at com.carrotsearch.randomizedtesting.RandomizedRunner$10.evaluate(RandomizedRunner.java:988)
	at com.carrotsearch.randomizedtesting.rules.SystemPropertiesRestoreRule$1.evaluate(SystemPropertiesRestoreRule.java:57)
	at org.apache.lucene.util.TestRuleSetupTeardownChained$1.evaluate(TestRuleSetupTeardownChained.java:49)
	at org.apache.lucene.util.AbstractBeforeAfterRule$1.evaluate(AbstractBeforeAfterRule.java:45)
	at org.apache.lucene.util.TestRuleThreadAndTestName$1.evaluate(TestRuleThreadAndTestName.java:48)
	at org.apache.lucene.util.TestRuleIgnoreAfterMaxFailures$1.evaluate(TestRuleIgnoreAfterMaxFailures.java:64)
	at org.apache.lucene.util.TestRuleMarkFailure$1.evaluate(TestRuleMarkFailure.java:47)
	at com.carrotsearch.randomizedtesting.rules.StatementAdapter.evaluate(StatementAdapter.java:36)
	at com.carrotsearch.randomizedtesting.ThreadLeakControl$StatementRunner.run(ThreadLeakControl.java:368)
	at com.carrotsearch.randomizedtesting.ThreadLeakControl.forkTimeoutingTask(ThreadLeakControl.java:817)
	at com.carrotsearch.randomizedtesting.ThreadLeakControl$3.evaluate(ThreadLeakControl.java:468)
	at com.carrotsearch.randomizedtesting.RandomizedRunner.runSingleTest(RandomizedRunner.java:947)
	at com.carrotsearch.randomizedtesting.RandomizedRunner$5.evaluate(RandomizedRunner.java:832)
	at com.carrotsearch.randomizedtesting.RandomizedRunner$6.evaluate(RandomizedRunner.java:883)
	at com.carrotsearch.randomizedtesting.RandomizedRunner$7.evaluate(RandomizedRunner.java:894)
	at com.carrotsearch.randomizedtesting.rules.StatementAdapter.evaluate(StatementAdapter.java:36)
	at com.carrotsearch.randomizedtesting.rules.SystemPropertiesRestoreRule$1.evaluate(SystemPropertiesRestoreRule.java:57)
	at org.apache.lucene.util.AbstractBeforeAfterRule$1.evaluate(AbstractBeforeAfterRule.java:45)
	at com.carrotsearch.randomizedtesting.rules.StatementAdapter.evaluate(StatementAdapter.java:36)
	at org.apache.lucene.util.TestRuleStoreClassName$1.evaluate(TestRuleStoreClassName.java:41)
	at com.carrotsearch.randomizedtesting.rules.NoShadowingOrOverridesOnMethodsRule$1.evaluate(NoShadowingOrOverridesOnMethodsRule.java:40)
	at com.carrotsearch.randomizedtesting.rules.NoShadowingOrOverridesOnMethodsRule$1.evaluate(NoShadowingOrOverridesOnMethodsRule.java:40)
	at com.carrotsearch.randomizedtesting.rules.StatementAdapter.evaluate(StatementAdapter.java:36)
	at com.carrotsearch.randomizedtesting.rules.StatementAdapter.evaluate(StatementAdapter.java:36)
	at org.apache.lucene.util.TestRuleAssertionsRequired$1.evaluate(TestRuleAssertionsRequired.java:53)
	at org.apache.lucene.util.TestRuleMarkFailure$1.evaluate(TestRuleMarkFailure.java:47)
	at org.apache.lucene.util.TestRuleIgnoreAfterMaxFailures$1.evaluate(TestRuleIgnoreAfterMaxFailures.java:64)
	at org.apache.lucene.util.TestRuleIgnoreTestSuites$1.evaluate(TestRuleIgnoreTestSuites.java:54)
	at com.carrotsearch.randomizedtesting.rules.StatementAdapter.evaluate(StatementAdapter.java:36)
	at com.carrotsearch.randomizedtesting.ThreadLeakControl$StatementRunner.run(ThreadLeakControl.java:368)
	at java.base/java.lang.Thread.run(Thread.java:835)




Build Log:
[...truncated 12941 lines...]
   [junit4] Suite: org.apache.solr.security.JWTAuthPluginIntegrationTest
   [junit4]   2> Creating dataDir: /home/jenkins/workspace/Lucene-Solr-master-Linux/solr/build/solr-core/test/J2/temp/solr.security.JWTAuthPluginIntegrationTest_2DB4A588D46E332D-001/init-core-data-001
   [junit4]   2> 392595 WARN  (SUITE-JWTAuthPluginIntegrationTest-seed#[2DB4A588D46E332D]-worker) [    ] o.a.s.SolrTestCaseJ4 startTrackingSearchers: numOpens=2 numCloses=2
   [junit4]   2> 392595 INFO  (SUITE-JWTAuthPluginIntegrationTest-seed#[2DB4A588D46E332D]-worker) [    ] o.a.s.SolrTestCaseJ4 Using PointFields (NUMERIC_POINTS_SYSPROP=true) w/NUMERIC_DOCVALUES_SYSPROP=true
   [junit4]   2> 392596 INFO  (SUITE-JWTAuthPluginIntegrationTest-seed#[2DB4A588D46E332D]-worker) [    ] o.a.s.SolrTestCaseJ4 Randomized ssl (false) and clientAuth (false) via: @org.apache.solr.SolrTestCaseJ4$SuppressSSL(bugUrl="None")
   [junit4]   2> 392596 INFO  (SUITE-JWTAuthPluginIntegrationTest-seed#[2DB4A588D46E332D]-worker) [    ] o.a.s.SolrTestCaseJ4 SecureRandom sanity checks: test.solr.allowed.securerandom=null & java.security.egd=file:/dev/./urandom
   [junit4]   2> 392598 INFO  (TEST-JWTAuthPluginIntegrationTest.testMetrics-seed#[2DB4A588D46E332D]) [    ] o.a.s.SolrTestCaseJ4 ###Starting testMetrics
   [junit4]   2> 392598 INFO  (TEST-JWTAuthPluginIntegrationTest.testMetrics-seed#[2DB4A588D46E332D]) [    ] o.a.s.c.MiniSolrCloudCluster Starting cluster of 2 servers in /home/jenkins/workspace/Lucene-Solr-master-Linux/solr/build/solr-core/test/J2/temp/solr.security.JWTAuthPluginIntegrationTest_2DB4A588D46E332D-001/tempDir-001
   [junit4]   2> 392598 INFO  (TEST-JWTAuthPluginIntegrationTest.testMetrics-seed#[2DB4A588D46E332D]) [    ] o.a.s.c.ZkTestServer STARTING ZK TEST SERVER
   [junit4]   2> 392599 INFO  (ZkTestServer Run Thread) [    ] o.a.s.c.ZkTestServer client port:0.0.0.0/0.0.0.0:0
   [junit4]   2> 392599 INFO  (ZkTestServer Run Thread) [    ] o.a.s.c.ZkTestServer Starting server
   [junit4]   2> 392699 INFO  (TEST-JWTAuthPluginIntegrationTest.testMetrics-seed#[2DB4A588D46E332D]) [    ] o.a.s.c.ZkTestServer start zk server on port:43259
   [junit4]   2> 392699 INFO  (TEST-JWTAuthPluginIntegrationTest.testMetrics-seed#[2DB4A588D46E332D]) [    ] o.a.s.c.ZkTestServer parse host and port list: 127.0.0.1:43259
   [junit4]   2> 392699 INFO  (TEST-JWTAuthPluginIntegrationTest.testMetrics-seed#[2DB4A588D46E332D]) [    ] o.a.s.c.ZkTestServer connecting to 127.0.0.1 43259
   [junit4]   2> 392701 INFO  (zkConnectionManagerCallback-8677-thread-1) [    ] o.a.s.c.c.ConnectionManager zkClient has connected
   [junit4]   2> 392702 INFO  (zkConnectionManagerCallback-8679-thread-1) [    ] o.a.s.c.c.ConnectionManager zkClient has connected
   [junit4]   2> 392703 INFO  (zkConnectionManagerCallback-8681-thread-1) [    ] o.a.s.c.c.ConnectionManager zkClient has connected
   [junit4]   2> 392704 WARN  (jetty-launcher-8682-thread-2) [    ] o.e.j.s.AbstractConnector Ignoring deprecated socket close linger time
   [junit4]   2> 392704 WARN  (jetty-launcher-8682-thread-1) [    ] o.e.j.s.AbstractConnector Ignoring deprecated socket close linger time
   [junit4]   2> 392704 INFO  (jetty-launcher-8682-thread-2) [    ] o.a.s.c.s.e.JettySolrRunner Start Jetty (original configured port=0)
   [junit4]   2> 392704 INFO  (jetty-launcher-8682-thread-1) [    ] o.a.s.c.s.e.JettySolrRunner Start Jetty (original configured port=0)
   [junit4]   2> 392704 INFO  (jetty-launcher-8682-thread-2) [    ] o.a.s.c.s.e.JettySolrRunner Trying to start Jetty on port 0 try number 1 ...
   [junit4]   2> 392704 INFO  (jetty-launcher-8682-thread-1) [    ] o.a.s.c.s.e.JettySolrRunner Trying to start Jetty on port 0 try number 1 ...
   [junit4]   2> 392704 INFO  (jetty-launcher-8682-thread-2) [    ] o.e.j.s.Server jetty-9.4.14.v20181114; built: 2018-11-14T21:20:31.478Z; git: c4550056e785fb5665914545889f21dc136ad9e6; jvm 12+33
   [junit4]   2> 392704 INFO  (jetty-launcher-8682-thread-1) [    ] o.e.j.s.Server jetty-9.4.14.v20181114; built: 2018-11-14T21:20:31.478Z; git: c4550056e785fb5665914545889f21dc136ad9e6; jvm 12+33
   [junit4]   2> 392716 INFO  (jetty-launcher-8682-thread-1) [    ] o.e.j.s.session DefaultSessionIdManager workerName=node0
   [junit4]   2> 392716 INFO  (jetty-launcher-8682-thread-1) [    ] o.e.j.s.session No SessionScavenger set, using defaults
   [junit4]   2> 392716 INFO  (jetty-launcher-8682-thread-1) [    ] o.e.j.s.session node0 Scavenging every 660000ms
   [junit4]   2> 392716 INFO  (jetty-launcher-8682-thread-2) [    ] o.e.j.s.session DefaultSessionIdManager workerName=node0
   [junit4]   2> 392716 INFO  (jetty-launcher-8682-thread-2) [    ] o.e.j.s.session No SessionScavenger set, using defaults
   [junit4]   2> 392716 INFO  (jetty-launcher-8682-thread-2) [    ] o.e.j.s.session node0 Scavenging every 660000ms
   [junit4]   2> 392716 INFO  (jetty-launcher-8682-thread-1) [    ] o.e.j.s.h.ContextHandler Started o.e.j.s.ServletContextHandler@2d01820d{/solr,null,AVAILABLE}
   [junit4]   2> 392716 INFO  (jetty-launcher-8682-thread-2) [    ] o.e.j.s.h.ContextHandler Started o.e.j.s.ServletContextHandler@750406e5{/solr,null,AVAILABLE}
   [junit4]   2> 392720 INFO  (jetty-launcher-8682-thread-2) [    ] o.e.j.s.AbstractConnector Started ServerConnector@6c799c10{HTTP/1.1,[http/1.1, h2c]}{127.0.0.1:41311}
   [junit4]   2> 392720 INFO  (jetty-launcher-8682-thread-1) [    ] o.e.j.s.AbstractConnector Started ServerConnector@28614e7f{HTTP/1.1,[http/1.1, h2c]}{127.0.0.1:35483}
   [junit4]   2> 392720 INFO  (jetty-launcher-8682-thread-2) [    ] o.e.j.s.Server Started @392766ms
   [junit4]   2> 392720 INFO  (jetty-launcher-8682-thread-1) [    ] o.e.j.s.Server Started @392766ms
   [junit4]   2> 392720 INFO  (jetty-launcher-8682-thread-2) [    ] o.a.s.c.s.e.JettySolrRunner Jetty properties: {hostContext=/solr, hostPort=41311}
   [junit4]   2> 392720 INFO  (jetty-launcher-8682-thread-1) [    ] o.a.s.c.s.e.JettySolrRunner Jetty properties: {hostContext=/solr, hostPort=35483}
   [junit4]   2> 392720 ERROR (jetty-launcher-8682-thread-1) [    ] o.a.s.u.StartupLoggingUtils Missing Java Option solr.log.dir. Logging may be missing or incomplete.
   [junit4]   2> 392720 INFO  (jetty-launcher-8682-thread-1) [    ] o.a.s.s.SolrDispatchFilter Using logger factory org.apache.logging.slf4j.Log4jLoggerFactory
   [junit4]   2> 392721 ERROR (jetty-launcher-8682-thread-2) [    ] o.a.s.u.StartupLoggingUtils Missing Java Option solr.log.dir. Logging may be missing or incomplete.
   [junit4]   2> 392721 INFO  (jetty-launcher-8682-thread-2) [    ] o.a.s.s.SolrDispatchFilter Using logger factory org.apache.logging.slf4j.Log4jLoggerFactory
   [junit4]   2> 392721 INFO  (jetty-launcher-8682-thread-1) [    ] o.a.s.s.SolrDispatchFilter  ___      _       Welcome to Apache Solr? version 9.0.0
   [junit4]   2> 392721 INFO  (jetty-launcher-8682-thread-2) [    ] o.a.s.s.SolrDispatchFilter  ___      _       Welcome to Apache Solr? version 9.0.0
   [junit4]   2> 392721 INFO  (jetty-launcher-8682-thread-1) [    ] o.a.s.s.SolrDispatchFilter / __| ___| |_ _   Starting in cloud mode on port null
   [junit4]   2> 392721 INFO  (jetty-launcher-8682-thread-2) [    ] o.a.s.s.SolrDispatchFilter / __| ___| |_ _   Starting in cloud mode on port null
   [junit4]   2> 392721 INFO  (jetty-launcher-8682-thread-1) [    ] o.a.s.s.SolrDispatchFilter \__ \/ _ \ | '_|  Install dir: null
   [junit4]   2> 392721 INFO  (jetty-launcher-8682-thread-2) [    ] o.a.s.s.SolrDispatchFilter \__ \/ _ \ | '_|  Install dir: null
   [junit4]   2> 392721 INFO  (jetty-launcher-8682-thread-2) [    ] o.a.s.s.SolrDispatchFilter |___/\___/_|_|    Start time: 2019-05-07T20:13:29.753070Z
   [junit4]   2> 392721 INFO  (jetty-launcher-8682-thread-1) [    ] o.a.s.s.SolrDispatchFilter |___/\___/_|_|    Start time: 2019-05-07T20:13:29.753070Z
   [junit4]   2> 392722 INFO  (zkConnectionManagerCallback-8685-thread-1) [    ] o.a.s.c.c.ConnectionManager zkClient has connected
   [junit4]   2> 392722 INFO  (jetty-launcher-8682-thread-2) [    ] o.a.s.s.SolrDispatchFilter solr.xml found in ZooKeeper. Loading...
   [junit4]   2> 392727 INFO  (zkConnectionManagerCallback-8686-thread-1) [    ] o.a.s.c.c.ConnectionManager zkClient has connected
   [junit4]   2> 392727 INFO  (jetty-launcher-8682-thread-1) [    ] o.a.s.s.SolrDispatchFilter solr.xml found in ZooKeeper. Loading...
   [junit4]   2> 392779 INFO  (jetty-launcher-8682-thread-2) [    ] o.a.s.h.c.HttpShardHandlerFactory Host whitelist initialized: WhitelistHostChecker [whitelistHosts=null, whitelistHostCheckingEnabled=true]
   [junit4]   2> 392780 WARN  (jetty-launcher-8682-thread-2) [    ] o.e.j.u.s.S.config No Client EndPointIdentificationAlgorithm configured for SslContextFactory@80fd0b1[provider=null,keyStore=null,trustStore=null]
   [junit4]   2> 392782 WARN  (jetty-launcher-8682-thread-2) [    ] o.e.j.u.s.S.config No Client EndPointIdentificationAlgorithm configured for SslContextFactory@37fac861[provider=null,keyStore=null,trustStore=null]
   [junit4]   2> 392783 INFO  (jetty-launcher-8682-thread-2) [    ] o.a.s.c.ZkContainer Zookeeper client=127.0.0.1:43259/solr
   [junit4]   2> 392788 INFO  (zkConnectionManagerCallback-8694-thread-1) [    ] o.a.s.c.c.ConnectionManager zkClient has connected
   [junit4]   2> 392789 INFO  (zkConnectionManagerCallback-8696-thread-1) [    ] o.a.s.c.c.ConnectionManager zkClient has connected
   [junit4]   2> 392806 INFO  (jetty-launcher-8682-thread-1) [    ] o.a.s.h.c.HttpShardHandlerFactory Host whitelist initialized: WhitelistHostChecker [whitelistHosts=null, whitelistHostCheckingEnabled=true]
   [junit4]   2> 392807 WARN  (jetty-launcher-8682-thread-1) [    ] o.e.j.u.s.S.config No Client EndPointIdentificationAlgorithm configured for SslContextFactory@7b6b1010[provider=null,keyStore=null,trustStore=null]
   [junit4]   2> 392808 WARN  (jetty-launcher-8682-thread-1) [    ] o.e.j.u.s.S.config No Client EndPointIdentificationAlgorithm configured for SslContextFactory@733aa2d2[provider=null,keyStore=null,trustStore=null]
   [junit4]   2> 392809 INFO  (jetty-launcher-8682-thread-1) [    ] o.a.s.c.ZkContainer Zookeeper client=127.0.0.1:43259/solr
   [junit4]   2> 392810 INFO  (zkConnectionManagerCallback-8704-thread-1) [    ] o.a.s.c.c.ConnectionManager zkClient has connected
   [junit4]   2> 392811 INFO  (zkConnectionManagerCallback-8706-thread-1) [    ] o.a.s.c.c.ConnectionManager zkClient has connected
   [junit4]   2> 392814 INFO  (jetty-launcher-8682-thread-1) [n:127.0.0.1:35483_solr    ] o.a.s.c.OverseerElectionContext I am going to be the leader 127.0.0.1:35483_solr
   [junit4]   2> 392814 INFO  (jetty-launcher-8682-thread-1) [n:127.0.0.1:35483_solr    ] o.a.s.c.Overseer Overseer (id=72211953921294344-127.0.0.1:35483_solr-n_0000000000) starting
   [junit4]   2> 392817 INFO  (zkConnectionManagerCallback-8713-thread-1) [    ] o.a.s.c.c.ConnectionManager zkClient has connected
   [junit4]   2> 392818 INFO  (jetty-launcher-8682-thread-1) [n:127.0.0.1:35483_solr    ] o.a.s.c.s.i.ZkClientClusterStateProvider Cluster at 127.0.0.1:43259/solr ready
   [junit4]   2> 392818 INFO  (OverseerStateUpdate-72211953921294344-127.0.0.1:35483_solr-n_0000000000) [n:127.0.0.1:35483_solr    ] o.a.s.c.Overseer Starting to work on the main queue : 127.0.0.1:35483_solr
   [junit4]   2> 392818 INFO  (jetty-launcher-8682-thread-1) [n:127.0.0.1:35483_solr    ] o.a.s.c.ZkController Register node as live in ZooKeeper:/live_nodes/127.0.0.1:35483_solr
   [junit4]   2> 392819 INFO  (zkCallback-8712-thread-1) [    ] o.a.s.c.c.ZkStateReader Updated live nodes from ZooKeeper... (0) -> (1)
   [junit4]   2> 392819 INFO  (zkCallback-8705-thread-1) [    ] o.a.s.c.c.ZkStateReader Updated live nodes from ZooKeeper... (0) -> (1)
   [junit4]   2> 392819 INFO  (jetty-launcher-8682-thread-2) [n:127.0.0.1:41311_solr    ] o.a.s.c.c.ZkStateReader Updated live nodes from ZooKeeper... (0) -> (1)
   [junit4]   2> 392819 INFO  (jetty-launcher-8682-thread-1) [n:127.0.0.1:35483_solr    ] o.a.s.c.CoreContainer Initializing authentication plugin: solr.JWTAuthPlugin
   [junit4]   2> 392820 INFO  (jetty-launcher-8682-thread-2) [n:127.0.0.1:41311_solr    ] o.a.s.c.ZkController Publish node=127.0.0.1:41311_solr as DOWN
   [junit4]   2> 392821 INFO  (jetty-launcher-8682-thread-2) [n:127.0.0.1:41311_solr    ] o.a.s.c.TransientSolrCoreCacheDefault Allocating transient cache for 2147483647 transient cores
   [junit4]   2> 392821 INFO  (jetty-launcher-8682-thread-2) [n:127.0.0.1:41311_solr    ] o.a.s.c.ZkController Register node as live in ZooKeeper:/live_nodes/127.0.0.1:41311_solr
   [junit4]   2> 392821 INFO  (zkCallback-8705-thread-1) [    ] o.a.s.c.c.ZkStateReader Updated live nodes from ZooKeeper... (1) -> (2)
   [junit4]   2> 392821 INFO  (zkCallback-8712-thread-1) [    ] o.a.s.c.c.ZkStateReader Updated live nodes from ZooKeeper... (1) -> (2)
   [junit4]   2> 392822 INFO  (jetty-launcher-8682-thread-2) [n:127.0.0.1:41311_solr    ] o.a.s.c.CoreContainer Initializing authentication plugin: solr.JWTAuthPlugin
   [junit4]   2> 392827 INFO  (zkCallback-8695-thread-1) [    ] o.a.s.c.c.ZkStateReader Updated live nodes from ZooKeeper... (1) -> (2)
   [junit4]   2> 392830 WARN  (jetty-launcher-8682-thread-1) [n:127.0.0.1:35483_solr    ] o.a.s.s.JWTAuthPlugin Warning: No adminUiScope provided, fallback to 'solr' as required scope. If this is not correct, the Admin UI login may not work
   [junit4]   2> 392830 WARN  (jetty-launcher-8682-thread-2) [n:127.0.0.1:41311_solr    ] o.a.s.s.JWTAuthPlugin Warning: No adminUiScope provided, fallback to 'solr' as required scope. If this is not correct, the Admin UI login may not work
   [junit4]   2> 392850 INFO  (jetty-launcher-8682-thread-1) [n:127.0.0.1:35483_solr    ] o.a.s.h.a.MetricsHistoryHandler No .system collection, keeping metrics history in memory.
   [junit4]   2> 392850 INFO  (zkConnectionManagerCallback-8718-thread-1) [    ] o.a.s.c.c.ConnectionManager zkClient has connected
   [junit4]   2> 392851 INFO  (jetty-launcher-8682-thread-2) [n:127.0.0.1:41311_solr    ] o.a.s.c.c.ZkStateReader Updated live nodes from ZooKeeper... (0) -> (2)
   [junit4]   2> 392851 INFO  (jetty-launcher-8682-thread-2) [n:127.0.0.1:41311_solr    ] o.a.s.c.s.i.ZkClientClusterStateProvider Cluster at 127.0.0.1:43259/solr ready
   [junit4]   2> 392852 INFO  (jetty-launcher-8682-thread-2) [n:127.0.0.1:41311_solr    ] o.a.s.h.a.MetricsHistoryHandler No .system collection, keeping metrics history in memory.
   [junit4]   2> 392865 INFO  (jetty-launcher-8682-thread-1) [n:127.0.0.1:35483_solr    ] o.a.s.m.r.SolrJmxReporter JMX monitoring for 'solr_35483.solr.node' (registry 'solr.node') enabled at server: com.sun.jmx.mbeanserver.JmxMBeanServer@7e8c9cc0
   [junit4]   2> 392865 INFO  (jetty-launcher-8682-thread-2) [n:127.0.0.1:41311_solr    ] o.a.s.m.r.SolrJmxReporter JMX monitoring for 'solr_41311.solr.node' (registry 'solr.node') enabled at server: com.sun.jmx.mbeanserver.JmxMBeanServer@7e8c9cc0
   [junit4]   2> 392871 INFO  (jetty-launcher-8682-thread-1) [n:127.0.0.1:35483_solr    ] o.a.s.m.r.SolrJmxReporter JMX monitoring for 'solr_35483.solr.jvm' (registry 'solr.jvm') enabled at server: com.sun.jmx.mbeanserver.JmxMBeanServer@7e8c9cc0
   [junit4]   2> 392871 INFO  (jetty-launcher-8682-thread-1) [n:127.0.0.1:35483_solr    ] o.a.s.m.r.SolrJmxReporter JMX monitoring for 'solr_35483.solr.jetty' (registry 'solr.jetty') enabled at server: com.sun.jmx.mbeanserver.JmxMBeanServer@7e8c9cc0
   [junit4]   2> 392871 INFO  (jetty-launcher-8682-thread-2) [n:127.0.0.1:41311_solr    ] o.a.s.m.r.SolrJmxReporter JMX monitoring for 'solr_41311.solr.jvm' (registry 'solr.jvm') enabled at server: com.sun.jmx.mbeanserver.JmxMBeanServer@7e8c9cc0
   [junit4]   2> 392872 INFO  (jetty-launcher-8682-thread-2) [n:127.0.0.1:41311_solr    ] o.a.s.m.r.SolrJmxReporter JMX monitoring for 'solr_41311.solr.jetty' (registry 'solr.jetty') enabled at server: com.sun.jmx.mbeanserver.JmxMBeanServer@7e8c9cc0
   [junit4]   2> 392872 INFO  (jetty-launcher-8682-thread-1) [n:127.0.0.1:35483_solr    ] o.a.s.c.CorePropertiesLocator Found 0 core definitions underneath /home/jenkins/workspace/Lucene-Solr-master-Linux/solr/build/solr-core/test/J2/temp/solr.security.JWTAuthPluginIntegrationTest_2DB4A588D46E332D-001/tempDir-001/node1/.
   [junit4]   2> 392872 INFO  (jetty-launcher-8682-thread-2) [n:127.0.0.1:41311_solr    ] o.a.s.c.CorePropertiesLocator Found 0 core definitions underneath /home/jenkins/workspace/Lucene-Solr-master-Linux/solr/build/solr-core/test/J2/temp/solr.security.JWTAuthPluginIntegrationTest_2DB4A588D46E332D-001/tempDir-001/node2/.
   [junit4]   2> 392900 INFO  (zkConnectionManagerCallback-8725-thread-1) [    ] o.a.s.c.c.ConnectionManager zkClient has connected
   [junit4]   2> 392901 INFO  (TEST-JWTAuthPluginIntegrationTest.testMetrics-seed#[2DB4A588D46E332D]) [    ] o.a.s.c.c.ZkStateReader Updated live nodes from ZooKeeper... (0) -> (2)
   [junit4]   2> 392902 INFO  (TEST-JWTAuthPluginIntegrationTest.testMetrics-seed#[2DB4A588D46E332D]) [    ] o.a.s.c.s.i.ZkClientClusterStateProvider Cluster at 127.0.0.1:43259/solr ready
   [junit4]   2> 393124 INFO  (qtp623898228-19260) [n:127.0.0.1:35483_solr    ] o.a.s.h.a.CollectionsHandler Invoked Collection Action :create with params name=jwtColl&action=CREATE&numShards=2 and sendToOCPQueue=true
   [junit4]   2> 393128 INFO  (OverseerThreadFactory-3223-thread-1-processing-n:127.0.0.1:35483_solr) [n:127.0.0.1:35483_solr    ] o.a.s.c.a.c.CreateCollectionCmd Create collection jwtColl
   [junit4]   2> 393129 INFO  (OverseerThreadFactory-3223-thread-1-processing-n:127.0.0.1:35483_solr) [n:127.0.0.1:35483_solr    ] o.a.s.c.c.ZkConfigManager Copying zk node /configs/_default/protwords.txt to /configs/jwtColl.AUTOCREATED/protwords.txt
   [junit4]   2> 393130 INFO  (OverseerThreadFactory-3223-thread-1-processing-n:127.0.0.1:35483_solr) [n:127.0.0.1:35483_solr    ] o.a.s.c.c.ZkConfigManager Copying zk node /configs/_default/managed-schema to /configs/jwtColl.AUTOCREATED/managed-schema
   [junit4]   2> 393132 INFO  (OverseerThreadFactory-3223-thread-1-processing-n:127.0.0.1:35483_solr) [n:127.0.0.1:35483_solr    ] o.a.s.c.c.ZkConfigManager Copying zk node /configs/_default/solrconfig.xml to /configs/jwtColl.AUTOCREATED/solrconfig.xml
   [junit4]   2> 393133 INFO  (OverseerThreadFactory-3223-thread-1-processing-n:127.0.0.1:35483_solr) [n:127.0.0.1:35483_solr    ] o.a.s.c.c.ZkConfigManager Copying zk node /configs/_default/synonyms.txt to /configs/jwtColl.AUTOCREATED/synonyms.txt
   [junit4]   2> 393133 INFO  (OverseerThreadFactory-3223-thread-1-processing-n:127.0.0.1:35483_solr) [n:127.0.0.1:35483_solr    ] o.a.s.c.c.ZkConfigManager Copying zk node /configs/_default/stopwords.txt to /configs/jwtColl.AUTOCREATED/stopwords.txt
   [junit4]   2> 393134 INFO  (OverseerThreadFactory-3223-thread-1-processing-n:127.0.0.1:35483_solr) [n:127.0.0.1:35483_solr    ] o.a.s.c.c.ZkConfigManager Copying zk node /configs/_default/lang/contractions_it.txt to /configs/jwtColl.AUTOCREATED/lang/contractions_it.txt
   [junit4]   2> 393135 INFO  (OverseerThreadFactory-3223-thread-1-processing-n:127.0.0.1:35483_solr) [n:127.0.0.1:35483_solr    ] o.a.s.c.c.ZkConfigManager Copying zk node /configs/_default/lang/stemdict_nl.txt to /configs/jwtColl.AUTOCREATED/lang/stemdict_nl.txt
   [junit4]   2> 393136 INFO  (OverseerThreadFactory-3223-thread-1-processing-n:127.0.0.1:35483_solr) [n:127.0.0.1:35483_solr    ] o.a.s.c.c.ZkConfigManager Copying zk node /configs/_default/lang/stopwords_hy.txt to /configs/jwtColl.AUTOCREATED/lang/stopwords_hy.txt
   [junit4]   2> 393136 INFO  (OverseerThreadFactory-3223-thread-1-processing-n:127.0.0.1:35483_solr) [n:127.0.0.1:35483_solr    ] o.a.s.c.c.ZkConfigManager Copying zk node /configs/_default/lang/stopwords_no.txt to /configs/jwtColl.AUTOCREATED/lang/stopwords_no.txt
   [junit4]   2> 393139 INFO  (OverseerThreadFactory-3223-thread-1-processing-n:127.0.0.1:35483_solr) [n:127.0.0.1:35483_solr    ] o.a.s.c.c.ZkConfigManager Copying zk node /configs/_default/lang/contractions_ca.txt to /configs/jwtColl.AUTOCREATED/lang/contractions_ca.txt
   [junit4]   2> 393140 INFO  (OverseerThreadFactory-3223-thread-1-processing-n:127.0.0.1:35483_solr) [n:127.0.0.1:35483_solr    ] o.a.s.c.c.ZkConfigManager Copying zk node /configs/_default/lang/stopwords_id.txt to /configs/jwtColl.AUTOCREATED/lang/stopwords_id.txt
   [junit4]   2> 393141 INFO  (OverseerThreadFactory-3223-thread-1-processing-n:127.0.0.1:35483_solr) [n:127.0.0.1:35483_solr    ] o.a.s.c.c.ZkConfigManager Copying zk node /configs/_default/lang/stopwords_ga.txt to /configs/jwtColl.AUTOCREATED/lang/stopwords_ga.txt
   [junit4]   2> 393142 INFO  (OverseerThreadFactory-3223-thread-1-processing-n:127.0.0.1:35483_solr) [n:127.0.0.1:35483_solr    ] o.a.s.c.c.ZkConfigManager Copying zk node /configs/_default/lang/stopwords_hi.txt to /configs/jwtColl.AUTOCREATED/lang/stopwords_hi.txt
   [junit4]   2> 393142 INFO  (OverseerThreadFactory-3223-thread-1-processing-n:127.0.0.1:35483_solr) [n:127.0.0.1:35483_solr    ] o.a.s.c.c.ZkConfigManager Copying zk node /configs/_default/lang/stopwords_da.txt to /configs/jwtColl.AUTOCREATED/lang/stopwords_da.txt
   [junit4]   2> 393143 INFO  (OverseerThreadFactory-3223-thread-1-processing-n:127.0.0.1:35483_solr) [n:127.0.0.1:35483_solr    ] o.a.s.c.c.ZkConfigManager Copying zk node /configs/_default/lang/stopwords_ja.txt to /configs/jwtColl.AUTOCREATED/lang/stopwords_ja.txt
   [junit4]   2> 393144 INFO  (OverseerThreadFactory-3223-thread-1-processing-n:127.0.0.1:35483_solr) [n:127.0.0.1:35483_solr    ] o.a.s.c.c.ZkConfigManager Copying zk node /configs/_default/lang/stopwords_pt.txt to /configs/jwtColl.AUTOCREATED/lang/stopwords_pt.txt
   [junit4]   2> 393146 INFO  (OverseerThreadFactory-3223-thread-1-processing-n:127.0.0.1:35483_solr) [n:127.0.0.1:35483_solr    ] o.a.s.c.c.ZkConfigManager Copying zk node /configs/_default/lang/stopwords_hu.txt to /configs/jwtColl.AUTOCREATED/lang/stopwords_hu.txt
   [junit4]   2> 393147 INFO  (OverseerThreadFactory-3223-thread-1-processing-n:127.0.0.1:35483_solr) [n:127.0.0.1:35483_solr    ] o.a.s.c.c.ZkConfigManager Copying zk node /configs/_default/lang/stopwords_el.txt to /configs/jwtColl.AUTOCREATED/lang/stopwords_el.txt
   [junit4]   2> 393147 INFO  (OverseerThreadFactory-3223-thread-1-processing-n:127.0.0.1:35483_solr) [n:127.0.0.1:35483_solr    ] o.a.s.c.c.ZkConfigManager Copying zk node /configs/_default/lang/stopwords_ru.txt to /configs/jwtColl.AUTOCREATED/lang/stopwords_ru.txt
   [junit4]   2> 393152 INFO  (OverseerThreadFactory-3223-thread-1-processing-n:127.0.0.1:35483_solr) [n:127.0.0.1:35483_solr    ] o.a.s.c.c.ZkConfigManager Copying zk node /configs/_default/lang/stopwords_tr.txt to /configs/jwtColl.AUTOCREATED/lang/stopwords_tr.txt
   [junit4]   2> 393153 INFO  (OverseerThreadFactory-3223-thread-1-processing-n:127.0.0.1:35483_solr) [n:127.0.0.1:35483_solr    ] o.a.s.c.c.ZkConfigManager Copying zk node /configs/_default/lang/stopwords_ar.txt to /configs/jwtColl.AUTOCREATED/lang/stopwords_ar.txt
   [junit4]   2> 393154 INFO  (OverseerThreadFactory-3223-thread-1-processing-n:127.0.0.1:35483_solr) [n:127.0.0.1:35483_solr    ] o.a.s.c.c.ZkConfigManager Copying zk node /configs/_default/lang/userdict_ja.txt to /configs/jwtColl.AUTOCREATED/lang/userdict_ja.txt
   [junit4]   2> 393155 INFO  (OverseerThreadFactory-3223-thread-1-processing-n:127.0.0.1:35483_solr) [n:127.0.0.1:35483_solr    ] o.a.s.c.c.ZkConfigManager Copying zk node /configs/_default/lang/stopwords_eu.txt to /configs/jwtColl.AUTOCREATED/lang/stopwords_eu.txt
   [junit4]   2> 393155 INFO  (OverseerThreadFactory-3223-thread-1-processing-n:127.0.0.1:35483_solr) [n:127.0.0.1:35483_solr    ] o.a.s.c.c.ZkConfigManager Copying zk node /configs/_default/lang/stopwords_it.txt to /configs/jwtColl.AUTOCREATED/lang/stopwords_it.txt
   [junit4]   2> 393156 INFO  (OverseerThreadFactory-3223-thread-1-processing-n:127.0.0.1:35483_solr) [n:127.0.0.1:35483_solr    ] o.a.s.c.c.ZkConfigManager Copying zk node /configs/_default/lang/stopwords_cz.txt to /configs/jwtColl.AUTOCREATED/lang/stopwords_cz.txt
   [junit4]   2> 393157 INFO  (OverseerThreadFactory-3223-thread-1-processing-n:127.0.0.1:35483_solr) [n:127.0.0.1:35483_solr    ] o.a.s.c.c.ZkConfigManager Copying zk node /configs/_default/lang/stoptags_ja.txt to /configs/jwtColl.AUTOCREATED/lang/stoptags_ja.txt
   [junit4]   2> 393157 INFO  (OverseerThreadFactory-3223-thread-1-processing-n:127.0.0.1:35483_solr) [n:127.0.0.1:35483_solr    ] o.a.s.c.c.ZkConfigManager Copying zk node /configs/_default/lang/contractions_fr.txt to /configs/jwtColl.AUTOCREATED/lang/contractions_fr.txt
   [junit4]   2> 393158 INFO  (OverseerThreadFactory-3223-thread-1-processing-n:127.0.0.1:35483_solr) [n:127.0.0.1:35483_solr    ] o.a.s.c.c.ZkConfigManager Copying zk node /configs/_default/lang/stopwords_de.txt to /configs/jwtColl.AUTOCREATED/lang/stopwords_de.txt
   [junit4]   2> 393159 INFO  (OverseerThreadFactory-3223-thread-1-processing-n:127.0.0.1:35483_solr) [n:127.0.0.1:35483_solr    ] o.a.s.c.c.ZkConfigManager Copying zk node /configs/_default/lang/stopwords_fa.txt to /configs/jwtColl.AUTOCREATED/lang/stopwords_fa.txt
   [junit4]   2> 393159 INFO  (OverseerThreadFactory-3223-thread-1-processing-n:127.0.0.1:35483_solr) [n:127.0.0.1:35483_solr    ] o.a.s.c.c.ZkConfigManager Copying zk node /configs/_default/lang/contractions_ga.txt to /configs/jwtColl.AUTOCREATED/lang/contractions_ga.txt
   [junit4]   2> 393160 INFO  (OverseerThreadFactory-3223-thread-1-processing-n:127.0.0.1:35483_solr) [n:127.0.0.1:35483_solr    ] o.a.s.c.c.ZkConfigManager Copying zk node /configs/_default/lang/stopwords_ca.txt to /configs/jwtColl.AUTOCREATED/lang/stopwords_ca.txt
   [junit4]   2> 393160 INFO  (OverseerThreadFactory-3223-thread-1-processing-n:127.0.0.1:35483_solr) [n:127.0.0.1:35483_solr    ] o.a.s.c.c.ZkConfigManager Copying zk node /configs/_default/lang/stopwords_nl.txt to /configs/jwtColl.AUTOCREATED/lang/stopwords_nl.txt
   [junit4]   2> 393161 INFO  (OverseerThreadFactory-3223-thread-1-processing-n:127.0.0.1:35483_solr) [n:127.0.0.1:35483_solr    ] o.a.s.c.c.ZkConfigManager Copying zk node /configs/_default/lang/stopwords_bg.txt to /configs/jwtColl.AUTOCREATED/lang/stopwords_bg.txt
   [junit4]   2> 393162 INFO  (OverseerThreadFactory-3223-thread-1-processing-n:127.0.0.1:35483_solr) [n:127.0.0.1:35483_solr    ] o.a.s.c.c.ZkConfigManager Copying zk node /configs/_default/lang/stopwords_lv.txt to /configs/jwtColl.AUTOCREATED/lang/stopwords_lv.txt
   [junit4]   2> 393162 INFO  (OverseerThreadFactory-3223-thread-1-processing-n:127.0.0.1:35483_solr) [n:127.0.0.1:35483_solr    ] o.a.s.c.c.ZkConfigManager Copying zk node /configs/_default/lang/stopwords_en.txt to /configs/jwtColl.AUTOCREATED/lang/stopwords_en.txt
   [junit4]   2> 393163 INFO  (OverseerThreadFactory-3223-thread-1-processing-n:127.0.0.1:35483_solr) [n:127.0.0.1:35483_solr    ] o.a.s.c.c.ZkConfigManager Copying zk node /configs/_default/lang/stopwords_es.txt to /configs/jwtColl.AUTOCREATED/lang/stopwords_es.txt
   [junit4]   2> 393164 INFO  (OverseerThreadFactory-3223-thread-1-processing-n:127.0.0.1:35483_solr) [n:127.0.0.1:35483_solr    ] o.a.s.c.c.ZkConfigManager Copying zk node /configs/_default/lang/stopwords_th.txt to /configs/jwtColl.AUTOCREATED/lang/stopwords_th.txt
   [junit4]   2> 393164 INFO  (OverseerThreadFactory-3223-thread-1-processing-n:127.0.0.1:35483_solr) [n:127.0.0.1:35483_solr    ] o.a.s.c.c.ZkConfigManager Copying zk node /configs/_default/lang/stopwords_ro.txt to /configs/jwtColl.AUTOCREATED/lang/stopwords_ro.txt
   [junit4]   2> 393165 INFO  (OverseerThreadFactory-3223-thread-1-processing-n:127.0.0.1:35483_solr) [n:127.0.0.1:35483_solr    ] o.a.s.c.c.ZkConfigManager Copying zk node /configs/_default/lang/stopwords_fr.txt to /configs/jwtColl.AUTOCREATED/lang/stopwords_fr.txt
   [junit4]   2> 393166 INFO  (OverseerThreadFactory-3223-thread-1-processing-n:127.0.0.1:35483_solr) [n:127.0.0.1:35483_solr    ] o.a.s.c.c.ZkConfigManager Copying zk node /configs/_default/lang/stopwords_sv.txt to /configs/jwtColl.AUTOCREATED/lang/stopwords_sv.txt
   [junit4]   2> 393167 INFO  (OverseerThreadFactory-3223-thread-1-processing-n:127.0.0.1:35483_solr) [n:127.0.0.1:35483_solr    ] o.a.s.c.c.ZkConfigManager Copying zk node /configs/_default/lang/stopwords_fi.txt to /configs/jwtColl.AUTOCREATED/lang/stopwords_fi.txt
   [junit4]   2> 393167 INFO  (OverseerThreadFactory-3223-thread-1-processing-n:127.0.0.1:35483_solr) [n:127.0.0.1:35483_solr    ] o.a.s.c.c.ZkConfigManager Copying zk node /configs/_default/lang/hyphenations_ga.txt to /configs/jwtColl.AUTOCREATED/lang/hyphenations_ga.txt
   [junit4]   2> 393168 INFO  (OverseerThreadFactory-3223-thread-1-processing-n:127.0.0.1:35483_solr) [n:127.0.0.1:35483_solr    ] o.a.s.c.c.ZkConfigManager Copying zk node /configs/_default/lang/stopwords_gl.txt to /configs/jwtColl.AUTOCREATED/lang/stopwords_gl.txt
   [junit4]   2> 393169 INFO  (OverseerThreadFactory-3223-thread-1-processing-n:127.0.0.1:35483_solr) [n:127.0.0.1:35483_solr    ] o.a.s.c.c.ZkConfigManager Copying zk node /configs/_default/params.json to /configs/jwtColl.AUTOCREATED/params.json
   [junit4]   2> 393279 INFO  (qtp623898228-19326) [n:127.0.0.1:35483_solr    ] o.a.s.s.HttpSolrCall [admin] webapp=null path=/admin/info/key params={omitHeader=true&wt=json} status=0 QTime=0
   [junit4]   2> 393280 INFO  (qtp623898228-19258) [    ] o.a.s.s.PKIAuthenticationPlugin New Key obtained from  node: 127.0.0.1:35483_solr / MIIBIjANBgkqhkiG9w0BAQEFAAOCAQ8AMIIBCgKCAQEAoJRUfrRffL96/qIwssU4x2M3yimH4KjxEqYqvnfgIYz0HNBaezgNvHyrTGIaMICSl45dH4fFQzUcZigFtOwcz/6c4t2RYxEVfV7I5IPS6R6fB3BZirICZlaPElkUVD8HplYDLG+zX3dFvc7JCmJ0UG9hfJ5zDcqZmc9D9cQBWtXm7nN1D4H85zZfbt8O6nlxtGzOawAi9D7tXsBaNpM3ABwDegfZCOnOHFbzoFE/20yOkEVIsrqwrrVbxCty31G9UzvW7MIqes9AymFv/GakPTkxuGWczsG8bwyW334p2kuFuf7wxibWcFRDBGA1cjstxoC8LYmz1Yk2YQwp9nDhxQIDAQAB
   [junit4]   2> 393284 INFO  (qtp623898228-19258) [n:127.0.0.1:35483_solr    ] o.a.s.s.HttpSolrCall [admin] webapp=null path=/admin/metrics params={prefix=CONTAINER.fs.usableSpace,CONTAINER.fs.totalSpace,CORE.coreName&wt=javabin&version=2&group=solr.node,solr.core} status=0 QTime=1
   [junit4]   2> 393289 INFO  (qtp623898228-19326) [n:127.0.0.1:35483_solr    ] o.a.s.s.HttpSolrCall [admin] webapp=null path=/admin/info/key params={omitHeader=true&wt=json} status=0 QTime=0
   [junit4]   2> 393289 INFO  (qtp277992501-19261) [    ] o.a.s.s.PKIAuthenticationPlugin New Key obtained from  node: 127.0.0.1:35483_solr / MIIBIjANBgkqhkiG9w0BAQEFAAOCAQ8AMIIBCgKCAQEAoJRUfrRffL96/qIwssU4x2M3yimH4KjxEqYqvnfgIYz0HNBaezgNvHyrTGIaMICSl45dH4fFQzUcZigFtOwcz/6c4t2RYxEVfV7I5IPS6R6fB3BZirICZlaPElkUVD8HplYDLG+zX3dFvc7JCmJ0UG9hfJ5zDcqZmc9D9cQBWtXm7nN1D4H85zZfbt8O6nlxtGzOawAi9D7tXsBaNpM3ABwDegfZCOnOHFbzoFE/20yOkEVIsrqwrrVbxCty31G9UzvW7MIqes9AymFv/GakPTkxuGWczsG8bwyW334p2kuFuf7wxibWcFRDBGA1cjstxoC8LYmz1Yk2YQwp9nDhxQIDAQAB
   [junit4]   2> 393291 INFO  (qtp277992501-19261) [n:127.0.0.1:41311_solr    ] o.a.s.s.HttpSolrCall [admin] webapp=null path=/admin/metrics params={prefix=CONTAINER.fs.usableSpace,CONTAINER.fs.totalSpace,CORE.coreName&wt=javabin&version=2&group=solr.node,solr.core} status=0 QTime=0
   [junit4]   2> 393293 INFO  (OverseerStateUpdate-72211953921294344-127.0.0.1:35483_solr-n_0000000000) [n:127.0.0.1:35483_solr    ] o.a.s.c.o.SliceMutator createReplica() {
   [junit4]   2>   "operation":"ADDREPLICA",
   [junit4]   2>   "collection":"jwtColl",
   [junit4]   2>   "shard":"shard1",
   [junit4]   2>   "core":"jwtColl_shard1_replica_n1",
   [junit4]   2>   "state":"down",
   [junit4]   2>   "base_url":"http://127.0.0.1:41311/solr",
   [junit4]   2>   "type":"NRT",
   [junit4]   2>   "waitForFinalState":"false"} 
   [junit4]   2> 393294 INFO  (OverseerStateUpdate-72211953921294344-127.0.0.1:35483_solr-n_0000000000) [n:127.0.0.1:35483_solr    ] o.a.s.c.o.SliceMutator createReplica() {
   [junit4]   2>   "operation":"ADDREPLICA",
   [junit4]   2>   "collection":"jwtColl",
   [junit4]   2>   "shard":"shard2",
   [junit4]   2>   "core":"jwtColl_shard2_replica_n2",
   [junit4]   2>   "state":"down",
   [junit4]   2>   "base_url":"http://127.0.0.1:35483/solr",
   [junit4]   2>   "type":"NRT",
   [junit4]   2>   "waitForFinalState":"false"} 
   [junit4]   2> 393500 INFO  (qtp623898228-19258) [n:127.0.0.1:35483_solr    x:jwtColl_shard2_replica_n2] o.a.s.h.a.CoreAdminOperation core create command qt=/admin/cores&coreNodeName=core_node4&collection.configName=jwtColl.AUTOCREATED&newCollection=true&name=jwtColl_shard2_replica_n2&action=CREATE&numShards=2&collection=jwtColl&shard=shard2&wt=javabin&version=2&replicaType=NRT
   [junit4]   2> 393500 INFO  (qtp277992501-19263) [n:127.0.0.1:41311_solr    x:jwtColl_shard1_replica_n1] o.a.s.h.a.CoreAdminOperation core create command qt=/admin/cores&coreNodeName=core_node3&collection.configName=jwtColl.AUTOCREATED&newCollection=true&name=jwtColl_shard1_replica_n1&action=CREATE&numShards=2&collection=jwtColl&shard=shard1&wt=javabin&version=2&replicaType=NRT
   [junit4]   2> 393500 INFO  (qtp623898228-19258) [n:127.0.0.1:35483_solr    x:jwtColl_shard2_replica_n2] o.a.s.c.TransientSolrCoreCacheDefault Allocating transient cache for 2147483647 transient cores
   [junit4]   2> 394507 INFO  (qtp623898228-19258) [n:127.0.0.1:35483_solr c:jwtColl s:shard2 r:core_node4 x:jwtColl_shard2_replica_n2] o.a.s.c.RequestParams conf resource params.json loaded . version : 0 
   [junit4]   2> 394507 INFO  (qtp623898228-19258) [n:127.0.0.1:35483_solr c:jwtColl s:shard2 r:core_node4 x:jwtColl_shard2_replica_n2] o.a.s.c.RequestParams request params refreshed to version 0
   [junit4]   2> 394507 INFO  (qtp277992501-19263) [n:127.0.0.1:41311_solr c:jwtColl s:shard1 r:core_node3 x:jwtColl_shard1_replica_n1] o.a.s.c.RequestParams conf resource params.json loaded . version : 0 
   [junit4]   2> 394507 INFO  (qtp277992501-19263) [n:127.0.0.1:41311_solr c:jwtColl s:shard1 r:core_node3 x:jwtColl_shard1_replica_n1] o.a.s.c.RequestParams request params refreshed to version 0
   [junit4]   2> 394507 WARN  (qtp623898228-19258) [n:127.0.0.1:35483_solr c:jwtColl s:shard2 r:core_node4 x:jwtColl_shard2_replica_n2] o.a.s.c.SolrConfig Couldn't add files from /home/jenkins/workspace/Lucene-Solr-master-Linux/solr/build/solr-core/test/J2/temp/solr.security.JWTAuthPluginIntegrationTest_2DB4A588D46E332D-001/tempDir-001/node1/jwtColl_shard2_replica_n2/../../../../contrib/extraction/lib filtered by .*\.jar to classpath: /home/jenkins/workspace/Lucene-Solr-master-Linux/solr/build/solr-core/test/J2/temp/solr.security.JWTAuthPluginIntegrationTest_2DB4A588D46E332D-001/tempDir-001/node1/jwtColl_shard2_replica_n2/../../../../contrib/extraction/lib
   [junit4]   2> 394507 WARN  (qtp277992501-19263) [n:127.0.0.1:41311_solr c:jwtColl s:shard1 r:core_node3 x:jwtColl_shard1_replica_n1] o.a.s.c.SolrConfig Couldn't add files from /home/jenkins/workspace/Lucene-Solr-master-Linux/solr/build/solr-core/test/J2/temp/solr.security.JWTAuthPluginIntegrationTest_2DB4A588D46E332D-001/tempDir-001/node2/jwtColl_shard1_replica_n1/../../../../contrib/extraction/lib filtered by .*\.jar to classpath: /home/jenkins/workspace/Lucene-Solr-master-Linux/solr/build/solr-core/test/J2/temp/solr.security.JWTAuthPluginIntegrationTest_2DB4A588D46E332D-001/tempDir-001/node2/jwtColl_shard1_replica_n1/../../../../contrib/extraction/lib
   [junit4]   2> 394507 WARN  (qtp277992501-19263) [n:127.0.0.1:41311_solr c:jwtColl s:shard1 r:core_node3 x:jwtColl_shard1_replica_n1] o.a.s.c.SolrConfig Couldn't add files from /home/jenkins/workspace/Lucene-Solr-master-Linux/solr/build/solr-core/test/J2/temp/solr.security.JWTAuthPluginIntegrationTest_2DB4A588D46E332D-001/tempDir-001/node2/jwtColl_shard1_replica_n1/../../../../dist filtered by solr-cell-\d.*\.jar to classpath: /home/jenkins/workspace/Lucene-Solr-master-Linux/solr/build/solr-core/test/J2/temp/solr.security.JWTAuthPluginIntegrationTest_2DB4A588D46E332D-001/tempDir-001/node2/jwtColl_shard1_replica_n1/../../../../dist
   [junit4]   2> 394507 WARN  (qtp623898228-19258) [n:127.0.0.1:35483_solr c:jwtColl s:shard2 r:core_node4 x:jwtColl_shard2_replica_n2] o.a.s.c.SolrConfig Couldn't add files from /home/jenkins/workspace/Lucene-Solr-master-Linux/solr/build/solr-core/test/J2/temp/solr.security.JWTAuthPluginIntegrationTest_2DB4A588D46E332D-001/tempDir-001/node1/jwtColl_shard2_replica_n2/../../../../dist filtered by solr-cell-\d.*\.jar to classpath: /home/jenkins/workspace/Lucene-Solr-master-Linux/solr/build/solr-core/test/J2/temp/solr.security.JWTAuthPluginIntegrationTest_2DB4A588D46E332D-001/tempDir-001/node1/jwtColl_shard2_replica_n2/../../../../dist
   [junit4]   2> 394507 WARN  (qtp623898228-19258) [n:127.0.0.1:35483_solr c:jwtColl s:shard2 r:core_node4 x:jwtColl_shard2_replica_n2] o.a.s.c.SolrConfig Couldn't add files from /home/jenkins/workspace/Lucene-Solr-master-Linux/solr/build/solr-core/test/J2/temp/solr.security.JWTAuthPluginIntegrationTest_2DB4A588D46E332D-001/tempDir-001/node1/jwtColl_shard2_replica_n2/../../../../contrib/clustering/lib filtered by .*\.jar to classpath: /home/jenkins/workspace/Lucene-Solr-master-Linux/solr/build/solr-core/test/J2/temp/solr.security.JWTAuthPluginIntegrationTest_2DB4A588D46E332D-001/tempDir-001/node1/jwtColl_shard2_replica_n2/../../../../contrib/clustering/lib
   [junit4]   2> 394507 WARN  (qtp277992501-19263) [n:127.0.0.1:41311_solr c:jwtColl s:shard1 r:core_node3 x:jwtColl_shard1_replica_n1] o.a.s.c.SolrConfig Couldn't add files from /home/jenkins/workspace/Lucene-Solr-master-Linux/solr/build/solr-core/test/J2/temp/solr.security.JWTAuthPluginIntegrationTest_2DB4A588D46E332D-001/tempDir-001/node2/jwtColl_shard1_replica_n1/../../../../contrib/clustering/lib filtered by .*\.jar to classpath: /home/jenkins/workspace/Lucene-Solr-master-Linux/solr/build/solr-core/test/J2/temp/solr.security.JWTAuthPluginIntegrationTest_2DB4A588D46E332D-001/tempDir-001/node2/jwtColl_shard1_replica_n1/../../../../contrib/clustering/lib
   [junit4]   2> 394507 WARN  (qtp623898228-19258) [n:127.0.0.1:35483_solr c:jwtColl s:shard2 r:core_node4 x:jwtColl_shard2_replica_n2] o.a.s.c.SolrConfig Couldn't add files from /home/jenkins/workspace/Lucene-Solr-master-Linux/solr/build/solr-core/test/J2/temp/solr.security.JWTAuthPluginIntegrationTest_2DB4A588D46E332D-001/tempDir-001/node1/jwtColl_shard2_replica_n2/../../../../dist filtered by solr-clustering-\d.*\.jar to classpath: /home/jenkins/workspace/Lucene-Solr-master-Linux/solr

[...truncated too long message...]

ts.badapples=true -Dtests.locale=en-PK -Dtests.timezone=America/Jujuy -Dtests.asserts=true -Dtests.file.encoding=US-ASCII
   [junit4] FAILURE 3.96s J0 | TestSolrCloudWithHadoopAuthPlugin.testBasics <<<
   [junit4]    > Throwable #1: java.lang.AssertionError: Expected metric minimums for prefix SECURITY./authentication.: {failMissingCredentials=0, authenticated=8, passThrough=0, failWrongCredentials=8, requests=16, errors=0}, but got: {failMissingCredentials=0, authenticated=8, passThrough=0, totalTime=27426511, failWrongCredentials=6, requestTimes=3478, requests=14, errors=0}
   [junit4]    > 	at __randomizedtesting.SeedInfo.seed([2DB4A588D46E332D:106C0BA4EC806D5D]:0)
   [junit4]    > 	at org.apache.solr.cloud.SolrCloudAuthTestCase.assertAuthMetricsMinimums(SolrCloudAuthTestCase.java:129)
   [junit4]    > 	at org.apache.solr.cloud.SolrCloudAuthTestCase.assertAuthMetricsMinimums(SolrCloudAuthTestCase.java:83)
   [junit4]    > 	at org.apache.solr.security.hadoop.TestSolrCloudWithHadoopAuthPlugin.testCollectionCreateSearchDelete(TestSolrCloudWithHadoopAuthPlugin.java:139)
   [junit4]    > 	at org.apache.solr.security.hadoop.TestSolrCloudWithHadoopAuthPlugin.testBasics(TestSolrCloudWithHadoopAuthPlugin.java:108)
   [junit4]    > 	at java.base/jdk.internal.reflect.NativeMethodAccessorImpl.invoke0(Native Method)
   [junit4]    > 	at java.base/jdk.internal.reflect.NativeMethodAccessorImpl.invoke(NativeMethodAccessorImpl.java:62)
   [junit4]    > 	at java.base/jdk.internal.reflect.DelegatingMethodAccessorImpl.invoke(DelegatingMethodAccessorImpl.java:43)
   [junit4]    > 	at java.base/java.lang.reflect.Method.invoke(Method.java:567)
   [junit4]    > 	at java.base/java.lang.Thread.run(Thread.java:835)
   [junit4]   2> 45457 INFO  (SUITE-TestSolrCloudWithHadoopAuthPlugin-seed#[2DB4A588D46E332D]-worker) [    ] o.a.k.k.k.s.i.DefaultInternalKdcServerImpl Default Internal kdc server stopped.
   [junit4]   2> 46458 INFO  (jetty-closer-292-thread-1) [    ] o.a.s.c.CoreContainer Shutting down CoreContainer instance=1476968321
   [junit4]   2> 46458 INFO  (jetty-closer-292-thread-1) [    ] o.a.s.c.ZkController Remove node as live in ZooKeeper:/live_nodes/127.0.0.1:46501_solr
   [junit4]   2> 46459 INFO  (jetty-closer-292-thread-1) [    ] o.a.s.c.ZkController Publish this node as DOWN...
   [junit4]   2> 46459 INFO  (jetty-closer-292-thread-1) [    ] o.a.s.c.ZkController Publish node=127.0.0.1:46501_solr as DOWN
   [junit4]   2> 46461 INFO  (jetty-closer-292-thread-1) [    ] o.a.s.m.SolrMetricManager Closing metric reporters for registry=solr.node, tag=null
   [junit4]   2> 46461 INFO  (jetty-closer-292-thread-1) [    ] o.a.s.m.r.SolrJmxReporter Closing reporter [org.apache.solr.metrics.reporters.SolrJmxReporter@48f8692: rootName = solr_46501, domain = solr.node, service url = null, agent id = null] for registry solr.node / com.codahale.metrics.MetricRegistry@872213a
   [junit4]   2> 46465 INFO  (jetty-closer-292-thread-1) [    ] o.a.s.m.SolrMetricManager Closing metric reporters for registry=solr.jvm, tag=null
   [junit4]   2> 46465 INFO  (jetty-closer-292-thread-1) [    ] o.a.s.m.r.SolrJmxReporter Closing reporter [org.apache.solr.metrics.reporters.SolrJmxReporter@2d37548f: rootName = solr_46501, domain = solr.jvm, service url = null, agent id = null] for registry solr.jvm / com.codahale.metrics.MetricRegistry@21d720d8
   [junit4]   2> 46467 INFO  (jetty-closer-292-thread-1) [    ] o.a.s.m.SolrMetricManager Closing metric reporters for registry=solr.jetty, tag=null
   [junit4]   2> 46467 INFO  (jetty-closer-292-thread-1) [    ] o.a.s.m.r.SolrJmxReporter Closing reporter [org.apache.solr.metrics.reporters.SolrJmxReporter@31d3a662: rootName = solr_46501, domain = solr.jetty, service url = null, agent id = null] for registry solr.jetty / com.codahale.metrics.MetricRegistry@26acddf
   [junit4]   2> 46467 INFO  (jetty-closer-292-thread-1) [    ] o.a.s.m.SolrMetricManager Closing metric reporters for registry=solr.cluster, tag=null
   [junit4]   2> 46467 INFO  (closeThreadPool-296-thread-1) [    ] o.a.s.c.Overseer Overseer (id=72212118377070597-127.0.0.1:46501_solr-n_0000000000) closing
   [junit4]   2> 46467 INFO  (OverseerStateUpdate-72212118377070597-127.0.0.1:46501_solr-n_0000000000) [n:127.0.0.1:46501_solr    ] o.a.s.c.Overseer Overseer Loop exiting : 127.0.0.1:46501_solr
   [junit4]   2> 46467 INFO  (OverseerAutoScalingTriggerThread-72212118377070597-127.0.0.1:46501_solr-n_0000000000) [    ] o.a.s.c.a.OverseerTriggerThread OverseerTriggerThread woken up but we are closed, exiting.
   [junit4]   2> 46468 INFO  (closeThreadPool-296-thread-2) [    ] o.a.s.c.Overseer Overseer (id=72212118377070597-127.0.0.1:46501_solr-n_0000000000) closing
   [junit4]   2> 46469 INFO  (zkCallback-283-thread-1) [    ] o.a.s.c.c.ZkStateReader Updated live nodes from ZooKeeper... (1) -> (0)
   [junit4]   2> 46469 INFO  (jetty-closer-292-thread-1) [    ] o.a.s.c.Overseer Overseer (id=72212118377070597-127.0.0.1:46501_solr-n_0000000000) closing
   [junit4]   2> 46476 INFO  (jetty-closer-292-thread-1) [    ] o.e.j.s.AbstractConnector Stopped ServerConnector@244c1c18{HTTP/1.1,[http/1.1, h2c]}{127.0.0.1:0}
   [junit4]   2> 46476 INFO  (jetty-closer-292-thread-1) [    ] o.e.j.s.h.ContextHandler Stopped o.e.j.s.ServletContextHandler@55a8baee{/solr,null,UNAVAILABLE}
   [junit4]   2> 46476 INFO  (jetty-closer-292-thread-1) [    ] o.e.j.s.session node0 Stopped scavenging
   [junit4]   2> 46477 INFO  (SUITE-TestSolrCloudWithHadoopAuthPlugin-seed#[2DB4A588D46E332D]-worker) [    ] o.a.s.c.ZkTestServer Shutting down ZkTestServer.
   [junit4]   2> 46478 WARN  (ZkTestServer Run Thread) [    ] o.a.s.c.ZkTestServer Watch limit violations: 
   [junit4]   2> Maximum concurrent create/delete watches above limit:
   [junit4]   2> 
   [junit4]   2> 	4	/solr/collections/testkerberoscollection/terms/shard1
   [junit4]   2> 	3	/solr/aliases.json
   [junit4]   2> 	3	/solr/collections/testkerberoscollection/state.json
   [junit4]   2> 	3	/solr/clusterprops.json
   [junit4]   2> 
   [junit4]   2> Maximum concurrent data watches above limit:
   [junit4]   2> 
   [junit4]   2> 	6	/solr/collections/testkerberoscollection/state.json
   [junit4]   2> 	3	/solr/clusterstate.json
   [junit4]   2> 	3	/solr/clusterprops.json
   [junit4]   2> 
   [junit4]   2> Maximum concurrent children watches above limit:
   [junit4]   2> 
   [junit4]   2> 	3	/solr/live_nodes
   [junit4]   2> 	3	/solr/collections
   [junit4]   2> 
   [junit4]   2> 46479 INFO  (SUITE-TestSolrCloudWithHadoopAuthPlugin-seed#[2DB4A588D46E332D]-worker) [    ] o.a.s.c.ZkTestServer parse host and port list: 127.0.0.1:39341
   [junit4]   2> 46479 INFO  (SUITE-TestSolrCloudWithHadoopAuthPlugin-seed#[2DB4A588D46E332D]-worker) [    ] o.a.s.c.ZkTestServer connecting to 127.0.0.1 39341
   [junit4]   2> NOTE: leaving temporary files on disk at: /home/jenkins/workspace/Lucene-Solr-master-Linux/solr/build/solr-core/test/J0/temp/solr.security.hadoop.TestSolrCloudWithHadoopAuthPlugin_2DB4A588D46E332D-003
   [junit4]   2> May 07, 2019 8:55:24 PM com.carrotsearch.randomizedtesting.ThreadLeakControl checkThreadLeaks
   [junit4]   2> WARNING: Will linger awaiting termination of 1 leaked thread(s).
   [junit4]   2> NOTE: test params are: codec=Lucene80, sim=Asserting(org.apache.lucene.search.similarities.AssertingSimilarity@4cc070bc), locale=en-PK, timezone=America/Jujuy
   [junit4]   2> NOTE: Linux 4.18.0-17-generic amd64/Oracle Corporation 12 (64-bit)/cpus=8,threads=1,free=15098552,total=203423744
   [junit4]   2> NOTE: All tests run in this JVM: [TestSolrCloudWithHadoopAuthPlugin, JWTAuthPluginIntegrationTest, TestSolrCloudWithHadoopAuthPlugin, TestSolrCloudWithHadoopAuthPlugin]
   [junit4] Completed [10/10 (10!)] on J0 in 5.76s, 1 test, 1 failure <<< FAILURES!

[...truncated 20 lines...]
BUILD FAILED
/home/jenkins/workspace/Lucene-Solr-master-Linux/lucene/common-build.xml:1493: The following error occurred while executing this line:
/home/jenkins/workspace/Lucene-Solr-master-Linux/lucene/common-build.xml:1020: There were test failures: 10 suites, 20 tests, 10 failures [seed: 2DB4A588D46E332D]

Total time: 49 seconds

[repro] Setting last failure code to 256

[repro] Failures:
[repro]   5/5 failed: org.apache.solr.security.JWTAuthPluginIntegrationTest
[repro]   5/5 failed: org.apache.solr.security.hadoop.TestSolrCloudWithHadoopAuthPlugin
[repro] Exiting with code 256
+ mv lucene/build lucene/build.repro
+ mv solr/build solr/build.repro
+ mv lucene/build.orig lucene/build
+ mv solr/build.orig solr/build
Archiving artifacts
Setting ANT_1_8_2_HOME=/home/jenkins/tools/hudson.tasks.Ant_AntInstallation/ANT_1.8.2
[WARNINGS] Parsing warnings in console log with parser Java Compiler (javac)
Setting ANT_1_8_2_HOME=/home/jenkins/tools/hudson.tasks.Ant_AntInstallation/ANT_1.8.2
No credentials specified
Setting ANT_1_8_2_HOME=/home/jenkins/tools/hudson.tasks.Ant_AntInstallation/ANT_1.8.2
<Git Blamer> Using GitBlamer to create author and commit information for all warnings.
<Git Blamer> GIT_COMMIT=560b5e779d469dd5219a633fbeb09fd064174b74, workspace=/home/jenkins/workspace/Lucene-Solr-master-Linux
[WARNINGS] Computing warning deltas based on reference build #24048
Recording test results
Setting ANT_1_8_2_HOME=/home/jenkins/tools/hudson.tasks.Ant_AntInstallation/ANT_1.8.2
Build step 'Publish JUnit test result report' changed build result to UNSTABLE
Email was triggered for: Unstable (Test Failures)
Sending email for trigger: Unstable (Test Failures)
Setting ANT_1_8_2_HOME=/home/jenkins/tools/hudson.tasks.Ant_AntInstallation/ANT_1.8.2
Setting ANT_1_8_2_HOME=/home/jenkins/tools/hudson.tasks.Ant_AntInstallation/ANT_1.8.2
Setting ANT_1_8_2_HOME=/home/jenkins/tools/hudson.tasks.Ant_AntInstallation/ANT_1.8.2
Setting ANT_1_8_2_HOME=/home/jenkins/tools/hudson.tasks.Ant_AntInstallation/ANT_1.8.2
Setting ANT_1_8_2_HOME=/home/jenkins/tools/hudson.tasks.Ant_AntInstallation/ANT_1.8.2
Setting ANT_1_8_2_HOME=/home/jenkins/tools/hudson.tasks.Ant_AntInstallation/ANT_1.8.2

Mime
View raw message