lucene-dev mailing list archives

Site index · List index
Message view « Date » · « Thread »
Top « Date » · « Thread »
From Apache Jenkins Server <jenk...@builds.apache.org>
Subject [JENKINS] Lucene-Solr-Tests-8.x - Build # 180 - Still Failing
Date Wed, 01 May 2019 11:02:17 GMT
Build: https://builds.apache.org/job/Lucene-Solr-Tests-8.x/180/

3 tests failed.
FAILED:  org.apache.solr.update.PeerSyncTest.test

Error Message:
Unexpected exception type, expected SolrException but got org.apache.solr.client.solrj.SolrServerException: Timeout occurred while waiting response from server at: http://127.0.0.1:46441/c_fxm/collection1

Stack Trace:
junit.framework.AssertionFailedError: Unexpected exception type, expected SolrException but got org.apache.solr.client.solrj.SolrServerException: Timeout occurred while waiting response from server at: http://127.0.0.1:46441/c_fxm/collection1
	at __randomizedtesting.SeedInfo.seed([1F6CAF0A211DB5C7:973890D08FE1D83F]:0)
	at org.apache.lucene.util.LuceneTestCase.expectThrows(LuceneTestCase.java:2700)
	at org.apache.lucene.util.LuceneTestCase.expectThrows(LuceneTestCase.java:2689)
	at org.apache.solr.update.PeerSyncTest.test(PeerSyncTest.java:279)
	at sun.reflect.NativeMethodAccessorImpl.invoke0(Native Method)
	at sun.reflect.NativeMethodAccessorImpl.invoke(NativeMethodAccessorImpl.java:62)
	at sun.reflect.DelegatingMethodAccessorImpl.invoke(DelegatingMethodAccessorImpl.java:43)
	at java.lang.reflect.Method.invoke(Method.java:498)
	at com.carrotsearch.randomizedtesting.RandomizedRunner.invoke(RandomizedRunner.java:1750)
	at com.carrotsearch.randomizedtesting.RandomizedRunner$8.evaluate(RandomizedRunner.java:938)
	at com.carrotsearch.randomizedtesting.RandomizedRunner$9.evaluate(RandomizedRunner.java:974)
	at com.carrotsearch.randomizedtesting.RandomizedRunner$10.evaluate(RandomizedRunner.java:988)
	at org.apache.solr.BaseDistributedSearchTestCase$ShardsRepeatRule$ShardsFixedStatement.callStatement(BaseDistributedSearchTestCase.java:1082)
	at org.apache.solr.BaseDistributedSearchTestCase$ShardsRepeatRule$ShardsStatement.evaluate(BaseDistributedSearchTestCase.java:1054)
	at com.carrotsearch.randomizedtesting.rules.SystemPropertiesRestoreRule$1.evaluate(SystemPropertiesRestoreRule.java:57)
	at org.apache.lucene.util.TestRuleSetupTeardownChained$1.evaluate(TestRuleSetupTeardownChained.java:49)
	at org.apache.lucene.util.AbstractBeforeAfterRule$1.evaluate(AbstractBeforeAfterRule.java:45)
	at org.apache.lucene.util.TestRuleThreadAndTestName$1.evaluate(TestRuleThreadAndTestName.java:48)
	at org.apache.lucene.util.TestRuleIgnoreAfterMaxFailures$1.evaluate(TestRuleIgnoreAfterMaxFailures.java:64)
	at org.apache.lucene.util.TestRuleMarkFailure$1.evaluate(TestRuleMarkFailure.java:47)
	at com.carrotsearch.randomizedtesting.rules.StatementAdapter.evaluate(StatementAdapter.java:36)
	at com.carrotsearch.randomizedtesting.ThreadLeakControl$StatementRunner.run(ThreadLeakControl.java:368)
	at com.carrotsearch.randomizedtesting.ThreadLeakControl.forkTimeoutingTask(ThreadLeakControl.java:817)
	at com.carrotsearch.randomizedtesting.ThreadLeakControl$3.evaluate(ThreadLeakControl.java:468)
	at com.carrotsearch.randomizedtesting.RandomizedRunner.runSingleTest(RandomizedRunner.java:947)
	at com.carrotsearch.randomizedtesting.RandomizedRunner$5.evaluate(RandomizedRunner.java:832)
	at com.carrotsearch.randomizedtesting.RandomizedRunner$6.evaluate(RandomizedRunner.java:883)
	at com.carrotsearch.randomizedtesting.RandomizedRunner$7.evaluate(RandomizedRunner.java:894)
	at com.carrotsearch.randomizedtesting.rules.StatementAdapter.evaluate(StatementAdapter.java:36)
	at com.carrotsearch.randomizedtesting.rules.SystemPropertiesRestoreRule$1.evaluate(SystemPropertiesRestoreRule.java:57)
	at org.apache.lucene.util.AbstractBeforeAfterRule$1.evaluate(AbstractBeforeAfterRule.java:45)
	at com.carrotsearch.randomizedtesting.rules.StatementAdapter.evaluate(StatementAdapter.java:36)
	at org.apache.lucene.util.TestRuleStoreClassName$1.evaluate(TestRuleStoreClassName.java:41)
	at com.carrotsearch.randomizedtesting.rules.NoShadowingOrOverridesOnMethodsRule$1.evaluate(NoShadowingOrOverridesOnMethodsRule.java:40)
	at com.carrotsearch.randomizedtesting.rules.NoShadowingOrOverridesOnMethodsRule$1.evaluate(NoShadowingOrOverridesOnMethodsRule.java:40)
	at com.carrotsearch.randomizedtesting.rules.StatementAdapter.evaluate(StatementAdapter.java:36)
	at com.carrotsearch.randomizedtesting.rules.StatementAdapter.evaluate(StatementAdapter.java:36)
	at com.carrotsearch.randomizedtesting.rules.StatementAdapter.evaluate(StatementAdapter.java:36)
	at org.apache.lucene.util.TestRuleAssertionsRequired$1.evaluate(TestRuleAssertionsRequired.java:53)
	at org.apache.lucene.util.TestRuleMarkFailure$1.evaluate(TestRuleMarkFailure.java:47)
	at org.apache.lucene.util.TestRuleIgnoreAfterMaxFailures$1.evaluate(TestRuleIgnoreAfterMaxFailures.java:64)
	at org.apache.lucene.util.TestRuleIgnoreTestSuites$1.evaluate(TestRuleIgnoreTestSuites.java:54)
	at com.carrotsearch.randomizedtesting.rules.StatementAdapter.evaluate(StatementAdapter.java:36)
	at com.carrotsearch.randomizedtesting.ThreadLeakControl$StatementRunner.run(ThreadLeakControl.java:368)
	at java.lang.Thread.run(Thread.java:748)
Caused by: org.apache.solr.client.solrj.SolrServerException: Timeout occurred while waiting response from server at: http://127.0.0.1:46441/c_fxm/collection1
	at org.apache.solr.client.solrj.impl.HttpSolrClient.executeMethod(HttpSolrClient.java:660)
	at org.apache.solr.client.solrj.impl.HttpSolrClient.request(HttpSolrClient.java:255)
	at org.apache.solr.client.solrj.impl.HttpSolrClient.request(HttpSolrClient.java:244)
	at org.apache.solr.client.solrj.SolrRequest.process(SolrRequest.java:207)
	at org.apache.solr.client.solrj.SolrRequest.process(SolrRequest.java:224)
	at org.apache.solr.BaseDistributedSearchTestCase.add(BaseDistributedSearchTestCase.java:576)
	at org.apache.solr.update.PeerSyncTest.lambda$test$0(PeerSyncTest.java:281)
	at org.apache.lucene.util.LuceneTestCase.expectThrows(LuceneTestCase.java:2695)
	... 43 more
Caused by: java.net.SocketTimeoutException: Read timed out
	at java.net.SocketInputStream.socketRead0(Native Method)
	at java.net.SocketInputStream.socketRead(SocketInputStream.java:116)
	at java.net.SocketInputStream.read(SocketInputStream.java:171)
	at java.net.SocketInputStream.read(SocketInputStream.java:141)
	at org.apache.http.impl.io.SessionInputBufferImpl.streamRead(SessionInputBufferImpl.java:137)
	at org.apache.http.impl.io.SessionInputBufferImpl.fillBuffer(SessionInputBufferImpl.java:153)
	at org.apache.http.impl.io.SessionInputBufferImpl.readLine(SessionInputBufferImpl.java:282)
	at org.apache.http.impl.conn.DefaultHttpResponseParser.parseHead(DefaultHttpResponseParser.java:138)
	at org.apache.http.impl.conn.DefaultHttpResponseParser.parseHead(DefaultHttpResponseParser.java:56)
	at org.apache.http.impl.io.AbstractMessageParser.parse(AbstractMessageParser.java:259)
	at org.apache.http.impl.DefaultBHttpClientConnection.receiveResponseHeader(DefaultBHttpClientConnection.java:163)
	at org.apache.http.impl.conn.CPoolProxy.receiveResponseHeader(CPoolProxy.java:165)
	at org.apache.http.protocol.HttpRequestExecutor.doReceiveResponse(HttpRequestExecutor.java:273)
	at org.apache.http.protocol.HttpRequestExecutor.execute(HttpRequestExecutor.java:125)
	at org.apache.http.impl.execchain.MainClientExec.execute(MainClientExec.java:272)
	at org.apache.http.impl.execchain.ProtocolExec.execute(ProtocolExec.java:185)
	at org.apache.http.impl.execchain.RetryExec.execute(RetryExec.java:89)
	at org.apache.http.impl.execchain.RedirectExec.execute(RedirectExec.java:110)
	at org.apache.http.impl.client.InternalHttpClient.doExecute(InternalHttpClient.java:185)
	at org.apache.http.impl.client.CloseableHttpClient.execute(CloseableHttpClient.java:83)
	at org.apache.http.impl.client.CloseableHttpClient.execute(CloseableHttpClient.java:56)
	at org.apache.solr.client.solrj.impl.HttpSolrClient.executeMethod(HttpSolrClient.java:548)
	... 50 more


FAILED:  org.apache.solr.update.PeerSyncWithLeaderTest.test

Error Message:
Unexpected exception type, expected SolrException but got org.apache.solr.client.solrj.SolrServerException: Timeout occurred while waiting response from server at: http://127.0.0.1:37756/collection1

Stack Trace:
junit.framework.AssertionFailedError: Unexpected exception type, expected SolrException but got org.apache.solr.client.solrj.SolrServerException: Timeout occurred while waiting response from server at: http://127.0.0.1:37756/collection1
	at __randomizedtesting.SeedInfo.seed([1F6CAF0A211DB5C7:973890D08FE1D83F]:0)
	at org.apache.lucene.util.LuceneTestCase.expectThrows(LuceneTestCase.java:2700)
	at org.apache.lucene.util.LuceneTestCase.expectThrows(LuceneTestCase.java:2689)
	at org.apache.solr.update.PeerSyncTest.test(PeerSyncTest.java:279)
	at sun.reflect.NativeMethodAccessorImpl.invoke0(Native Method)
	at sun.reflect.NativeMethodAccessorImpl.invoke(NativeMethodAccessorImpl.java:62)
	at sun.reflect.DelegatingMethodAccessorImpl.invoke(DelegatingMethodAccessorImpl.java:43)
	at java.lang.reflect.Method.invoke(Method.java:498)
	at com.carrotsearch.randomizedtesting.RandomizedRunner.invoke(RandomizedRunner.java:1750)
	at com.carrotsearch.randomizedtesting.RandomizedRunner$8.evaluate(RandomizedRunner.java:938)
	at com.carrotsearch.randomizedtesting.RandomizedRunner$9.evaluate(RandomizedRunner.java:974)
	at com.carrotsearch.randomizedtesting.RandomizedRunner$10.evaluate(RandomizedRunner.java:988)
	at org.apache.solr.BaseDistributedSearchTestCase$ShardsRepeatRule$ShardsFixedStatement.callStatement(BaseDistributedSearchTestCase.java:1082)
	at org.apache.solr.BaseDistributedSearchTestCase$ShardsRepeatRule$ShardsStatement.evaluate(BaseDistributedSearchTestCase.java:1054)
	at com.carrotsearch.randomizedtesting.rules.SystemPropertiesRestoreRule$1.evaluate(SystemPropertiesRestoreRule.java:57)
	at org.apache.lucene.util.TestRuleSetupTeardownChained$1.evaluate(TestRuleSetupTeardownChained.java:49)
	at org.apache.lucene.util.AbstractBeforeAfterRule$1.evaluate(AbstractBeforeAfterRule.java:45)
	at org.apache.lucene.util.TestRuleThreadAndTestName$1.evaluate(TestRuleThreadAndTestName.java:48)
	at org.apache.lucene.util.TestRuleIgnoreAfterMaxFailures$1.evaluate(TestRuleIgnoreAfterMaxFailures.java:64)
	at org.apache.lucene.util.TestRuleMarkFailure$1.evaluate(TestRuleMarkFailure.java:47)
	at com.carrotsearch.randomizedtesting.rules.StatementAdapter.evaluate(StatementAdapter.java:36)
	at com.carrotsearch.randomizedtesting.ThreadLeakControl$StatementRunner.run(ThreadLeakControl.java:368)
	at com.carrotsearch.randomizedtesting.ThreadLeakControl.forkTimeoutingTask(ThreadLeakControl.java:817)
	at com.carrotsearch.randomizedtesting.ThreadLeakControl$3.evaluate(ThreadLeakControl.java:468)
	at com.carrotsearch.randomizedtesting.RandomizedRunner.runSingleTest(RandomizedRunner.java:947)
	at com.carrotsearch.randomizedtesting.RandomizedRunner$5.evaluate(RandomizedRunner.java:832)
	at com.carrotsearch.randomizedtesting.RandomizedRunner$6.evaluate(RandomizedRunner.java:883)
	at com.carrotsearch.randomizedtesting.RandomizedRunner$7.evaluate(RandomizedRunner.java:894)
	at com.carrotsearch.randomizedtesting.rules.StatementAdapter.evaluate(StatementAdapter.java:36)
	at com.carrotsearch.randomizedtesting.rules.SystemPropertiesRestoreRule$1.evaluate(SystemPropertiesRestoreRule.java:57)
	at org.apache.lucene.util.AbstractBeforeAfterRule$1.evaluate(AbstractBeforeAfterRule.java:45)
	at com.carrotsearch.randomizedtesting.rules.StatementAdapter.evaluate(StatementAdapter.java:36)
	at org.apache.lucene.util.TestRuleStoreClassName$1.evaluate(TestRuleStoreClassName.java:41)
	at com.carrotsearch.randomizedtesting.rules.NoShadowingOrOverridesOnMethodsRule$1.evaluate(NoShadowingOrOverridesOnMethodsRule.java:40)
	at com.carrotsearch.randomizedtesting.rules.NoShadowingOrOverridesOnMethodsRule$1.evaluate(NoShadowingOrOverridesOnMethodsRule.java:40)
	at com.carrotsearch.randomizedtesting.rules.StatementAdapter.evaluate(StatementAdapter.java:36)
	at com.carrotsearch.randomizedtesting.rules.StatementAdapter.evaluate(StatementAdapter.java:36)
	at com.carrotsearch.randomizedtesting.rules.StatementAdapter.evaluate(StatementAdapter.java:36)
	at org.apache.lucene.util.TestRuleAssertionsRequired$1.evaluate(TestRuleAssertionsRequired.java:53)
	at org.apache.lucene.util.TestRuleMarkFailure$1.evaluate(TestRuleMarkFailure.java:47)
	at org.apache.lucene.util.TestRuleIgnoreAfterMaxFailures$1.evaluate(TestRuleIgnoreAfterMaxFailures.java:64)
	at org.apache.lucene.util.TestRuleIgnoreTestSuites$1.evaluate(TestRuleIgnoreTestSuites.java:54)
	at com.carrotsearch.randomizedtesting.rules.StatementAdapter.evaluate(StatementAdapter.java:36)
	at com.carrotsearch.randomizedtesting.ThreadLeakControl$StatementRunner.run(ThreadLeakControl.java:368)
	at java.lang.Thread.run(Thread.java:748)
Caused by: org.apache.solr.client.solrj.SolrServerException: Timeout occurred while waiting response from server at: http://127.0.0.1:37756/collection1
	at org.apache.solr.client.solrj.impl.HttpSolrClient.executeMethod(HttpSolrClient.java:660)
	at org.apache.solr.client.solrj.impl.HttpSolrClient.request(HttpSolrClient.java:255)
	at org.apache.solr.client.solrj.impl.HttpSolrClient.request(HttpSolrClient.java:244)
	at org.apache.solr.client.solrj.SolrRequest.process(SolrRequest.java:207)
	at org.apache.solr.client.solrj.SolrRequest.process(SolrRequest.java:224)
	at org.apache.solr.BaseDistributedSearchTestCase.add(BaseDistributedSearchTestCase.java:576)
	at org.apache.solr.update.PeerSyncTest.lambda$test$0(PeerSyncTest.java:281)
	at org.apache.lucene.util.LuceneTestCase.expectThrows(LuceneTestCase.java:2695)
	... 43 more
Caused by: java.net.SocketTimeoutException: Read timed out
	at java.net.SocketInputStream.socketRead0(Native Method)
	at java.net.SocketInputStream.socketRead(SocketInputStream.java:116)
	at java.net.SocketInputStream.read(SocketInputStream.java:171)
	at java.net.SocketInputStream.read(SocketInputStream.java:141)
	at org.apache.http.impl.io.SessionInputBufferImpl.streamRead(SessionInputBufferImpl.java:137)
	at org.apache.http.impl.io.SessionInputBufferImpl.fillBuffer(SessionInputBufferImpl.java:153)
	at org.apache.http.impl.io.SessionInputBufferImpl.readLine(SessionInputBufferImpl.java:282)
	at org.apache.http.impl.conn.DefaultHttpResponseParser.parseHead(DefaultHttpResponseParser.java:138)
	at org.apache.http.impl.conn.DefaultHttpResponseParser.parseHead(DefaultHttpResponseParser.java:56)
	at org.apache.http.impl.io.AbstractMessageParser.parse(AbstractMessageParser.java:259)
	at org.apache.http.impl.DefaultBHttpClientConnection.receiveResponseHeader(DefaultBHttpClientConnection.java:163)
	at org.apache.http.impl.conn.CPoolProxy.receiveResponseHeader(CPoolProxy.java:165)
	at org.apache.http.protocol.HttpRequestExecutor.doReceiveResponse(HttpRequestExecutor.java:273)
	at org.apache.http.protocol.HttpRequestExecutor.execute(HttpRequestExecutor.java:125)
	at org.apache.http.impl.execchain.MainClientExec.execute(MainClientExec.java:272)
	at org.apache.http.impl.execchain.ProtocolExec.execute(ProtocolExec.java:185)
	at org.apache.http.impl.execchain.RetryExec.execute(RetryExec.java:89)
	at org.apache.http.impl.execchain.RedirectExec.execute(RedirectExec.java:110)
	at org.apache.http.impl.client.InternalHttpClient.doExecute(InternalHttpClient.java:185)
	at org.apache.http.impl.client.CloseableHttpClient.execute(CloseableHttpClient.java:83)
	at org.apache.http.impl.client.CloseableHttpClient.execute(CloseableHttpClient.java:56)
	at org.apache.solr.client.solrj.impl.HttpSolrClient.executeMethod(HttpSolrClient.java:548)
	... 50 more


FAILED:  org.apache.solr.update.TestInPlaceUpdatesDistrib.test

Error Message:
Thread pool didn't terminate within 15 secs

Stack Trace:
java.lang.AssertionError: Thread pool didn't terminate within 15 secs
	at __randomizedtesting.SeedInfo.seed([1F6CAF0A211DB5C7:973890D08FE1D83F]:0)
	at org.junit.Assert.fail(Assert.java:88)
	at org.junit.Assert.assertTrue(Assert.java:41)
	at org.apache.solr.update.TestInPlaceUpdatesDistrib.reorderedDBQsResurrectionTest(TestInPlaceUpdatesDistrib.java:852)
	at org.apache.solr.update.TestInPlaceUpdatesDistrib.test(TestInPlaceUpdatesDistrib.java:179)
	at sun.reflect.NativeMethodAccessorImpl.invoke0(Native Method)
	at sun.reflect.NativeMethodAccessorImpl.invoke(NativeMethodAccessorImpl.java:62)
	at sun.reflect.DelegatingMethodAccessorImpl.invoke(DelegatingMethodAccessorImpl.java:43)
	at java.lang.reflect.Method.invoke(Method.java:498)
	at com.carrotsearch.randomizedtesting.RandomizedRunner.invoke(RandomizedRunner.java:1750)
	at com.carrotsearch.randomizedtesting.RandomizedRunner$8.evaluate(RandomizedRunner.java:938)
	at com.carrotsearch.randomizedtesting.RandomizedRunner$9.evaluate(RandomizedRunner.java:974)
	at com.carrotsearch.randomizedtesting.RandomizedRunner$10.evaluate(RandomizedRunner.java:988)
	at org.apache.solr.BaseDistributedSearchTestCase$ShardsRepeatRule$ShardsFixedStatement.callStatement(BaseDistributedSearchTestCase.java:1082)
	at org.apache.solr.BaseDistributedSearchTestCase$ShardsRepeatRule$ShardsStatement.evaluate(BaseDistributedSearchTestCase.java:1054)
	at com.carrotsearch.randomizedtesting.rules.SystemPropertiesRestoreRule$1.evaluate(SystemPropertiesRestoreRule.java:57)
	at org.apache.lucene.util.TestRuleSetupTeardownChained$1.evaluate(TestRuleSetupTeardownChained.java:49)
	at org.apache.lucene.util.AbstractBeforeAfterRule$1.evaluate(AbstractBeforeAfterRule.java:45)
	at org.apache.lucene.util.TestRuleThreadAndTestName$1.evaluate(TestRuleThreadAndTestName.java:48)
	at org.apache.lucene.util.TestRuleIgnoreAfterMaxFailures$1.evaluate(TestRuleIgnoreAfterMaxFailures.java:64)
	at org.apache.lucene.util.TestRuleMarkFailure$1.evaluate(TestRuleMarkFailure.java:47)
	at com.carrotsearch.randomizedtesting.rules.StatementAdapter.evaluate(StatementAdapter.java:36)
	at com.carrotsearch.randomizedtesting.ThreadLeakControl$StatementRunner.run(ThreadLeakControl.java:368)
	at com.carrotsearch.randomizedtesting.ThreadLeakControl.forkTimeoutingTask(ThreadLeakControl.java:817)
	at com.carrotsearch.randomizedtesting.ThreadLeakControl$3.evaluate(ThreadLeakControl.java:468)
	at com.carrotsearch.randomizedtesting.RandomizedRunner.runSingleTest(RandomizedRunner.java:947)
	at com.carrotsearch.randomizedtesting.RandomizedRunner$5.evaluate(RandomizedRunner.java:832)
	at com.carrotsearch.randomizedtesting.RandomizedRunner$6.evaluate(RandomizedRunner.java:883)
	at com.carrotsearch.randomizedtesting.RandomizedRunner$7.evaluate(RandomizedRunner.java:894)
	at com.carrotsearch.randomizedtesting.rules.StatementAdapter.evaluate(StatementAdapter.java:36)
	at com.carrotsearch.randomizedtesting.rules.SystemPropertiesRestoreRule$1.evaluate(SystemPropertiesRestoreRule.java:57)
	at org.apache.lucene.util.AbstractBeforeAfterRule$1.evaluate(AbstractBeforeAfterRule.java:45)
	at com.carrotsearch.randomizedtesting.rules.StatementAdapter.evaluate(StatementAdapter.java:36)
	at org.apache.lucene.util.TestRuleStoreClassName$1.evaluate(TestRuleStoreClassName.java:41)
	at com.carrotsearch.randomizedtesting.rules.NoShadowingOrOverridesOnMethodsRule$1.evaluate(NoShadowingOrOverridesOnMethodsRule.java:40)
	at com.carrotsearch.randomizedtesting.rules.NoShadowingOrOverridesOnMethodsRule$1.evaluate(NoShadowingOrOverridesOnMethodsRule.java:40)
	at com.carrotsearch.randomizedtesting.rules.StatementAdapter.evaluate(StatementAdapter.java:36)
	at com.carrotsearch.randomizedtesting.rules.StatementAdapter.evaluate(StatementAdapter.java:36)
	at com.carrotsearch.randomizedtesting.rules.StatementAdapter.evaluate(StatementAdapter.java:36)
	at org.apache.lucene.util.TestRuleAssertionsRequired$1.evaluate(TestRuleAssertionsRequired.java:53)
	at org.apache.lucene.util.TestRuleMarkFailure$1.evaluate(TestRuleMarkFailure.java:47)
	at org.apache.lucene.util.TestRuleIgnoreAfterMaxFailures$1.evaluate(TestRuleIgnoreAfterMaxFailures.java:64)
	at org.apache.lucene.util.TestRuleIgnoreTestSuites$1.evaluate(TestRuleIgnoreTestSuites.java:54)
	at com.carrotsearch.randomizedtesting.rules.StatementAdapter.evaluate(StatementAdapter.java:36)
	at com.carrotsearch.randomizedtesting.ThreadLeakControl$StatementRunner.run(ThreadLeakControl.java:368)
	at java.lang.Thread.run(Thread.java:748)




Build Log:
[...truncated 14256 lines...]
   [junit4] Suite: org.apache.solr.update.PeerSyncTest
   [junit4]   2> Creating dataDir: /x1/jenkins/jenkins-slave/workspace/Lucene-Solr-Tests-8.x/solr/build/solr-core/test/J1/temp/solr.update.PeerSyncTest_1F6CAF0A211DB5C7-001/init-core-data-001
   [junit4]   2> 1150002 INFO  (SUITE-PeerSyncTest-seed#[1F6CAF0A211DB5C7]-worker) [    ] o.a.s.BaseDistributedSearchTestCase Setting hostContext system property: /c_fxm/
   [junit4]   2> 1150003 INFO  (TEST-PeerSyncTest.test-seed#[1F6CAF0A211DB5C7]) [    ] o.a.s.c.SolrResourceLoader [null] Added 2 libs to classloader, from paths: [/x1/jenkins/jenkins-slave/workspace/Lucene-Solr-Tests-8.x/solr/core/src/test-files/solr/collection1/lib, /x1/jenkins/jenkins-slave/workspace/Lucene-Solr-Tests-8.x/solr/core/src/test-files/solr/collection1/lib/classes]
   [junit4]   2> 1150033 INFO  (TEST-PeerSyncTest.test-seed#[1F6CAF0A211DB5C7]) [    ] o.a.s.c.SolrConfig Using Lucene MatchVersion: 8.1.0
   [junit4]   2> 1150055 INFO  (TEST-PeerSyncTest.test-seed#[1F6CAF0A211DB5C7]) [    ] o.a.s.s.IndexSchema [null] Schema name=test
   [junit4]   2> 1150243 INFO  (TEST-PeerSyncTest.test-seed#[1F6CAF0A211DB5C7]) [    ] o.a.s.s.IndexSchema Loaded schema test/1.0 with uniqueid field id
   [junit4]   2> 1150379 INFO  (TEST-PeerSyncTest.test-seed#[1F6CAF0A211DB5C7]) [    ] o.a.s.h.c.HttpShardHandlerFactory Host whitelist initialized: WhitelistHostChecker [whitelistHosts=null, whitelistHostCheckingEnabled=false]
   [junit4]   2> 1150382 WARN  (TEST-PeerSyncTest.test-seed#[1F6CAF0A211DB5C7]) [    ] o.e.j.u.s.S.config No Client EndPointIdentificationAlgorithm configured for SslContextFactory@4f2f56ef[provider=null,keyStore=null,trustStore=null]
   [junit4]   2> 1150387 WARN  (TEST-PeerSyncTest.test-seed#[1F6CAF0A211DB5C7]) [    ] o.e.j.u.s.S.config No Client EndPointIdentificationAlgorithm configured for SslContextFactory@10b88063[provider=null,keyStore=null,trustStore=null]
   [junit4]   2> 1150413 INFO  (TEST-PeerSyncTest.test-seed#[1F6CAF0A211DB5C7]) [    ] o.a.s.c.TransientSolrCoreCacheDefault Allocating transient cache for 2147483647 transient cores
   [junit4]   2> 1150414 INFO  (TEST-PeerSyncTest.test-seed#[1F6CAF0A211DB5C7]) [    ] o.a.s.h.a.MetricsHistoryHandler No .system collection, keeping metrics history in memory.
   [junit4]   2> 1150436 INFO  (TEST-PeerSyncTest.test-seed#[1F6CAF0A211DB5C7]) [    ] o.a.s.m.r.SolrJmxReporter JMX monitoring for 'solr.node' (registry 'solr.node') enabled at server: com.sun.jmx.mbeanserver.JmxMBeanServer@e847652
   [junit4]   2> 1150448 INFO  (TEST-PeerSyncTest.test-seed#[1F6CAF0A211DB5C7]) [    ] o.a.s.m.r.SolrJmxReporter JMX monitoring for 'solr.jvm' (registry 'solr.jvm') enabled at server: com.sun.jmx.mbeanserver.JmxMBeanServer@e847652
   [junit4]   2> 1150448 INFO  (TEST-PeerSyncTest.test-seed#[1F6CAF0A211DB5C7]) [    ] o.a.s.m.r.SolrJmxReporter JMX monitoring for 'solr.jetty' (registry 'solr.jetty') enabled at server: com.sun.jmx.mbeanserver.JmxMBeanServer@e847652
   [junit4]   2> 1150465 INFO  (coreLoadExecutor-5534-thread-1) [    x:collection1] o.a.s.c.SolrResourceLoader [null] Added 2 libs to classloader, from paths: [/x1/jenkins/jenkins-slave/workspace/Lucene-Solr-Tests-8.x/solr/core/src/test-files/solr/collection1/lib, /x1/jenkins/jenkins-slave/workspace/Lucene-Solr-Tests-8.x/solr/core/src/test-files/solr/collection1/lib/classes]
   [junit4]   2> 1150501 INFO  (coreLoadExecutor-5534-thread-1) [    x:collection1] o.a.s.c.SolrConfig Using Lucene MatchVersion: 8.1.0
   [junit4]   2> 1150542 INFO  (coreLoadExecutor-5534-thread-1) [    x:collection1] o.a.s.s.IndexSchema [collection1] Schema name=test
   [junit4]   2> 1150715 INFO  (coreLoadExecutor-5534-thread-1) [    x:collection1] o.a.s.s.IndexSchema Loaded schema test/1.0 with uniqueid field id
   [junit4]   2> 1150737 INFO  (coreLoadExecutor-5534-thread-1) [    x:collection1] o.a.s.c.CoreContainer Creating SolrCore 'collection1' using configuration from instancedir /x1/jenkins/jenkins-slave/workspace/Lucene-Solr-Tests-8.x/solr/core/src/test-files/solr/collection1, trusted=true
   [junit4]   2> 1150738 INFO  (coreLoadExecutor-5534-thread-1) [    x:collection1] o.a.s.m.r.SolrJmxReporter JMX monitoring for 'solr.core.collection1' (registry 'solr.core.collection1') enabled at server: com.sun.jmx.mbeanserver.JmxMBeanServer@e847652
   [junit4]   2> 1150738 INFO  (coreLoadExecutor-5534-thread-1) [    x:collection1] o.a.s.c.SolrCore [[collection1] ] Opening new SolrCore at [/x1/jenkins/jenkins-slave/workspace/Lucene-Solr-Tests-8.x/solr/core/src/test-files/solr/collection1], dataDir=[/x1/jenkins/jenkins-slave/workspace/Lucene-Solr-Tests-8.x/solr/build/solr-core/test/J1/temp/solr.update.PeerSyncTest_1F6CAF0A211DB5C7-001/init-core-data-001/]
   [junit4]   2> 1150740 INFO  (coreLoadExecutor-5534-thread-1) [    x:collection1] o.a.s.u.RandomMergePolicy RandomMergePolicy wrapping class org.apache.lucene.index.LogByteSizeMergePolicy: [LogByteSizeMergePolicy: minMergeSize=1677721, mergeFactor=44, maxMergeSize=2147483648, maxMergeSizeForForcedMerge=9223372036854775807, calibrateSizeByDeletes=false, maxMergeDocs=2147483647, maxCFSSegmentSizeMB=8.796093022207999E12, noCFSRatio=0.0]
   [junit4]   2> 1150743 WARN  (coreLoadExecutor-5534-thread-1) [    x:collection1] o.a.s.c.RequestHandlers INVALID paramSet a in requestHandler {type = requestHandler,name = /dump,class = DumpRequestHandler,attributes = {initParams=a, name=/dump, class=DumpRequestHandler},args = {defaults={a=A,b=B}}}
   [junit4]   2> 1150807 INFO  (coreLoadExecutor-5534-thread-1) [    x:collection1] o.a.s.u.UpdateHandler Using UpdateLog implementation: org.apache.solr.update.UpdateLog
   [junit4]   2> 1150807 INFO  (coreLoadExecutor-5534-thread-1) [    x:collection1] o.a.s.u.UpdateLog Initializing UpdateLog: dataDir= defaultSyncLevel=FLUSH numRecordsToKeep=100 maxNumLogsToKeep=10 numVersionBuckets=65536
   [junit4]   2> 1150808 INFO  (coreLoadExecutor-5534-thread-1) [    x:collection1] o.a.s.u.CommitTracker Hard AutoCommit: disabled
   [junit4]   2> 1150808 INFO  (coreLoadExecutor-5534-thread-1) [    x:collection1] o.a.s.u.CommitTracker Soft AutoCommit: disabled
   [junit4]   2> 1150809 INFO  (coreLoadExecutor-5534-thread-1) [    x:collection1] o.a.s.u.RandomMergePolicy RandomMergePolicy wrapping class org.apache.lucene.index.TieredMergePolicy: [TieredMergePolicy: maxMergeAtOnce=30, maxMergeAtOnceExplicit=27, maxMergedSegmentMB=26.0166015625, floorSegmentMB=1.5185546875, forceMergeDeletesPctAllowed=9.297114121057213, segmentsPerTier=26.0, maxCFSSegmentSizeMB=8.796093022207999E12, noCFSRatio=1.0, deletesPctAllowed=24.350423108116424
   [junit4]   2> 1150809 INFO  (coreLoadExecutor-5534-thread-1) [    x:collection1] o.a.s.s.SolrIndexSearcher Opening [Searcher@6229647b[collection1] main]
   [junit4]   2> 1150810 WARN  (coreLoadExecutor-5534-thread-1) [    x:collection1] o.a.s.r.ManagedResourceStorage Cannot write to config directory /x1/jenkins/jenkins-slave/workspace/Lucene-Solr-Tests-8.x/solr/core/src/test-files/solr/collection1/conf; switching to use InMemory storage instead.
   [junit4]   2> 1150810 INFO  (coreLoadExecutor-5534-thread-1) [    x:collection1] o.a.s.h.ReplicationHandler Commits will be reserved for 10000ms.
   [junit4]   2> 1150810 INFO  (coreLoadExecutor-5534-thread-1) [    x:collection1] o.a.s.u.UpdateLog Could not find max version in index or recent updates, using new clock 1632324788111278080
   [junit4]   2> 1150813 INFO  (searcherExecutor-5535-thread-1-processing-x:collection1) [    x:collection1] o.a.s.c.SolrCore [collection1] Registered new searcher Searcher@6229647b[collection1] main{ExitableDirectoryReader(UninvertingDirectoryReader())}
   [junit4]   2> 1151001 WARN  (TEST-PeerSyncTest.test-seed#[1F6CAF0A211DB5C7]) [    ] o.e.j.s.AbstractConnector Ignoring deprecated socket close linger time
   [junit4]   2> 1151002 INFO  (TEST-PeerSyncTest.test-seed#[1F6CAF0A211DB5C7]) [    ] o.a.s.c.s.e.JettySolrRunner Start Jetty (original configured port=0)
   [junit4]   2> 1151002 INFO  (TEST-PeerSyncTest.test-seed#[1F6CAF0A211DB5C7]) [    ] o.a.s.c.s.e.JettySolrRunner Trying to start Jetty on port 0 try number 1 ...
   [junit4]   2> 1151002 INFO  (TEST-PeerSyncTest.test-seed#[1F6CAF0A211DB5C7]) [    ] o.e.j.s.Server jetty-9.4.14.v20181114; built: 2018-11-14T21:20:31.478Z; git: c4550056e785fb5665914545889f21dc136ad9e6; jvm 1.8.0_191-b12
   [junit4]   2> 1151003 INFO  (TEST-PeerSyncTest.test-seed#[1F6CAF0A211DB5C7]) [    ] o.e.j.s.session DefaultSessionIdManager workerName=node0
   [junit4]   2> 1151003 INFO  (TEST-PeerSyncTest.test-seed#[1F6CAF0A211DB5C7]) [    ] o.e.j.s.session No SessionScavenger set, using defaults
   [junit4]   2> 1151003 INFO  (TEST-PeerSyncTest.test-seed#[1F6CAF0A211DB5C7]) [    ] o.e.j.s.session node0 Scavenging every 660000ms
   [junit4]   2> 1151006 INFO  (TEST-PeerSyncTest.test-seed#[1F6CAF0A211DB5C7]) [    ] o.e.j.s.h.ContextHandler Started o.e.j.s.ServletContextHandler@1c404d85{/c_fxm,null,AVAILABLE}
   [junit4]   2> 1151006 INFO  (TEST-PeerSyncTest.test-seed#[1F6CAF0A211DB5C7]) [    ] o.e.j.s.AbstractConnector Started ServerConnector@6666beaa{HTTP/1.1,[http/1.1, h2c]}{127.0.0.1:33232}
   [junit4]   2> 1151006 INFO  (TEST-PeerSyncTest.test-seed#[1F6CAF0A211DB5C7]) [    ] o.e.j.s.Server Started @1151085ms
   [junit4]   2> 1151006 INFO  (TEST-PeerSyncTest.test-seed#[1F6CAF0A211DB5C7]) [    ] o.a.s.c.s.e.JettySolrRunner Jetty properties: {schema=schema.xml, solrconfig=solrconfig-tlog.xml, hostContext=/c_fxm, hostPort=33232, coreRootDirectory=/x1/jenkins/jenkins-slave/workspace/Lucene-Solr-Tests-8.x/solr/build/solr-core/test/J1/temp/solr.update.PeerSyncTest_1F6CAF0A211DB5C7-001/tempDir-001/control/cores}
   [junit4]   2> 1151007 ERROR (TEST-PeerSyncTest.test-seed#[1F6CAF0A211DB5C7]) [    ] o.a.s.u.StartupLoggingUtils Missing Java Option solr.log.dir. Logging may be missing or incomplete.
   [junit4]   2> 1151007 INFO  (TEST-PeerSyncTest.test-seed#[1F6CAF0A211DB5C7]) [    ] o.a.s.s.SolrDispatchFilter Using logger factory org.apache.logging.slf4j.Log4jLoggerFactory
   [junit4]   2> 1151007 INFO  (TEST-PeerSyncTest.test-seed#[1F6CAF0A211DB5C7]) [    ] o.a.s.s.SolrDispatchFilter  ___      _       Welcome to Apache Solr™ version 8.1.0
   [junit4]   2> 1151007 INFO  (TEST-PeerSyncTest.test-seed#[1F6CAF0A211DB5C7]) [    ] o.a.s.s.SolrDispatchFilter / __| ___| |_ _   Starting in standalone mode on port null
   [junit4]   2> 1151007 INFO  (TEST-PeerSyncTest.test-seed#[1F6CAF0A211DB5C7]) [    ] o.a.s.s.SolrDispatchFilter \__ \/ _ \ | '_|  Install dir: null
   [junit4]   2> 1151007 INFO  (TEST-PeerSyncTest.test-seed#[1F6CAF0A211DB5C7]) [    ] o.a.s.s.SolrDispatchFilter |___/\___/_|_|    Start time: 2019-05-01T10:23:46.652Z
   [junit4]   2> 1151007 INFO  (TEST-PeerSyncTest.test-seed#[1F6CAF0A211DB5C7]) [    ] o.a.s.c.SolrXmlConfig Loading container configuration from /x1/jenkins/jenkins-slave/workspace/Lucene-Solr-Tests-8.x/solr/build/solr-core/test/J1/temp/solr.update.PeerSyncTest_1F6CAF0A211DB5C7-001/tempDir-001/control/solr.xml
   [junit4]   2> 1151012 INFO  (TEST-PeerSyncTest.test-seed#[1F6CAF0A211DB5C7]) [    ] o.a.s.c.SolrXmlConfig Configuration parameter autoReplicaFailoverWorkLoopDelay is ignored
   [junit4]   2> 1151012 INFO  (TEST-PeerSyncTest.test-seed#[1F6CAF0A211DB5C7]) [    ] o.a.s.c.SolrXmlConfig Configuration parameter autoReplicaFailoverBadNodeExpiration is ignored
   [junit4]   2> 1151014 INFO  (TEST-PeerSyncTest.test-seed#[1F6CAF0A211DB5C7]) [    ] o.a.s.c.SolrXmlConfig MBean server found: com.sun.jmx.mbeanserver.JmxMBeanServer@e847652, but no JMX reporters were configured - adding default JMX reporter.
   [junit4]   2> 1151148 INFO  (TEST-PeerSyncTest.test-seed#[1F6CAF0A211DB5C7]) [    ] o.a.s.h.c.HttpShardHandlerFactory Host whitelist initialized: WhitelistHostChecker [whitelistHosts=null, whitelistHostCheckingEnabled=false]
   [junit4]   2> 1151150 WARN  (TEST-PeerSyncTest.test-seed#[1F6CAF0A211DB5C7]) [    ] o.e.j.u.s.S.config No Client EndPointIdentificationAlgorithm configured for SslContextFactory@67937af0[provider=null,keyStore=null,trustStore=null]
   [junit4]   2> 1151154 WARN  (TEST-PeerSyncTest.test-seed#[1F6CAF0A211DB5C7]) [    ] o.e.j.u.s.S.config No Client EndPointIdentificationAlgorithm configured for SslContextFactory@29b666ba[provider=null,keyStore=null,trustStore=null]
   [junit4]   2> 1151181 INFO  (TEST-PeerSyncTest.test-seed#[1F6CAF0A211DB5C7]) [    ] o.a.s.c.TransientSolrCoreCacheDefault Allocating transient cache for 4 transient cores
   [junit4]   2> 1151181 INFO  (TEST-PeerSyncTest.test-seed#[1F6CAF0A211DB5C7]) [    ] o.a.s.h.a.MetricsHistoryHandler No .system collection, keeping metrics history in memory.
   [junit4]   2> 1151209 INFO  (TEST-PeerSyncTest.test-seed#[1F6CAF0A211DB5C7]) [    ] o.a.s.m.r.SolrJmxReporter JMX monitoring for 'solr.node' (registry 'solr.node') enabled at server: com.sun.jmx.mbeanserver.JmxMBeanServer@e847652
   [junit4]   2> 1151224 INFO  (TEST-PeerSyncTest.test-seed#[1F6CAF0A211DB5C7]) [    ] o.a.s.m.r.SolrJmxReporter JMX monitoring for 'solr.jvm' (registry 'solr.jvm') enabled at server: com.sun.jmx.mbeanserver.JmxMBeanServer@e847652
   [junit4]   2> 1151225 INFO  (TEST-PeerSyncTest.test-seed#[1F6CAF0A211DB5C7]) [    ] o.a.s.m.r.SolrJmxReporter JMX monitoring for 'solr.jetty' (registry 'solr.jetty') enabled at server: com.sun.jmx.mbeanserver.JmxMBeanServer@e847652
   [junit4]   2> 1151227 INFO  (TEST-PeerSyncTest.test-seed#[1F6CAF0A211DB5C7]) [    ] o.a.s.c.CorePropertiesLocator Found 1 core definitions underneath /x1/jenkins/jenkins-slave/workspace/Lucene-Solr-Tests-8.x/solr/build/solr-core/test/J1/temp/solr.update.PeerSyncTest_1F6CAF0A211DB5C7-001/tempDir-001/control/cores
   [junit4]   2> 1151227 INFO  (TEST-PeerSyncTest.test-seed#[1F6CAF0A211DB5C7]) [    ] o.a.s.c.CorePropertiesLocator Cores are: [collection1]
   [junit4]   2> 1151228 INFO  (coreLoadExecutor-5548-thread-1) [    x:collection1] o.a.s.c.SolrResourceLoader [null] Added 2 libs to classloader, from paths: [/x1/jenkins/jenkins-slave/workspace/Lucene-Solr-Tests-8.x/solr/core/src/test-files/solr/collection1/lib, /x1/jenkins/jenkins-slave/workspace/Lucene-Solr-Tests-8.x/solr/core/src/test-files/solr/collection1/lib/classes]
   [junit4]   2> 1151263 INFO  (coreLoadExecutor-5548-thread-1) [    x:collection1] o.a.s.c.SolrConfig Using Lucene MatchVersion: 8.1.0
   [junit4]   2> 1151286 INFO  (coreLoadExecutor-5548-thread-1) [    x:collection1] o.a.s.s.IndexSchema [collection1] Schema name=test
   [junit4]   2> 1151427 INFO  (coreLoadExecutor-5548-thread-1) [    x:collection1] o.a.s.s.IndexSchema Loaded schema test/1.0 with uniqueid field id
   [junit4]   2> 1151436 INFO  (coreLoadExecutor-5548-thread-1) [    x:collection1] o.a.s.c.CoreContainer Creating SolrCore 'collection1' using configuration from configset /x1/jenkins/jenkins-slave/workspace/Lucene-Solr-Tests-8.x/solr/core/src/test-files/solr/collection1, trusted=true
   [junit4]   2> 1151437 INFO  (coreLoadExecutor-5548-thread-1) [    x:collection1] o.a.s.m.r.SolrJmxReporter JMX monitoring for 'solr.core.collection1' (registry 'solr.core.collection1') enabled at server: com.sun.jmx.mbeanserver.JmxMBeanServer@e847652
   [junit4]   2> 1151437 INFO  (coreLoadExecutor-5548-thread-1) [    x:collection1] o.a.s.c.SolrCore [[collection1] ] Opening new SolrCore at [/x1/jenkins/jenkins-slave/workspace/Lucene-Solr-Tests-8.x/solr/core/src/test-files/solr/collection1], dataDir=[/x1/jenkins/jenkins-slave/workspace/Lucene-Solr-Tests-8.x/solr/build/solr-core/test/J1/temp/solr.update.PeerSyncTest_1F6CAF0A211DB5C7-001/tempDir-001/control/cores/collection1/data/]
   [junit4]   2> 1151439 INFO  (coreLoadExecutor-5548-thread-1) [    x:collection1] o.a.s.u.RandomMergePolicy RandomMergePolicy wrapping class org.apache.lucene.index.LogByteSizeMergePolicy: [LogByteSizeMergePolicy: minMergeSize=1677721, mergeFactor=44, maxMergeSize=2147483648, maxMergeSizeForForcedMerge=9223372036854775807, calibrateSizeByDeletes=false, maxMergeDocs=2147483647, maxCFSSegmentSizeMB=8.796093022207999E12, noCFSRatio=0.0]
   [junit4]   2> 1151441 WARN  (coreLoadExecutor-5548-thread-1) [    x:collection1] o.a.s.c.RequestHandlers INVALID paramSet a in requestHandler {type = requestHandler,name = /dump,class = DumpRequestHandler,attributes = {initParams=a, name=/dump, class=DumpRequestHandler},args = {defaults={a=A,b=B}}}
   [junit4]   2> 1151500 INFO  (coreLoadExecutor-5548-thread-1) [    x:collection1] o.a.s.u.UpdateHandler Using UpdateLog implementation: org.apache.solr.update.UpdateLog
   [junit4]   2> 1151500 INFO  (coreLoadExecutor-5548-thread-1) [    x:collection1] o.a.s.u.UpdateLog Initializing UpdateLog: dataDir= defaultSyncLevel=FLUSH numRecordsToKeep=100 maxNumLogsToKeep=10 numVersionBuckets=65536
   [junit4]   2> 1151501 INFO  (coreLoadExecutor-5548-thread-1) [    x:collection1] o.a.s.u.CommitTracker Hard AutoCommit: disabled
   [junit4]   2> 1151501 INFO  (coreLoadExecutor-5548-thread-1) [    x:collection1] o.a.s.u.CommitTracker Soft AutoCommit: disabled
   [junit4]   2> 1151503 INFO  (coreLoadExecutor-5548-thread-1) [    x:collection1] o.a.s.u.RandomMergePolicy RandomMergePolicy wrapping class org.apache.lucene.index.TieredMergePolicy: [TieredMergePolicy: maxMergeAtOnce=30, maxMergeAtOnceExplicit=27, maxMergedSegmentMB=26.0166015625, floorSegmentMB=1.5185546875, forceMergeDeletesPctAllowed=9.297114121057213, segmentsPerTier=26.0, maxCFSSegmentSizeMB=8.796093022207999E12, noCFSRatio=1.0, deletesPctAllowed=24.350423108116424
   [junit4]   2> 1151503 INFO  (coreLoadExecutor-5548-thread-1) [    x:collection1] o.a.s.s.SolrIndexSearcher Opening [Searcher@57fdefaa[collection1] main]
   [junit4]   2> 1151503 WARN  (coreLoadExecutor-5548-thread-1) [    x:collection1] o.a.s.r.ManagedResourceStorage Cannot write to config directory /x1/jenkins/jenkins-slave/workspace/Lucene-Solr-Tests-8.x/solr/core/src/test-files/solr/collection1/conf; switching to use InMemory storage instead.
   [junit4]   2> 1151504 INFO  (coreLoadExecutor-5548-thread-1) [    x:collection1] o.a.s.h.ReplicationHandler Commits will be reserved for 10000ms.
   [junit4]   2> 1151504 INFO  (coreLoadExecutor-5548-thread-1) [    x:collection1] o.a.s.u.UpdateLog Could not find max version in index or recent updates, using new clock 1632324788838989824
   [junit4]   2> 1151508 INFO  (searcherExecutor-5549-thread-1-processing-x:collection1) [    x:collection1] o.a.s.c.SolrCore [collection1] Registered new searcher Searcher@57fdefaa[collection1] main{ExitableDirectoryReader(UninvertingDirectoryReader())}
   [junit4]   2> 1151683 WARN  (TEST-PeerSyncTest.test-seed#[1F6CAF0A211DB5C7]) [    ] o.e.j.s.AbstractConnector Ignoring deprecated socket close linger time
   [junit4]   2> 1151684 INFO  (TEST-PeerSyncTest.test-seed#[1F6CAF0A211DB5C7]) [    ] o.a.s.c.s.e.JettySolrRunner Start Jetty (original configured port=0)
   [junit4]   2> 1151684 INFO  (TEST-PeerSyncTest.test-seed#[1F6CAF0A211DB5C7]) [    ] o.a.s.c.s.e.JettySolrRunner Trying to start Jetty on port 0 try number 1 ...
   [junit4]   2> 1151684 INFO  (TEST-PeerSyncTest.test-seed#[1F6CAF0A211DB5C7]) [    ] o.e.j.s.Server jetty-9.4.14.v20181114; built: 2018-11-14T21:20:31.478Z; git: c4550056e785fb5665914545889f21dc136ad9e6; jvm 1.8.0_191-b12
   [junit4]   2> 1151685 INFO  (TEST-PeerSyncTest.test-seed#[1F6CAF0A211DB5C7]) [    ] o.e.j.s.session DefaultSessionIdManager workerName=node0
   [junit4]   2> 1151685 INFO  (TEST-PeerSyncTest.test-seed#[1F6CAF0A211DB5C7]) [    ] o.e.j.s.session No SessionScavenger set, using defaults
   [junit4]   2> 1151685 INFO  (TEST-PeerSyncTest.test-seed#[1F6CAF0A211DB5C7]) [    ] o.e.j.s.session node0 Scavenging every 660000ms
   [junit4]   2> 1151685 INFO  (TEST-PeerSyncTest.test-seed#[1F6CAF0A211DB5C7]) [    ] o.e.j.s.h.ContextHandler Started o.e.j.s.ServletContextHandler@424462e0{/c_fxm,null,AVAILABLE}
   [junit4]   2> 1151686 INFO  (TEST-PeerSyncTest.test-seed#[1F6CAF0A211DB5C7]) [    ] o.e.j.s.AbstractConnector Started ServerConnector@75778eb4{HTTP/1.1,[http/1.1, h2c]}{127.0.0.1:46441}
   [junit4]   2> 1151686 INFO  (TEST-PeerSyncTest.test-seed#[1F6CAF0A211DB5C7]) [    ] o.e.j.s.Server Started @1151765ms
   [junit4]   2> 1151686 INFO  (TEST-PeerSyncTest.test-seed#[1F6CAF0A211DB5C7]) [    ] o.a.s.c.s.e.JettySolrRunner Jetty properties: {schema=schema.xml, solrconfig=solrconfig-tlog.xml, hostContext=/c_fxm, hostPort=46441, coreRootDirectory=/x1/jenkins/jenkins-slave/workspace/Lucene-Solr-Tests-8.x/solr/build/solr-core/test/J1/temp/solr.update.PeerSyncTest_1F6CAF0A211DB5C7-001/tempDir-001/shard0/cores}
   [junit4]   2> 1151686 ERROR (TEST-PeerSyncTest.test-seed#[1F6CAF0A211DB5C7]) [    ] o.a.s.u.StartupLoggingUtils Missing Java Option solr.log.dir. Logging may be missing or incomplete.
   [junit4]   2> 1151686 INFO  (TEST-PeerSyncTest.test-seed#[1F6CAF0A211DB5C7]) [    ] o.a.s.s.SolrDispatchFilter Using logger factory org.apache.logging.slf4j.Log4jLoggerFactory
   [junit4]   2> 1151687 INFO  (TEST-PeerSyncTest.test-seed#[1F6CAF0A211DB5C7]) [    ] o.a.s.s.SolrDispatchFilter  ___      _       Welcome to Apache Solr™ version 8.1.0
   [junit4]   2> 1151687 INFO  (TEST-PeerSyncTest.test-seed#[1F6CAF0A211DB5C7]) [    ] o.a.s.s.SolrDispatchFilter / __| ___| |_ _   Starting in standalone mode on port null
   [junit4]   2> 1151687 INFO  (TEST-PeerSyncTest.test-seed#[1F6CAF0A211DB5C7]) [    ] o.a.s.s.SolrDispatchFilter \__ \/ _ \ | '_|  Install dir: null
   [junit4]   2> 1151687 INFO  (TEST-PeerSyncTest.test-seed#[1F6CAF0A211DB5C7]) [    ] o.a.s.s.SolrDispatchFilter |___/\___/_|_|    Start time: 2019-05-01T10:23:47.332Z
   [junit4]   2> 1151687 INFO  (TEST-PeerSyncTest.test-seed#[1F6CAF0A211DB5C7]) [    ] o.a.s.c.SolrXmlConfig Loading container configuration from /x1/jenkins/jenkins-slave/workspace/Lucene-Solr-Tests-8.x/solr/build/solr-core/test/J1/temp/solr.update.PeerSyncTest_1F6CAF0A211DB5C7-001/tempDir-001/shard0/solr.xml
   [junit4]   2> 1151707 INFO  (TEST-PeerSyncTest.test-seed#[1F6CAF0A211DB5C7]) [    ] o.a.s.c.SolrXmlConfig Configuration parameter autoReplicaFailoverWorkLoopDelay is ignored
   [junit4]   2> 1151707 INFO  (TEST-PeerSyncTest.test-seed#[1F6CAF0A211DB5C7]) [    ] o.a.s.c.SolrXmlConfig Configuration parameter autoReplicaFailoverBadNodeExpiration is ignored
   [junit4]   2> 1151709 INFO  (TEST-PeerSyncTest.test-seed#[1F6CAF0A211DB5C7]) [    ] o.a.s.c.SolrXmlConfig MBean server found: com.sun.jmx.mbeanserver.JmxMBeanServer@e847652, but no JMX reporters were configured - adding default JMX reporter.
   [junit4]   2> 1151854 INFO  (TEST-PeerSyncTest.test-seed#[1F6CAF0A211DB5C7]) [    ] o.a.s.h.c.HttpShardHandlerFactory Host whitelist initialized: WhitelistHostChecker [whitelistHosts=null, whitelistHostCheckingEnabled=false]
   [junit4]   2> 1151856 WARN  (TEST-PeerSyncTest.test-seed#[1F6CAF0A211DB5C7]) [    ] o.e.j.u.s.S.config No Client EndPointIdentificationAlgorithm configured for SslContextFactory@4d8aff5c[provider=null,keyStore=null,trustStore=null]
   [junit4]   2> 1151861 WARN  (TEST-PeerSyncTest.test-seed#[1F6CAF0A211DB5C7]) [    ] o.e.j.u.s.S.config No Client EndPointIdentificationAlgorithm configured for SslContextFactory@153db3a4[provider=null,keyStore=null,trustStore=null]
   [junit4]   2> 1151888 INFO  (TEST-PeerSyncTest.test-seed#[1F6CAF0A211DB5C7]) [    ] o.a.s.c.TransientSolrCoreCacheDefault Allocating transient cache for 4 transient cores
   [junit4]   2> 1151888 INFO  (TEST-PeerSyncTest.test-seed#[1F6CAF0A211DB5C7]) [    ] o.a.s.h.a.MetricsHistoryHandler No .system collection, keeping metrics history in memory.
   [junit4]   2> 1151916 INFO  (TEST-PeerSyncTest.test-seed#[1F6CAF0A211DB5C7]) [    ] o.a.s.m.r.SolrJmxReporter JMX monitoring for 'solr.node' (registry 'solr.node') enabled at server: com.sun.jmx.mbeanserver.JmxMBeanServer@e847652
   [junit4]   2> 1151932 INFO  (TEST-PeerSyncTest.test-seed#[1F6CAF0A211DB5C7]) [    ] o.a.s.m.r.SolrJmxReporter JMX monitoring for 'solr.jvm' (registry 'solr.jvm') enabled at server: com.sun.jmx.mbeanserver.JmxMBeanServer@e847652
   [junit4]   2> 1151932 INFO  (TEST-PeerSyncTest.test-seed#[1F6CAF0A211DB5C7]) [    ] o.a.s.m.r.SolrJmxReporter JMX monitoring for 'solr.jetty' (registry 'solr.jetty') enabled at server: com.sun.jmx.mbeanserver.JmxMBeanServer@e847652
   [junit4]   2> 1151935 INFO  (TEST-PeerSyncTest.test-seed#[1F6CAF0A211DB5C7]) [    ] o.a.s.c.CorePropertiesLocator Found 1 core definitions underneath /x1/jenkins/jenkins-slave/workspace/Lucene-Solr-Tests-8.x/solr/build/solr-core/test/J1/temp/solr.update.PeerSyncTest_1F6CAF0A211DB5C7-001/tempDir-001/shard0/cores
   [junit4]   2> 1151935 INFO  (TEST-PeerSyncTest.test-seed#[1F6CAF0A211DB5C7]) [    ] o.a.s.c.CorePropertiesLocator Cores are: [collection1]
   [junit4]   2> 1151936 INFO  (coreLoadExecutor-5562-thread-1) [    x:collection1] o.a.s.c.SolrResourceLoader [null] Added 2 libs to classloader, from paths: [/x1/jenkins/jenkins-slave/workspace/Lucene-Solr-Tests-8.x/solr/core/src/test-files/solr/collection1/lib, /x1/jenkins/jenkins-slave/workspace/Lucene-Solr-Tests-8.x/solr/core/src/test-files/solr/collection1/lib/classes]
   [junit4]   2> 1151967 INFO  (coreLoadExecutor-5562-thread-1) [    x:collection1] o.a.s.c.SolrConfig Using Lucene MatchVersion: 8.1.0
   [junit4]   2> 1151988 INFO  (coreLoadExecutor-5562-thread-1) [    x:collection1] o.a.s.s.IndexSchema [collection1] Schema name=test
   [junit4]   2> 1152126 INFO  (coreLoadExecutor-5562-thread-1) [    x:collection1] o.a.s.s.IndexSchema Loaded schema test/1.0 with uniqueid field id
   [junit4]   2> 1152135 INFO  (coreLoadExecutor-5562-thread-1) [    x:collection1] o.a.s.c.CoreContainer Creating SolrCore 'collection1' using configuration from configset /x1/jenkins/jenkins-slave/workspace/Lucene-Solr-Tests-8.x/solr/core/src/test-files/solr/collection1, trusted=true
   [junit4]   2> 1152135 INFO  (coreLoadExecutor-5562-thread-1) [    x:collection1] o.a.s.m.r.SolrJmxReporter JMX monitoring for 'solr.core.collection1' (registry 'solr.core.collection1') enabled at server: com.sun.jmx.mbeanserver.JmxMBeanServer@e847652
   [junit4]   2> 1152136 INFO  (coreLoadExecutor-5562-thread-1) [    x:collection1] o.a.s.c.SolrCore [[collection1] ] Opening new SolrCore at [/x1/jenkins/jenkins-slave/workspace/Lucene-Solr-Tests-8.x/solr/core/src/test-files/solr/collection1], dataDir=[/x1/jenkins/jenkins-slave/workspace/Lucene-Solr-Tests-8.x/solr/build/solr-core/test/J1/temp/solr.update.PeerSyncTest_1F6CAF0A211DB5C7-001/tempDir-001/shard0/cores/collection1/data/]
   [junit4]   2> 1152140 INFO  (coreLoadExecutor-5562-thread-1) [    x:collection1] o.a.s.u.RandomMergePolicy RandomMergePolicy wrapping class org.apache.lucene.index.LogByteSizeMergePolicy: [LogByteSizeMergePolicy: minMergeSize=1677721, mergeFactor=44, maxMergeSize=2147483648, maxMergeSizeForForcedMerge=9223372036854775807, calibrateSizeByDeletes=false, maxMergeDocs=2147483647, maxCFSSegmentSizeMB=8.796093022207999E12, noCFSRatio=0.0]
   [junit4]   2> 1152142 WARN  (coreLoadExecutor-5562-thread-1) [    x:collection1] o.a.s.c.RequestHandlers INVALID paramSet a in requestHandler {type = requestHandler,name = /dump,class = DumpRequestHandler,attributes = {initParams=a, name=/dump, class=DumpRequestHandler},args = {defaults={a=A,b=B}}}
   [junit4]   2> 1152207 INFO  (coreLoadExecutor-5562-thread-1) [    x:collection1] o.a.s.u.UpdateHandler Using UpdateLog implementation: org.apache.solr.update.UpdateLog
   [junit4]   2> 1152207 INFO  (coreLoadExecutor-5562-thread-1) [    x:collection1] o.a.s.u.UpdateLog Initializing UpdateLog: dataDir= defaultSyncLevel=FLUSH numRecordsToKeep=100 maxNumLogsToKeep=10 numVersionBuckets=65536
   [junit4]   2> 1152209 INFO  (coreLoadExecutor-5562-thread-1) [    x:collection1] o.a.s.u.CommitTracker Hard AutoCommit: disabled
   [junit4]   2> 1152209 INFO  (coreLoadExecutor-5562-thread-1) [    x:collection1] o.a.s.u.CommitTracker Soft AutoCommit: disabled
   [junit4]   2> 1152210 INFO  (coreLoadExecutor-5562-thread-1) [    x:collection1] o.a.s.u.RandomMergePolicy RandomMergePolicy wrapping class org.apache.lucene.index.TieredMergePolicy: [TieredMergePolicy: maxMergeAtOnce=30, maxMergeAtOnceExplicit=27, maxMergedSegmentMB=26.0166015625, floorSegmentMB=1.5185546875, forceMergeDeletesPctAllowed=9.297114121057213, segmentsPerTier=26.0, maxCFSSegmentSizeMB=8.796093022207999E12, noCFSRatio=1.0, deletesPctAllowed=24.350423108116424
   [junit4]   2> 1152210 INFO  (coreLoadExecutor-5562-thread-1) [    x:collection1] o.a.s.s.SolrIndexSearcher Opening [Searcher@4263762d[collection1] main]
   [junit4]   2> 1152211 WARN  (coreLoadExecutor-5562-thread-1) [    x:collection1] o.a.s.r.ManagedResourceStorage Cannot write to config directory /x1/jenkins/jenkins-slave/workspace/Lucene-Solr-Tests-8.x/solr/core/src/test-files/solr/collection1/conf; switching to use InMemory storage instead.
   [junit4]   2> 1152211 INFO  (coreLoadExecutor-5562-thread-1) [    x:collection1] o.a.s.h.ReplicationHandler Commits will be reserved for 10000ms.
   [junit4]   2> 1152211 INFO  (coreLoadExecutor-5562-thread-1) [    x:collection1] o.a.s.u.UpdateLog Could not find max version in index or recent updates, using new clock 1632324789580333056
   [junit4]   2> 1152215 INFO  (searcherExecutor-5563-thread-1-processing-x:collection1) [    x:collection1] o.a.s.c.SolrCore [collection1] Registered new searcher Searcher@4263762d[collection1] main{ExitableDirectoryReader(UninvertingDirectoryReader())}
   [junit4]   2> 1152493 WARN  (TEST-PeerSyncTest.test-seed#[1F6CAF0A211DB5C7]) [    ] o.e.j.s.AbstractConnector Ignoring deprecated socket close linger time
   [junit4]   2> 1152493 INFO  (TEST-PeerSyncTest.test-seed#[1F6CAF0A211DB5C7]) [    ] o.a.s.c.s.e.JettySolrRunner Start Jetty (original configured port=0)
   [junit4]   2> 1152493 INFO  (TEST-PeerSyncTest.test-seed#[1F6CAF0A211DB5C7]) [    ] o.a.s.c.s.e.JettySolrRunner Trying to start Jetty on port 0 try number 1 ...
   [junit4]   2> 1152493 INFO  (TEST-PeerSyncTest.test-seed#[1F6CAF0A211DB5C7]) [    ] o.e.j.s.Server jetty-9.4.14.v20181114; built: 2018-11-14T21:20:31.478Z; git: c4550056e785fb5665914545889f21dc136ad9e6; jvm 1.8.0_191-b12
   [junit4]   2> 1152494 INFO  (TEST-PeerSyncTest.test-seed#[1F6CAF0A211DB5C7]) [    ] o.e.j.s.session DefaultSessionIdManager workerName=node0
   [junit4]   2> 1152494 INFO  (TEST-PeerSyncTest.test-seed#[1F6CAF0A211DB5C7]) [    ] o.e.j.s.session No SessionScavenger set, using defaults
   [junit4]   2> 1152495 INFO  (TEST-PeerSyncTest.test-seed#[1F6CAF0A211DB5C7]) [    ] o.e.j.s.session node0 Scavenging every 600000ms
   [junit4]   2> 1152495 INFO  (TEST-PeerSyncTest.test-seed#[1F6CAF0A211DB5C7]) [    ] o.e.j.s.h.ContextHandler Started o.e.j.s.ServletContextHandler@15aa3b84{/c_fxm,null,AVAILABLE}
   [junit4]   2> 1152496 INFO  (TEST-PeerSyncTest.test-seed#[1F6CAF0A211DB5C7]) [    ] o.e.j.s.AbstractConnector Started ServerConnector@7f678561{HTTP/1.1,[http/1.1, h2c]}{127.0.0.1:38049}
   [junit4]   2> 1152496 INFO  (TEST-PeerSyncTest.test-seed#[1F6CAF0A211DB5C7]) [    ] o.e.j.s.Server Started @1152574ms
   [junit4]   2> 1152496 INFO  (TEST-PeerSyncTest.test-seed#[1F6CAF0A211DB5C7]) [    ] o.a.s.c.s.e.JettySolrRunner Jetty properties: {schema=schema.xml, solrconfig=solrconfig-tlog.xml, hostContext=/c_fxm, hostPort=38049, coreRootDirectory=/x1/jenkins/jenkins-slave/workspace/Lucene-Solr-Tests-8.x/solr/build/solr-core/test/J1/temp/solr.update.PeerSyncTest_1F6CAF0A211DB5C7-001/tempDir-001/shard1/cores}
   [junit4]   2> 1152496 ERROR (TEST-PeerSyncTest.test-seed#[1F6CAF0A211DB5C7]) [    ] o.a.s.u.StartupLoggingUtils Missing Java Option solr.log.dir. Logging may be missing or incomplete.
   [junit4]   2> 1152496 INFO  (TEST-PeerSyncTest.test-seed#[1F6CAF0A211DB5C7]) [    ] o.a.s.s.SolrDispatchFilter Using logger factory org.apache.logging.slf4j.Log4jLoggerFactory
   [junit4]   2> 1152496 INFO  (TEST-PeerSyncTest.test-seed#[1F6CAF0A211DB5C7]) [    ] o.a.s.s.SolrDispatchFilter  ___      _       Welcome to Apache Solr™ version 8.1.0
   [junit4]   2> 1152496 INFO  (TEST-PeerSyncTest.test-seed#[1F6CAF0A211DB5C7]) [    ] o.a.s.s.SolrDispatchFilter / __| ___| |_ _   Starting in standalone mode on port null
   [junit4]   2> 1152496 INFO  (TEST-PeerSyncTest.test-seed#[1F6CAF0A211DB5C7]) [    ] o.a.s.s.SolrDispatchFilter \__ \/ _ \ | '_|  Install dir: null
   [junit4]   2> 1152496 INFO  (TEST-PeerSyncTest.test-seed#[1F6CAF0A211DB5C7]) [    ] o.a.s.s.SolrDispatchFilter |___/\___/_|_|    Start time: 2019-05-01T10:23:48.141Z
   [junit4]   2> 1152496 INFO  (TEST-PeerSyncTest.test-seed#[1F6CAF0A211DB5C7]) [    ] o.a.s.c.SolrXmlConfig Loading container configuration from /x1/jenkins/jenkins-slave/workspace/Lucene-Solr-Tests-8.x/solr/build/solr-core/test/J1/temp/solr.update.PeerSyncTest_1F6CAF0A211DB5C7-001/tempDir-001/shard1/solr.xml
   [junit4]   2> 1152501 INFO  (TEST-PeerSyncTest.test-seed#[1F6CAF0A211DB5C7]) [    ] o.a.s.c.SolrXmlConfig Configuration parameter autoReplicaFailoverWorkLoopDelay is ignored
   [junit4]   2> 1152501 INFO  (TEST-PeerSyncTest.test-seed#[1F6CAF0A211DB5C7]) [    ] o.a.s.c.SolrXmlConfig Configuration parameter autoReplicaFailoverBadNodeExpiration is ignored
   [junit4]   2> 1152503 INFO  (TEST-PeerSyncTest.test-seed#[1F6CAF0A211DB5C7]) [    ] o.a.s.c.SolrXmlConfig MBean server found: com.sun.jmx.mbeanserver.JmxMBeanServer@e847652, but no JMX reporters were configured - adding default JMX reporter.
   [junit4]   2> 1152663 INFO  (TEST-PeerSyncTest.test-seed#[1F6CAF0A211DB5C7]) [    ] o.a.s.h.c.HttpShardHandlerFactory Host whitelist initialized: WhitelistHostChecker [whitelistHosts=null, whitelistHostCheckingEnabled=false]
   [junit4]   2> 1152665 WARN  (TEST-PeerSyncTest.test-seed#[1F6CAF0A211DB5C7]) [    ] o.e.j.u.s.S.config No Client EndPointIdentificationAlgorithm configured for SslContextFactory@1b11328a[provider=null,keyStore=null,trustStore=null]
   [junit4]   2> 1152670 WARN  (TEST-PeerSyncTest.test-seed#[1F6CAF0A211DB5C7]) [    ] o.e.j.u.s.S.config No Client EndPointIdentificationAlgorithm configured for SslContextFactory@14d6d545[provider=null,keyStore=null,trustStore=null]
   [junit4]   2> 1152735 INFO  (TEST-PeerSyncTest.test-seed#[1F6CAF0A211DB5C7]) [    ] o.a.s.c.TransientSolrCoreCacheDefault Allocating transient cache for 4 transient cores
   [junit4]   2> 1152735 INFO  (TEST-PeerSyncTest.test-seed#[1F6CAF0A211DB5C7]) [    ] o.a.s.h.a.MetricsHistoryHandler No .system collection, keeping metrics history in memory.
   [junit4]   2> 1152799 INFO  (TEST-PeerSyncTest.test-seed#[1F6CAF0A211DB5C7]) [    ] o.a.s.m.r.SolrJmxReporter JMX monitoring for 'solr.node' (registry 'solr.node') enabled at server: com.sun.jmx.mbeanserver.JmxMBeanServer@e847652
   [junit4]   2> 1152815 INFO  (TEST-PeerSyncTest.test-seed#[1F6CAF0A211DB5C7]) [    ] o.a.s.m.r.SolrJmxReporter JMX monitoring for 'solr.jvm' (registry 'solr.jvm') enabled at server: com.sun.jmx.mbeanserver.JmxMBeanServer@e847652
   [junit4]   2> 1152815 INFO  (TEST-PeerSyncTest.test-seed#[1F6CAF0A211DB5C7]) [    ] o.a.s.m.r.SolrJmxReporter JMX monitoring for 'solr.jetty' (registry 'solr.jetty') enabled at server: com.sun.jmx.mbeanserver.JmxMBeanServer@e847652
   [junit4]   2> 1152818 INFO  (TEST-PeerSyncTest.test-seed#[1F6CAF0A211DB5C7]) [    ] o.a.s.c.CorePropertiesLocator Found 1 core definitions underneath /x1/jenkins/jenkins-slave/workspace/Lucene-Solr-Tests-8.x/solr/build/solr-core/test/J1/temp/solr.update.PeerSyncTest_1F6CAF0A211DB5C7-001/tempDir-001/shard1/cores
   [junit4]   2> 1152818 INFO  (TEST-PeerSyncTest.test-seed#[1F6CAF0A211DB5C7]) [    ] o.a.s.c.CorePropertiesLocator Cores are: [collection1]
   [junit4]   2> 1152819 INFO  (coreLoadExecutor-5576-thread-1) [    x:collection1] o.a.s.c.SolrResourceLoader [null] Added 2 libs to classloader, from paths: [/x1/jenkins/jenkins-slave/workspace/Lucene-Solr-Tests-8.x/solr/core/src/test-files/solr/collection1/lib, /x1/jenkins/jenkins-slave/workspace/Lucene-Solr-Tests-8.x/solr/core/src/test-files/solr/collection1/lib/classes]
   [junit4]   2> 1152856 INFO  (coreLoadExecutor-5576-thread-1) [    x:collection1] o.a.s.c.SolrConfig Using Lucene MatchVersion: 8.1.0
   [junit4]   2> 1152878 INFO  (coreLoadExecutor-5576-thread-1) [    x:collection1] o.a.s.s.IndexSchema [collection1] Schema name=test
   [junit4]   2> 1153030 INFO  (coreLoadExecutor-5576-thread-1) [    x:collection1] o.a.s.s.IndexSchema Loaded schema test/1.0 with uniqueid field id
   [junit4]   2> 1153040 INFO  (coreLoadExecutor-5576-thread-1) [    x:collection1] o.a.s.c.CoreContainer Creating SolrCore 'collection1' using configuration from configset /x1/jenkins/jenkins-slave/workspace/Lucene-Solr-Tests-8.x/solr/core/src/test-files/solr/collection1, trusted=true
   [junit4]   2> 1153041 INFO  (coreLoadExecutor-5576-thread-1) [    x:collection1] o.a.s.m.r.SolrJmxReporter JMX monitoring for 'solr.core.collection1' (registry 'solr.core.collection1') enabled at server: com.sun.jmx.mbeanserver.JmxMBeanServer@e847652
   [junit4]   2> 1153041 INFO  (coreLoadExecutor-5576-thread-1) [    x:collection1] o.a.s.c.SolrCore [[collection1] ] Opening new SolrCore at [/x1/jenkins/jenkins-slave/workspace/Lucene-Solr-Tests-8.x/solr/core/src/test-files/solr/collection1], dataDir=[/x1/jenkins/jenkins-slave/workspace/Lucene-Solr-Tests-8.x/solr/build/solr-core/test/J1/temp/solr.update.PeerSyncTest_1F6CAF0A211DB5C7-001/tempDir-001/shard1/cores/collection1/data/]
   [junit4]   2> 1153044 INFO  (coreLoadExecutor-5576-thread-1) [    x:collection1] o.a.s.u.RandomMergePolicy RandomMergePolicy wrapping class org.apache.lucene.index.LogByteSizeMergePolicy: [LogByteSizeMergePolicy: minMergeSize=1677721, mergeFactor=44, maxMergeSize=2147483648, maxMergeSizeForForcedMerge=9223372036854775807, calibrateSizeByDeletes=false, maxMergeDocs=2147483647, maxCFSSegmentSizeMB=8.796093022207999E12, noCFSRatio=0.0]
   [junit4]   2> 1153083 WARN  (coreLoadExecutor-5576-thread-1) [    x:collection1] o.a.s.c.RequestHandlers INVALID paramSet a in requestHandler {type = requestHandler,name = /dump,class = DumpRequestHandler,attributes = {initParams=a, name=/dump, class=DumpRequestHandler},args = {defaults={a=A,b=B}}}
   [junit4]   2> 1153203 INFO  (coreLoadExecutor-5576-thread-1) [    x:collection1] o.a.s.u.UpdateHandler Using UpdateLog implementation: org.apache.solr.update.UpdateLog
   [junit4]   2> 1153203 INFO  (coreLoadExecutor-5576-thread-1) [    x:collection1] o.a.s.u.UpdateLog Initializing UpdateLog: dataDir= defaultSyncLevel=FLUSH numRecordsToKeep=100 maxNumLogsToKeep=10 numVersionBuckets=65536
   [junit4]   2> 1153205 INFO  (coreLoadExecutor-5576-thread-1) [    x:collection1] o.a.s.u.CommitTracker Hard AutoCommit: disabled
   [junit4]   2> 1153205 INFO  (coreLoadExecutor-5576-thread-1) [    x:collection1] o.a.s.u.CommitTracker Soft AutoCommit: disabled
   [junit4]   2> 1153206 INFO  (coreLoadExecutor-5576-thread-1) [    x:collection1] o.a.s.u.RandomMergePolicy RandomMergePolicy wrapping class org.apache.lucene.index.TieredMergePolicy: [TieredMergePolicy: maxMergeAtOnce=30, maxMergeAtOnceExplicit=27, maxMergedSegmentMB=26.0166015625, floorSegmentMB=1.5185546875, forceMergeDeletesPctAllowed=9.297114121057213, segmentsPerTier=26.0, maxCFSSegmentSizeMB=8.796093022207999E12, noCFSRatio=1.0, deletesPctAllowed=24.350423108116424
   [junit4]   2> 1153206 INFO  (coreLoadExecutor-5576-thread-1) [    x:collection1] o.a.s.s.SolrIndexSearcher Opening [Searcher@4859578b[collection1] main]
   [junit4]   2> 1153207 WARN  (coreLoadExecutor-5576-thread-1) [    x:collection1] o.a.s.r.ManagedResourceStorage Cannot write to config directory /x1/jenkins/jenkins-slave/workspace/Lucene-Solr-Tests-8.x/solr/core/src/test-files/solr/collection1/conf; switching to use InMemory storage instead.
   [junit4]   2> 1153207 INFO  (coreLoadExecutor-5576-thread-1) [    x:collection1] o.a.s.h.ReplicationHandler Commits will be reserved for 10000ms.
   [junit4]   2> 1153208 INFO  (coreLoadExecutor-5576-thread-1) [    x:collection1] o.a.s.u.UpdateLog Could not find max version in index or recent updates, using new clock 1632324790625763328
   [junit4]   2> 1153214 INFO  (searcherExecutor-5577-thread-1-processing-x:collection1) [    x:collection1] o.a.s.c.SolrCore [collection1] Registered new searcher Searcher@4859578b[collection1] main{ExitableDirectoryReader(UninvertingDirectoryReader())}
   [junit4]   2> 1153448 WARN  (TEST-PeerSyncTest.test-seed#[1F6CAF0A211DB5C7]) [    ] o.e.j.s.AbstractConnector Ignoring deprecated socket close linger time
   [junit4]   2> 1153449 INFO  (TEST-PeerSyncTest.test-seed#[1F6CAF0A211DB5C7]) [    ] o.a.s.c.s.e.JettySolrRunner Start Jetty (original configured port=0)
   [junit4]   2> 1153449 INFO  (TEST-PeerSyncTest.test-seed#[1F6CAF0A211DB5C7]) [    ] o.a.s.c.s.e.JettySolrRunner Trying to start Jetty on port 0 try number 1 ...
   [junit4]   2> 1153449 INFO  (TEST-PeerSyncTest.test-seed#[1F6CAF0A211DB5C7]) [    ] o.e.j.s.Server jetty-9.4.14.v20181114; built: 2018-11-14T21:20:31.478Z; git: c4550056e785fb5665914545889f21dc136ad9e6; jvm 1.8.0_191-b12
   [junit4]   2> 1153450 INFO  (TEST-PeerSyncTest.test-seed#[1F6CAF0A211DB5C7]) [    ] o.e.j.s.session DefaultSessionIdManager workerName=node0
   [junit4]   2> 1153450 INFO  (TEST-PeerSyncTest.test-seed#[1F6CAF0A211DB5C7]) [    ] o.e.j.s.session No SessionScavenger set, using defaults
   [junit4]   2> 1153450 INFO  (TEST-PeerSyncTest.test-seed#[1F6CAF0A211DB5C7]) [    ] o.e.j.s.session node0 Scavenging every 600000ms
   [junit4]   2> 1153450 INFO  (TEST-PeerSyncTest.test-seed#[1F6CAF0A211DB5C7]) [    ] o.e.j.s.h.ContextHandler Started o.e.j.s.ServletContextHandler@a079c6e{/c_fxm,null,AVAILABLE}
   [junit4]   2> 1153451 INFO  (TEST-PeerSyncTest.test-seed#[1F6CAF0A211DB5C7]) [    ] o.e.j.s.AbstractConnector Started ServerConnector@6d21fb95{HTTP/1.1,[http/1.1, h2c]}{127.0.0.1:45150}
   [junit4]   2> 1153451 INFO  (TEST-PeerSyncTest.test-seed#[1F6CAF0A211DB5C7]) [    ] o.e.j.s.Server Started @1153529ms
   [junit4]   2> 1153451 INFO  (TEST-PeerSyncTest.test-seed#[1F6CAF0A211DB5C7]) [    ] o.a.s.c.s.e.JettySolrRunner Jetty properties: {schema=schema.xml, solrconfig=solrconfig-tlog.xml, hostContext=/c_fxm, hostPort=45150, coreRootDirectory=/x1/jenkins/jenkins-slave/workspace/Lucene-Solr-Tests-8.x/solr/build/solr-core/test/J1/temp/solr.update.PeerSyncTest_1F6CAF0A211DB5C7-001/tempDir-001/shard2/cores}
   [junit4]   2> 1153451 ERROR (TEST-PeerSyncTest.test-seed#[1F6CAF0A211DB5C7]) [    ] o.a.s.u.StartupLoggingUtils Missing Java Option solr.log.dir. Logging may be missing or incomplete.
   [junit4]   2> 1153451 INFO  (TEST-PeerSyncTest.test-seed#[1F6CAF0A211DB5C7]) [    ] o.a.s.s.SolrDispatchFilter Using logger factory org.apache.logging.slf4j.Log4jLoggerFactory
   [junit4]   2> 1153451 INFO  (TEST-PeerSyncTest.test-seed#[1F6CAF0A211DB5C7]) [    ] o.a.s.s.SolrDispatchFilter  ___      _       Welcome to Apache Solr™ version 8.1.0
   [junit4]   2> 1153451 INFO  (TEST-PeerSyncTest.test-seed#[1F6CAF0A211DB5C7]) [    ] o.a.s.s.SolrDispatchFilter / __| ___| |_ _   Starting in standalone mode on port null
   [junit4]   2> 1153451 INFO  (TEST-PeerSyncTest.test-seed#[1F6CAF0A211DB5C7]) [    ] o.a.s.s.SolrDispatchFilter \__ \/ _ \ | '_|  Install dir: null
   [junit4]   2> 1153451 INFO  (TEST-PeerSyncTest.test-seed#[1F6CAF0A211DB5C7]) [    ] o.a.s.s.SolrDispatchFilter |___/\___/_|_|    Start time: 2019-05-01T10:23:49.096Z
   [junit4]   2> 1153452 INFO  (TEST-PeerSyncTest.test-seed#[1F6CAF0A211DB5C7]) [    ] o.a.s.c.SolrXmlConfig Loading container configuration from /x1/jenkins/jenkins-slave/workspace/Lucene-Solr-Tests-8.x/solr/build/solr-core/test/J1/temp/solr.update.PeerSyncTest_1F6CAF0A211DB5C7-001/tempDir-001/shard2/solr.xml
   [junit4]   2> 1153457 INFO  (TEST-PeerSyncTest.test-seed#[1F6CAF0A211DB5C7]) [    ] o.a.s.c.SolrXmlConfig Configuration parameter autoReplicaFailoverWorkLoopDelay is ignored
   [junit4]   2> 1153457 INFO  (TEST-PeerSyncTest.test-seed#[1F6CAF0A211DB5C7]) [    ] o.a.s.c.SolrXmlConfig Configuration parameter autoReplicaFailoverBadNodeExpiration is ignored
   [junit4]   2> 1153459 INFO  (TEST-PeerSyncTest.test-seed#[1F6CAF0A211DB5C7]) [    ] o.a.s.c.SolrXmlConfig MBean server found: com.sun.jmx.mbeanserver.JmxMBeanServer@e847652, but no JMX reporters were configured - adding default JMX reporter.
   [junit4]   2> 1153700 INFO  (TEST-PeerSyncTest.test-seed#[1F6CAF0A211DB5C7]) [    ] o.a.s.h.c.HttpShardHandlerFactory Host whitelist initialized: WhitelistHostChecker [whitelistHosts=null, whitelistHostCheckingEnabled=false]
   [junit4]   2> 1153702 WARN  (TEST-PeerSyncTest.test-seed#[1F6CAF0A211DB5C7]) [    ] o.e.j.u.s.S.config No Client EndPointIdentificationAlgorithm configured for SslContextFactory@648a23f6[provider=null,keyStore=null,trustStore=null]
   [junit4]   2> 1153707 WARN  (TEST-PeerSyncTest.test-seed#[1F6CAF0A211DB5C7]) [    ] o.e.j.u.s.S.config No Client EndPointIdentificationAlgorithm configured for SslContextFactory@40737f91[provider=null,keyStore=null,trustStore=null]
   [junit4]   2> 1153734 INFO  (TEST-PeerSyncTest.test-seed#[1F6CAF0A211DB5C7]) [    ] o.a.s.c.TransientSolrCoreCacheDefault Allocating transient cache for 4 transient cores
   [junit4]   2> 1153734 INFO  (TEST-PeerSyncTest.test-seed#[1F6CAF0A211DB5C7]) [    ] o.a.s.h.a.MetricsHistoryHandler No .system collection, keeping metrics history in memory.
   [junit4]   2> 1153766 INFO  (TEST-PeerSyncTest.test-seed#[1F6CAF0A211DB5C7]) [    ] o.a.s.m.r.SolrJmxReporter JMX monitoring for 'solr.node' (registry 'solr.node') enabled at server: com.sun.jmx.mbeanserver.JmxMBeanServer@e847652
   [junit4]   2> 1153782 INFO  (TEST-PeerSyncTest.test-seed#[1F6CAF0A211DB5C7]) [    ] o.a.s.m.r.SolrJmxReporter JMX monitoring for 'solr.jvm' (registry 'solr.jvm') enabled at server: com.sun.jmx.mbeanserver.JmxMBeanServer@e847652
   [junit4]   2> 1153783 INFO  (TEST-PeerSyncTest.test-seed#[1F6CAF0A211DB5C7]) [    ] o.a.s.m.r.SolrJmxReporter JMX monitoring for 'solr.jetty' (registry 'solr.jetty') enabled at server: com.sun.jmx.mbeanserver.JmxMBeanServer@e847652
   [junit4]   2> 1153785 INFO  (TEST-PeerSyncTest.test-seed#[1F6CAF0A211DB5C7]) [    ] o.a.s.c.CorePropertiesLocator Found 1 core definitions underneath /x1/jenkins/jenkins-slave/workspace/Lucene-Solr-Tests-8.x/solr/build/solr-core/test/J1/temp/solr.update.PeerSyncTest_1F6CAF0A211DB5C7-001/tempDir-001/shard2/cores
   [junit4]   2> 1153786 INFO  (TEST-PeerSyncTest.test-seed#[1F6CAF0A211DB5C7]) [    ] o.a.s.c.CorePropertiesLocator Cores are: [collection1]
   [junit4]   2> 1153787 INFO  (coreLoadExecutor-5590-thread-1) [    x:collection1] o.a.s.c.SolrResourceLoader [null] Added 2 libs to classloader, from paths: [/x1/jenkins/jenkins-slave/workspace/Lucene-Solr-Tests-8.x/solr/core/src/test-files/solr/collection1/lib, /x1/jenkins/jenkins-slave/workspace/Lucene-Solr-Tests-8.x/solr/core/src/test-files/solr/collection1/lib/classes]
   [junit4]   2> 1153882 INFO  (coreLoadExecutor-5590-thread-1) [    x:collection1] o.a.s.c.SolrConfig Using Lucene MatchVersion: 8.1.0
   [junit4]   2> 1153920 INFO  (coreLoadExecutor-5590-thread-1) [    x:collection1] o.a.s.s.IndexSchema [collection1] Schema name=test
   [junit4]   2> 1154150 INFO  (coreLoadExecutor-5590-thread-1) [    x:collection1] o.a.s.s.IndexSchema Loaded schema test/1.0 with uniqueid field id
   [junit4]   2> 1154162 INFO  (coreLoadExecutor-5590-thread-1) [    x:collection1] o.a.s.c.CoreContainer Creating SolrCore 'collection1' using configuration from configset /x1/jenkins/jenkins-slave/workspace/Lucene-Solr-Tests-8.x/solr/core/src/test-files/solr/collection1, trusted=true
   [junit4]   2> 1154163 INFO  (coreLoadExecutor-5590-thread-1) [    x:collection1] o.a.s.m.r.SolrJmxReporter JMX monitoring for 'solr.core.collection1' (registry 'solr.core.collection1') enabled at server: com.sun.jmx.mbeanserver.JmxMBeanServer@e847652
   [junit4]   2> 1154163 INFO  (coreLoadExecutor-5590-thread-1) [    x:collection1] o.a.s.c.SolrCore [[collection1] ] Opening new SolrCore at [/x1/jenkins/jenkins-slave/workspace/Lucene-Solr-Tests-8.x/solr/core/src/test-files/solr/collection1], dataDir=[/x1/jenkins/jenkins-slave/workspace/Lucene-Solr-Tests-8.x/solr/build/solr-core/test/J1/temp/solr.update.PeerSyncTest_1F6CAF0A211DB5C7-001/tempDir-001/shard2/cores/collection1/data/]
   [junit4]   2> 1154166 INFO  (coreLoadExecutor-5590-thread-1) [    x:collection1] o.a.s.u.RandomMergePolicy RandomMergePolicy wrapping class org.apache.lucene.index.LogByteSizeMergePolicy: [LogByteSizeMergePolicy: minMergeSize=1677721, mergeFactor=44, maxMergeSize=2147483648, maxMergeSizeForForcedMerge=9223372036854775807, calibrateSizeByDeletes=false, maxMergeDocs=2147483647, maxCFSSegmentSizeMB=8.796093022207999E12, noCFSRatio=0.0]
   [junit4]   2> 1154169 WARN  (coreLoadExecutor-5590-thread-1) [    x:collection1] o.a.s.c.RequestHandlers INVALID paramSet a in requestHandler {type = requestHandler,name = /dump,class = DumpRequestHandler,attributes = {initParams=a, name=/dump, class=DumpRequestHandler},args = {defaults={a=A,b=B}}}
   [junit4]   2> 1154249 INFO  (coreLoadExecutor-5590-thread-1) [    x:collection1] o.a.s.u.UpdateHandler Using UpdateLog implementation: org.apache.solr.update.UpdateLog
   [junit4]   2> 1154249 INFO  (coreLoadExecutor-5590-thread-1) [    x:collection1] o.a.s.u.UpdateLog Initializing UpdateLog: dataDir= defaultSyncLevel=FLUSH numRecordsToKeep=100 maxNumLogsToKeep=10 numVersionBuckets=65536
   [junit4]   2> 1154250 INFO  (coreLoadExecutor-5590-thread-1) [    x:collection1] o.a.s.u.CommitTracker Hard AutoCommit: disabled
   [junit4]   2> 1154250 INFO  (coreLoadExecutor-5590-thread-1) [    x:collection1] o.a.s.u.CommitTracker Soft AutoCommit: disabled
   [junit4]   2> 1154251 INFO  (coreLoadExecutor-5590-thread-1) [    x:collection1] o.a.s.u.RandomMergePolicy RandomMergePolicy wrapping class org.apache.lucene.index.TieredMergePolicy: [TieredMergePolicy: maxMergeAtOnce=30, maxMergeAtOnceExplicit=27, maxMergedSegmentMB=26.0166015625, floorSegmentMB=1.5185546875, forceMergeDeletesPctAllowed=9.297114121057213, segmentsPerTier=26.0, maxCFSSegmentSizeMB=8.796093022207999E12, noCFSRatio=1.0, deletesPctAllowed=24.350423108116424
   [junit4]   2> 1154252 INFO  (coreLoadExecutor-5590-thread-1) [    x:collection1] o.a.s.s.SolrIndexSearcher Opening [Searcher@2d50ab47[collection1] main]
   [junit4]   2> 1154252 WARN  (coreLoadExecutor-5590-thread-1) [    x:collection1] o.a.s.r.ManagedResourceStorage Cannot write to config directory /x1/jenkins/jenkins-slave/workspace/Lucene-Solr-Tests-8.x/solr/core/src/test-files/solr/collection1/conf; switching to use InMemory storage instead.
   [junit4]   2> 1154253 INFO  (coreLoadExecutor-5590-thread-1) [    x:collection1] o.a.s.h.ReplicationHandler Commits will be reserved for 10000ms.
   [junit4]   2> 1154253 INFO  (coreLoadExecutor-5590-thread-1) [    x:collection1] o.a.s.u.UpdateLog Could not find max version in index or recent updates, using new clock 1632324791721525248
   [junit4]   2> 1154257 INFO  (searcherExecutor-5591-thread-1-processing-x:collection1) [    x:collection1] o.a.s.c.SolrCore [collection1] Registered new searcher Searcher@2d50ab47[collection1] main{ExitableDirectoryReader(UninvertingDirectoryReader())}
   [junit4]   2> 1154764 INFO  (qtp1507201046-16543) [    x:collection1] o.a.s.u.p.LogUpdateProcessorFactory [collection1]  webapp=/c_fxm path=/update params={update.distrib=FROMLEADER&wt=javabin&version=2}{add=[1 (1)]} 0 4
   [junit4]   2> 1154767 INFO  (qtp952415609-16564) [    x:collection1] o.a.s.u.PeerSync PeerSync: core=collection1 url= START replicas=[http://127.0.0.1:46441/c_fxm/collection1] nUpdates=100
   [junit4]   2> 1154771 INFO  (qtp1507201046-16545) [    x:collection1] o.a.s.s.SolrIndexSearcher Opening [Searcher@58a904ab[collection1] realtime]
   [junit4]   2> 1154771 INFO  (qtp1507201046-16545) [    x:collection1] o.a.s.u.IndexFingerprint IndexFingerprint millis:3.0 result:{maxVersionSpecified=9223372036854775807, maxVersionEncountered=1, maxInHash=1, versionsHash=-5451962507482445012, numVersions=1, numDocs=1, maxDoc=1}
   [junit4]   2> 1154772 INFO  (qtp1507201046-16545) [    x:collection1] o.a.s.c.S.Request [collection1]  webapp=/c_fxm path=/get params={distrib=false&qt=/get&getFingerprint=9223372036854775807&wt=javabin&version=2} status=0 QTime=3
   [junit4]   2> 1154772 INFO  (qtp952415609-16564) [    x:collection1] o.a.s.u.IndexFingerprint IndexFingerprint millis:0.0 result:{maxVersionSpecified=9223372036854775807, maxVersionEncountered=0, maxInHash=0, versionsHash=0, numVersions=0, numDocs=0, maxDoc=0}
   [junit4]   2> 1154773 INFO  (qtp952415609-16564) [    x:collection1] o.a.s.u.PeerSync PeerSync: core=collection1 url= DONE.  We have no versions.  sync failed.
   [junit4]   2> 1154773 INFO  (qtp1507201046-16546) [    x:collection1] o.a.s.u.IndexFingerprint IndexFingerprint millis:0.0 result:{maxVersionSpecified=9223372036854775807, maxVersionEncountered=1, maxInHash=1, versionsHash=-5451962507482445012, numVersions=1, numDocs=1, maxDoc=1}
   [junit4]   2> 1154774 INFO  (qtp1507201046-16546) [    x:collection1] o.a.s.c.S.Request [collection1]  webapp=/c_fxm path=/get params={distrib=false&qt=/get&fingerprint=true&getVersions=100&wt=javabin&version=2} status=0 QTime=0
   [junit4]   2> 1154774 INFO  (qtp952415609-16564) [    x:collection1] o.a.s.c.S.Request [collection1]  webapp=/c_fxm path=/get params={qt=/get&getVersions=100&sync=http://127.0.0.1:46441/c_fxm/collection1&wt=javabin&version=2} status=0 QTime=7
   [junit4]   2> 1154776 INFO  (qtp952415609-16565) [    x:collection1] o.a.s.u.p.LogUpdateProcessorFactory [collection1]  webapp=/c_fxm path=/update params={update.distrib=FROMLEADER&wt=javabin&version=2}{add=[1 (1)]} 0 1
   [junit4]   2> 1154777 INFO  (qtp952415609-16566) [    x:collection1] o.a.s.u.PeerSync PeerSync: core=collection1 url= START replicas=[http://127.0.0.1:46441/c_fxm/collection1] nUpdates=100
   [junit4]   2> 1154778 INFO  (qtp1507201046-16542) [    x:collection1] o.a.s.u.IndexFingerprint IndexFingerprint millis:0.0 result:{maxVersionSpecified=9223372036854775807, maxVersionEncountered=1, maxInHash=1, versionsHash=-5451962507482445012, numVersions=1, numDocs=1, maxDoc=1}
   [junit4]   2> 1154778 INFO  (qtp1507201046-16542) [    x:collection1] o.a.s.c.S.Request [collection1]  webapp=/c_fxm path=/get params={distrib=false&qt=/get&getFingerprint=9223372036854775807&wt=javabin&version=2} status=0 QTime=0
   [junit4]   2> 1154780 INFO  (qtp952415609-16566) [    x:collection1] o.a.s.s.SolrIndexSearcher Opening [Searcher@4dccf251[collection1] realtime]
   [junit4]   2> 1154781 INFO  (qtp952415609-16566) [    x:collection1] o.a.s.u.IndexFingerprint IndexFingerprint millis:2.0 result:{maxVersionSpecified=9223372036854775807, maxVersionEncountered=1, maxInHash=1, versionsHash=-5451962507482445012, numVersions=1, numDocs=1, maxDoc=1}
   [junit4]   2> 1154781 INFO  (qtp952415609-16566) [    x:collection1] o.a.s.u.PeerSync We are already in sync. No need to do a PeerSync 
   [junit4]   2> 1154781 INFO  (qtp952415609-16566) [    x:collection1] o.a.s.c.S.Request [collection1]  webapp=/c_fxm path=/get params={qt=/get&getVersions=100&sync=http://127.0.0.1:46441/c_fxm/collection1&wt=javabin&version=2} status=0 QTime=3
   [junit4]   2> 1154782 INFO  (qtp1507201046-16543) [    x:collection1] o.a.s.u.DirectUpdateHandler2 start commit{_version_=1632324792276221952,optimize=false,openSearcher=true,waitSearcher=true,expungeDeletes=false,softCommit=false,prepareCommit=false}
   [junit4]   2> 1154782 INFO  (qtp1507201046-16543) [    x:collection1] o.a.s.u.SolrIndexWriter Calling setCommitData with IW:org.apache.solr.update.SolrIndexWriter@5681d294 commitCommandVersion:1632324792276221952
   [junit4]   2> 1154783 INFO  (qtp1507201046-16543) [    x:collection1] o.a.s.s.SolrIndexSearcher Opening [Searcher@512791d3[collection1] main]
   [junit4]   2> 1154784 INFO  (qtp1507201046-16543) [    x:collection1] o.a.s.u.DirectUpdateHandler2 end_commit_flush
   [junit4]   2> 1154786 INFO  (searcherExecutor-5563-thread-1-processing-x:collection1) [    x:collection1] o.a.s.c.SolrCore [collection1] Registered new searcher Searcher@512791d3[collection1] main{ExitableDirectoryReader(UninvertingDirectoryReader(Uninverting(_0(8.1.0):C1:[diagnostics={os=Linux, java.vendor=Oracle Corporation, java.version=1.8.0_191, java.vm.version=25.191-b12, lucene.version=8.1.0, os.arch=amd64, java.runtime.version=1.8.0_191-b12, source=flush, os.version=4.4.0-137-generic, timestamp=1556706230415}]:[attributes={Lucene50StoredFieldsFormat.mode=BEST_SPEED}])))}
   [junit4]   2> 1154786 INFO  (qtp1507201046-16543) [    x:collection1] o.a.s.u.p.LogUpdateProcessorFactory [collection1]  webapp=/c_fxm path=/update params={waitSearcher=true&commit=true&softCommit=false&wt=javabin&version=2}{commit=} 0 4
   [junit4]   2> 1154787 INFO  (qtp952415609-16567) [    x:collection1] o.a.s.u.DirectUpdateHandler2 start commit{_version_=1632324792281464832,optimize=false,openSearcher=true,waitSearcher=true,expungeDeletes=false,softCommit=false,prepareCommit=false}
   [junit4]   2> 1154787 INFO  (qtp952415609-16567) [    x:collection1] o.a.s.u.SolrIndexWriter Calling setCommitData with IW:org.apache.solr.update.SolrIndexWriter@15640571 commitCommandVersion:1632324792281464832
   [junit4]   2> 1154789 INFO  (qtp952415609-16567) [    x:collection1] o.a.s.s.SolrIndexSearcher Opening [Searcher@699e0b34[collection1] main]
   [junit4]   2> 1154789 INFO  (qtp952415609-16567) [    x:collection1] o.a.s.u.DirectUpdateHandler2 end_commit_flush
   [junit4]   2> 1154791 INFO  (searcherExecutor-5577-thread-1-processing-x:collection1) [    x:collection1] o.a.s.c.SolrCore [collection1] Registered new searcher Searcher@699e0b34[collection1] main{ExitableDirectoryReader(UninvertingDirectoryReader(Uninverting(_0(8.1.0):C1:[diagnostics={os=Linux, java.vendor=Oracle Corporation, java.version=1.8.0_191, java.vm.version=25.191-b12, lucene.version=8.1.0, os.arch=amd64, java.runtime.version=1.8.0_191-b12, source=flush, os.version=4.4.0-137-generic, timestamp=1556706230424}]:[attributes={Lucene50StoredFieldsFormat.mode=BEST_SPEED}])))}
   [junit4]   2> 1154792 INFO  (qtp952415609-16567) [    x:collection1] o.a.s.u.p.LogUpdateProcessorFactory [collection1]  webapp=/c_fxm path=/update params={waitSearcher=true&commit=true&softCommit=false&wt=javabin&version=2}{commit=} 0 4
   [junit4]   2> 1154793 INFO  (qtp1507201046-16544) [    x:collection1] o.a.s.c.S.Request [collection1]  webapp=/c_fxm path=/select params={q=*:*&wt=javabin&version=2} hits=1 status=0 QTime=0
   [junit4]   2> 1154794 INFO  (qtp952415609-16563) [    x:collection1] o.a.s.c.S.Request [collection1]  webapp=/c_fxm path=/select params={q=*:*&wt=javabin&version=2} hits=1 status=0 QTime=0
   [junit4]   2> 1154797 INFO  (qtp1507201046-16545) [    x:collection1] o.a.s.u.p.LogUpdateProcessorFactory [collection1]  webapp=/c_fxm path=/update params={update.distrib=FROMLEADER&wt=javabin&version=2}{add=[2 (2)]} 0 2
   [junit4]   2> 1154798 INFO  (qtp952415609-16564) [    x:collection1] o.a.s.u.PeerSync PeerSync: core=collection1 url= START replicas=[http://127.0.0.1:46441/c_fxm/collection1] nUpdates=100
   [junit4]   2> 1154801 INFO  (qtp1507201046-16546) [    x:collection1] o.a.s.s.SolrIndexSearcher Opening [Searcher@24f068ce[collection1] realtime]
   [junit4]   2> 1154802 INFO  (qtp1507201046-16546) [    x:collection1] o.a.s.u.IndexFingerprint IndexFingerprint millis:2.0 result:{maxVersionSpecified=9223372036854775807, maxVersionEncountered=2, maxInHash=2, versionsHash=-1218814014108643565, numVersions=2, numDocs=2, maxDoc=1}
   [junit4]   2> 1154802 INFO  (qtp1507201046-16546) [    x:collection1] o.a.s.c.S.Request [collection1]  webapp=/c_fxm path=/get params={distrib=false&qt=/get&getFingerprint=9223372036854775807&wt=javabin&version=2} status=0 QTime=3
   [junit4]   2> 1154802 INFO  (qtp952415609-16564) [    x:collection1] o.a.s.u.IndexFingerprint IndexFingerprint millis:0.0 result:{maxVersionSpecified=9223372036854775807, maxVersionEncountered=1, maxInHash=1, versionsHash=-5451962507482445012, numVersions=1, numDocs=1, maxDoc=1}
   [junit4]   2> 1154814 INFO  (qtp1507201046-16542) [    x:collection1] o.a.s.u.IndexFingerprint IndexFingerprint millis:0.0 result:{maxVersionSpecified=9223372036854775807, maxVersionEncountered=2, maxInHash=2, versionsHash=-1218814014108643565, numVersions=2, numDocs=2, maxDoc=1}
   [junit4]   2> 1154814 INFO  (qtp1507201046-16542) [    x:collection1] o.a.s.c.S.Request [collection1]  webapp=/c_fxm path=/get params={distrib=false&qt=/get&fingerprint=true&getVersions=100&wt=javabin&version=2} status=0 QTime=0
   [junit4]   2> 1154814 INFO  (qtp952415609-16564) [    x:collection1] o.a.s.u.PeerSync PeerSync: core=collection1 url=  Received 2 versions from http://127.0.0.1:46441/c_fxm/collection1 fingerprint:{maxVersionSpecified=9223372036854775807, maxVersionEncountered=2, maxInHash=2, versionsHash=-1218814014108643565, numVersions=2, numDocs=2, maxDoc=1}
   [junit4]   2> 1154816 INFO  (qtp1507201046-16543) [    x:collection1] o.a.s.c.S.Request [collection1]  webapp=/c_fxm path=/get params={distrib=false&qt=/get&checkCanHandleVersionRanges=false&wt=javabin&version=2} status=0 QTime=0
   [junit4]   2> 1154816 INFO  (qtp952415609-16564) [    x:collection1] o.a.s.u.PeerSync PeerSync: core=collection1 url= Requesting updates from http://127.0.0.1:46441/c_fxm/collection1n=1 versions=2...2
   [junit4]   2> 1154818 INFO  (qtp1507201046-16544) [    x:collection1] o.a.s.u.IndexFingerprint IndexFingerprint millis:0.0 result:{maxVersionSpecified=2, maxVersionEncountered=2, maxInHash=2, versionsHash=-1218814014108643565, numVersions=2, numDocs=2, maxDoc=1}
   [junit4]   2> 1154818 INFO  (qtp1507201046-16544) [    x:collection1] o.a.s.c.S.Request [collection1]  webapp=/c_fxm path=/get params={getUpdates=2...2&distrib=false&qt=/get&fingerprint=true&onlyIfActive=false&wt=javabin&version=2} status=0 QTime=0
   [junit4]   2> 1154824 INFO  (qtp952415609-16564) [    x:collection1] o.a.s.u.p.LogUpdateProcessorFactory [collection1] {add=[2 (2)]} 0 6
   [junit4]   2> 1154827 INFO  (qtp952415609-16564) [    x:collection1] o.a.s.s.SolrIndexSearcher Opening [Searcher@f301b2e[collection1] realtime]
   [junit4]   2> 1154827 INFO  (qtp952415609-16564) [    x:collection1] o.a.s.u.IndexFingerprint IndexFingerprint millis:3.0 result:{maxVersionSpecified=2, maxVersionEncountered=2, maxInHash=2, versionsHash=-1218814014108643565, numVersions=2, numDocs=2, maxDoc=1}
   [junit4]   2> 1154827 INFO  (qtp952415609-16564) [    x:collection1] o.a.s.u.PeerSync Fingerprint comparison: 0
   [junit4]   2> 1154827 INFO  (qtp952415609-16564) [    x:collection1] o.a.s.u.PeerSync PeerSync: core=collection1 url= DONE. sync succeeded
   [junit4]   2> 1154827 INFO  (qtp952415609-16564) [    x:collection1] o.a.s.c.S.Request [collection1]  webapp=/c_fxm path=/get params={qt=/get&getVersions=100&sync=http://127.0.0.1:46441/c_fxm/collection1&wt=javabin&version=2} status=0 QTime=29
   [junit4]   2> 1154828 INFO  (qtp1507201046-16545) [    x:collection1] o.a.s.u.DirectUpdateHandler2 start commit{_version_=1632324792324456448,optimize=false,openSearcher=true,waitSearcher=true,expungeDeletes=false,softCommit=false,prepareCommit=false}
   [junit4]   2> 1154828 INFO  (qtp1507201046-16545) [    x:collection1] o.a.s.u.SolrIndexWriter Calling setCommitData with IW:org.apache.solr.update.SolrIndexWriter@5681d294 commitCommandVersion:1632324792324456448
   [junit4]   2> 1154829 INFO  (qtp1507201046-16545) [    x:collection1] o.a.s.s.SolrIndexSearcher Opening [Searcher@32e9e584[collection1] main]
   [junit4]   2> 1154832 INFO  (searcherExecutor-5563-thread-1-processing-x:collection1) [    x:collection1] o.a.s.c.SolrCore [collection1] Registered new searcher Searcher@32e9e584[collection1] main{ExitableDirectoryReader(UninvertingDirectoryReader(Uninverting(_0(8.1.0):C1:[diagnostics={os=Linux, java.vendor=Oracle Corporation, java.version=1.8.0_191, java.vm.version=25.191-b12, lucene.version=8.1.0, os.arch=amd64, java.runtime.version=1.8.0_191-b12, source=flush, os.version=4.4.0-137-generic, timestamp=1556706230415}]:[attributes={Lucene50StoredFieldsFormat.mode=BEST_SPEED}]) Uninverting(_1(8.1.0):C1:[diagnostics={os=Linux, java.vendor=Oracle Corporation, java.version=1.8.0_191, java.vm.version=25.191-b12, lucene.version=8.1.0, os.arch=amd64, java.runtime.version=1.8.0_191-b12, source=flush, os.version=4.4.0-137-generic, timestamp=1556706230445}]:[attributes={Lucene50StoredFieldsFormat.mode=BEST_SPEED}])))}
   [junit4]   2> 1154832 INFO  (qtp1507201046-16545) [    x:collection1] o.a.s.u.DirectUpdateHandler2 end_commit_flush
   [junit4]   2> 1154832 INFO  (qtp1507201046-16545) [    x:collection1] o.a.s.u.p.LogUpdateProcessorFactory [collection1]  webapp=/c_fxm path=/update params={waitSearcher=true&commit=true&softCommit=false&wt=javabin&version=2}{commit=} 0 4
   [junit4]   2> 1154833 INFO  (qtp952415609-16565) [    x:collection1] o.a.s.u.DirectUpdateHandler2 start commit{_version_=1632324792329699328,optimize=false,openSearcher=true,waitSearcher=true,expungeDeletes=false,softCommit=false,prepareCommit=false}
   [junit4]   2> 1154833 INFO  (qtp952415609-16565) [    x:collection1] o.a.s.u.SolrIndexWriter Calling setCommitData with IW:org.apache.solr.update.SolrIndexWriter@15640571 commitCommandVersion:1632324792329699328
   [junit4]   2> 1154833 INFO  (qtp952415609-16565) [    x:collection1] o.a.s.s.SolrIndexSearcher Opening [Searcher@65e9b4b1[collection1] main]
   [junit4]   2> 1154834 INFO  (qtp952415609-16565) [    x:collection1] o.a.s.u.DirectUpdateHandler2 end_commit_flush
   [junit4]   2> 1154836 INFO  (searcherExecutor-5577-thread-1-processing-x:collection1) [    x:collection1] o.a.s.c.SolrCore [collection1] Registered new searcher Searcher@65e9b4b1[collection1] main{ExitableDirectoryReader(UninvertingDirectoryReader(Uninverting(_0(8.1.0):C1:[diagnostics={os=Linux, java.vendor=Oracle Corporation, java.version=1.8.0_191, java.vm.version=25.191-b12, lucene.version=8.1.0, os.arch=amd64, java.runtime.version=1.8.0_191-b12, source=flush, os.version=4.4.0-137-generic, timestamp=1556706230424}]:[attributes={Lucene50StoredFieldsFormat.mode=BEST_SPEED}]) Uninverting(_1(8.1.0):C1:[diagnostics={os=Linux, java.vendor=Oracle Corporation, java.version=1.8.0_191, java.vm.version=25.191-b12, lucene.version=8.1.0, os.arch=amd64, java.runtime.version=1.8.0_191-b12, source=flush, os.version=4.4.0-137-generic, timestamp=1556706230471}]:[attributes={Lucene50StoredFieldsFormat.mode=BEST_SPEED}])))}
   [junit4]   2> 1154836 INFO  (qtp952415609-16565) [    x:collection1] o.a.s.u.p.LogUpdateProcessorFactory [collection1]  webapp=/c_fxm path=/update params={waitSearcher=true&commit=true&softCommit=false&wt=javabin&version=2}{commit=} 0 3
   [junit4]   2> 1154837 INFO  (qtp1507201046-16546) [    x:collection1] o.a.s.c.S.Request [collection1]  webapp=/c_fxm path=/select params={q=*:*&wt=javabin&version=2} hits=2 status=0 QTime=0
   [junit4]   2> 1154841 INFO  (qtp952415609-16566) [    x:collection1] o.a.s.c.S.Request [collection1]  webapp=/c_fxm path=/select params={q=*:*&wt=javabin&version=2} hits=2 status=0 QTime=0
   [junit4]   2> 1154843 INFO  (qtp1507201046-16542) [    x:collection1] o.a.s.u.p.LogUpdateProcessorFactory [collection1]  webapp=/c_fxm path=/update params={update.distrib=FROMLEADER&wt=javabin&version=2}{add=[3 (3)]} 0 1
   [junit4]   2> 1154844 INFO  (qtp1507201046-16543) [    x:collection1] o.a.s.u.p.LogUpdateProcessorFactory [collection1]  webapp=/c_fxm path=/update params={update.distrib=FROMLEADER&wt=javabin&version=2}{add=[4 (4)]} 0 0
   [junit4]   2> 1154845 INFO  (qtp1507201046-16544) [    x:collection1] o.a.s.u.p.LogUpdateProcessorFactory [collection1]  webapp=/c_fxm path=/update params={update.distrib=FROMLEADER&wt=javabin&version=2}{add=[5 (5)]} 0 0
   [junit4]   2> 1154846 INFO  (qtp1507201046-16545) [    x:collection1] o.a.s.u.p.LogUpdateProcessorFactory [collection1]  webapp=/c_fxm path=/update params={update.distrib=FROMLEADER&wt=javabin&version=2}{add=[6 (6)]} 0 0
   [junit4]   2> 1154847 INFO  (qtp1507201046-16545) [    x:collection1] o.a.s.u.p.LogUpdateProcessorFactory [collection1]  webapp=/c_fxm path=/update params={update.distrib=FROMLEADER&wt=javabin&version=2}{add=[7 (7)]} 0 0
   [junit4]   2> 1154848 INFO  (qtp1507201046-16545) [    x:collection1] o.a.s.u.p.LogUpdateProcessorFactory [collection1]  webapp=/c_fxm path=/update params={update.distrib=FROMLEADER&wt=javabin&version=2}{add=[8 (8)]} 0 0
   [junit4]   2> 1154849 INFO  (qtp1507201046-16545) [    x:collection1] o.a.s.u.p.LogUpdateProcessorFactory [collection1]  webapp=/c_fxm path=/update params={update.distrib=FROMLEADER&wt=javabin&version=2}{add=[9 (9)]} 0 0
   [junit4]   2> 1154850 INFO  (qtp1507201046-16545) [    x:collection1] o.a.s.u.p.LogUpdateProcessorFactory [collection1]  webapp=/c_fxm path=/update params={update.distrib=FROMLEADER&wt=javabin&version=2}{add=[10 (10)]} 0 0
   [junit4]   2> 1154850 INFO  (qtp952415609-16567) [    x:collection1] o.a.s.u.PeerSync PeerSync: core=collection1 url= START replicas=[http://127.0.0.1:46441/c_fxm/collection1] nUpdates=100
   [junit4]   2> 1154854 INFO  (qtp1507201046-16546) [    x:collection1] o.a.s.s.SolrIndexSearcher Opening [Searcher@33c60ca1[collection1] realtime]
   [junit4]   2> 1154855 INFO  (qtp1507201046-16546) [    x:collection1] o.a.s.u.IndexFingerprint IndexFingerprint millis:3.0 result:{maxVersionSpecified=9223372036854775807, maxVersionEncountered=10, maxInHash=10, versionsHash=-5671163287542876028, numVersions=10, numDocs=10, maxDoc=8}
   [junit4]   2> 1154855 INFO  (qtp1507201046-16546) [    x:collection1] o.a.s.c.S.Request [collection1]  webapp=/c_fxm path=/get params={distrib=false&qt=/get&getFingerprint=9223372036854775807&wt=javabin&version=2} status=0 QTime=3
   [junit4]   2> 1154855 INFO  (qtp952415609-16567) [    x:collection1] o.a.s.u.IndexFingerprint IndexFingerprint millis:0.0 resul

[...truncated too long message...]

 rootName = null, domain = solr.jetty, service url = null, agent id = null] for registry solr.jetty / com.codahale.metrics.MetricRegistry@62eb093
   [junit4]   2> NOTE: leaving temporary files on disk at: /x1/jenkins/jenkins-slave/workspace/Lucene-Solr-Tests-8.x/solr/build/solr-core/test/J2/temp/solr.update.PeerSyncWithLeaderTest_1F6CAF0A211DB5C7-001
   [junit4]   2> NOTE: test params are: codec=Asserting(Lucene80): {title_stringNoNorms=PostingsFormat(name=LuceneVarGapDocFreqInterval), title_stemmed=PostingsFormat(name=Asserting), multiDefault=PostingsFormat(name=Asserting), _root_=PostingsFormat(name=LuceneVarGapDocFreqInterval), id=FSTOrd50, text=TestBloomFilteredLucenePostings(BloomFilteringPostingsFormat(Lucene50(blocksize=128))), title=PostingsFormat(name=Asserting), title_lettertok=FSTOrd50}, docValues:{range_facet_l_dv=DocValuesFormat(name=Lucene80), n_l1=DocValuesFormat(name=Direct), multiDefault=DocValuesFormat(name=Lucene80), val_i_dvo=DocValuesFormat(name=Lucene80), _root_=DocValuesFormat(name=Direct), intDefault=DocValuesFormat(name=Direct), n_dt1=DocValuesFormat(name=Lucene80), n_td1=DocValuesFormat(name=Lucene80), n_d1=DocValuesFormat(name=Direct), range_facet_l=DocValuesFormat(name=Direct), n_f1=DocValuesFormat(name=Lucene80), n_ti1=DocValuesFormat(name=Lucene80), n_tl1=DocValuesFormat(name=Lucene80), _version_=DocValuesFormat(name=Direct), n_tf1=DocValuesFormat(name=Direct), n_tdt1=DocValuesFormat(name=Direct), id_i1=DocValuesFormat(name=Lucene80), range_facet_i_dv=DocValuesFormat(name=Direct), id=DocValuesFormat(name=Lucene80), intDvoDefault=DocValuesFormat(name=Asserting), timestamp=DocValuesFormat(name=Direct)}, maxPointsInLeafNode=1982, maxMBSortInHeap=7.764810612223133, sim=Asserting(org.apache.lucene.search.similarities.AssertingSimilarity@16784554), locale=id-ID, timezone=Europe/Prague
   [junit4]   2> NOTE: Linux 4.4.0-137-generic amd64/Oracle Corporation 1.8.0_191 (64-bit)/cpus=4,threads=1,free=177326976,total=529006592
   [junit4]   2> NOTE: All tests run in this JVM: [PingRequestHandlerTest, TestRawResponseWriter, DeleteReplicaTest, FileUtilsTest, HdfsChaosMonkeyNothingIsSafeTest, DistributedQueryElevationComponentTest, RAMDirectoryFactoryTest, TestMinHashQParser, TestCloudJSONFacetSKG, LeaderElectionTest, TestNRTOpen, CloudMLTQParserTest, DocValuesTest, FileBasedSpellCheckerTest, TestBackupRepositoryFactory, TestDirectoryFactory, TestZkAclsWithHadoopAuth, ConnectionManagerTest, TestManagedSchemaAPI, SuggesterTSTTest, CdcrUpdateLogTest, TestReversedWildcardFilterFactory, FieldMutatingUpdateProcessorTest, AlternateDirectoryTest, SmileWriterTest, TestPointFields, BasicZkTest, TestDelegationWithHadoopAuth, TestManagedResource, SystemInfoHandlerTest, BitVectorTest, TestFastOutputStream, TestReplicationHandler, TestJoin, TestTrackingShardHandlerFactory, SignatureUpdateProcessorFactoryTest, TestStressLiveNodes, HttpSolrCallGetCoreTest, TestDocumentBuilder, DeleteInactiveReplicaTest, SolrCmdDistributorTest, ScheduledTriggerIntegrationTest, TestEmbeddedSolrServerSchemaAPI, TestPartialUpdateDeduplication, CopyFieldTest, SyncSliceTest, TestFileDictionaryLookup, TestNoOpRegenerator, TestCoreDiscovery, SuggestComponentContextFilterQueryTest, SynonymTokenizerTest, RankQueryTest, TestZkChroot, TestExpandComponent, TestSystemIdResolver, ZkShardTermsTest, TestDynamicFieldResource, TestSegmentSorting, SolrCoreMetricManagerTest, TriggerSetPropertiesIntegrationTest, CurrencyRangeFacetCloudTest, TestPayloadScoreQParserPlugin, DistributedQueueTest, TestLuceneIndexBackCompat, TestSolrIndexConfig, HDFSCollectionsAPITest, HdfsSyncSliceTest, TestHighFrequencyDictionaryFactory, BadComponentTest, TestIBSimilarityFactory, FastVectorHighlighterTest, TestStandardQParsers, TestSortByMinMaxFunction, TestJavabinTupleStreamParser, TestClassicSimilarityFactory, SolrMetricsIntegrationTest, TestOnReconnectListenerSupport, TestSlowCompositeReaderWrapper, HLLSerializationTest, CdcrRequestHandlerTest, RegexBoostProcessorTest, TestSimExtremeIndexing, TestCollapseQParserPlugin, SharedFSAutoReplicaFailoverTest, NodeAddedTriggerTest, PKIAuthenticationIntegrationTest, TestRequestStatusCollectionAPI, TestCloudPhrasesIdentificationComponent, LeaderTragicEventTest, ActionThrottleTest, LukeRequestHandlerTest, TestCharFilters, TestSimpleQParserPlugin, TestBulkSchemaAPI, TestConfigSetsAPIZkFailure, TestSolrCloudWithSecureImpersonation, TestCollationFieldDocValues, HdfsUnloadDistributedZkTest, OverriddenZkACLAndCredentialsProvidersTest, TestSubQueryTransformer, PeerSyncWithBufferUpdatesTest, TestJsonFacetsStatsParsing, ZkControllerTest, HdfsDirectoryFactoryTest, DOMUtilTest, TestSolr4Spatial2, CdcrBootstrapTest, TestExclusionRuleCollectionAccess, TimeZoneUtilsTest, SolrRequestParserTest, SearchRateTriggerTest, SolrJmxReporterTest, TestFieldCacheSortRandom, TestCloudManagedSchema, AtomicUpdatesTest, TestTolerantUpdateProcessorRandomCloud, TestConfig, TestReloadAndDeleteDocs, IndexSchemaRuntimeFieldTest, CollectionsAPIAsyncDistributedZkTest, BinaryUpdateRequestHandlerTest, TestConfigSetProperties, TestRTimerTree, HttpPartitionWithTlogReplicasTest, ByteBuffersDirectoryFactoryTest, ConvertedLegacyTest, TestNestedUpdateProcessor, AssignBackwardCompatibilityTest, TestXmlQParser, TestClusterStateMutator, PhrasesIdentificationComponentTest, DistributedIntervalFacetingTest, UpdateLogTest, TestRebalanceLeaders, SortSpecParsingTest, GraphQueryTest, TestQueryUtils, TestLogWatcher, DistributedMLTComponentTest, XmlUpdateRequestHandlerTest, ClusterStateTest, ClusterStateUpdateTest, CollectionPropsTest, DeleteShardTest, DeleteStatusTest, DistribCursorPagingTest, DistributedVersionInfoTest, DocValuesNotIndexedTest, ForceLeaderTest, ForceLeaderWithTlogReplicasTest, FullSolrCloudDistribCmdsTest, HealthCheckHandlerTest, LeaderVoteWaitTimeoutTest, MissingSegmentRecoveryTest, MoveReplicaHDFSFailoverTest, MoveReplicaHDFSTest, MoveReplicaTest, MultiThreadedOCPTest, NestedShardedAtomicUpdateTest, OverseerCollectionConfigSetProcessorTest, OverseerRolesTest, OverseerTaskQueueTest, PeerSyncReplicationTest, RemoteQueryErrorTest, ReplaceNodeNoTargetTest, ReplaceNodeTest, ReplicationFactorTest, SSLMigrationTest, SaslZkACLProviderTest, SliceStateTest, SolrCLIZkUtilsTest, SolrCloudExampleTest, TestCloudConsistency, TestCloudRecovery, TestCloudSearcherWarming, TestLeaderElectionWithEmptyReplica, TestShortCircuitedRequests, TestSkipOverseerOperations, AssignTest, AsyncCallRequestStatusResponseTest, CollectionsAPIDistributedZkTest, TestCollectionsAPIViaSolrCloudCluster, AutoAddReplicasPlanActionTest, AutoScalingHandlerTest, ComputePlanActionTest, NodeLostTriggerIntegrationTest, NodeLostTriggerTest, TriggerCooldownIntegrationTest, TestSimLargeCluster, TestReplicationHandlerBackup, TestSQLHandlerNonCloud, TestSolrConfigHandlerCloud, CoreAdminOperationTest, CoreAdminRequestStatusTest, DaemonStreamApiTest, MetricsHandlerTest, MetricsHistoryHandlerTest, PropertiesRequestHandlerTest, SecurityConfHandlerTest, SegmentsInfoRequestHandlerTest, TestApiFramework, TestCollectionAPIs, TestConfigsApi, CustomHighlightComponentTest, DistributedFacetExistsSmallTest, DistributedFacetPivotSmallAdvancedTest, DistributedSpellCheckComponentTest, QueryElevationComponentTest, ShufflingReplicaListTransformerTest, SuggestComponentTest, TermVectorComponentTest, TestExportWriter, Tagger2Test, TaggerTest, HighlighterMaxOffsetTest, UninvertDocValuesMergePolicyTest, WrapperMergePolicyFactoryTest, TestLegacyField, TestLegacyFieldReuse, TestLegacyNumericUtils, TestNumericRangeQuery32, SolrCloudReportersTest, SolrRrdBackendFactoryTest, TestRemoteStreaming, TestStreamBody, TestMacroExpander, TestCSVResponseWriter, TestRawTransformer, TestSolrQueryResponse, TestFieldCollectionResource, TestFieldTypeCollectionResource, TestSchemaNameResource, TestSchemaSimilarityResource, TestUniqueKeyFieldResource, TestManagedSynonymFilterFactory, BadCopyFieldTest, BadIndexSchemaTest, DateRangeFieldTest, NotRequiredUniqueKeyTest, NumericFieldsTest, OpenExchangeRatesOrgProviderTest, PolyFieldTest, PreAnalyzedFieldManagedSchemaCloudTest, SchemaApiFailureTest, TestSchemalessBufferedUpdates, TestUseDocValuesAsStored, TestComplexPhraseLeadingWildcard, TestComplexPhraseQParserPlugin, TestComponentsName, TestCustomSort, TestElisionMultitermQuery, TestFastLRUCache, TestFieldSortValues, TestFilteredDocIdSet, TestFiltering, TestRangeQuery, TestReload, TestReloadDeadlock, TestSolrCoreParser, TestSolrFieldCacheBean, TestSolrJ, TestStressLucene, TestStressRecovery, TestStressReorder, TestStressUserVersions, TestStressVersions, TestSurroundQueryParser, TestXmlQParserPlugin, DistributedFacetSimpleRefinementLongTailTest, DistanceFunctionTest, BJQParserTest, BlockJoinFacetDistribTest, TestLMDirichletSimilarityFactory, TestLMJelinekMercerSimilarityFactory, TestNonDefinedSimilarityFactory, TestExactSharedStatsCache, TestExactStatsCache, AuditLoggerPluginTest, BasicAuthIntegrationTest, TestPKIAuthenticationPlugin, IndexBasedSpellCheckerTest, SpellCheckCollatorWithCollapseTest, SpellPossibilityIteratorTest, TestSuggestSpellingConverter, SuggesterWFSTTest, TestPhraseSuggestions, BlockDirectoryTest, TestFieldCacheWithThreads, TestLegacyFieldCache, TestNumericTerms32, TestUninvertingReader, DataDrivenBlockJoinTest, DirectUpdateHandlerTest, DocumentBuilderTest, PeerSyncWithIndexFingerprintCachingTest, PeerSyncWithLeaderTest]
   [junit4] Completed [855/855 (3!)] on J2 in 140.11s, 1 test, 1 failure <<< FAILURES!

[...truncated 8974 lines...]
BUILD FAILED
/x1/jenkins/jenkins-slave/workspace/Lucene-Solr-Tests-8.x/build.xml:634: The following error occurred while executing this line:
/x1/jenkins/jenkins-slave/workspace/Lucene-Solr-Tests-8.x/build.xml:128: Found 1 violations in source files (File uses Mockito but has no assumeWorkingMockito() call).

Total time: 100 minutes 17 seconds
Build step 'Invoke Ant' marked build as failure
Archiving artifacts
Recording test results
Email was triggered for: Failure - Any
Sending email for trigger: Failure - Any

Mime
View raw message