lucene-dev mailing list archives

Site index · List index
Message view « Date » · « Thread »
Top « Date » · « Thread »
From Policeman Jenkins Server <jenk...@thetaphi.de>
Subject [JENKINS-EA] Lucene-Solr-8.x-Linux (64bit/jdk-13-ea+18) - Build # 503 - Still Unstable!
Date Thu, 02 May 2019 23:23:23 GMT
Build: https://jenkins.thetaphi.de/job/Lucene-Solr-8.x-Linux/503/
Java: 64bit/jdk-13-ea+18 -XX:-UseCompressedOops -XX:+UseG1GC

8 tests failed.
FAILED:  junit.framework.TestSuite.org.apache.solr.update.processor.DistributedUpdateProcessorTest

Error Message:
SOLR-11606: ByteBuddy used by Mockito is not working with this JVM version.

Stack Trace:
org.junit.AssumptionViolatedException: SOLR-11606: ByteBuddy used by Mockito is not working with this JVM version.
	at __randomizedtesting.SeedInfo.seed([553F3438543FB92A]:0)
	at com.carrotsearch.randomizedtesting.RandomizedTest.assumeNoException(RandomizedTest.java:742)
	at org.apache.solr.SolrTestCaseJ4.assumeWorkingMockito(SolrTestCaseJ4.java:374)
	at org.apache.solr.update.processor.DistributedUpdateProcessorTest.beforeClass(DistributedUpdateProcessorTest.java:60)
	at java.base/jdk.internal.reflect.NativeMethodAccessorImpl.invoke0(Native Method)
	at java.base/jdk.internal.reflect.NativeMethodAccessorImpl.invoke(NativeMethodAccessorImpl.java:62)
	at java.base/jdk.internal.reflect.DelegatingMethodAccessorImpl.invoke(DelegatingMethodAccessorImpl.java:43)
	at java.base/java.lang.reflect.Method.invoke(Method.java:567)
	at com.carrotsearch.randomizedtesting.RandomizedRunner.invoke(RandomizedRunner.java:1750)
	at com.carrotsearch.randomizedtesting.RandomizedRunner$6.evaluate(RandomizedRunner.java:878)
	at com.carrotsearch.randomizedtesting.RandomizedRunner$7.evaluate(RandomizedRunner.java:894)
	at com.carrotsearch.randomizedtesting.rules.StatementAdapter.evaluate(StatementAdapter.java:36)
	at com.carrotsearch.randomizedtesting.rules.SystemPropertiesRestoreRule$1.evaluate(SystemPropertiesRestoreRule.java:57)
	at org.apache.lucene.util.AbstractBeforeAfterRule$1.evaluate(AbstractBeforeAfterRule.java:45)
	at com.carrotsearch.randomizedtesting.rules.StatementAdapter.evaluate(StatementAdapter.java:36)
	at org.apache.lucene.util.TestRuleStoreClassName$1.evaluate(TestRuleStoreClassName.java:41)
	at com.carrotsearch.randomizedtesting.rules.NoShadowingOrOverridesOnMethodsRule$1.evaluate(NoShadowingOrOverridesOnMethodsRule.java:40)
	at com.carrotsearch.randomizedtesting.rules.NoShadowingOrOverridesOnMethodsRule$1.evaluate(NoShadowingOrOverridesOnMethodsRule.java:40)
	at com.carrotsearch.randomizedtesting.rules.StatementAdapter.evaluate(StatementAdapter.java:36)
	at com.carrotsearch.randomizedtesting.rules.StatementAdapter.evaluate(StatementAdapter.java:36)
	at org.apache.lucene.util.TestRuleAssertionsRequired$1.evaluate(TestRuleAssertionsRequired.java:53)
	at org.apache.lucene.util.TestRuleMarkFailure$1.evaluate(TestRuleMarkFailure.java:47)
	at org.apache.lucene.util.TestRuleIgnoreAfterMaxFailures$1.evaluate(TestRuleIgnoreAfterMaxFailures.java:64)
	at org.apache.lucene.util.TestRuleIgnoreTestSuites$1.evaluate(TestRuleIgnoreTestSuites.java:54)
	at com.carrotsearch.randomizedtesting.rules.StatementAdapter.evaluate(StatementAdapter.java:36)
	at com.carrotsearch.randomizedtesting.ThreadLeakControl$StatementRunner.run(ThreadLeakControl.java:368)
	at java.base/java.lang.Thread.run(Thread.java:835)
Caused by: java.lang.IllegalArgumentException: Unknown Java version: 13
	at net.bytebuddy.ClassFileVersion.ofJavaVersion(ClassFileVersion.java:210)
	at net.bytebuddy.ClassFileVersion$VersionLocator$ForJava9CapableVm.locate(ClassFileVersion.java:462)
	at net.bytebuddy.ClassFileVersion.ofThisVm(ClassFileVersion.java:223)
	at java.base/jdk.internal.reflect.NativeMethodAccessorImpl.invoke0(Native Method)
	at java.base/jdk.internal.reflect.NativeMethodAccessorImpl.invoke(NativeMethodAccessorImpl.java:62)
	at java.base/jdk.internal.reflect.DelegatingMethodAccessorImpl.invoke(DelegatingMethodAccessorImpl.java:43)
	at java.base/java.lang.reflect.Method.invoke(Method.java:567)
	at org.apache.solr.SolrTestCaseJ4.assumeWorkingMockito(SolrTestCaseJ4.java:372)
	... 24 more


FAILED:  junit.framework.TestSuite.org.apache.solr.update.processor.DistributedUpdateProcessorTest

Error Message:


Stack Trace:
java.lang.NullPointerException
	at __randomizedtesting.SeedInfo.seed([553F3438543FB92A]:0)
	at org.apache.solr.update.processor.DistributedUpdateProcessorTest.AfterClass(DistributedUpdateProcessorTest.java:67)
	at java.base/jdk.internal.reflect.NativeMethodAccessorImpl.invoke0(Native Method)
	at java.base/jdk.internal.reflect.NativeMethodAccessorImpl.invoke(NativeMethodAccessorImpl.java:62)
	at java.base/jdk.internal.reflect.DelegatingMethodAccessorImpl.invoke(DelegatingMethodAccessorImpl.java:43)
	at java.base/java.lang.reflect.Method.invoke(Method.java:567)
	at com.carrotsearch.randomizedtesting.RandomizedRunner.invoke(RandomizedRunner.java:1750)
	at com.carrotsearch.randomizedtesting.RandomizedRunner$7.evaluate(RandomizedRunner.java:901)
	at com.carrotsearch.randomizedtesting.rules.StatementAdapter.evaluate(StatementAdapter.java:36)
	at com.carrotsearch.randomizedtesting.rules.SystemPropertiesRestoreRule$1.evaluate(SystemPropertiesRestoreRule.java:57)
	at org.apache.lucene.util.AbstractBeforeAfterRule$1.evaluate(AbstractBeforeAfterRule.java:45)
	at com.carrotsearch.randomizedtesting.rules.StatementAdapter.evaluate(StatementAdapter.java:36)
	at org.apache.lucene.util.TestRuleStoreClassName$1.evaluate(TestRuleStoreClassName.java:41)
	at com.carrotsearch.randomizedtesting.rules.NoShadowingOrOverridesOnMethodsRule$1.evaluate(NoShadowingOrOverridesOnMethodsRule.java:40)
	at com.carrotsearch.randomizedtesting.rules.NoShadowingOrOverridesOnMethodsRule$1.evaluate(NoShadowingOrOverridesOnMethodsRule.java:40)
	at com.carrotsearch.randomizedtesting.rules.StatementAdapter.evaluate(StatementAdapter.java:36)
	at com.carrotsearch.randomizedtesting.rules.StatementAdapter.evaluate(StatementAdapter.java:36)
	at org.apache.lucene.util.TestRuleAssertionsRequired$1.evaluate(TestRuleAssertionsRequired.java:53)
	at org.apache.lucene.util.TestRuleMarkFailure$1.evaluate(TestRuleMarkFailure.java:47)
	at org.apache.lucene.util.TestRuleIgnoreAfterMaxFailures$1.evaluate(TestRuleIgnoreAfterMaxFailures.java:64)
	at org.apache.lucene.util.TestRuleIgnoreTestSuites$1.evaluate(TestRuleIgnoreTestSuites.java:54)
	at com.carrotsearch.randomizedtesting.rules.StatementAdapter.evaluate(StatementAdapter.java:36)
	at com.carrotsearch.randomizedtesting.ThreadLeakControl$StatementRunner.run(ThreadLeakControl.java:368)
	at java.base/java.lang.Thread.run(Thread.java:835)


FAILED:  junit.framework.TestSuite.org.apache.solr.update.processor.DistributedUpdateProcessorTest

Error Message:
SOLR-11606: ByteBuddy used by Mockito is not working with this JVM version.

Stack Trace:
org.junit.AssumptionViolatedException: SOLR-11606: ByteBuddy used by Mockito is not working with this JVM version.
	at __randomizedtesting.SeedInfo.seed([553F3438543FB92A]:0)
	at com.carrotsearch.randomizedtesting.RandomizedTest.assumeNoException(RandomizedTest.java:742)
	at org.apache.solr.SolrTestCaseJ4.assumeWorkingMockito(SolrTestCaseJ4.java:374)
	at org.apache.solr.update.processor.DistributedUpdateProcessorTest.beforeClass(DistributedUpdateProcessorTest.java:60)
	at java.base/jdk.internal.reflect.NativeMethodAccessorImpl.invoke0(Native Method)
	at java.base/jdk.internal.reflect.NativeMethodAccessorImpl.invoke(NativeMethodAccessorImpl.java:62)
	at java.base/jdk.internal.reflect.DelegatingMethodAccessorImpl.invoke(DelegatingMethodAccessorImpl.java:43)
	at java.base/java.lang.reflect.Method.invoke(Method.java:567)
	at com.carrotsearch.randomizedtesting.RandomizedRunner.invoke(RandomizedRunner.java:1750)
	at com.carrotsearch.randomizedtesting.RandomizedRunner$6.evaluate(RandomizedRunner.java:878)
	at com.carrotsearch.randomizedtesting.RandomizedRunner$7.evaluate(RandomizedRunner.java:894)
	at com.carrotsearch.randomizedtesting.rules.StatementAdapter.evaluate(StatementAdapter.java:36)
	at com.carrotsearch.randomizedtesting.rules.SystemPropertiesRestoreRule$1.evaluate(SystemPropertiesRestoreRule.java:57)
	at org.apache.lucene.util.AbstractBeforeAfterRule$1.evaluate(AbstractBeforeAfterRule.java:45)
	at com.carrotsearch.randomizedtesting.rules.StatementAdapter.evaluate(StatementAdapter.java:36)
	at org.apache.lucene.util.TestRuleStoreClassName$1.evaluate(TestRuleStoreClassName.java:41)
	at com.carrotsearch.randomizedtesting.rules.NoShadowingOrOverridesOnMethodsRule$1.evaluate(NoShadowingOrOverridesOnMethodsRule.java:40)
	at com.carrotsearch.randomizedtesting.rules.NoShadowingOrOverridesOnMethodsRule$1.evaluate(NoShadowingOrOverridesOnMethodsRule.java:40)
	at com.carrotsearch.randomizedtesting.rules.StatementAdapter.evaluate(StatementAdapter.java:36)
	at com.carrotsearch.randomizedtesting.rules.StatementAdapter.evaluate(StatementAdapter.java:36)
	at org.apache.lucene.util.TestRuleAssertionsRequired$1.evaluate(TestRuleAssertionsRequired.java:53)
	at org.apache.lucene.util.TestRuleMarkFailure$1.evaluate(TestRuleMarkFailure.java:47)
	at org.apache.lucene.util.TestRuleIgnoreAfterMaxFailures$1.evaluate(TestRuleIgnoreAfterMaxFailures.java:64)
	at org.apache.lucene.util.TestRuleIgnoreTestSuites$1.evaluate(TestRuleIgnoreTestSuites.java:54)
	at com.carrotsearch.randomizedtesting.rules.StatementAdapter.evaluate(StatementAdapter.java:36)
	at com.carrotsearch.randomizedtesting.ThreadLeakControl$StatementRunner.run(ThreadLeakControl.java:368)
	at java.base/java.lang.Thread.run(Thread.java:835)
Caused by: java.lang.IllegalArgumentException: Unknown Java version: 13
	at net.bytebuddy.ClassFileVersion.ofJavaVersion(ClassFileVersion.java:210)
	at net.bytebuddy.ClassFileVersion$VersionLocator$ForJava9CapableVm.locate(ClassFileVersion.java:462)
	at net.bytebuddy.ClassFileVersion.ofThisVm(ClassFileVersion.java:223)
	at java.base/jdk.internal.reflect.NativeMethodAccessorImpl.invoke0(Native Method)
	at java.base/jdk.internal.reflect.NativeMethodAccessorImpl.invoke(NativeMethodAccessorImpl.java:62)
	at java.base/jdk.internal.reflect.DelegatingMethodAccessorImpl.invoke(DelegatingMethodAccessorImpl.java:43)
	at java.base/java.lang.reflect.Method.invoke(Method.java:567)
	at org.apache.solr.SolrTestCaseJ4.assumeWorkingMockito(SolrTestCaseJ4.java:372)
	... 24 more


FAILED:  junit.framework.TestSuite.org.apache.solr.update.processor.DistributedUpdateProcessorTest

Error Message:


Stack Trace:
java.lang.NullPointerException
	at __randomizedtesting.SeedInfo.seed([553F3438543FB92A]:0)
	at org.apache.solr.update.processor.DistributedUpdateProcessorTest.AfterClass(DistributedUpdateProcessorTest.java:67)
	at java.base/jdk.internal.reflect.NativeMethodAccessorImpl.invoke0(Native Method)
	at java.base/jdk.internal.reflect.NativeMethodAccessorImpl.invoke(NativeMethodAccessorImpl.java:62)
	at java.base/jdk.internal.reflect.DelegatingMethodAccessorImpl.invoke(DelegatingMethodAccessorImpl.java:43)
	at java.base/java.lang.reflect.Method.invoke(Method.java:567)
	at com.carrotsearch.randomizedtesting.RandomizedRunner.invoke(RandomizedRunner.java:1750)
	at com.carrotsearch.randomizedtesting.RandomizedRunner$7.evaluate(RandomizedRunner.java:901)
	at com.carrotsearch.randomizedtesting.rules.StatementAdapter.evaluate(StatementAdapter.java:36)
	at com.carrotsearch.randomizedtesting.rules.SystemPropertiesRestoreRule$1.evaluate(SystemPropertiesRestoreRule.java:57)
	at org.apache.lucene.util.AbstractBeforeAfterRule$1.evaluate(AbstractBeforeAfterRule.java:45)
	at com.carrotsearch.randomizedtesting.rules.StatementAdapter.evaluate(StatementAdapter.java:36)
	at org.apache.lucene.util.TestRuleStoreClassName$1.evaluate(TestRuleStoreClassName.java:41)
	at com.carrotsearch.randomizedtesting.rules.NoShadowingOrOverridesOnMethodsRule$1.evaluate(NoShadowingOrOverridesOnMethodsRule.java:40)
	at com.carrotsearch.randomizedtesting.rules.NoShadowingOrOverridesOnMethodsRule$1.evaluate(NoShadowingOrOverridesOnMethodsRule.java:40)
	at com.carrotsearch.randomizedtesting.rules.StatementAdapter.evaluate(StatementAdapter.java:36)
	at com.carrotsearch.randomizedtesting.rules.StatementAdapter.evaluate(StatementAdapter.java:36)
	at org.apache.lucene.util.TestRuleAssertionsRequired$1.evaluate(TestRuleAssertionsRequired.java:53)
	at org.apache.lucene.util.TestRuleMarkFailure$1.evaluate(TestRuleMarkFailure.java:47)
	at org.apache.lucene.util.TestRuleIgnoreAfterMaxFailures$1.evaluate(TestRuleIgnoreAfterMaxFailures.java:64)
	at org.apache.lucene.util.TestRuleIgnoreTestSuites$1.evaluate(TestRuleIgnoreTestSuites.java:54)
	at com.carrotsearch.randomizedtesting.rules.StatementAdapter.evaluate(StatementAdapter.java:36)
	at com.carrotsearch.randomizedtesting.ThreadLeakControl$StatementRunner.run(ThreadLeakControl.java:368)
	at java.base/java.lang.Thread.run(Thread.java:835)


FAILED:  junit.framework.TestSuite.org.apache.solr.update.processor.DistributedUpdateProcessorTest

Error Message:
SOLR-11606: ByteBuddy used by Mockito is not working with this JVM version.

Stack Trace:
org.junit.AssumptionViolatedException: SOLR-11606: ByteBuddy used by Mockito is not working with this JVM version.
	at __randomizedtesting.SeedInfo.seed([553F3438543FB92A]:0)
	at com.carrotsearch.randomizedtesting.RandomizedTest.assumeNoException(RandomizedTest.java:742)
	at org.apache.solr.SolrTestCaseJ4.assumeWorkingMockito(SolrTestCaseJ4.java:374)
	at org.apache.solr.update.processor.DistributedUpdateProcessorTest.beforeClass(DistributedUpdateProcessorTest.java:60)
	at java.base/jdk.internal.reflect.NativeMethodAccessorImpl.invoke0(Native Method)
	at java.base/jdk.internal.reflect.NativeMethodAccessorImpl.invoke(NativeMethodAccessorImpl.java:62)
	at java.base/jdk.internal.reflect.DelegatingMethodAccessorImpl.invoke(DelegatingMethodAccessorImpl.java:43)
	at java.base/java.lang.reflect.Method.invoke(Method.java:567)
	at com.carrotsearch.randomizedtesting.RandomizedRunner.invoke(RandomizedRunner.java:1750)
	at com.carrotsearch.randomizedtesting.RandomizedRunner$6.evaluate(RandomizedRunner.java:878)
	at com.carrotsearch.randomizedtesting.RandomizedRunner$7.evaluate(RandomizedRunner.java:894)
	at com.carrotsearch.randomizedtesting.rules.StatementAdapter.evaluate(StatementAdapter.java:36)
	at com.carrotsearch.randomizedtesting.rules.SystemPropertiesRestoreRule$1.evaluate(SystemPropertiesRestoreRule.java:57)
	at org.apache.lucene.util.AbstractBeforeAfterRule$1.evaluate(AbstractBeforeAfterRule.java:45)
	at com.carrotsearch.randomizedtesting.rules.StatementAdapter.evaluate(StatementAdapter.java:36)
	at org.apache.lucene.util.TestRuleStoreClassName$1.evaluate(TestRuleStoreClassName.java:41)
	at com.carrotsearch.randomizedtesting.rules.NoShadowingOrOverridesOnMethodsRule$1.evaluate(NoShadowingOrOverridesOnMethodsRule.java:40)
	at com.carrotsearch.randomizedtesting.rules.NoShadowingOrOverridesOnMethodsRule$1.evaluate(NoShadowingOrOverridesOnMethodsRule.java:40)
	at com.carrotsearch.randomizedtesting.rules.StatementAdapter.evaluate(StatementAdapter.java:36)
	at com.carrotsearch.randomizedtesting.rules.StatementAdapter.evaluate(StatementAdapter.java:36)
	at org.apache.lucene.util.TestRuleAssertionsRequired$1.evaluate(TestRuleAssertionsRequired.java:53)
	at org.apache.lucene.util.TestRuleMarkFailure$1.evaluate(TestRuleMarkFailure.java:47)
	at org.apache.lucene.util.TestRuleIgnoreAfterMaxFailures$1.evaluate(TestRuleIgnoreAfterMaxFailures.java:64)
	at org.apache.lucene.util.TestRuleIgnoreTestSuites$1.evaluate(TestRuleIgnoreTestSuites.java:54)
	at com.carrotsearch.randomizedtesting.rules.StatementAdapter.evaluate(StatementAdapter.java:36)
	at com.carrotsearch.randomizedtesting.ThreadLeakControl$StatementRunner.run(ThreadLeakControl.java:368)
	at java.base/java.lang.Thread.run(Thread.java:835)
Caused by: java.lang.IllegalArgumentException: Unknown Java version: 13
	at net.bytebuddy.ClassFileVersion.ofJavaVersion(ClassFileVersion.java:210)
	at net.bytebuddy.ClassFileVersion$VersionLocator$ForJava9CapableVm.locate(ClassFileVersion.java:462)
	at net.bytebuddy.ClassFileVersion.ofThisVm(ClassFileVersion.java:223)
	at java.base/jdk.internal.reflect.NativeMethodAccessorImpl.invoke0(Native Method)
	at java.base/jdk.internal.reflect.NativeMethodAccessorImpl.invoke(NativeMethodAccessorImpl.java:62)
	at java.base/jdk.internal.reflect.DelegatingMethodAccessorImpl.invoke(DelegatingMethodAccessorImpl.java:43)
	at java.base/java.lang.reflect.Method.invoke(Method.java:567)
	at org.apache.solr.SolrTestCaseJ4.assumeWorkingMockito(SolrTestCaseJ4.java:372)
	... 24 more


FAILED:  junit.framework.TestSuite.org.apache.solr.update.processor.DistributedUpdateProcessorTest

Error Message:


Stack Trace:
java.lang.NullPointerException
	at __randomizedtesting.SeedInfo.seed([553F3438543FB92A]:0)
	at org.apache.solr.update.processor.DistributedUpdateProcessorTest.AfterClass(DistributedUpdateProcessorTest.java:67)
	at java.base/jdk.internal.reflect.NativeMethodAccessorImpl.invoke0(Native Method)
	at java.base/jdk.internal.reflect.NativeMethodAccessorImpl.invoke(NativeMethodAccessorImpl.java:62)
	at java.base/jdk.internal.reflect.DelegatingMethodAccessorImpl.invoke(DelegatingMethodAccessorImpl.java:43)
	at java.base/java.lang.reflect.Method.invoke(Method.java:567)
	at com.carrotsearch.randomizedtesting.RandomizedRunner.invoke(RandomizedRunner.java:1750)
	at com.carrotsearch.randomizedtesting.RandomizedRunner$7.evaluate(RandomizedRunner.java:901)
	at com.carrotsearch.randomizedtesting.rules.StatementAdapter.evaluate(StatementAdapter.java:36)
	at com.carrotsearch.randomizedtesting.rules.SystemPropertiesRestoreRule$1.evaluate(SystemPropertiesRestoreRule.java:57)
	at org.apache.lucene.util.AbstractBeforeAfterRule$1.evaluate(AbstractBeforeAfterRule.java:45)
	at com.carrotsearch.randomizedtesting.rules.StatementAdapter.evaluate(StatementAdapter.java:36)
	at org.apache.lucene.util.TestRuleStoreClassName$1.evaluate(TestRuleStoreClassName.java:41)
	at com.carrotsearch.randomizedtesting.rules.NoShadowingOrOverridesOnMethodsRule$1.evaluate(NoShadowingOrOverridesOnMethodsRule.java:40)
	at com.carrotsearch.randomizedtesting.rules.NoShadowingOrOverridesOnMethodsRule$1.evaluate(NoShadowingOrOverridesOnMethodsRule.java:40)
	at com.carrotsearch.randomizedtesting.rules.StatementAdapter.evaluate(StatementAdapter.java:36)
	at com.carrotsearch.randomizedtesting.rules.StatementAdapter.evaluate(StatementAdapter.java:36)
	at org.apache.lucene.util.TestRuleAssertionsRequired$1.evaluate(TestRuleAssertionsRequired.java:53)
	at org.apache.lucene.util.TestRuleMarkFailure$1.evaluate(TestRuleMarkFailure.java:47)
	at org.apache.lucene.util.TestRuleIgnoreAfterMaxFailures$1.evaluate(TestRuleIgnoreAfterMaxFailures.java:64)
	at org.apache.lucene.util.TestRuleIgnoreTestSuites$1.evaluate(TestRuleIgnoreTestSuites.java:54)
	at com.carrotsearch.randomizedtesting.rules.StatementAdapter.evaluate(StatementAdapter.java:36)
	at com.carrotsearch.randomizedtesting.ThreadLeakControl$StatementRunner.run(ThreadLeakControl.java:368)
	at java.base/java.lang.Thread.run(Thread.java:835)


FAILED:  junit.framework.TestSuite.org.apache.solr.update.processor.DistributedUpdateProcessorTest

Error Message:
SOLR-11606: ByteBuddy used by Mockito is not working with this JVM version.

Stack Trace:
org.junit.AssumptionViolatedException: SOLR-11606: ByteBuddy used by Mockito is not working with this JVM version.
	at __randomizedtesting.SeedInfo.seed([553F3438543FB92A]:0)
	at com.carrotsearch.randomizedtesting.RandomizedTest.assumeNoException(RandomizedTest.java:742)
	at org.apache.solr.SolrTestCaseJ4.assumeWorkingMockito(SolrTestCaseJ4.java:374)
	at org.apache.solr.update.processor.DistributedUpdateProcessorTest.beforeClass(DistributedUpdateProcessorTest.java:60)
	at java.base/jdk.internal.reflect.NativeMethodAccessorImpl.invoke0(Native Method)
	at java.base/jdk.internal.reflect.NativeMethodAccessorImpl.invoke(NativeMethodAccessorImpl.java:62)
	at java.base/jdk.internal.reflect.DelegatingMethodAccessorImpl.invoke(DelegatingMethodAccessorImpl.java:43)
	at java.base/java.lang.reflect.Method.invoke(Method.java:567)
	at com.carrotsearch.randomizedtesting.RandomizedRunner.invoke(RandomizedRunner.java:1750)
	at com.carrotsearch.randomizedtesting.RandomizedRunner$6.evaluate(RandomizedRunner.java:878)
	at com.carrotsearch.randomizedtesting.RandomizedRunner$7.evaluate(RandomizedRunner.java:894)
	at com.carrotsearch.randomizedtesting.rules.StatementAdapter.evaluate(StatementAdapter.java:36)
	at com.carrotsearch.randomizedtesting.rules.SystemPropertiesRestoreRule$1.evaluate(SystemPropertiesRestoreRule.java:57)
	at org.apache.lucene.util.AbstractBeforeAfterRule$1.evaluate(AbstractBeforeAfterRule.java:45)
	at com.carrotsearch.randomizedtesting.rules.StatementAdapter.evaluate(StatementAdapter.java:36)
	at org.apache.lucene.util.TestRuleStoreClassName$1.evaluate(TestRuleStoreClassName.java:41)
	at com.carrotsearch.randomizedtesting.rules.NoShadowingOrOverridesOnMethodsRule$1.evaluate(NoShadowingOrOverridesOnMethodsRule.java:40)
	at com.carrotsearch.randomizedtesting.rules.NoShadowingOrOverridesOnMethodsRule$1.evaluate(NoShadowingOrOverridesOnMethodsRule.java:40)
	at com.carrotsearch.randomizedtesting.rules.StatementAdapter.evaluate(StatementAdapter.java:36)
	at com.carrotsearch.randomizedtesting.rules.StatementAdapter.evaluate(StatementAdapter.java:36)
	at org.apache.lucene.util.TestRuleAssertionsRequired$1.evaluate(TestRuleAssertionsRequired.java:53)
	at org.apache.lucene.util.TestRuleMarkFailure$1.evaluate(TestRuleMarkFailure.java:47)
	at org.apache.lucene.util.TestRuleIgnoreAfterMaxFailures$1.evaluate(TestRuleIgnoreAfterMaxFailures.java:64)
	at org.apache.lucene.util.TestRuleIgnoreTestSuites$1.evaluate(TestRuleIgnoreTestSuites.java:54)
	at com.carrotsearch.randomizedtesting.rules.StatementAdapter.evaluate(StatementAdapter.java:36)
	at com.carrotsearch.randomizedtesting.ThreadLeakControl$StatementRunner.run(ThreadLeakControl.java:368)
	at java.base/java.lang.Thread.run(Thread.java:835)
Caused by: java.lang.IllegalArgumentException: Unknown Java version: 13
	at net.bytebuddy.ClassFileVersion.ofJavaVersion(ClassFileVersion.java:210)
	at net.bytebuddy.ClassFileVersion$VersionLocator$ForJava9CapableVm.locate(ClassFileVersion.java:462)
	at net.bytebuddy.ClassFileVersion.ofThisVm(ClassFileVersion.java:223)
	at java.base/jdk.internal.reflect.NativeMethodAccessorImpl.invoke0(Native Method)
	at java.base/jdk.internal.reflect.NativeMethodAccessorImpl.invoke(NativeMethodAccessorImpl.java:62)
	at java.base/jdk.internal.reflect.DelegatingMethodAccessorImpl.invoke(DelegatingMethodAccessorImpl.java:43)
	at java.base/java.lang.reflect.Method.invoke(Method.java:567)
	at org.apache.solr.SolrTestCaseJ4.assumeWorkingMockito(SolrTestCaseJ4.java:372)
	... 24 more


FAILED:  junit.framework.TestSuite.org.apache.solr.update.processor.DistributedUpdateProcessorTest

Error Message:


Stack Trace:
java.lang.NullPointerException
	at __randomizedtesting.SeedInfo.seed([553F3438543FB92A]:0)
	at org.apache.solr.update.processor.DistributedUpdateProcessorTest.AfterClass(DistributedUpdateProcessorTest.java:67)
	at java.base/jdk.internal.reflect.NativeMethodAccessorImpl.invoke0(Native Method)
	at java.base/jdk.internal.reflect.NativeMethodAccessorImpl.invoke(NativeMethodAccessorImpl.java:62)
	at java.base/jdk.internal.reflect.DelegatingMethodAccessorImpl.invoke(DelegatingMethodAccessorImpl.java:43)
	at java.base/java.lang.reflect.Method.invoke(Method.java:567)
	at com.carrotsearch.randomizedtesting.RandomizedRunner.invoke(RandomizedRunner.java:1750)
	at com.carrotsearch.randomizedtesting.RandomizedRunner$7.evaluate(RandomizedRunner.java:901)
	at com.carrotsearch.randomizedtesting.rules.StatementAdapter.evaluate(StatementAdapter.java:36)
	at com.carrotsearch.randomizedtesting.rules.SystemPropertiesRestoreRule$1.evaluate(SystemPropertiesRestoreRule.java:57)
	at org.apache.lucene.util.AbstractBeforeAfterRule$1.evaluate(AbstractBeforeAfterRule.java:45)
	at com.carrotsearch.randomizedtesting.rules.StatementAdapter.evaluate(StatementAdapter.java:36)
	at org.apache.lucene.util.TestRuleStoreClassName$1.evaluate(TestRuleStoreClassName.java:41)
	at com.carrotsearch.randomizedtesting.rules.NoShadowingOrOverridesOnMethodsRule$1.evaluate(NoShadowingOrOverridesOnMethodsRule.java:40)
	at com.carrotsearch.randomizedtesting.rules.NoShadowingOrOverridesOnMethodsRule$1.evaluate(NoShadowingOrOverridesOnMethodsRule.java:40)
	at com.carrotsearch.randomizedtesting.rules.StatementAdapter.evaluate(StatementAdapter.java:36)
	at com.carrotsearch.randomizedtesting.rules.StatementAdapter.evaluate(StatementAdapter.java:36)
	at org.apache.lucene.util.TestRuleAssertionsRequired$1.evaluate(TestRuleAssertionsRequired.java:53)
	at org.apache.lucene.util.TestRuleMarkFailure$1.evaluate(TestRuleMarkFailure.java:47)
	at org.apache.lucene.util.TestRuleIgnoreAfterMaxFailures$1.evaluate(TestRuleIgnoreAfterMaxFailures.java:64)
	at org.apache.lucene.util.TestRuleIgnoreTestSuites$1.evaluate(TestRuleIgnoreTestSuites.java:54)
	at com.carrotsearch.randomizedtesting.rules.StatementAdapter.evaluate(StatementAdapter.java:36)
	at com.carrotsearch.randomizedtesting.ThreadLeakControl$StatementRunner.run(ThreadLeakControl.java:368)
	at java.base/java.lang.Thread.run(Thread.java:835)




Build Log:
[...truncated 15787 lines...]
   [junit4] Suite: org.apache.solr.update.processor.DistributedUpdateProcessorTest
   [junit4]   2> Creating dataDir: /home/jenkins/workspace/Lucene-Solr-8.x-Linux/solr/build/solr-core/test/J2/temp/solr.update.processor.DistributedUpdateProcessorTest_553F3438543FB92A-001/init-core-data-001
   [junit4]   2> 1914484 WARN  (SUITE-DistributedUpdateProcessorTest-seed#[553F3438543FB92A]-worker) [    ] o.a.s.SolrTestCaseJ4 startTrackingSearchers: numOpens=6 numCloses=6
   [junit4]   2> 1914484 INFO  (SUITE-DistributedUpdateProcessorTest-seed#[553F3438543FB92A]-worker) [    ] o.a.s.SolrTestCaseJ4 Using PointFields (NUMERIC_POINTS_SYSPROP=true) w/NUMERIC_DOCVALUES_SYSPROP=true
   [junit4]   2> 1914485 INFO  (SUITE-DistributedUpdateProcessorTest-seed#[553F3438543FB92A]-worker) [    ] o.a.s.SolrTestCaseJ4 Randomized ssl (false) and clientAuth (true) via: @org.apache.solr.util.RandomizeSSL(reason="", ssl=0.0/0.0, value=0.0/0.0, clientAuth=0.0/0.0)
   [junit4]   2> 1914485 INFO  (SUITE-DistributedUpdateProcessorTest-seed#[553F3438543FB92A]-worker) [    ] o.a.s.SolrTestCaseJ4 SecureRandom sanity checks: test.solr.allowed.securerandom=null & java.security.egd=file:/dev/./urandom
   [junit4]   2> 1914486 INFO  (SUITE-DistributedUpdateProcessorTest-seed#[553F3438543FB92A]-worker) [    ] o.a.s.SolrTestCaseJ4 ------------------------------------------------------- Done waiting for tracked resources to be released
   [junit4]   2> NOTE: test params are: codec=Asserting(Lucene80): {}, docValues:{}, maxPointsInLeafNode=196, maxMBSortInHeap=7.397995895102787, sim=Asserting(org.apache.lucene.search.similarities.AssertingSimilarity@7839f17c), locale=mg, timezone=US/Alaska
   [junit4]   2> NOTE: Linux 4.18.0-17-generic amd64/Oracle Corporation 13-ea (64-bit)/cpus=8,threads=1,free=285795872,total=500170752
   [junit4]   2> NOTE: All tests run in this JVM: [PhrasesIdentificationComponentTest, SyncSliceTest, HdfsChaosMonkeyNothingIsSafeTest, ByteBuffersDirectoryFactoryTest, AssignBackwardCompatibilityTest, TestIndexSearcher, TestXmlQParser, TestRebalanceLeaders, HttpPartitionWithTlogReplicasTest, MissingSegmentRecoveryTest, DeleteReplicaTest, UpdateLogTest, TestCloudManagedSchema, DateRangeFieldTest, AuditLoggerPluginTest, TestSQLHandlerNonCloud, TestInPlaceUpdatesRequiredField, SystemInfoHandlerTest, TestFieldCacheSortRandom, HttpSolrCallGetCoreTest, BadComponentTest, TestSchemaResource, DocValuesTest, TestEmbeddedSolrServerSchemaAPI, SimpleCollectionCreateDeleteTest, TestConfigSetProperties, TestPayloadScoreQParserPlugin, HighlighterTest, ChaosMonkeySafeLeaderTest, TestFieldCache, HLLSerializationTest, IndexSchemaRuntimeFieldTest, CdcrRequestHandlerTest, AutoscalingHistoryHandlerTest, TestLegacyNumericUtils, NodeMarkersRegistrationTest, SharedFSAutoReplicaFailoverTest, UUIDFieldTest, HdfsSyncSliceTest, TestConfig, RestartWhileUpdatingTest, SuggesterTSTTest, UnloadDistributedZkTest, TestFoldingMultitermQuery, DaemonStreamApiTest, SolrCmdDistributorTest, NestedShardedAtomicUpdateTest, TestJmxIntegration, TestDynamicFieldResource, TestMacroExpander, TestSortByMinMaxFunction, TestSolrIndexConfig, TestPullReplicaErrorHandling, TestRawResponseWriter, BlockDirectoryTest, TestLRUCache, CurrencyRangeFacetCloudTest, TemplateUpdateProcessorTest, CloudMLTQParserTest, TestClusterProperties, TestPerFieldSimilarityWithDefaultOverride, BlockJoinFacetDistribTest, TestDirectoryFactory, TestExclusionRuleCollectionAccess, TestRequestStatusCollectionAPI, JWTAuthPluginIntegrationTest, TestClusterStateMutator, TestDocumentBuilder, TestNRTOpen, ConvertedLegacyTest, MergeStrategyTest, PeerSyncWithBufferUpdatesTest, SearchRateTriggerTest, HdfsAutoAddReplicasIntegrationTest, TestRTimerTree, CopyFieldTest, TestFunctionQuery, TestSolrCloudWithSecureImpersonation, TestSimDistribStateManager, TestTrie, TriggerSetPropertiesIntegrationTest, TestHdfsCloudBackupRestore, TestLogWatcher, XmlUpdateRequestHandlerTest, TestJoin, TestAnalyzeInfixSuggestions, PKIAuthenticationIntegrationTest, PingRequestHandlerTest, TestNoOpRegenerator, SolrCoreMetricManagerTest, TestSolr4Spatial2, SolrIndexSplitterTest, TestDistributedGrouping, TestCloudRecovery, TestCloudPhrasesIdentificationComponent, DefaultValueUpdateProcessorTest, TestScoreJoinQPNoScore, ActionThrottleTest, TestReqParamsAPI, EmbeddedSolrNoSerializeTest, RecoveryZkTest, CleanupOldIndexTest, AsyncCallRequestStatusResponseTest, ZkControllerTest, CoreAdminOperationTest, SearchHandlerTest, ShufflingReplicaListTransformerTest, TestCharFilters, CoreSorterTest, SolrShardReporterTest, OverseerTest, TestStreamBody, AtomicUpdatesTest, TestRangeQuery, TestPointFields, TestReplicationHandler, CollectionsAPIAsyncDistributedZkTest, TestComponentsName, TestIBSimilarityFactory, SimpleFacetsTest, TestLuceneIndexBackCompat, SaslZkACLProviderTest, DocumentBuilderTest, TestHighFrequencyDictionaryFactory, ScheduledTriggerIntegrationTest, TestConfigReload, DebugComponentTest, SolrMetricsIntegrationTest, SolrCloudExampleTest, CdcrBootstrapTest, OverriddenZkACLAndCredentialsProvidersTest, TestCloudJSONFacetSKG, OutputWriterTest, ImplicitSnitchTest, NestedAtomicUpdateTest, GraphQueryTest, ClusterStateUpdateTest, TestNumericRangeQuery32, ReplaceNodeNoTargetTest, TestSolrJ, DOMUtilTest, TestLuceneMatchVersion, BasicDistributedZk2Test, BasicZkTest, CollectionPropsTest, CollectionStateFormat2Test, ConcurrentCreateRoutedAliasTest, ConfigSetsAPITest, ConnectionManagerTest, CreateCollectionCleanupTest, CreateRoutedAliasTest, DeleteInactiveReplicaTest, DeleteShardTest, DeleteStatusTest, DistribCursorPagingTest, DistribJoinFromCollectionTest, DistributedQueueTest, DistributedVersionInfoTest, LeaderElectionTest, LeaderFailoverAfterPartitionTest, LegacyCloudClusterPropTest, MetricsHistoryIntegrationTest, MoveReplicaHDFSFailoverTest, MoveReplicaHDFSTest, MoveReplicaTest, TestConfigSetsAPIExclusivity, TestConfigSetsAPIZkFailure, TestCryptoKeys, TestHashPartitioner, TestLeaderElectionZkExpiry, TestRequestForwarding, TestSSLRandomization, TestShortCircuitedRequests, TestStressCloudBlindAtomicUpdates, TestTlogReplica, TestTolerantUpdateProcessorCloud, TestWithCollection, AutoScalingHandlerTest, HttpTriggerListenerTest, MetricTriggerTest, NodeAddedTriggerIntegrationTest, SystemLogListenerTest, TestSimDistributedQueue, TestSimNodeAddedTrigger, TestSimNodeLostTrigger, TestSimPolicyCloud, TestSimTriggerIntegration, CdcrWithNodesRestartsTest, HDFSCollectionsAPITest, AlternateDirectoryTest, DirectoryFactoryTest, ExitableDirectoryReaderTest, HdfsDirectoryFactoryTest, PluginInfoTest, QueryResultKeyTest, RAMDirectoryFactoryTest, RequestHandlersTest, ResourceLoaderTest, SOLR749Test, SolrCoreCheckLockOnStartupTest, SolrCoreTest, TestBackupRepositoryFactory, TestConfigSets, TestCoreContainer, TestDynamicLoading, BinaryUpdateRequestHandlerTest, CSVRequestHandlerTest, FieldAnalysisRequestHandlerTest, TestSolrConfigHandlerConcurrent, TestApiFramework, TestCollectionAPIs, TestConfigsApi, DistributedDebugComponentTest, DistributedFacetExistsSmallTest, DistributedFacetPivotLongTailTest, DistributedFacetPivotSmallTest, DistributedMLTComponentTest, DistributedQueryComponentOptimizationTest, DistributedTermsComponentTest, StatsComponentTest, TermVectorComponentTest, TermsComponentTest, TestDistributedStatsComponentCardinality, TestHttpShardHandlerFactory, TestTrackingShardHandlerFactory, SolrJmxReporterCloudTest, SolrJmxReporterTest, JSONWriterTest, TestBinaryResponseWriter, TestCustomDocTransformer, TestGraphMLResponseWriter, TestRetrieveFieldsOptimizer, TestChildDocTransformer, TestSubQueryTransformerCrossCore, TestSubQueryTransformerDistrib, TestFieldCollectionResource, TestFieldResource, TestFieldTypeCollectionResource, TestSchemaSimilarityResource, TestSerializedLuceneMatchVersion, TestUniqueKeyFieldResource, TestManagedSynonymFilterFactory, BadCopyFieldTest, IndexSchemaTest, ManagedSchemaRoundRobinCloudTest, NumericFieldsTest, PolyFieldTest, PreAnalyzedFieldTest, RequiredFieldsTest, SchemaVersionSpecificBehaviorTest, SpatialRPTFieldTypeTest, TestCollationField, TestCollationFieldDocValues, TestHalfAndHalfDocValues, TestManagedSchema, TestManagedSchemaAPI, TestSchemaManager, TestSortableTextField, QueryParsingTest, ReturnFieldsTest, SortSpecParsingTest, TestAddFieldRealTimeGet, TestCustomSort, TestDocSet, TestExtendedDismaxParser, TestLegacyNumericRangeQueryBuilder, TestMinHashQParser, TestQueryTypes, TestRealTimeGet, TestRecoveryHdfs, TestAuthorizationFramework, TestZkAclsWithHadoopAuth, NoCacheHeaderTest, SolrRequestParserTest, DirectSolrSpellCheckerTest, SpellCheckCollatorTest, TestAnalyzedSuggestions, BufferStoreTest, HdfsDirectoryTest, TestHdfsUpdateLog, ClassificationUpdateProcessorFactoryTest, ClassificationUpdateProcessorIntegrationTest, DistributedUpdateProcessorTest]
   [junit4]   2> NOTE: reproduce with: ant test  -Dtestcase=DistributedUpdateProcessorTest -Dtests.seed=553F3438543FB92A -Dtests.multiplier=3 -Dtests.slow=true -Dtests.locale=mg -Dtests.timezone=US/Alaska -Dtests.asserts=true -Dtests.file.encoding=UTF-8
   [junit4] ERROR   0.00s J2 | DistributedUpdateProcessorTest (suite) <<<
   [junit4]    > Assumption #1: SOLR-11606: ByteBuddy used by Mockito is not working with this JVM version.Throwable #2: java.lang.NullPointerException
   [junit4]    > 	at __randomizedtesting.SeedInfo.seed([553F3438543FB92A]:0)
   [junit4]    > 	at org.apache.solr.update.processor.DistributedUpdateProcessorTest.AfterClass(DistributedUpdateProcessorTest.java:67)
   [junit4]    > 	at java.base/jdk.internal.reflect.NativeMethodAccessorImpl.invoke0(Native Method)
   [junit4]    > 	at java.base/jdk.internal.reflect.NativeMethodAccessorImpl.invoke(NativeMethodAccessorImpl.java:62)
   [junit4]    > 	at java.base/jdk.internal.reflect.DelegatingMethodAccessorImpl.invoke(DelegatingMethodAccessorImpl.java:43)
   [junit4]    > 	at java.base/java.lang.reflect.Method.invoke(Method.java:567)
   [junit4]    > 	at java.base/java.lang.Thread.run(Thread.java:835)
   [junit4] Completed [812/855 (1!)] on J2 in 0.26s, 0 tests, 1 error <<< FAILURES!

[...truncated 43257 lines...]
[repro] Jenkins log URL: https://jenkins.thetaphi.de/job/Lucene-Solr-8.x-Linux/503/consoleText

[repro] Revision: 9952c2a24f353002ba2057748860df89d87f0c3e

[repro] Ant options: "-Dargs=-XX:-UseCompressedOops -XX:+UseG1GC"
[repro] Repro line:  ant test  -Dtestcase=DistributedUpdateProcessorTest -Dtests.seed=553F3438543FB92A -Dtests.multiplier=3 -Dtests.slow=true -Dtests.locale=mg -Dtests.timezone=US/Alaska -Dtests.asserts=true -Dtests.file.encoding=UTF-8

[repro] ant clean

[...truncated 6 lines...]
[repro] Test suites by module:
[repro]    solr/core
[repro]       DistributedUpdateProcessorTest
[repro] ant compile-test

[...truncated 3581 lines...]
[repro] ant test-nocompile -Dtests.dups=5 -Dtests.maxfailures=5 -Dtests.class="*.DistributedUpdateProcessorTest" -Dtests.showOutput=onerror "-Dargs=-XX:-UseCompressedOops -XX:+UseG1GC" -Dtests.seed=553F3438543FB92A -Dtests.multiplier=3 -Dtests.slow=true -Dtests.locale=mg -Dtests.timezone=US/Alaska -Dtests.asserts=true -Dtests.file.encoding=UTF-8

[...truncated 32 lines...]
   [junit4] Suite: org.apache.solr.update.processor.DistributedUpdateProcessorTest
   [junit4]   2> Creating dataDir: /home/jenkins/workspace/Lucene-Solr-8.x-Linux/solr/build/solr-core/test/J2/temp/solr.update.processor.DistributedUpdateProcessorTest_553F3438543FB92A-001/init-core-data-001
   [junit4]   2> 2407 INFO  (SUITE-DistributedUpdateProcessorTest-seed#[553F3438543FB92A]-worker) [    ] o.a.s.SolrTestCaseJ4 Using PointFields (NUMERIC_POINTS_SYSPROP=true) w/NUMERIC_DOCVALUES_SYSPROP=true
   [junit4]   2> 2453 INFO  (SUITE-DistributedUpdateProcessorTest-seed#[553F3438543FB92A]-worker) [    ] o.e.j.u.log Logging initialized @2481ms to org.eclipse.jetty.util.log.Slf4jLog
   [junit4]   2> 2462 INFO  (SUITE-DistributedUpdateProcessorTest-seed#[553F3438543FB92A]-worker) [    ] o.a.s.SolrTestCaseJ4 Randomized ssl (false) and clientAuth (true) via: @org.apache.solr.util.RandomizeSSL(reason="", value=0.0/0.0, ssl=0.0/0.0, clientAuth=0.0/0.0)
   [junit4]   2> 2476 INFO  (SUITE-DistributedUpdateProcessorTest-seed#[553F3438543FB92A]-worker) [    ] o.a.s.SolrTestCaseJ4 SecureRandom sanity checks: test.solr.allowed.securerandom=null & java.security.egd=file:/dev/./urandom
   [junit4]   2> 2498 INFO  (SUITE-DistributedUpdateProcessorTest-seed#[553F3438543FB92A]-worker) [    ] o.a.s.SolrTestCaseJ4 ------------------------------------------------------- Done waiting for tracked resources to be released
   [junit4]   2> NOTE: test params are: codec=Asserting(Lucene80): {}, docValues:{}, maxPointsInLeafNode=196, maxMBSortInHeap=7.397995895102787, sim=Asserting(org.apache.lucene.search.similarities.AssertingSimilarity@15151851), locale=mg, timezone=US/Alaska
   [junit4]   2> NOTE: Linux 4.18.0-17-generic amd64/Oracle Corporation 13-ea (64-bit)/cpus=8,threads=2,free=59820032,total=119537664
   [junit4]   2> NOTE: All tests run in this JVM: [DistributedUpdateProcessorTest]
   [junit4]   2> NOTE: reproduce with: ant test  -Dtestcase=DistributedUpdateProcessorTest -Dtests.seed=553F3438543FB92A -Dtests.multiplier=3 -Dtests.slow=true -Dtests.badapples=true -Dtests.locale=mg -Dtests.timezone=US/Alaska -Dtests.asserts=true -Dtests.file.encoding=UTF-8
   [junit4] ERROR   0.00s J2 | DistributedUpdateProcessorTest (suite) <<<
   [junit4]    > Assumption #1: SOLR-11606: ByteBuddy used by Mockito is not working with this JVM version.Throwable #2: java.lang.NullPointerException
   [junit4]    > 	at __randomizedtesting.SeedInfo.seed([553F3438543FB92A]:0)
   [junit4]    > 	at org.apache.solr.update.processor.DistributedUpdateProcessorTest.AfterClass(DistributedUpdateProcessorTest.java:67)
   [junit4]    > 	at java.base/jdk.internal.reflect.NativeMethodAccessorImpl.invoke0(Native Method)
   [junit4]    > 	at java.base/jdk.internal.reflect.NativeMethodAccessorImpl.invoke(NativeMethodAccessorImpl.java:62)
   [junit4]    > 	at java.base/jdk.internal.reflect.DelegatingMethodAccessorImpl.invoke(DelegatingMethodAccessorImpl.java:43)
   [junit4]    > 	at java.base/java.lang.reflect.Method.invoke(Method.java:567)
   [junit4]    > 	at java.base/java.lang.Thread.run(Thread.java:835)
   [junit4] Completed [1/5 (1!)] on J2 in 1.93s, 0 tests, 1 error <<< FAILURES!

[...truncated 1 lines...]
   [junit4] Suite: org.apache.solr.update.processor.DistributedUpdateProcessorTest
   [junit4]   2> Creating dataDir: /home/jenkins/workspace/Lucene-Solr-8.x-Linux/solr/build/solr-core/test/J1/temp/solr.update.processor.DistributedUpdateProcessorTest_553F3438543FB92A-001/init-core-data-001
   [junit4]   2> 2361 INFO  (SUITE-DistributedUpdateProcessorTest-seed#[553F3438543FB92A]-worker) [    ] o.a.s.SolrTestCaseJ4 Using PointFields (NUMERIC_POINTS_SYSPROP=true) w/NUMERIC_DOCVALUES_SYSPROP=true
   [junit4]   2> 2394 INFO  (SUITE-DistributedUpdateProcessorTest-seed#[553F3438543FB92A]-worker) [    ] o.e.j.u.log Logging initialized @2430ms to org.eclipse.jetty.util.log.Slf4jLog
   [junit4]   2> 2400 INFO  (SUITE-DistributedUpdateProcessorTest-seed#[553F3438543FB92A]-worker) [    ] o.a.s.SolrTestCaseJ4 Randomized ssl (false) and clientAuth (true) via: @org.apache.solr.util.RandomizeSSL(reason="", ssl=0.0/0.0, value=0.0/0.0, clientAuth=0.0/0.0)
   [junit4]   2> 2413 INFO  (SUITE-DistributedUpdateProcessorTest-seed#[553F3438543FB92A]-worker) [    ] o.a.s.SolrTestCaseJ4 SecureRandom sanity checks: test.solr.allowed.securerandom=null & java.security.egd=file:/dev/./urandom
   [junit4]   2> 2433 INFO  (SUITE-DistributedUpdateProcessorTest-seed#[553F3438543FB92A]-worker) [    ] o.a.s.SolrTestCaseJ4 ------------------------------------------------------- Done waiting for tracked resources to be released
   [junit4]   2> NOTE: test params are: codec=Asserting(Lucene80): {}, docValues:{}, maxPointsInLeafNode=196, maxMBSortInHeap=7.397995895102787, sim=Asserting(org.apache.lucene.search.similarities.AssertingSimilarity@2cd57275), locale=mg, timezone=US/Alaska
   [junit4]   2> NOTE: Linux 4.18.0-17-generic amd64/Oracle Corporation 13-ea (64-bit)/cpus=8,threads=2,free=65168408,total=122683392
   [junit4]   2> NOTE: All tests run in this JVM: [DistributedUpdateProcessorTest]
   [junit4]   2> NOTE: reproduce with: ant test  -Dtestcase=DistributedUpdateProcessorTest -Dtests.seed=553F3438543FB92A -Dtests.multiplier=3 -Dtests.slow=true -Dtests.badapples=true -Dtests.locale=mg -Dtests.timezone=US/Alaska -Dtests.asserts=true -Dtests.file.encoding=UTF-8
   [junit4] ERROR   0.00s J1 | DistributedUpdateProcessorTest (suite) <<<
   [junit4]    > Assumption #1: SOLR-11606: ByteBuddy used by Mockito is not working with this JVM version.Throwable #2: java.lang.NullPointerException
   [junit4]    > 	at __randomizedtesting.SeedInfo.seed([553F3438543FB92A]:0)
   [junit4]    > 	at org.apache.solr.update.processor.DistributedUpdateProcessorTest.AfterClass(DistributedUpdateProcessorTest.java:67)
   [junit4]    > 	at java.base/jdk.internal.reflect.NativeMethodAccessorImpl.invoke0(Native Method)
   [junit4]    > 	at java.base/jdk.internal.reflect.NativeMethodAccessorImpl.invoke(NativeMethodAccessorImpl.java:62)
   [junit4]    > 	at java.base/jdk.internal.reflect.DelegatingMethodAccessorImpl.invoke(DelegatingMethodAccessorImpl.java:43)
   [junit4]    > 	at java.base/java.lang.reflect.Method.invoke(Method.java:567)
   [junit4]    > 	at java.base/java.lang.Thread.run(Thread.java:835)
   [junit4] Completed [2/5 (2!)] on J1 in 1.95s, 0 tests, 1 error <<< FAILURES!

[...truncated 1 lines...]
   [junit4] Suite: org.apache.solr.update.processor.DistributedUpdateProcessorTest
   [junit4]   2> Creating dataDir: /home/jenkins/workspace/Lucene-Solr-8.x-Linux/solr/build/solr-core/test/J0/temp/solr.update.processor.DistributedUpdateProcessorTest_553F3438543FB92A-001/init-core-data-001
   [junit4]   2> 2343 INFO  (SUITE-DistributedUpdateProcessorTest-seed#[553F3438543FB92A]-worker) [    ] o.a.s.SolrTestCaseJ4 Using PointFields (NUMERIC_POINTS_SYSPROP=true) w/NUMERIC_DOCVALUES_SYSPROP=true
   [junit4]   2> 2378 INFO  (SUITE-DistributedUpdateProcessorTest-seed#[553F3438543FB92A]-worker) [    ] o.e.j.u.log Logging initialized @2405ms to org.eclipse.jetty.util.log.Slf4jLog
   [junit4]   2> 2387 INFO  (SUITE-DistributedUpdateProcessorTest-seed#[553F3438543FB92A]-worker) [    ] o.a.s.SolrTestCaseJ4 Randomized ssl (false) and clientAuth (true) via: @org.apache.solr.util.RandomizeSSL(reason="", value=0.0/0.0, ssl=0.0/0.0, clientAuth=0.0/0.0)
   [junit4]   2> 2402 INFO  (SUITE-DistributedUpdateProcessorTest-seed#[553F3438543FB92A]-worker) [    ] o.a.s.SolrTestCaseJ4 SecureRandom sanity checks: test.solr.allowed.securerandom=null & java.security.egd=file:/dev/./urandom
   [junit4]   2> 2421 INFO  (SUITE-DistributedUpdateProcessorTest-seed#[553F3438543FB92A]-worker) [    ] o.a.s.SolrTestCaseJ4 ------------------------------------------------------- Done waiting for tracked resources to be released
   [junit4]   2> NOTE: test params are: codec=Asserting(Lucene80): {}, docValues:{}, maxPointsInLeafNode=196, maxMBSortInHeap=7.397995895102787, sim=Asserting(org.apache.lucene.search.similarities.AssertingSimilarity@3cad4f28), locale=mg, timezone=US/Alaska
   [junit4]   2> NOTE: Linux 4.18.0-17-generic amd64/Oracle Corporation 13-ea (64-bit)/cpus=8,threads=2,free=65702920,total=122683392
   [junit4]   2> NOTE: All tests run in this JVM: [DistributedUpdateProcessorTest]
   [junit4]   2> NOTE: reproduce with: ant test  -Dtestcase=DistributedUpdateProcessorTest -Dtests.seed=553F3438543FB92A -Dtests.multiplier=3 -Dtests.slow=true -Dtests.badapples=true -Dtests.locale=mg -Dtests.timezone=US/Alaska -Dtests.asserts=true -Dtests.file.encoding=UTF-8
   [junit4] ERROR   0.00s J0 | DistributedUpdateProcessorTest (suite) <<<
   [junit4]    > Assumption #1: SOLR-11606: ByteBuddy used by Mockito is not working with this JVM version.Throwable #2: java.lang.NullPointerException
   [junit4]    > 	at __randomizedtesting.SeedInfo.seed([553F3438543FB92A]:0)
   [junit4]    > 	at org.apache.solr.update.processor.DistributedUpdateProcessorTest.AfterClass(DistributedUpdateProcessorTest.java:67)
   [junit4]    > 	at java.base/jdk.internal.reflect.NativeMethodAccessorImpl.invoke0(Native Method)
   [junit4]    > 	at java.base/jdk.internal.reflect.NativeMethodAccessorImpl.invoke(NativeMethodAccessorImpl.java:62)
   [junit4]    > 	at java.base/jdk.internal.reflect.DelegatingMethodAccessorImpl.invoke(DelegatingMethodAccessorImpl.java:43)
   [junit4]    > 	at java.base/java.lang.reflect.Method.invoke(Method.java:567)
   [junit4]    > 	at java.base/java.lang.Thread.run(Thread.java:835)
   [junit4] Completed [3/5 (3!)] on J0 in 1.88s, 0 tests, 1 error <<< FAILURES!

[...truncated 1 lines...]
   [junit4] Suite: org.apache.solr.update.processor.DistributedUpdateProcessorTest
   [junit4]   2> Creating dataDir: /home/jenkins/workspace/Lucene-Solr-8.x-Linux/solr/build/solr-core/test/J2/temp/solr.update.processor.DistributedUpdateProcessorTest_553F3438543FB92A-001/init-core-data-001
   [junit4]   2> 2960 INFO  (SUITE-DistributedUpdateProcessorTest-seed#[553F3438543FB92A]-worker) [    ] o.a.s.SolrTestCaseJ4 Using PointFields (NUMERIC_POINTS_SYSPROP=true) w/NUMERIC_DOCVALUES_SYSPROP=true
   [junit4]   2> 2961 INFO  (SUITE-DistributedUpdateProcessorTest-seed#[553F3438543FB92A]-worker) [    ] o.a.s.SolrTestCaseJ4 Randomized ssl (false) and clientAuth (true) via: @org.apache.solr.util.RandomizeSSL(reason="", value=0.0/0.0, ssl=0.0/0.0, clientAuth=0.0/0.0)
   [junit4]   2> 2961 INFO  (SUITE-DistributedUpdateProcessorTest-seed#[553F3438543FB92A]-worker) [    ] o.a.s.SolrTestCaseJ4 SecureRandom sanity checks: test.solr.allowed.securerandom=null & java.security.egd=file:/dev/./urandom
   [junit4]   2> 2962 INFO  (SUITE-DistributedUpdateProcessorTest-seed#[553F3438543FB92A]-worker) [    ] o.a.s.SolrTestCaseJ4 ------------------------------------------------------- Done waiting for tracked resources to be released
   [junit4]   2> NOTE: test params are: codec=Asserting(Lucene80): {}, docValues:{}, maxPointsInLeafNode=196, maxMBSortInHeap=7.397995895102787, sim=Asserting(org.apache.lucene.search.similarities.AssertingSimilarity@2eba8ba5), locale=mg, timezone=US/Alaska
   [junit4]   2> NOTE: Linux 4.18.0-17-generic amd64/Oracle Corporation 13-ea (64-bit)/cpus=8,threads=1,free=32974368,total=119537664
   [junit4]   2> NOTE: All tests run in this JVM: [DistributedUpdateProcessorTest, DistributedUpdateProcessorTest]
   [junit4]   2> NOTE: reproduce with: ant test  -Dtestcase=DistributedUpdateProcessorTest -Dtests.seed=553F3438543FB92A -Dtests.multiplier=3 -Dtests.slow=true -Dtests.badapples=true -Dtests.locale=mg -Dtests.timezone=US/Alaska -Dtests.asserts=true -Dtests.file.encoding=UTF-8
   [junit4] ERROR   0.00s J2 | DistributedUpdateProcessorTest (suite) <<<
   [junit4]    > Assumption #1: SOLR-11606: ByteBuddy used by Mockito is not working with this JVM version.Throwable #2: java.lang.NullPointerException
   [junit4]    > 	at __randomizedtesting.SeedInfo.seed([553F3438543FB92A]:0)
   [junit4]    > 	at org.apache.solr.update.processor.DistributedUpdateProcessorTest.AfterClass(DistributedUpdateProcessorTest.java:67)
   [junit4]    > 	at java.base/jdk.internal.reflect.NativeMethodAccessorImpl.invoke0(Native Method)
   [junit4]    > 	at java.base/jdk.internal.reflect.NativeMethodAccessorImpl.invoke(NativeMethodAccessorImpl.java:62)
   [junit4]    > 	at java.base/jdk.internal.reflect.DelegatingMethodAccessorImpl.invoke(DelegatingMethodAccessorImpl.java:43)
   [junit4]    > 	at java.base/java.lang.reflect.Method.invoke(Method.java:567)
   [junit4]    > 	at java.base/java.lang.Thread.run(Thread.java:835)
   [junit4] Completed [4/5 (4!)] on J2 in 0.27s, 0 tests, 1 error <<< FAILURES!

[...truncated 1 lines...]
   [junit4] Suite: org.apache.solr.update.processor.DistributedUpdateProcessorTest
   [junit4]   2> Creating dataDir: /home/jenkins/workspace/Lucene-Solr-8.x-Linux/solr/build/solr-core/test/J0/temp/solr.update.processor.DistributedUpdateProcessorTest_553F3438543FB92A-001/init-core-data-001
   [junit4]   2> 2969 INFO  (SUITE-DistributedUpdateProcessorTest-seed#[553F3438543FB92A]-worker) [    ] o.a.s.SolrTestCaseJ4 Using PointFields (NUMERIC_POINTS_SYSPROP=true) w/NUMERIC_DOCVALUES_SYSPROP=true
   [junit4]   2> 2970 INFO  (SUITE-DistributedUpdateProcessorTest-seed#[553F3438543FB92A]-worker) [    ] o.a.s.SolrTestCaseJ4 Randomized ssl (false) and clientAuth (true) via: @org.apache.solr.util.RandomizeSSL(reason="", value=0.0/0.0, ssl=0.0/0.0, clientAuth=0.0/0.0)
   [junit4]   2> 2970 INFO  (SUITE-DistributedUpdateProcessorTest-seed#[553F3438543FB92A]-worker) [    ] o.a.s.SolrTestCaseJ4 SecureRandom sanity checks: test.solr.allowed.securerandom=null & java.security.egd=file:/dev/./urandom
   [junit4]   2> 2971 INFO  (SUITE-DistributedUpdateProcessorTest-seed#[553F3438543FB92A]-worker) [    ] o.a.s.SolrTestCaseJ4 ------------------------------------------------------- Done waiting for tracked resources to be released
   [junit4]   2> NOTE: test params are: codec=Asserting(Lucene80): {}, docValues:{}, maxPointsInLeafNode=196, maxMBSortInHeap=7.397995895102787, sim=Asserting(org.apache.lucene.search.similarities.AssertingSimilarity@30942809), locale=mg, timezone=US/Alaska
   [junit4]   2> NOTE: Linux 4.18.0-17-generic amd64/Oracle Corporation 13-ea (64-bit)/cpus=8,threads=1,free=39013128,total=122683392
   [junit4]   2> NOTE: All tests run in this JVM: [DistributedUpdateProcessorTest, DistributedUpdateProcessorTest]
   [junit4]   2> NOTE: reproduce with: ant test  -Dtestcase=DistributedUpdateProcessorTest -Dtests.seed=553F3438543FB92A -Dtests.multiplier=3 -Dtests.slow=true -Dtests.badapples=true -Dtests.locale=mg -Dtests.timezone=US/Alaska -Dtests.asserts=true -Dtests.file.encoding=UTF-8
   [junit4] ERROR   0.00s J0 | DistributedUpdateProcessorTest (suite) <<<
   [junit4]    > Assumption #1: SOLR-11606: ByteBuddy used by Mockito is not working with this JVM version.Throwable #2: java.lang.NullPointerException
   [junit4]    > 	at __randomizedtesting.SeedInfo.seed([553F3438543FB92A]:0)
   [junit4]    > 	at org.apache.solr.update.processor.DistributedUpdateProcessorTest.AfterClass(DistributedUpdateProcessorTest.java:67)
   [junit4]    > 	at java.base/jdk.internal.reflect.NativeMethodAccessorImpl.invoke0(Native Method)
   [junit4]    > 	at java.base/jdk.internal.reflect.NativeMethodAccessorImpl.invoke(NativeMethodAccessorImpl.java:62)
   [junit4]    > 	at java.base/jdk.internal.reflect.DelegatingMethodAccessorImpl.invoke(DelegatingMethodAccessorImpl.java:43)
   [junit4]    > 	at java.base/java.lang.reflect.Method.invoke(Method.java:567)
   [junit4]    > 	at java.base/java.lang.Thread.run(Thread.java:835)
   [junit4] Completed [5/5 (5!)] on J0 in 0.26s, 0 tests, 1 error <<< FAILURES!

[...truncated 15 lines...]
BUILD FAILED
/home/jenkins/workspace/Lucene-Solr-8.x-Linux/lucene/common-build.xml:1573: The following error occurred while executing this line:
/home/jenkins/workspace/Lucene-Solr-8.x-Linux/lucene/common-build.xml:1100: There were test failures: 5 suites, 0 tests, 10 suite-level errors [seed: 553F3438543FB92A]

Total time: 5 seconds

[repro] Setting last failure code to 256

[repro] Failures:
[repro]   5/5 failed: org.apache.solr.update.processor.DistributedUpdateProcessorTest
[repro] Exiting with code 256
+ mv lucene/build lucene/build.repro
+ mv solr/build solr/build.repro
+ mv lucene/build.orig lucene/build
+ mv solr/build.orig solr/build
Archiving artifacts
Setting ANT_1_8_2_HOME=/home/jenkins/tools/hudson.tasks.Ant_AntInstallation/ANT_1.8.2
[WARNINGS] Parsing warnings in console log with parser Java Compiler (javac)
Setting ANT_1_8_2_HOME=/home/jenkins/tools/hudson.tasks.Ant_AntInstallation/ANT_1.8.2
No credentials specified
Setting ANT_1_8_2_HOME=/home/jenkins/tools/hudson.tasks.Ant_AntInstallation/ANT_1.8.2
<Git Blamer> Using GitBlamer to create author and commit information for all warnings.
<Git Blamer> GIT_COMMIT=9952c2a24f353002ba2057748860df89d87f0c3e, workspace=/home/jenkins/workspace/Lucene-Solr-8.x-Linux
[WARNINGS] Computing warning deltas based on reference build #502
Recording test results
Setting ANT_1_8_2_HOME=/home/jenkins/tools/hudson.tasks.Ant_AntInstallation/ANT_1.8.2
Build step 'Publish JUnit test result report' changed build result to UNSTABLE
Email was triggered for: Unstable (Test Failures)
Sending email for trigger: Unstable (Test Failures)
Setting ANT_1_8_2_HOME=/home/jenkins/tools/hudson.tasks.Ant_AntInstallation/ANT_1.8.2
Setting ANT_1_8_2_HOME=/home/jenkins/tools/hudson.tasks.Ant_AntInstallation/ANT_1.8.2
Setting ANT_1_8_2_HOME=/home/jenkins/tools/hudson.tasks.Ant_AntInstallation/ANT_1.8.2
Setting ANT_1_8_2_HOME=/home/jenkins/tools/hudson.tasks.Ant_AntInstallation/ANT_1.8.2
Setting ANT_1_8_2_HOME=/home/jenkins/tools/hudson.tasks.Ant_AntInstallation/ANT_1.8.2
Setting ANT_1_8_2_HOME=/home/jenkins/tools/hudson.tasks.Ant_AntInstallation/ANT_1.8.2

Mime
View raw message