lucene-dev mailing list archives

Site index · List index
Message view « Date » · « Thread »
Top « Date » · « Thread »
From Policeman Jenkins Server <jenk...@thetaphi.de>
Subject [JENKINS] Lucene-Solr-master-Windows (64bit/jdk-11.0.2) - Build # 7965 - Unstable!
Date Wed, 29 May 2019 12:20:23 GMT
Build: https://jenkins.thetaphi.de/job/Lucene-Solr-master-Windows/7965/
Java: 64bit/jdk-11.0.2 -XX:+UseCompressedOops -XX:+UseParallelGC

2 tests failed.
FAILED:  org.apache.solr.prometheus.exporter.SolrExporterIntegrationTest.jvmMetrics

Error Message:
expected:<36> but was:<48>

Stack Trace:
java.lang.AssertionError: expected:<36> but was:<48>
	at __randomizedtesting.SeedInfo.seed([D35B7140CBA340F5:EF4CAFDE4D8C61]:0)
	at org.junit.Assert.fail(Assert.java:88)
	at org.junit.Assert.failNotEquals(Assert.java:834)
	at org.junit.Assert.assertEquals(Assert.java:645)
	at org.junit.Assert.assertEquals(Assert.java:631)
	at org.apache.solr.prometheus.exporter.SolrExporterIntegrationTest.jvmMetrics(SolrExporterIntegrationTest.java:71)
	at java.base/jdk.internal.reflect.NativeMethodAccessorImpl.invoke0(Native Method)
	at java.base/jdk.internal.reflect.NativeMethodAccessorImpl.invoke(NativeMethodAccessorImpl.java:62)
	at java.base/jdk.internal.reflect.DelegatingMethodAccessorImpl.invoke(DelegatingMethodAccessorImpl.java:43)
	at java.base/java.lang.reflect.Method.invoke(Method.java:566)
	at com.carrotsearch.randomizedtesting.RandomizedRunner.invoke(RandomizedRunner.java:1750)
	at com.carrotsearch.randomizedtesting.RandomizedRunner$8.evaluate(RandomizedRunner.java:938)
	at com.carrotsearch.randomizedtesting.RandomizedRunner$9.evaluate(RandomizedRunner.java:974)
	at com.carrotsearch.randomizedtesting.RandomizedRunner$10.evaluate(RandomizedRunner.java:988)
	at com.carrotsearch.randomizedtesting.rules.SystemPropertiesRestoreRule$1.evaluate(SystemPropertiesRestoreRule.java:57)
	at org.apache.lucene.util.TestRuleSetupTeardownChained$1.evaluate(TestRuleSetupTeardownChained.java:49)
	at org.apache.lucene.util.AbstractBeforeAfterRule$1.evaluate(AbstractBeforeAfterRule.java:45)
	at org.apache.lucene.util.TestRuleThreadAndTestName$1.evaluate(TestRuleThreadAndTestName.java:48)
	at org.apache.lucene.util.TestRuleIgnoreAfterMaxFailures$1.evaluate(TestRuleIgnoreAfterMaxFailures.java:64)
	at org.apache.lucene.util.TestRuleMarkFailure$1.evaluate(TestRuleMarkFailure.java:47)
	at com.carrotsearch.randomizedtesting.rules.StatementAdapter.evaluate(StatementAdapter.java:36)
	at com.carrotsearch.randomizedtesting.ThreadLeakControl$StatementRunner.run(ThreadLeakControl.java:368)
	at com.carrotsearch.randomizedtesting.ThreadLeakControl.forkTimeoutingTask(ThreadLeakControl.java:817)
	at com.carrotsearch.randomizedtesting.ThreadLeakControl$3.evaluate(ThreadLeakControl.java:468)
	at com.carrotsearch.randomizedtesting.RandomizedRunner.runSingleTest(RandomizedRunner.java:947)
	at com.carrotsearch.randomizedtesting.RandomizedRunner$5.evaluate(RandomizedRunner.java:832)
	at com.carrotsearch.randomizedtesting.RandomizedRunner$6.evaluate(RandomizedRunner.java:883)
	at com.carrotsearch.randomizedtesting.RandomizedRunner$7.evaluate(RandomizedRunner.java:894)
	at com.carrotsearch.randomizedtesting.rules.StatementAdapter.evaluate(StatementAdapter.java:36)
	at com.carrotsearch.randomizedtesting.rules.SystemPropertiesRestoreRule$1.evaluate(SystemPropertiesRestoreRule.java:57)
	at org.apache.lucene.util.AbstractBeforeAfterRule$1.evaluate(AbstractBeforeAfterRule.java:45)
	at com.carrotsearch.randomizedtesting.rules.StatementAdapter.evaluate(StatementAdapter.java:36)
	at org.apache.lucene.util.TestRuleStoreClassName$1.evaluate(TestRuleStoreClassName.java:41)
	at com.carrotsearch.randomizedtesting.rules.NoShadowingOrOverridesOnMethodsRule$1.evaluate(NoShadowingOrOverridesOnMethodsRule.java:40)
	at com.carrotsearch.randomizedtesting.rules.NoShadowingOrOverridesOnMethodsRule$1.evaluate(NoShadowingOrOverridesOnMethodsRule.java:40)
	at com.carrotsearch.randomizedtesting.rules.StatementAdapter.evaluate(StatementAdapter.java:36)
	at com.carrotsearch.randomizedtesting.rules.StatementAdapter.evaluate(StatementAdapter.java:36)
	at org.apache.lucene.util.TestRuleAssertionsRequired$1.evaluate(TestRuleAssertionsRequired.java:53)
	at org.apache.lucene.util.TestRuleMarkFailure$1.evaluate(TestRuleMarkFailure.java:47)
	at org.apache.lucene.util.TestRuleIgnoreAfterMaxFailures$1.evaluate(TestRuleIgnoreAfterMaxFailures.java:64)
	at org.apache.lucene.util.TestRuleIgnoreTestSuites$1.evaluate(TestRuleIgnoreTestSuites.java:54)
	at com.carrotsearch.randomizedtesting.rules.StatementAdapter.evaluate(StatementAdapter.java:36)
	at com.carrotsearch.randomizedtesting.ThreadLeakControl$StatementRunner.run(ThreadLeakControl.java:368)
	at java.base/java.lang.Thread.run(Thread.java:834)


FAILED:  org.apache.solr.cloud.OverseerTaskQueueTest.testLeakChildWatcher

Error Message:
expected:<1> but was:<0>

Stack Trace:
java.lang.AssertionError: expected:<1> but was:<0>
	at __randomizedtesting.SeedInfo.seed([DAF80DE5E94E4832:DF5845FED1575B7C]:0)
	at org.junit.Assert.fail(Assert.java:88)
	at org.junit.Assert.failNotEquals(Assert.java:834)
	at org.junit.Assert.assertEquals(Assert.java:645)
	at org.junit.Assert.assertEquals(Assert.java:631)
	at org.apache.solr.cloud.DistributedQueueTest.testLeakChildWatcher(DistributedQueueTest.java:216)
	at java.base/jdk.internal.reflect.NativeMethodAccessorImpl.invoke0(Native Method)
	at java.base/jdk.internal.reflect.NativeMethodAccessorImpl.invoke(NativeMethodAccessorImpl.java:62)
	at java.base/jdk.internal.reflect.DelegatingMethodAccessorImpl.invoke(DelegatingMethodAccessorImpl.java:43)
	at java.base/java.lang.reflect.Method.invoke(Method.java:566)
	at com.carrotsearch.randomizedtesting.RandomizedRunner.invoke(RandomizedRunner.java:1750)
	at com.carrotsearch.randomizedtesting.RandomizedRunner$8.evaluate(RandomizedRunner.java:938)
	at com.carrotsearch.randomizedtesting.RandomizedRunner$9.evaluate(RandomizedRunner.java:974)
	at com.carrotsearch.randomizedtesting.RandomizedRunner$10.evaluate(RandomizedRunner.java:988)
	at com.carrotsearch.randomizedtesting.rules.SystemPropertiesRestoreRule$1.evaluate(SystemPropertiesRestoreRule.java:57)
	at org.apache.lucene.util.TestRuleSetupTeardownChained$1.evaluate(TestRuleSetupTeardownChained.java:49)
	at org.apache.lucene.util.AbstractBeforeAfterRule$1.evaluate(AbstractBeforeAfterRule.java:45)
	at org.apache.lucene.util.TestRuleThreadAndTestName$1.evaluate(TestRuleThreadAndTestName.java:48)
	at org.apache.lucene.util.TestRuleIgnoreAfterMaxFailures$1.evaluate(TestRuleIgnoreAfterMaxFailures.java:64)
	at org.apache.lucene.util.TestRuleMarkFailure$1.evaluate(TestRuleMarkFailure.java:47)
	at com.carrotsearch.randomizedtesting.rules.StatementAdapter.evaluate(StatementAdapter.java:36)
	at com.carrotsearch.randomizedtesting.ThreadLeakControl$StatementRunner.run(ThreadLeakControl.java:368)
	at com.carrotsearch.randomizedtesting.ThreadLeakControl.forkTimeoutingTask(ThreadLeakControl.java:817)
	at com.carrotsearch.randomizedtesting.ThreadLeakControl$3.evaluate(ThreadLeakControl.java:468)
	at com.carrotsearch.randomizedtesting.RandomizedRunner.runSingleTest(RandomizedRunner.java:947)
	at com.carrotsearch.randomizedtesting.RandomizedRunner$5.evaluate(RandomizedRunner.java:832)
	at com.carrotsearch.randomizedtesting.RandomizedRunner$6.evaluate(RandomizedRunner.java:883)
	at com.carrotsearch.randomizedtesting.RandomizedRunner$7.evaluate(RandomizedRunner.java:894)
	at com.carrotsearch.randomizedtesting.rules.StatementAdapter.evaluate(StatementAdapter.java:36)
	at com.carrotsearch.randomizedtesting.rules.SystemPropertiesRestoreRule$1.evaluate(SystemPropertiesRestoreRule.java:57)
	at org.apache.lucene.util.AbstractBeforeAfterRule$1.evaluate(AbstractBeforeAfterRule.java:45)
	at com.carrotsearch.randomizedtesting.rules.StatementAdapter.evaluate(StatementAdapter.java:36)
	at org.apache.lucene.util.TestRuleStoreClassName$1.evaluate(TestRuleStoreClassName.java:41)
	at com.carrotsearch.randomizedtesting.rules.NoShadowingOrOverridesOnMethodsRule$1.evaluate(NoShadowingOrOverridesOnMethodsRule.java:40)
	at com.carrotsearch.randomizedtesting.rules.NoShadowingOrOverridesOnMethodsRule$1.evaluate(NoShadowingOrOverridesOnMethodsRule.java:40)
	at com.carrotsearch.randomizedtesting.rules.StatementAdapter.evaluate(StatementAdapter.java:36)
	at com.carrotsearch.randomizedtesting.rules.StatementAdapter.evaluate(StatementAdapter.java:36)
	at org.apache.lucene.util.TestRuleAssertionsRequired$1.evaluate(TestRuleAssertionsRequired.java:53)
	at org.apache.lucene.util.TestRuleMarkFailure$1.evaluate(TestRuleMarkFailure.java:47)
	at org.apache.lucene.util.TestRuleIgnoreAfterMaxFailures$1.evaluate(TestRuleIgnoreAfterMaxFailures.java:64)
	at org.apache.lucene.util.TestRuleIgnoreTestSuites$1.evaluate(TestRuleIgnoreTestSuites.java:54)
	at com.carrotsearch.randomizedtesting.rules.StatementAdapter.evaluate(StatementAdapter.java:36)
	at com.carrotsearch.randomizedtesting.ThreadLeakControl$StatementRunner.run(ThreadLeakControl.java:368)
	at java.base/java.lang.Thread.run(Thread.java:834)




Build Log:
[...truncated 14140 lines...]
   [junit4] Suite: org.apache.solr.cloud.OverseerTaskQueueTest
   [junit4]   2> Creating dataDir: C:\Users\jenkins\workspace\Lucene-Solr-master-Windows\solr\build\solr-core\test\J0\temp\solr.cloud.OverseerTaskQueueTest_DAF80DE5E94E4832-001\init-core-data-001
   [junit4]   2> 2490835 INFO  (TEST-OverseerTaskQueueTest.testDistributedQueueCache-seed#[DAF80DE5E94E4832]) [    ] o.a.s.c.ZkTestServer STARTING ZK TEST SERVER
   [junit4]   2> 2490835 INFO  (ZkTestServer Run Thread) [    ] o.a.s.c.ZkTestServer client port:0.0.0.0/0.0.0.0:0
   [junit4]   2> 2490835 INFO  (ZkTestServer Run Thread) [    ] o.a.s.c.ZkTestServer Starting server
   [junit4]   2> 2490936 INFO  (TEST-OverseerTaskQueueTest.testDistributedQueueCache-seed#[DAF80DE5E94E4832]) [    ] o.a.s.c.ZkTestServer start zk server on port:49700
   [junit4]   2> 2490936 INFO  (TEST-OverseerTaskQueueTest.testDistributedQueueCache-seed#[DAF80DE5E94E4832]) [    ] o.a.s.c.ZkTestServer parse host and port list: 127.0.0.1:49700
   [junit4]   2> 2490936 INFO  (TEST-OverseerTaskQueueTest.testDistributedQueueCache-seed#[DAF80DE5E94E4832]) [    ] o.a.s.c.ZkTestServer connecting to 127.0.0.1 49700
   [junit4]   2> 2490945 INFO  (zkConnectionManagerCallback-13797-thread-1) [    ] o.a.s.c.c.ConnectionManager zkClient has connected
   [junit4]   2> 2490951 INFO  (zkConnectionManagerCallback-13799-thread-1) [    ] o.a.s.c.c.ConnectionManager zkClient has connected
   [junit4]   2> 2490955 INFO  (zkConnectionManagerCallback-13801-thread-1) [    ] o.a.s.c.c.ConnectionManager zkClient has connected
   [junit4]   2> 2490979 INFO  (TEST-OverseerTaskQueueTest.testDistributedQueueCache-seed#[DAF80DE5E94E4832]) [    ] o.a.s.c.ZkTestServer Shutting down ZkTestServer.
   [junit4]   2> 2490983 INFO  (TEST-OverseerTaskQueueTest.testDistributedQueueCache-seed#[DAF80DE5E94E4832]) [    ] o.a.s.c.ZkTestServer parse host and port list: 127.0.0.1:49700
   [junit4]   2> 2490983 INFO  (TEST-OverseerTaskQueueTest.testDistributedQueueCache-seed#[DAF80DE5E94E4832]) [    ] o.a.s.c.ZkTestServer connecting to 127.0.0.1 49700
   [junit4]   2> 2491991 INFO  (TEST-OverseerTaskQueueTest.testPeekElements-seed#[DAF80DE5E94E4832]) [    ] o.a.s.c.ZkTestServer STARTING ZK TEST SERVER
   [junit4]   2> 2491992 INFO  (ZkTestServer Run Thread) [    ] o.a.s.c.ZkTestServer client port:0.0.0.0/0.0.0.0:0
   [junit4]   2> 2491992 INFO  (ZkTestServer Run Thread) [    ] o.a.s.c.ZkTestServer Starting server
   [junit4]   2> 2492092 INFO  (TEST-OverseerTaskQueueTest.testPeekElements-seed#[DAF80DE5E94E4832]) [    ] o.a.s.c.ZkTestServer start zk server on port:49714
   [junit4]   2> 2492092 INFO  (TEST-OverseerTaskQueueTest.testPeekElements-seed#[DAF80DE5E94E4832]) [    ] o.a.s.c.ZkTestServer parse host and port list: 127.0.0.1:49714
   [junit4]   2> 2492092 INFO  (TEST-OverseerTaskQueueTest.testPeekElements-seed#[DAF80DE5E94E4832]) [    ] o.a.s.c.ZkTestServer connecting to 127.0.0.1 49714
   [junit4]   2> 2492102 INFO  (zkConnectionManagerCallback-13804-thread-1) [    ] o.a.s.c.c.ConnectionManager zkClient has connected
   [junit4]   2> 2492112 INFO  (zkConnectionManagerCallback-13806-thread-1) [    ] o.a.s.c.c.ConnectionManager zkClient has connected
   [junit4]   2> 2492118 INFO  (zkConnectionManagerCallback-13808-thread-1) [    ] o.a.s.c.c.ConnectionManager zkClient has connected
   [junit4]   2> 2493633 INFO  (TEST-OverseerTaskQueueTest.testPeekElements-seed#[DAF80DE5E94E4832]) [    ] o.a.s.c.ZkTestServer Shutting down ZkTestServer.
   [junit4]   2> 2493638 INFO  (TEST-OverseerTaskQueueTest.testPeekElements-seed#[DAF80DE5E94E4832]) [    ] o.a.s.c.ZkTestServer parse host and port list: 127.0.0.1:49714
   [junit4]   2> 2493638 INFO  (TEST-OverseerTaskQueueTest.testPeekElements-seed#[DAF80DE5E94E4832]) [    ] o.a.s.c.ZkTestServer connecting to 127.0.0.1 49714
   [junit4]   2> 2494643 INFO  (TEST-OverseerTaskQueueTest.testLocallyOffer-seed#[DAF80DE5E94E4832]) [    ] o.a.s.c.ZkTestServer STARTING ZK TEST SERVER
   [junit4]   2> 2494644 INFO  (ZkTestServer Run Thread) [    ] o.a.s.c.ZkTestServer client port:0.0.0.0/0.0.0.0:0
   [junit4]   2> 2494644 INFO  (ZkTestServer Run Thread) [    ] o.a.s.c.ZkTestServer Starting server
   [junit4]   2> 2494745 INFO  (TEST-OverseerTaskQueueTest.testLocallyOffer-seed#[DAF80DE5E94E4832]) [    ] o.a.s.c.ZkTestServer start zk server on port:49767
   [junit4]   2> 2494745 INFO  (TEST-OverseerTaskQueueTest.testLocallyOffer-seed#[DAF80DE5E94E4832]) [    ] o.a.s.c.ZkTestServer parse host and port list: 127.0.0.1:49767
   [junit4]   2> 2494745 INFO  (TEST-OverseerTaskQueueTest.testLocallyOffer-seed#[DAF80DE5E94E4832]) [    ] o.a.s.c.ZkTestServer connecting to 127.0.0.1 49767
   [junit4]   2> 2494756 INFO  (zkConnectionManagerCallback-13811-thread-1) [    ] o.a.s.c.c.ConnectionManager zkClient has connected
   [junit4]   2> 2494763 INFO  (zkConnectionManagerCallback-13813-thread-1) [    ] o.a.s.c.c.ConnectionManager zkClient has connected
   [junit4]   2> 2494769 INFO  (zkConnectionManagerCallback-13815-thread-1) [    ] o.a.s.c.c.ConnectionManager zkClient has connected
   [junit4]   2> 2495269 INFO  (TEST-OverseerTaskQueueTest.testLocallyOffer-seed#[DAF80DE5E94E4832]) [    ] o.a.s.c.ZkTestServer Shutting down ZkTestServer.
   [junit4]   2> 2495269 WARN  (NIOServerCxn.Factory:0.0.0.0/0.0.0.0:0) [    ] o.a.z.s.NIOServerCnxn Unable to read additional data from client sessionid 0x1004a87498d0002, likely client has closed socket
   [junit4]   2> 2495271 WARN  (NIOServerCxn.Factory:0.0.0.0/0.0.0.0:0) [    ] o.a.z.s.NIOServerCnxn Unable to read additional data from client sessionid 0x1004a87498d0000, likely client has closed socket
   [junit4]   2> 2495272 WARN  (NIOServerCxn.Factory:0.0.0.0/0.0.0.0:0) [    ] o.a.z.s.NIOServerCnxnFactory Ignoring unexpected runtime exception
   [junit4]   2>           => java.nio.channels.CancelledKeyException
   [junit4]   2> 	at java.base/sun.nio.ch.SelectionKeyImpl.ensureValid(SelectionKeyImpl.java:71)
   [junit4]   2> java.nio.channels.CancelledKeyException: null
   [junit4]   2> 	at sun.nio.ch.SelectionKeyImpl.ensureValid(SelectionKeyImpl.java:71) ~[?:?]
   [junit4]   2> 	at sun.nio.ch.SelectionKeyImpl.readyOps(SelectionKeyImpl.java:130) ~[?:?]
   [junit4]   2> 	at org.apache.zookeeper.server.NIOServerCnxnFactory.run(NIOServerCnxnFactory.java:212) ~[zookeeper-3.4.14.jar:3.4.14-4c25d480e66aadd371de8bd2fd8da255ac140bcf]
   [junit4]   2> 	at java.lang.Thread.run(Thread.java:834) [?:?]
   [junit4]   2> 2495276 INFO  (TEST-OverseerTaskQueueTest.testLocallyOffer-seed#[DAF80DE5E94E4832]) [    ] o.a.s.c.ZkTestServer parse host and port list: 127.0.0.1:49767
   [junit4]   2> 2495276 INFO  (TEST-OverseerTaskQueueTest.testLocallyOffer-seed#[DAF80DE5E94E4832]) [    ] o.a.s.c.ZkTestServer connecting to 127.0.0.1 49767
   [junit4]   2> 2496282 INFO  (TEST-OverseerTaskQueueTest.testDistributedQueue-seed#[DAF80DE5E94E4832]) [    ] o.a.s.c.ZkTestServer STARTING ZK TEST SERVER
   [junit4]   2> 2496283 INFO  (ZkTestServer Run Thread) [    ] o.a.s.c.ZkTestServer client port:0.0.0.0/0.0.0.0:0
   [junit4]   2> 2496283 INFO  (ZkTestServer Run Thread) [    ] o.a.s.c.ZkTestServer Starting server
   [junit4]   2> 2496384 INFO  (TEST-OverseerTaskQueueTest.testDistributedQueue-seed#[DAF80DE5E94E4832]) [    ] o.a.s.c.ZkTestServer start zk server on port:49805
   [junit4]   2> 2496384 INFO  (TEST-OverseerTaskQueueTest.testDistributedQueue-seed#[DAF80DE5E94E4832]) [    ] o.a.s.c.ZkTestServer parse host and port list: 127.0.0.1:49805
   [junit4]   2> 2496384 INFO  (TEST-OverseerTaskQueueTest.testDistributedQueue-seed#[DAF80DE5E94E4832]) [    ] o.a.s.c.ZkTestServer connecting to 127.0.0.1 49805
   [junit4]   2> 2496392 INFO  (zkConnectionManagerCallback-13818-thread-1) [    ] o.a.s.c.c.ConnectionManager zkClient has connected
   [junit4]   2> 2496399 INFO  (zkConnectionManagerCallback-13820-thread-1) [    ] o.a.s.c.c.ConnectionManager zkClient has connected
   [junit4]   2> 2496403 INFO  (zkConnectionManagerCallback-13822-thread-1) [    ] o.a.s.c.c.ConnectionManager zkClient has connected
   [junit4]   2> 2498419 INFO  (TEST-OverseerTaskQueueTest.testDistributedQueue-seed#[DAF80DE5E94E4832]) [    ] o.a.s.c.ZkTestServer Shutting down ZkTestServer.
   [junit4]   2> 2498423 INFO  (TEST-OverseerTaskQueueTest.testDistributedQueue-seed#[DAF80DE5E94E4832]) [    ] o.a.s.c.ZkTestServer parse host and port list: 127.0.0.1:49805
   [junit4]   2> 2498423 INFO  (TEST-OverseerTaskQueueTest.testDistributedQueue-seed#[DAF80DE5E94E4832]) [    ] o.a.s.c.ZkTestServer connecting to 127.0.0.1 49805
   [junit4]   2> 2499441 INFO  (TEST-OverseerTaskQueueTest.testLeakChildWatcher-seed#[DAF80DE5E94E4832]) [    ] o.a.s.c.ZkTestServer STARTING ZK TEST SERVER
   [junit4]   2> 2499441 INFO  (ZkTestServer Run Thread) [    ] o.a.s.c.ZkTestServer client port:0.0.0.0/0.0.0.0:0
   [junit4]   2> 2499441 INFO  (ZkTestServer Run Thread) [    ] o.a.s.c.ZkTestServer Starting server
   [junit4]   2> 2499541 INFO  (TEST-OverseerTaskQueueTest.testLeakChildWatcher-seed#[DAF80DE5E94E4832]) [    ] o.a.s.c.ZkTestServer start zk server on port:49830
   [junit4]   2> 2499541 INFO  (TEST-OverseerTaskQueueTest.testLeakChildWatcher-seed#[DAF80DE5E94E4832]) [    ] o.a.s.c.ZkTestServer parse host and port list: 127.0.0.1:49830
   [junit4]   2> 2499541 INFO  (TEST-OverseerTaskQueueTest.testLeakChildWatcher-seed#[DAF80DE5E94E4832]) [    ] o.a.s.c.ZkTestServer connecting to 127.0.0.1 49830
   [junit4]   2> 2499649 INFO  (zkConnectionManagerCallback-13825-thread-1) [    ] o.a.s.c.c.ConnectionManager zkClient has connected
   [junit4]   2> 2499705 INFO  (zkConnectionManagerCallback-13827-thread-1) [    ] o.a.s.c.c.ConnectionManager zkClient has connected
   [junit4]   2> 2499806 INFO  (zkConnectionManagerCallback-13829-thread-1) [    ] o.a.s.c.c.ConnectionManager zkClient has connected
   [junit4]   2> 2500074 INFO  (TEST-OverseerTaskQueueTest.testLeakChildWatcher-seed#[DAF80DE5E94E4832]) [    ] o.a.s.c.ZkTestServer Shutting down ZkTestServer.
   [junit4]   2> 2500074 WARN  (NIOServerCxn.Factory:0.0.0.0/0.0.0.0:0) [    ] o.a.z.s.NIOServerCnxn Unable to read additional data from client sessionid 0x1004a875c4d0000, likely client has closed socket
   [junit4]   2> 2500082 INFO  (TEST-OverseerTaskQueueTest.testLeakChildWatcher-seed#[DAF80DE5E94E4832]) [    ] o.a.s.c.ZkTestServer parse host and port list: 127.0.0.1:49830
   [junit4]   2> 2500082 INFO  (TEST-OverseerTaskQueueTest.testLeakChildWatcher-seed#[DAF80DE5E94E4832]) [    ] o.a.s.c.ZkTestServer connecting to 127.0.0.1 49830
   [junit4]   2> NOTE: reproduce with: ant test  -Dtestcase=OverseerTaskQueueTest -Dtests.method=testLeakChildWatcher -Dtests.seed=DAF80DE5E94E4832 -Dtests.slow=true -Dtests.locale=sq-MK -Dtests.timezone=Etc/GMT-7 -Dtests.asserts=true -Dtests.file.encoding=UTF-8
   [junit4] FAILURE 1.66s J0 | OverseerTaskQueueTest.testLeakChildWatcher <<<
   [junit4]    > Throwable #1: java.lang.AssertionError: expected:<1> but was:<0>
   [junit4]    > 	at __randomizedtesting.SeedInfo.seed([DAF80DE5E94E4832:DF5845FED1575B7C]:0)
   [junit4]    > 	at org.apache.solr.cloud.DistributedQueueTest.testLeakChildWatcher(DistributedQueueTest.java:216)
   [junit4]    > 	at java.base/jdk.internal.reflect.NativeMethodAccessorImpl.invoke0(Native Method)
   [junit4]    > 	at java.base/jdk.internal.reflect.NativeMethodAccessorImpl.invoke(NativeMethodAccessorImpl.java:62)
   [junit4]    > 	at java.base/jdk.internal.reflect.DelegatingMethodAccessorImpl.invoke(DelegatingMethodAccessorImpl.java:43)
   [junit4]    > 	at java.base/java.lang.reflect.Method.invoke(Method.java:566)
   [junit4]    > 	at java.base/java.lang.Thread.run(Thread.java:834)
   [junit4]   2> 2501094 INFO  (TEST-OverseerTaskQueueTest.testContainsTaskWithRequestId-seed#[DAF80DE5E94E4832]) [    ] o.a.s.c.ZkTestServer STARTING ZK TEST SERVER
   [junit4]   2> 2501095 INFO  (ZkTestServer Run Thread) [    ] o.a.s.c.ZkTestServer client port:0.0.0.0/0.0.0.0:0
   [junit4]   2> 2501095 INFO  (ZkTestServer Run Thread) [    ] o.a.s.c.ZkTestServer Starting server
   [junit4]   2> 2501195 INFO  (TEST-OverseerTaskQueueTest.testContainsTaskWithRequestId-seed#[DAF80DE5E94E4832]) [    ] o.a.s.c.ZkTestServer start zk server on port:49846
   [junit4]   2> 2501195 INFO  (TEST-OverseerTaskQueueTest.testContainsTaskWithRequestId-seed#[DAF80DE5E94E4832]) [    ] o.a.s.c.ZkTestServer parse host and port list: 127.0.0.1:49846
   [junit4]   2> 2501195 INFO  (TEST-OverseerTaskQueueTest.testContainsTaskWithRequestId-seed#[DAF80DE5E94E4832]) [    ] o.a.s.c.ZkTestServer connecting to 127.0.0.1 49846
   [junit4]   2> 2501209 INFO  (zkConnectionManagerCallback-13832-thread-1) [    ] o.a.s.c.c.ConnectionManager zkClient has connected
   [junit4]   2> 2501218 INFO  (zkConnectionManagerCallback-13834-thread-1) [    ] o.a.s.c.c.ConnectionManager zkClient has connected
   [junit4]   2> 2501225 INFO  (zkConnectionManagerCallback-13836-thread-1) [    ] o.a.s.c.c.ConnectionManager zkClient has connected
   [junit4]   2> 2501252 INFO  (TEST-OverseerTaskQueueTest.testContainsTaskWithRequestId-seed#[DAF80DE5E94E4832]) [    ] o.a.s.c.ZkTestServer Shutting down ZkTestServer.
   [junit4]   2> 2501257 INFO  (TEST-OverseerTaskQueueTest.testContainsTaskWithRequestId-seed#[DAF80DE5E94E4832]) [    ] o.a.s.c.ZkTestServer parse host and port list: 127.0.0.1:49846
   [junit4]   2> 2501257 INFO  (TEST-OverseerTaskQueueTest.testContainsTaskWithRequestId-seed#[DAF80DE5E94E4832]) [    ] o.a.s.c.ZkTestServer connecting to 127.0.0.1 49846
   [junit4]   2> 2502264 INFO  (TEST-OverseerTaskQueueTest.testDistributedQueueBlocking-seed#[DAF80DE5E94E4832]) [    ] o.a.s.c.ZkTestServer STARTING ZK TEST SERVER
   [junit4]   2> 2502271 INFO  (ZkTestServer Run Thread) [    ] o.a.s.c.ZkTestServer client port:0.0.0.0/0.0.0.0:0
   [junit4]   2> 2502272 INFO  (ZkTestServer Run Thread) [    ] o.a.s.c.ZkTestServer Starting server
   [junit4]   2> 2502365 INFO  (TEST-OverseerTaskQueueTest.testDistributedQueueBlocking-seed#[DAF80DE5E94E4832]) [    ] o.a.s.c.ZkTestServer start zk server on port:49860
   [junit4]   2> 2502365 INFO  (TEST-OverseerTaskQueueTest.testDistributedQueueBlocking-seed#[DAF80DE5E94E4832]) [    ] o.a.s.c.ZkTestServer parse host and port list: 127.0.0.1:49860
   [junit4]   2> 2502365 INFO  (TEST-OverseerTaskQueueTest.testDistributedQueueBlocking-seed#[DAF80DE5E94E4832]) [    ] o.a.s.c.ZkTestServer connecting to 127.0.0.1 49860
   [junit4]   2> 2502375 INFO  (zkConnectionManagerCallback-13839-thread-1) [    ] o.a.s.c.c.ConnectionManager zkClient has connected
   [junit4]   2> 2502381 INFO  (zkConnectionManagerCallback-13841-thread-1) [    ] o.a.s.c.c.ConnectionManager zkClient has connected
   [junit4]   2> 2502390 INFO  (zkConnectionManagerCallback-13843-thread-1) [    ] o.a.s.c.c.ConnectionManager zkClient has connected
   [junit4]   2> 2503615 WARN  (zkConnectionManagerCallback-13843-thread-1) [    ] o.a.s.c.c.ConnectionManager Watcher org.apache.solr.common.cloud.ConnectionManager@6acc570b name: ZooKeeperConnection Watcher:127.0.0.1:49860/solr got event WatchedEvent state:Disconnected type:None path:null path: null type: None
   [junit4]   2> 2503615 WARN  (zkConnectionManagerCallback-13843-thread-1) [    ] o.a.s.c.c.ConnectionManager zkClient has disconnected
   [junit4]   2> 2505067 WARN  (TEST-OverseerTaskQueueTest.testDistributedQueueBlocking-seed#[DAF80DE5E94E4832]-SendThread(127.0.0.1:49860)) [    ] o.a.z.ClientCnxn Unable to reconnect to ZooKeeper service, session 0x1004a8767580002 has expired
   [junit4]   2> 2505067 WARN  (zkConnectionManagerCallback-13843-thread-1) [    ] o.a.s.c.c.ConnectionManager Watcher org.apache.solr.common.cloud.ConnectionManager@6acc570b name: ZooKeeperConnection Watcher:127.0.0.1:49860/solr got event WatchedEvent state:Expired type:None path:null path: null type: None
   [junit4]   2> 2505067 WARN  (zkConnectionManagerCallback-13843-thread-1) [    ] o.a.s.c.c.ConnectionManager Our previous ZooKeeper session was expired. Attempting to reconnect to recover relationship with ZooKeeper...
   [junit4]   2> 2505067 WARN  (zkConnectionManagerCallback-13843-thread-1) [    ] o.a.s.c.c.DefaultConnectionStrategy Connection expired - starting a new one...
   [junit4]   2> 2505071 INFO  (zkConnectionManagerCallback-13843-thread-1-EventThread) [    ] o.a.s.c.c.ConnectionManager zkClient has connected
   [junit4]   2> 2505072 INFO  (zkConnectionManagerCallback-13843-thread-1) [    ] o.a.s.c.c.ConnectionManager Connection with ZooKeeper reestablished.
   [junit4]   2> 2505072 INFO  (zkConnectionManagerCallback-13843-thread-1) [    ] o.a.s.c.c.DefaultConnectionStrategy Reconnected to ZooKeeper
   [junit4]   2> 2505072 INFO  (zkConnectionManagerCallback-13843-thread-1) [    ] o.a.s.c.c.ConnectionManager zkClient Connected:true
   [junit4]   2> 2506229 INFO  (TEST-OverseerTaskQueueTest.testDistributedQueueBlocking-seed#[DAF80DE5E94E4832]) [    ] o.a.s.c.ZkTestServer Shutting down ZkTestServer.
   [junit4]   2> 2506230 WARN  (NIOServerCxn.Factory:0.0.0.0/0.0.0.0:0) [    ] o.a.z.s.NIOServerCnxn Unable to read additional data from client sessionid 0x1004a8767580000, likely client has closed socket
   [junit4]   2> 2506232 WARN  (ZkTestServer Run Thread) [    ] o.a.s.c.ZkTestServer Watch limit violations: 
   [junit4]   2> Maximum concurrent children watches above limit:
   [junit4]   2> 
   [junit4]   2> 	2	/solr/distqueue/test
   [junit4]   2> 
   [junit4]   2> 2506232 INFO  (TEST-OverseerTaskQueueTest.testDistributedQueueBlocking-seed#[DAF80DE5E94E4832]) [    ] o.a.s.c.ZkTestServer parse host and port list: 127.0.0.1:49860
   [junit4]   2> 2506232 INFO  (TEST-OverseerTaskQueueTest.testDistributedQueueBlocking-seed#[DAF80DE5E94E4832]) [    ] o.a.s.c.ZkTestServer connecting to 127.0.0.1 49860
   [junit4]   2> NOTE: leaving temporary files on disk at: C:\Users\jenkins\workspace\Lucene-Solr-master-Windows\solr\build\solr-core\test\J0\temp\solr.cloud.OverseerTaskQueueTest_DAF80DE5E94E4832-001
   [junit4]   2> NOTE: test params are: codec=Asserting(Lucene80), sim=Asserting(org.apache.lucene.search.similarities.AssertingSimilarity@28470e31), locale=sq-MK, timezone=Etc/GMT-7
   [junit4]   2> NOTE: Windows 10 10.0 amd64/Oracle Corporation 11.0.2 (64-bit)/cpus=3,threads=1,free=202907072,total=413138944
   [junit4]   2> NOTE: All tests run in this JVM: [TestJoin, NumberUtilsTest, TestConfigSetsAPIExclusivity, TestCSVResponseWriter, OutputWriterTest, HdfsNNFailoverTest, ScriptEngineTest, TestDocTermOrds, BigEndianAscendingWordSerializerTest, TestTolerantUpdateProcessorRandomCloud, TestDFISimilarityFactory, TestReloadDeadlock, HealthCheckHandlerTest, URLClassifyProcessorTest, UninvertDocValuesMergePolicyTest, TestBulkSchemaConcurrent, TestStressUserVersions, SolrCoreMetricManagerTest, ShardRoutingCustomTest, MigrateRouteKeyTest, TimeZoneUtilsTest, AddSchemaFieldsUpdateProcessorFactoryTest, TestStressRecovery, ParsingFieldUpdateProcessorsTest, TestTrackingShardHandlerFactory, XmlInterpolationTest, DocValuesTest, HdfsCollectionsAPIDistributedZkTest, LeaderFailureAfterFreshStartTest, TestClusterStateMutator, SolrGraphiteReporterTest, MoveReplicaHDFSFailoverTest, TestComponentsName, ClusterStateUpdateTest, LeaderElectionContextKeyTest, CoreAdminHandlerTest, LeaderElectionTest, HttpPartitionTest, AuthToolTest, TestSolrDeletionPolicy1, UnloadDistributedZkTest, TestBackupRepositoryFactory, OverseerModifyCollectionTest, SuggesterTSTTest, TestDistributedGrouping, TestTrie, DistributedUpdateProcessorTest, AutoscalingHistoryHandlerTest, SearchHandlerTest, HdfsBasicDistributedZk2Test, ReturnFieldsTest, DistanceUnitsTest, SolrMetricReporterTest, SortByFunctionTest, ComputePlanActionTest, NodeMutatorTest, ZkStateWriterTest, StatsComponentTest, OpenExchangeRatesOrgProviderTest, TestTlogReplica, TestGraphTermsQParserPlugin, MetricsHistoryIntegrationTest, TimeRoutedAliasUpdateProcessorTest, TestDocSet, TestSmileRequest, TestManagedSchema, TestFieldCacheSort, HLLSerializationTest, TestSchemaVersionResource, TestRecoveryHdfs, TestXmlQParserPlugin, V2StandaloneTest, SearchRateTriggerIntegrationTest, TestLeaderElectionZkExpiry, TestManagedSchemaThreadSafety, TestSolrCloudWithSecureImpersonation, TestDistribIDF, TestLMJelinekMercerSimilarityFactory, HdfsTlogReplayBufferedWhileIndexingTest, AssignBackwardCompatibilityTest, TestClusterProperties, SimpleCollectionCreateDeleteTest, MBeansHandlerTest, AlternateDirectoryTest, SolrCmdDistributorTest, SolrIndexMetricsTest, DateFieldTest, AuditLoggerIntegrationTest, TestSnapshotCloudManager, TestIndexSearcher, FieldMutatingUpdateProcessorTest, TestLegacyFieldCache, TestSolrCloudSnapshots, TestGeoJSONResponseWriter, SortSpecParsingTest, NodeLostTriggerTest, TestHdfsBackupRestoreCore, TestSolrCloudWithDelegationTokens, SolrInfoBeanTest, TestConfigOverlay, SolrXmlInZkTest, TestMultiWordSynonyms, AnalysisAfterCoreReloadTest, SecurityConfHandlerTest, TestPKIAuthenticationPlugin, TestNonDefinedSimilarityFactory, TaggerTest, TestJmxIntegration, TestCloudRecovery2, ChaosMonkeySafeLeaderTest, RollingRestartTest, TestNestedDocsSort, TermVectorComponentTest, CategoryRoutedAliasUpdateProcessorTest, GraphQueryTest, TestDeprecatedFilters, XsltUpdateRequestHandlerTest, TestCrossCoreJoin, JsonLoaderTest, TestXIncludeConfig, TestPhraseSuggestions, CloneFieldUpdateProcessorFactoryTest, ChaosMonkeyNothingIsSafeTest, BJQParserTest, TestFieldCache, SpellCheckCollatorWithCollapseTest, TestSizeLimitedDistributedMap, RecoveryAfterSoftCommitTest, TestSimGenericDistributedQueue, TestUniqueKeyFieldResource, TestRTimerTree, TestComplexPhraseLeadingWildcard, TestRangeQuery, SpellingQueryConverterTest, TestCollectionsAPIViaSolrCloudCluster, CollectionReloadTest, TestNumericTerms64, LoggingHandlerTest, PluginInfoTest, CdcrWithNodesRestartsTest, AddBlockUpdateTest, TestPrepRecovery, HighlighterTest, TokenizerChainTest, PhrasesIdentificationComponentTest, TestDynamicURP, OverseerTest, TestSortByMinMaxFunction, HighlighterConfigTest, DocValuesMissingTest, SolrLogAuditLoggerPluginTest, WordBreakSolrSpellCheckerTest, MultiThreadedOCPTest, TestRealTimeGet, TestLocalFSCloudBackupRestore, ConcurrentCreateRoutedAliasTest, TestJsonFacetRefinement, ScheduledTriggerIntegrationTest, RegexBoostProcessorTest, SuggesterWFSTTest, TestCoreContainer, SolrCloudReportersTest, RestoreTriggerStateTest, IndexBasedSpellCheckerTest, BlockDirectoryTest, TestHttpShardHandlerFactory, TransactionLogTest, TriggerIntegrationTest, AddReplicaTest, ResponseBuilderTest, TestConfigReload, DirectSolrConnectionTest, TestNestedUpdateProcessor, TestEmbeddedSolrServerAdminHandler, TestCloudPhrasesIdentificationComponent, TestInfoStreamLogging, TestConfigSetProperties, TestAnalyzedSuggestions, TestLegacyNumericRangeQueryBuilder, TriggerCooldownIntegrationTest, JavabinLoaderTest, TestFieldCacheVsDocValues, TestBlobHandler, TestSimDistribStateManager, MetricsHistoryHandlerTest, DisMaxRequestHandlerTest, SparseHLLTest, BadCopyFieldTest, TestAtomicUpdateErrorCases, TestDirectoryFactory, TestCodecSupport, TestSimClusterStateProvider, TestSchemalessBufferedUpdates, ConcurrentDeleteAndCreateCollectionTest, SharedFSAutoReplicaFailoverTest, BinaryUpdateRequestHandlerTest, DocValuesNotIndexedTest, TestSegmentSorting, ProtectedTermFilterFactoryTest, DirectUpdateHandlerTest, NodeAddedTriggerTest, TestStressInPlaceUpdates, ReplicaListTransformerTest, DistributedFacetExistsSmallTest, LeaderVoteWaitTimeoutTest, IndexSizeTriggerTest, RootFieldTest, TestReplicationHandlerBackup, CoreAdminRequestStatusTest, SolrRequestParserTest, TestHdfsUpdateLog, TestFacetMethods, ConnectionReuseTest, ConvertedLegacyTest, CursorPagingTest, EchoParamsTest, MinimalSchemaTest, TestDistributedSearch, TestDocumentBuilder, TestGroupingSearch, TestHighlightDedupGrouping, TestSimpleTrackingShardHandler, TestSolrCoreProperties, TestReversedWildcardFilterFactory, TestEmbeddedSolrServerSchemaAPI, TestJettySolrRunner, BasicZkTest, CleanupOldIndexTest, CloudExitableDirectoryReaderTest, ClusterStateTest, CollectionStateFormat2Test, CollectionsAPISolrJTest, DeleteShardTest, DeleteStatusTest, DistribCursorPagingTest, DistribJoinFromCollectionTest, DistributedQueueTest, DistributedVersionInfoTest, MultiSolrCloudTestCaseTest, OverriddenZkACLAndCredentialsProvidersTest, OverseerCollectionConfigSetProcessorTest, OverseerTaskQueueTest]
   [junit4] Completed [476/858 (1!)] on J0 in 16.47s, 7 tests, 1 failure <<< FAILURES!

[...truncated 9702 lines...]
   [junit4] Suite: org.apache.solr.prometheus.exporter.SolrExporterIntegrationTest
   [junit4]   2> Creating dataDir: C:\Users\jenkins\workspace\Lucene-Solr-master-Windows\solr\build\contrib\solr-prometheus-exporter\test\J0\temp\solr.prometheus.exporter.SolrExporterIntegrationTest_D35B7140CBA340F5-001\init-core-data-001
   [junit4]   1> 11:56:05.475 [jetty-launcher-24-thread-1] ERROR org.apache.solr.util.StartupLoggingUtils - Missing Java Option solr.log.dir. Logging may be missing or incomplete.
   [junit4]   1> 11:56:05.497 [jetty-launcher-24-thread-3] ERROR org.apache.solr.util.StartupLoggingUtils - Missing Java Option solr.log.dir. Logging may be missing or incomplete.
   [junit4]   1> 11:56:05.517 [jetty-launcher-24-thread-4] ERROR org.apache.solr.util.StartupLoggingUtils - Missing Java Option solr.log.dir. Logging may be missing or incomplete.
   [junit4]   1> 11:56:05.518 [jetty-launcher-24-thread-2] ERROR org.apache.solr.util.StartupLoggingUtils - Missing Java Option solr.log.dir. Logging may be missing or incomplete.
   [junit4]   1> replica:core_node5 rstate:active live:true
   [junit4]   1> replica:core_node6 rstate:active live:true
   [junit4]   1> replica:core_node7 rstate:active live:true
   [junit4]   1> replica:core_node8 rstate:active live:true
   [junit4]   1> no one is recoverying
   [junit4]   1> replica:core_node5 rstate:active live:true
   [junit4]   1> replica:core_node6 rstate:active live:true
   [junit4]   1> replica:core_node7 rstate:active live:true
   [junit4]   1> replica:core_node8 rstate:active live:true
   [junit4]   1> no one is recoverying
   [junit4]   1> 11:56:13.644 [qtp1430154399-166] ERROR org.apache.solr.schema.ManagedIndexSchema - Bad version when trying to persist schema using 2 due to: org.apache.zookeeper.KeeperException$BadVersionException: KeeperErrorCode = BadVersion for /configs/collection1_config/managed-schema
   [junit4]   1> 11:56:13.747 [qtp1042936214-144] ERROR org.apache.solr.schema.ManagedIndexSchema - Bad version when trying to persist schema using 3 due to: org.apache.zookeeper.KeeperException$BadVersionException: KeeperErrorCode = BadVersion for /configs/collection1_config/managed-schema
   [junit4]   1> 11:56:13.877 [qtp698406621-160] ERROR org.apache.solr.schema.ManagedIndexSchema - Bad version when trying to persist schema using 4 due to: org.apache.zookeeper.KeeperException$BadVersionException: KeeperErrorCode = BadVersion for /configs/collection1_config/managed-schema
   [junit4]   1> 11:56:13.978 [qtp698406621-178] ERROR org.apache.solr.schema.ManagedIndexSchema - Bad version when trying to persist schema using 5 due to: org.apache.zookeeper.KeeperException$BadVersionException: KeeperErrorCode = BadVersion for /configs/collection1_config/managed-schema
   [junit4]   1> 11:56:13.978 [qtp65921996-149] ERROR org.apache.solr.schema.ManagedIndexSchema - Bad version when trying to persist schema using 5 due to: org.apache.zookeeper.KeeperException$BadVersionException: KeeperErrorCode = BadVersion for /configs/collection1_config/managed-schema
   [junit4]   1> Waiting for Prometheus exporter
   [junit4]   1> Prometheus exporter running
   [junit4]   1> Waiting for Prometheus exporter
   [junit4]   1> Prometheus exporter running
   [junit4]   1> Prometheus exporter running
   [junit4]   2> NOTE: reproduce with: ant test  -Dtestcase=SolrExporterIntegrationTest -Dtests.method=jvmMetrics -Dtests.seed=D35B7140CBA340F5 -Dtests.slow=true -Dtests.locale=to -Dtests.timezone=Asia/Tokyo -Dtests.asserts=true -Dtests.file.encoding=Cp1252
   [junit4] FAILURE 0.37s J0 | SolrExporterIntegrationTest.jvmMetrics <<<
   [junit4]    > Throwable #1: java.lang.AssertionError: expected:<36> but was:<48>
   [junit4]    > 	at __randomizedtesting.SeedInfo.seed([D35B7140CBA340F5:EF4CAFDE4D8C61]:0)
   [junit4]    > 	at org.apache.solr.prometheus.exporter.SolrExporterIntegrationTest.jvmMetrics(SolrExporterIntegrationTest.java:71)
   [junit4]    > 	at java.base/jdk.internal.reflect.NativeMethodAccessorImpl.invoke0(Native Method)
   [junit4]    > 	at java.base/jdk.internal.reflect.NativeMethodAccessorImpl.invoke(NativeMethodAccessorImpl.java:62)
   [junit4]    > 	at java.base/jdk.internal.reflect.DelegatingMethodAccessorImpl.invoke(DelegatingMethodAccessorImpl.java:43)
   [junit4]    > 	at java.base/java.lang.reflect.Method.invoke(Method.java:566)
   [junit4]    > 	at java.base/java.lang.Thread.run(Thread.java:834)
   [junit4]   1> Waiting for Prometheus exporter
   [junit4]   1> Prometheus exporter running
   [junit4]   1> Waiting for Prometheus exporter
   [junit4]   1> Prometheus exporter running
   [junit4]   2> NOTE: leaving temporary files on disk at: C:\Users\jenkins\workspace\Lucene-Solr-master-Windows\solr\build\contrib\solr-prometheus-exporter\test\J0\temp\solr.prometheus.exporter.SolrExporterIntegrationTest_D35B7140CBA340F5-001
   [junit4]   2> NOTE: test params are: codec=CheapBastard, sim=Asserting(org.apache.lucene.search.similarities.AssertingSimilarity@5c4eef8e), locale=to, timezone=Asia/Tokyo
   [junit4]   2> NOTE: Windows 10 10.0 amd64/Oracle Corporation 11.0.2 (64-bit)/cpus=3,threads=1,free=129003088,total=264241152
   [junit4]   2> NOTE: All tests run in this JVM: [SolrStandaloneScraperTest, SolrExporterIntegrationTest]
   [junit4] Completed [5/5 (1!)] on J0 in 13.62s, 5 tests, 1 failure <<< FAILURES!

[...truncated 41648 lines...]
[asciidoctor:convert] asciidoctor: ERROR: about-this-guide.adoc: line 1: invalid part, must have at least one section (e.g., chapter, appendix, etc.)
[asciidoctor:convert] asciidoctor: ERROR: solr-glossary.adoc: line 1: invalid part, must have at least one section (e.g., chapter, appendix, etc.)
     [java] Processed 2566 links (2099 relative) to 3378 anchors in 253 files
     [echo] Validated Links & Anchors via: C:\Users\jenkins\workspace\Lucene-Solr-master-Windows\solr\build\solr-ref-guide/bare-bones-html/

-documentation-lint:
    [jtidy] FIXME: Broken HTML checks were disabled, as jtidy can't handle HTML5.
     [echo] Checking for broken links...
     [exec] 
     [exec] Crawl/parse...
     [exec] 
     [exec] Verify...
     [echo] Checking for malformed docs...

jar-checksums:

resolve:

ivy-availability-check:
[loadresource] Do not set property disallowed.ivy.jars.list as its length is 0.

-ivy-fail-disallowed-ivy-version:

ivy-fail:

ivy-configure:
[ivy:configure] :: loading settings :: file = C:\Users\jenkins\workspace\Lucene-Solr-master-Windows\lucene\top-level-ivy-settings.xml

resolve:

ivy-availability-check:
[loadresource] Do not set property disallowed.ivy.jars.list as its length is 0.

-ivy-fail-disallowed-ivy-version:

ivy-fail:

ivy-configure:
[ivy:configure] :: loading settings :: file = C:\Users\jenkins\workspace\Lucene-Solr-master-Windows\lucene\top-level-ivy-settings.xml

resolve:

resolve:

ivy-availability-check:
[loadresource] Do not set property disallowed.ivy.jars.list as its length is 0.

-ivy-fail-disallowed-ivy-version:

ivy-fail:

ivy-configure:
[ivy:configure] :: loading settings :: file = C:\Users\jenkins\workspace\Lucene-Solr-master-Windows\lucene\top-level-ivy-settings.xml

resolve:

ivy-availability-check:
[loadresource] Do not set property disallowed.ivy.jars.list as its length is 0.

-ivy-fail-disallowed-ivy-version:

ivy-fail:

ivy-configure:
[ivy:configure] :: loading settings :: file = C:\Users\jenkins\workspace\Lucene-Solr-master-Windows\lucene\top-level-ivy-settings.xml

resolve:

ivy-availability-check:
[loadresource] Do not set property disallowed.ivy.jars.list as its length is 0.

-ivy-fail-disallowed-ivy-version:

ivy-fail:

ivy-configure:
[ivy:configure] :: loading settings :: file = C:\Users\jenkins\workspace\Lucene-Solr-master-Windows\lucene\top-level-ivy-settings.xml

resolve:

ivy-availability-check:
[loadresource] Do not set property disallowed.ivy.jars.list as its length is 0.

-ivy-fail-disallowed-ivy-version:

ivy-fail:

ivy-configure:
[ivy:configure] :: loading settings :: file = C:\Users\jenkins\workspace\Lucene-Solr-master-Windows\lucene\top-level-ivy-settings.xml

resolve:

ivy-availability-check:
[loadresource] Do not set property disallowed.ivy.jars.list as its length is 0.

-ivy-fail-disallowed-ivy-version:

ivy-fail:

ivy-configure:
[ivy:configure] :: loading settings :: file = C:\Users\jenkins\workspace\Lucene-Solr-master-Windows\lucene\top-level-ivy-settings.xml

resolve:

ivy-availability-check:
[loadresource] Do not set property disallowed.ivy.jars.list as its length is 0.

-ivy-fail-disallowed-ivy-version:

ivy-fail:

ivy-configure:
[ivy:configure] :: loading settings :: file = C:\Users\jenkins\workspace\Lucene-Solr-master-Windows\lucene\top-level-ivy-settings.xml

resolve:

ivy-availability-check:
[loadresource] Do not set property disallowed.ivy.jars.list as its length is 0.

-ivy-fail-disallowed-ivy-version:

ivy-fail:

ivy-configure:
[ivy:configure] :: loading settings :: file = C:\Users\jenkins\workspace\Lucene-Solr-master-Windows\lucene\top-level-ivy-settings.xml

resolve:

ivy-availability-check:
[loadresource] Do not set property disallowed.ivy.jars.list as its length is 0.

-ivy-fail-disallowed-ivy-version:

ivy-fail:

ivy-configure:
[ivy:configure] :: loading settings :: file = C:\Users\jenkins\workspace\Lucene-Solr-master-Windows\lucene\top-level-ivy-settings.xml

resolve:

ivy-availability-check:
[loadresource] Do not set property disallowed.ivy.jars.list as its length is 0.

-ivy-fail-disallowed-ivy-version:

ivy-fail:

ivy-configure:
[ivy:configure] :: loading settings :: file = C:\Users\jenkins\workspace\Lucene-Solr-master-Windows\lucene\top-level-ivy-settings.xml

resolve:

ivy-availability-check:
[loadresource] Do not set property disallowed.ivy.jars.list as its length is 0.

-ivy-fail-disallowed-ivy-version:

ivy-fail:

ivy-configure:
[ivy:configure] :: loading settings :: file = C:\Users\jenkins\workspace\Lucene-Solr-master-Windows\lucene\top-level-ivy-settings.xml

resolve:

ivy-availability-check:
[loadresource] Do not set property disallowed.ivy.jars.list as its length is 0.

-ivy-fail-disallowed-ivy-version:

ivy-fail:

ivy-configure:
[ivy:configure] :: loading settings :: file = C:\Users\jenkins\workspace\Lucene-Solr-master-Windows\lucene\top-level-ivy-settings.xml

resolve:

ivy-availability-check:
[loadresource] Do not set property disallowed.ivy.jars.list as its length is 0.

-ivy-fail-disallowed-ivy-version:

ivy-fail:

ivy-configure:
[ivy:configure] :: loading settings :: file = C:\Users\jenkins\workspace\Lucene-Solr-master-Windows\lucene\top-level-ivy-settings.xml

resolve:

ivy-availability-check:
[loadresource] Do not set property disallowed.ivy.jars.list as its length is 0.

-ivy-fail-disallowed-ivy-version:

ivy-fail:

ivy-configure:
[ivy:configure] :: loading settings :: file = C:\Users\jenkins\workspace\Lucene-Solr-master-Windows\lucene\top-level-ivy-settings.xml

resolve:

ivy-availability-check:
[loadresource] Do not set property disallowed.ivy.jars.list as its length is 0.

-ivy-fail-disallowed-ivy-version:

ivy-fail:

ivy-configure:
[ivy:configure] :: loading settings :: file = C:\Users\jenkins\workspace\Lucene-Solr-master-Windows\lucene\top-level-ivy-settings.xml

resolve:

ivy-availability-check:
[loadresource] Do not set property disallowed.ivy.jars.list as its length is 0.

-ivy-fail-disallowed-ivy-version:

ivy-fail:

ivy-configure:
[ivy:configure] :: loading settings :: file = C:\Users\jenkins\workspace\Lucene-Solr-master-Windows\lucene\top-level-ivy-settings.xml

resolve:

ivy-availability-check:
[loadresource] Do not set property disallowed.ivy.jars.list as its length is 0.

-ivy-fail-disallowed-ivy-version:

ivy-fail:

ivy-configure:
[ivy:configure] :: loading settings :: file = C:\Users\jenkins\workspace\Lucene-Solr-master-Windows\lucene\top-level-ivy-settings.xml

resolve:

ivy-availability-check:
[loadresource] Do not set property disallowed.ivy.jars.list as its length is 0.

-ivy-fail-disallowed-ivy-version:

ivy-fail:

ivy-configure:
[ivy:configure] :: loading settings :: file = C:\Users\jenkins\workspace\Lucene-Solr-master-Windows\lucene\top-level-ivy-settings.xml

resolve:

ivy-availability-check:
[loadresource] Do not set property disallowed.ivy.jars.list as its length is 0.

-ivy-fail-disallowed-ivy-version:

ivy-fail:

ivy-configure:
[ivy:configure] :: loading settings :: file = C:\Users\jenkins\workspace\Lucene-Solr-master-Windows\lucene\top-level-ivy-settings.xml

resolve:

ivy-availability-check:
[loadresource] Do not set property disallowed.ivy.jars.list as its length is 0.

-ivy-fail-disallowed-ivy-version:

ivy-fail:

ivy-configure:
[ivy:configure] :: loading settings :: file = C:\Users\jenkins\workspace\Lucene-Solr-master-Windows\lucene\top-level-ivy-settings.xml

resolve:

ivy-availability-check:
[loadresource] Do not set property disallowed.ivy.jars.list as its length is 0.

-ivy-fail-disallowed-ivy-version:

ivy-fail:

ivy-configure:
[ivy:configure] :: loading settings :: file = C:\Users\jenkins\workspace\Lucene-Solr-master-Windows\lucene\top-level-ivy-settings.xml

resolve:

ivy-availability-check:
[loadresource] Do not set property disallowed.ivy.jars.list as its length is 0.

-ivy-fail-disallowed-ivy-version:

ivy-fail:

ivy-configure:
[ivy:configure] :: loading settings :: file = C:\Users\jenkins\workspace\Lucene-Solr-master-Windows\lucene\top-level-ivy-settings.xml

resolve:

ivy-availability-check:
[loadresource] Do not set property disallowed.ivy.jars.list as its length is 0.

-ivy-fail-disallowed-ivy-version:

ivy-fail:

ivy-configure:
[ivy:configure] :: loading settings :: file = C:\Users\jenkins\workspace\Lucene-Solr-master-Windows\lucene\top-level-ivy-settings.xml

resolve:

ivy-availability-check:
[loadresource] Do not set property disallowed.ivy.jars.list as its length is 0.

-ivy-fail-disallowed-ivy-version:

ivy-fail:

ivy-configure:
[ivy:configure] :: loading settings :: file = C:\Users\jenkins\workspace\Lucene-Solr-master-Windows\lucene\top-level-ivy-settings.xml

resolve:

ivy-availability-check:
[loadresource] Do not set property disallowed.ivy.jars.list as its length is 0.

-ivy-fail-disallowed-ivy-version:

ivy-fail:

ivy-configure:
[ivy:configure] :: loading settings :: file = C:\Users\jenkins\workspace\Lucene-Solr-master-Windows\lucene\top-level-ivy-settings.xml

resolve:

ivy-availability-check:
[loadresource] Do not set property disallowed.ivy.jars.list as its length is 0.

-ivy-fail-disallowed-ivy-version:

ivy-fail:

ivy-configure:
[ivy:configure] :: loading settings :: file = C:\Users\jenkins\workspace\Lucene-Solr-master-Windows\lucene\top-level-ivy-settings.xml

common.resolve:

resolve:

ivy-availability-check:
[loadresource] Do not set property disallowed.ivy.jars.list as its length is 0.

-ivy-fail-disallowed-ivy-version:

ivy-fail:

ivy-configure:
[ivy:configure] :: loading settings :: file = C:\Users\jenkins\workspace\Lucene-Solr-master-Windows\lucene\top-level-ivy-settings.xml

resolve:

ivy-availability-check:
[loadresource] Do not set property disallowed.ivy.jars.list as its length is 0.

-ivy-fail-disallowed-ivy-version:

ivy-fail:

ivy-configure:
[ivy:configure] :: loading settings :: file = C:\Users\jenkins\workspace\Lucene-Solr-master-Windows\lucene\top-level-ivy-settings.xml

resolve:

ivy-availability-check:
[loadresource] Do not set property disallowed.ivy.jars.list as its length is 0.

-ivy-fail-disallowed-ivy-version:

ivy-fail:

ivy-configure:
[ivy:configure] :: loading settings :: file = C:\Users\jenkins\workspace\Lucene-Solr-master-Windows\lucene\top-level-ivy-settings.xml

resolve:

ivy-availability-check:
[loadresource] Do not set property disallowed.ivy.jars.list as its length is 0.

-ivy-fail-disallowed-ivy-version:

ivy-fail:

ivy-configure:
[ivy:configure] :: loading settings :: file = C:\Users\jenkins\workspace\Lucene-Solr-master-Windows\lucene\top-level-ivy-settings.xml

resolve:

ivy-availability-check:
[loadresource] Do not set property disallowed.ivy.jars.list as its length is 0.

-ivy-fail-disallowed-ivy-version:

ivy-fail:

ivy-configure:
[ivy:configure] :: loading settings :: file = C:\Users\jenkins\workspace\Lucene-Solr-master-Windows\lucene\top-level-ivy-settings.xml

resolve:

jar-checksums:
    [mkdir] Created dir: C:\Users\jenkins\workspace\Lucene-Solr-master-Windows\lucene\null689452854
     [copy] Copying 38 files to C:\Users\jenkins\workspace\Lucene-Solr-master-Windows\lucene\null689452854
   [delete] Deleting directory C:\Users\jenkins\workspace\Lucene-Solr-master-Windows\lucene\null689452854

resolve-example:

ivy-availability-check:
[loadresource] Do not set property disallowed.ivy.jars.list as its length is 0.

-ivy-fail-disallowed-ivy-version:

ivy-fail:

ivy-configure:
[ivy:configure] :: loading settings :: file = C:\Users\jenkins\workspace\Lucene-Solr-master-Windows\lucene\top-level-ivy-settings.xml

resolve:

resolve-server:

ivy-availability-check:
[loadresource] Do not set property disallowed.ivy.jars.list as its length is 0.

-ivy-fail-disallowed-ivy-version:

ivy-fail:

ivy-fail:

ivy-configure:
[ivy:configure] :: loading settings :: file = C:\Users\jenkins\workspace\Lucene-Solr-master-Windows\lucene\top-level-ivy-settings.xml

resolve:

resolve:

ivy-availability-check:
[loadresource] Do not set property disallowed.ivy.jars.list as its length is 0.

-ivy-fail-disallowed-ivy-version:

ivy-fail:

ivy-fail:

ivy-configure:
[ivy:configure] :: loading settings :: file = C:\Users\jenkins\workspace\Lucene-Solr-master-Windows\lucene\top-level-ivy-settings.xml

resolve:

ivy-availability-check:
[loadresource] Do not set property disallowed.ivy.jars.list as its length is 0.

-ivy-fail-disallowed-ivy-version:

ivy-fail:

ivy-fail:

ivy-configure:
[ivy:configure] :: loading settings :: file = C:\Users\jenkins\workspace\Lucene-Solr-master-Windows\lucene\top-level-ivy-settings.xml

resolve:

ivy-availability-check:
[loadresource] Do not set property disallowed.ivy.jars.list as its length is 0.

-ivy-fail-disallowed-ivy-version:

ivy-fail:

ivy-configure:
[ivy:configure] :: loading settings :: file = C:\Users\jenkins\workspace\Lucene-Solr-master-Windows\lucene\top-level-ivy-settings.xml

resolve:

ivy-availability-check:
[loadresource] Do not set property disallowed.ivy.jars.list as its length is 0.

-ivy-fail-disallowed-ivy-version:

ivy-fail:

ivy-fail:

ivy-configure:
[ivy:configure] :: loading settings :: file = C:\Users\jenkins\workspace\Lucene-Solr-master-Windows\lucene\top-level-ivy-settings.xml

resolve:

ivy-availability-check:
[loadresource] Do not set property disallowed.ivy.jars.list as its length is 0.

-ivy-fail-disallowed-ivy-version:

ivy-fail:

ivy-configure:
[ivy:configure] :: loading settings :: file = C:\Users\jenkins\workspace\Lucene-Solr-master-Windows\lucene\top-level-ivy-settings.xml

resolve:

ivy-availability-check:
[loadresource] Do not set property disallowed.ivy.jars.list as its length is 0.

-ivy-fail-disallowed-ivy-version:

ivy-fail:

ivy-fail:

ivy-configure:
[ivy:configure] :: loading settings :: file = C:\Users\jenkins\workspace\Lucene-Solr-master-Windows\lucene\top-level-ivy-settings.xml

resolve:

ivy-availability-check:
[loadresource] Do not set property disallowed.ivy.jars.list as its length is 0.

-ivy-fail-disallowed-ivy-version:

ivy-fail:

ivy-fail:

ivy-configure:
[ivy:configure] :: loading settings :: file = C:\Users\jenkins\workspace\Lucene-Solr-master-Windows\lucene\top-level-ivy-settings.xml

resolve:

ivy-availability-check:
[loadresource] Do not set property disallowed.ivy.jars.list as its length is 0.

-ivy-fail-disallowed-ivy-version:

ivy-fail:

ivy-fail:

ivy-configure:
[ivy:configure] :: loading settings :: file = C:\Users\jenkins\workspace\Lucene-Solr-master-Windows\lucene\top-level-ivy-settings.xml

resolve:

ivy-availability-check:
[loadresource] Do not set property disallowed.ivy.jars.list as its length is 0.

-ivy-fail-disallowed-ivy-version:

ivy-fail:

ivy-fail:

ivy-configure:
[ivy:configure] :: loading settings :: file = C:\Users\jenkins\workspace\Lucene-Solr-master-Windows\lucene\top-level-ivy-settings.xml

resolve:

ivy-availability-check:
[loadresource] Do not set property disallowed.ivy.jars.list as its length is 0.

-ivy-fail-disallowed-ivy-version:

ivy-fail:

ivy-fail:

ivy-configure:
[ivy:configure] :: loading settings :: file = C:\Users\jenkins\workspace\Lucene-Solr-master-Windows\lucene\top-level-ivy-settings.xml

resolve:

ivy-availability-check:
[loadresource] Do not set property disallowed.ivy.jars.list as its length is 0.

-ivy-fail-disallowed-ivy-version:

ivy-fail:

ivy-fail:

ivy-configure:
[ivy:configure] :: loading settings :: file = C:\Users\jenkins\workspace\Lucene-Solr-master-Windows\lucene\top-level-ivy-settings.xml

resolve:

ivy-availability-check:
[loadresource] Do not set property disallowed.ivy.jars.list as its length is 0.

-ivy-fail-disallowed-ivy-version:

ivy-fail:

ivy-fail:

ivy-configure:
[ivy:configure] :: loading settings :: file = C:\Users\jenkins\workspace\Lucene-Solr-master-Windows\lucene\top-level-ivy-settings.xml

resolve:

ivy-availability-check:
[loadresource] Do not set property disallowed.ivy.jars.list as its length is 0.

-ivy-fail-disallowed-ivy-version:

ivy-fail:

ivy-fail:

ivy-configure:
[ivy:configure] :: loading settings :: file = C:\Users\jenkins\workspace\Lucene-Solr-master-Windows\lucene\top-level-ivy-settings.xml

resolve:

ivy-availability-check:
[loadresource] Do not set property disallowed.ivy.jars.list as its length is 0.

-ivy-fail-disallowed-ivy-version:

ivy-fail:

ivy-fail:

ivy-configure:
[ivy:configure] :: loading settings :: file = C:\Users\jenkins\workspace\Lucene-Solr-master-Windows\lucene\top-level-ivy-settings.xml

resolve:

ivy-availability-check:
[loadresource] Do not set property disallowed.ivy.jars.list as its length is 0.

-ivy-fail-disallowed-ivy-version:

ivy-fail:

ivy-fail:

ivy-configure:
[ivy:configure] :: loading settings :: file = C:\Users\jenkins\workspace\Lucene-Solr-master-Windows\lucene\top-level-ivy-settings.xml

resolve:

jar-checksums:
    [mkdir] Created dir: C:\Users\jenkins\workspace\Lucene-Solr-master-Windows\solr\null1232787694
     [copy] Copying 240 files to C:\Users\jenkins\workspace\Lucene-Solr-master-Windows\solr\null1232787694
   [delete] Deleting directory C:\Users\jenkins\workspace\Lucene-Solr-master-Windows\solr\null1232787694

check-working-copy:
[ivy:cachepath] :: resolving dependencies :: #;working@serv1-vm1
[ivy:cachepath] 	confs: [default]
[ivy:cachepath] 	found org.eclipse.jgit#org.eclipse.jgit;5.3.0.201903130848-r in public
[ivy:cachepath] 	found com.jcraft#jsch;0.1.54 in public
[ivy:cachepath] 	found com.jcraft#jzlib;1.1.1 in public
[ivy:cachepath] 	found com.googlecode.javaewah#JavaEWAH;1.1.6 in public
[ivy:cachepath] 	found org.slf4j#slf4j-api;1.7.2 in public
[ivy:cachepath] 	found org.bouncycastle#bcpg-jdk15on;1.60 in public
[ivy:cachepath] 	found org.bouncycastle#bcprov-jdk15on;1.60 in public
[ivy:cachepath] 	found org.bouncycastle#bcpkix-jdk15on;1.60 in public
[ivy:cachepath] 	found org.slf4j#slf4j-nop;1.7.2 in public
[ivy:cachepath] :: resolution report :: resolve 81ms :: artifacts dl 6ms
	---------------------------------------------------------------------
	|                  |            modules            ||   artifacts   |
	|       conf       | number| search|dwnlded|evicted|| number|dwnlded|
	---------------------------------------------------------------------
	|      default     |   9   |   0   |   0   |   0   ||   9   |   0   |
	---------------------------------------------------------------------
[wc-checker] Initializing working copy...
[wc-checker] Checking working copy status...

-jenkins-base:

BUILD SUCCESSFUL
Total time: 122 minutes 57 seconds
Setting ANT_1_8_2_HOME=C:\Users\jenkins\tools\hudson.tasks.Ant_AntInstallation\ANT_1.8.2
[Lucene-Solr-master-Windows] $ cmd /c call C:\Users\jenkins\AppData\Local\Temp\jenkins7507207834231400522.bat

C:\Users\jenkins\workspace\Lucene-Solr-master-Windows>IF EXIST lucene\build move /y lucene\build lucene\build.orig 
        1 dir(s) moved.

C:\Users\jenkins\workspace\Lucene-Solr-master-Windows>IF EXIST solr\build move /y solr\build solr\build.orig 
        1 dir(s) moved.

C:\Users\jenkins\workspace\Lucene-Solr-master-Windows>set ANT_HOME=C:\Users\jenkins\tools\hudson.tasks.Ant_AntInstallation\ANT_1.8.2 

C:\Users\jenkins\workspace\Lucene-Solr-master-Windows>set PATH=C:\Users\jenkins\tools\hudson.tasks.Ant_AntInstallation\ANT_1.8.2\bin;C:\Users\jenkins\tools\java\64bit\jdk-11.0.2\bin;C:\Program Files (x86)\Common Files\Oracle\Java\javapath;C:\ProgramData\Oracle\Java\javapath;C:\Python35\Scripts\;C:\Python35\;C:\Perl64\site\bin;C:\Perl64\bin;C:\WINDOWS\system32;C:\WINDOWS;C:\WINDOWS\System32\Wbem;C:\WINDOWS\System32\WindowsPowerShell\v1.0\;C:\WINDOWS\System32\OpenSSH\;C:\Users\jenkins\AppData\Local\Microsoft\WindowsApps 

C:\Users\jenkins\workspace\Lucene-Solr-master-Windows>C:\Python35\python.exe -u dev-tools\scripts\reproduceJenkinsFailures.py --no-git https://jenkins.thetaphi.de/job/Lucene-Solr-master-Windows/7965/consoleText 
[repro] Jenkins log URL: https://jenkins.thetaphi.de/job/Lucene-Solr-master-Windows/7965/consoleText

[repro] Revision: 90e0d1eba10b3d611b2f8692f57e33beb91823b0

[repro] Ant options: "-Dargs=-XX:+UseCompressedOops -XX:+UseParallelGC"
[repro] Repro line:  ant test  -Dtestcase=OverseerTaskQueueTest -Dtests.method=testLeakChildWatcher -Dtests.seed=DAF80DE5E94E4832 -Dtests.slow=true -Dtests.locale=sq-MK -Dtests.timezone=Etc/GMT-7 -Dtests.asserts=true -Dtests.file.encoding=UTF-8


[repro] Repro line:  ant test  -Dtestcase=SolrExporterIntegrationTest -Dtests.method=jvmMetrics -Dtests.seed=D35B7140CBA340F5 -Dtests.slow=true -Dtests.locale=to -Dtests.timezone=Asia/Tokyo -Dtests.asserts=true -Dtests.file.encoding=Cp1252


[repro] ant clean
Buildfile: C:\Users\jenkins\workspace\Lucene-Solr-master-Windows\build.xml

clean:

clean:

clean:

BUILD SUCCESSFUL
Total time: 0 seconds
[repro] Test suites by module:
[repro]    solr\contrib\prometheus-exporter
[repro]       SolrExporterIntegrationTest
[repro]    solr\core
[repro]       OverseerTaskQueueTest
[repro] ant compile-test
Buildfile: C:\Users\jenkins\workspace\Lucene-Solr-master-Windows\solr\contrib\prometheus-exporter\build.xml

compile-solr-test-framework:

ivy-availability-check:
[loadresource] Do not set property disallowed.ivy.jars.list as its length is 0.

-ivy-fail-disallowed-ivy-version:

ivy-fail:

ivy-configure:
[ivy:configure] :: Apache Ivy 2.4.0 - 20141213170938 :: http://ant.apache.org/ivy/ ::
[ivy:configure] :: loading settings :: file = C:\Users\jenkins\workspace\Lucene-Solr-master-Windows\lucene\top-level-ivy-settings.xml

resolve:

-clover.disable:

-clover.load:

-clover.classpath:

-clover.setup:

clover:

compile-solr-core:

compile-solrj:

ivy-availability-check:
[loadresource] Do not set property disallowed.ivy.jars.list as its length is 0.

-ivy-fail-disallowed-ivy-version:

ivy-fail:

ivy-configure:
[ivy:configure] :: loading settings :: file = C:\Users\jenkins\workspace\Lucene-Solr-master-Windows\lucene\top-level-ivy-settings.xml

resolve-groovy:
[ivy:cachepath] :: resolving dependencies :: org.codehaus.groovy#groovy-all-caller;working
[ivy:cachepath] 	confs: [default]
[ivy:cachepath] 	found org.codehaus.groovy#groovy-all;2.4.16 in public
[ivy:cachepath] :: resolution report :: resolve 34ms :: artifacts dl 0ms
	---------------------------------------------------------------------
	|                  |            modules            ||   artifacts   |
	|       conf       | number| search|dwnlded|evicted|| number|dwnlded|
	---------------------------------------------------------------------
	|      default     |   1   |   0   |   0   |   0   ||   1   |   0   |
	---------------------------------------------------------------------

check-lucene-core-uptodate:

jar-lucene-core:

-check-git-state:

-git-cleanroot:

-copy-git-state:
     [copy] Copying 1 file to C:\Users\jenkins\workspace\Lucene-Solr-master-Windows\lucene\build

git-autoclean:

ivy-availability-check:
[loadresource] Do not set property disallowed.ivy.jars.list as its length is 0.

-ivy-fail-disallowed-ivy-version:

ivy-fail:

ivy-configure:
[ivy:configure] :: loading settings :: file = C:\Users\jenkins\workspace\Lucene-Solr-master-Windows\lucene\top-level-ivy-settings.xml

resolve:

init:

-clover.disable:

-clover.load:

-clover.classpath:

-clover.setup:

clover:

compile-core:
    [mkdir] Created dir: C:\Users\jenkins\workspace\Lucene-Solr-master-Windows\lucene\build\core\classes\java
    [javac] Compiling 862 source files to C:\Users\jenkins\workspace\Lucene-Solr-master-Windows\lucene\build\core\classes\java
    [javac] Note: C:\Users\jenkins\workspace\Lucene-Solr-master-Windows\lucene\core\src\java\org\apache\lucene\util\fst\PositiveIntOutputs.java uses or overrides a deprecated API.
    [javac] Note: Recompile with -Xlint:deprecation for details.
    [javac] Creating empty C:\Users\jenkins\workspace\Lucene-Solr-master-Windows\lucene\build\core\classes\java\org\apache\lucene\util\graph\package-info.class
    [javac] Creating empty C:\Users\jenkins\workspace\Lucene-Solr-master-Windows\lucene\build\core\classes\java\org\apache\lucene\document\package-info.class
    [javac] Creating empty C:\Users\jenkins\workspace\Lucene-Solr-master-Windows\lucene\build\core\classes\java\org\apache\lucene\package-info.class
    [javac] Creating empty C:\Users\jenkins\workspace\Lucene-Solr-master-Windows\lucene\build\core\classes\java\org\apache\lucene\util\bkd\package-info.class
    [javac] Creating empty C:\Users\jenkins\workspace\Lucene-Solr-master-Windows\lucene\build\core\classes\java\org\apache\lucene\codecs\compressing\package-info.class
    [javac] Creating empty C:\Users\jenkins\workspace\Lucene-Solr-master-Windows\lucene\build\core\classes\java\org\apache\lucene\codecs\lucene60\package-info.class
    [javac] Creating empty C:\Users\jenkins\workspace\Lucene-Solr-master-Windows\lucene\build\core\classes\java\org\apache\lucene\codecs\package-info.class
    [javac] Creating empty C:\Users\jenkins\workspace\Lucene-Solr-master-Windows\lucene\build\core\classes\java\org\apache\lucene\codecs\lucene80\package-info.class
    [javac] Creating empty C:\Users\jenkins\workspace\Lucene-Solr-master-Windows\lucene\build\core\classes\java\org\apache\lucene\util\package-info.class
    [javac] Creating empty C:\Users\jenkins\workspace\Lucene-Solr-master-Windows\lucene\build\core\classes\java\org\apache\lucene\index\package-info.class
    [javac] Creating empty C:\Users\jenkins\workspace\Lucene-Solr-master-Windows\lucene\build\core\classes\java\org\apache\lucene\util\fst\package-info.class
    [javac] Creating empty C:\Users\jenkins\workspace\Lucene-Solr-master-Windows\lucene\build\core\classes\java\org\apache\lucene\analysis\tokenattributes\package-info.class
    [javac] Creating empty C:\Users\jenkins\workspace\Lucene-Solr-master-Windows\lucene\build\core\classes\java\org\apache\lucene\search\package-info.class
    [javac] Creating empty C:\Users\jenkins\workspace\Lucene-Solr-master-Windows\lucene\build\core\classes\java\org\apache\lucene\util\packed\package-info.class
    [javac] Creating empty C:\Users\jenkins\workspace\Lucene-Solr-master-Windows\lucene\build\core\classes\java\org\apache\lucene\util\mutable\package-info.class
    [javac] Creating empty C:\Users\jenkins\workspace\Lucene-Solr-master-Windows\lucene\build\core\classes\java\org\apache\lucene\codecs\lucene70\package-info.class
    [javac] Creating empty C:\Users\jenkins\workspace\Lucene-Solr-master-Windows\lucene\build\core\classes\java\org\apache\lucene\codecs\perfield\package-info.class
    [javac] Creating empty C:\Users\jenkins\workspace\Lucene-Solr-master-Windows\lucene\build\core\classes\java\org\apache\lucene\analysis\package-info.class
    [javac] Creating empty C:\Users\jenkins\workspace\Lucene-Solr-master-Windows\lucene\build\core\classes\java\org\apache\lucene\analysis\standard\package-info.class
    [javac] Creating empty C:\Users\jenkins\workspace\Lucene-Solr-master-Windows\lucene\build\core\classes\java\org\apache\lucene\store\package-info.class
    [javac] Creating empty C:\Users\jenkins\workspace\Lucene-Solr-master-Windows\lucene\build\core\classes\java\org\apache\lucene\codecs\blocktree\package-info.class
    [javac] Creating empty C:\Users\jenkins\workspace\Lucene-Solr-master-Windows\lucene\build\core\classes\java\org\apache\lucene\search\spans\package-info.class
    [javac] Creating empty C:\Users\jenkins\workspace\Lucene-Solr-master-Windows\lucene\build\core\classes\java\org\apache\lucene\search\similarities\package-info.class
    [javac] Creating empty C:\Users\jenkins\workspace\Lucene-Solr-master-Windows\lucene\build\core\classes\java\org\apache\lucene\util\automaton\package-info.class
    [javac] Creating empty C:\Users\jenkins\workspace\Lucene-Solr-master-Windows\lucene\build\core\classes\java\org\apache\lucene\codecs\lucene50\package-info.class
    [javac] Creating empty C:\Users\jenkins\workspace\Lucene-Solr-master-Windows\lucene\build\core\classes\java\org\apache\lucene\geo\package-info.class
     [copy] Copying 3 files to C:\Users\jenkins\workspace\Lucene-Solr-master-Windows\lucene\build\core\classes\java

jar-core:
     [exec] Execute failed: java.io.IOException: Cannot run program "git" (in directory "C:\Users\jenkins\workspace\Lucene-Solr-master-Windows\lucene\core"): CreateProcess error=2, The system cannot find the file specified
      [jar] Building jar: C:\Users\jenkins\workspace\Lucene-Solr-master-Windows\lucene\build\core\lucene-core-9.0.0-SNAPSHOT.jar

check-backward-codecs-uptodate:

jar-backward-codecs:

-check-git-state:

-git-cleanroot:

-copy-git-state:

git-autoclean:

ivy-availability-check:
[loadresource] Do not set property disallowed.ivy.jars.list as its length is 0.

-ivy-fail-disallowed-ivy-version:

ivy-fail:

ivy-configure:
[ivy:configure] :: loading settings :: file = C:\Users\jenkins\workspace\Lucene-Solr-master-Windows\lucene\top-level-ivy-settings.xml

resolve:

common.init:

compile-lucene-core:

-check-git-state:

-git-cleanroot:

-copy-git-state:

git-autoclean:

ivy-availability-check:
[loadresource] Do not set property disallowed.ivy.jars.list as its length is 0.

-ivy-fail-disallowed-ivy-version:

ivy-fail:

ivy-configure:
[ivy:configure] :: loading settings :: file = C:\Users\jenkins\workspace\Lucene-Solr-master-Windows\lucene\top-level-ivy-settings.xml

resolve:

init:

-clover.disable:

-clover.load:

-clover.classpath:

-clover.setup:

clover:

compile-core:

init:

-clover.disable:

-clover.load:

-clover.classpath:

-clover.setup:

clover:

compile-core:
    [mkdir] Created dir: C:\Users\jenkins\workspace\Lucene-Solr-master-Windows\lucene\build\backward-codecs\classes\java
    [javac] Compiling 9 source files to C:\Users\jenkins\workspace\Lucene-Solr-master-Windows\lucene\build\backward-codecs\classes\java
     [copy] Copying 3 files to C:\Users\jenkins\workspace\Lucene-Solr-master-Windows\lucene\build\backward-codecs\classes\java

jar-core:
     [exec] Execute failed: java.io.IOException: Cannot run program "git" (in directory "C:\Users\jenkins\workspace\Lucene-Solr-master-Windows\lucene\backward-codecs"): CreateProcess error=2, The system cannot find the file specified
      [jar] Building jar: C:\Users\jenkins\workspace\Lucene-Solr-master-Windows\lucene\build\backward-codecs\lucene-backward-codecs-9.0.0-SNAPSHOT.jar

check-analyzers-phonetic-uptodate:

jar-analyzers-phonetic:

check-analyzers-common-uptodate:

jar-analyzers-common:

-check-git-state:

-git-cleanroot:

-copy-git-state:

git-autoclean:

ivy-availability-check:
[loadresource] Do not set property disallowed.ivy.jars.list as its length is 0.

-ivy-fail-disallowed-ivy-version:

ivy-fail:

ivy-configure:
[ivy:configure] :: loading settings :: file = C:\Users\jenkins\workspace\Lucene-Solr-master-Windows\lucene\top-level-ivy-settings.xml

resolve:

common.init:

compile-lucene-core:

-check-git-state:

-git-cleanroot:

-copy-git-state:

git-autoclean:

ivy-availability-check:
[loadresource] Do not set property disallowed.ivy.jars.list as its length is 0.

-ivy-fail-disallowed-ivy-version:

ivy-fail:

ivy-configure:
[ivy:configure] :: loading settings :: file = C:\Users\jenkins\workspace\Lucene-Solr-master-Windows\lucene\top-level-ivy-settings.xml

resolve:

init:

-clover.disable:

-clover.load:

-clover.classpath:

-clover.setup:

clover:

compile-core:

init:

-clover.disable:

-clover.load:

-clover.classpath:

-clover.setup:

clover:

compile-core:
    [mkdir] Created dir: C:\Users\jenkins\workspace\Lucene-Solr-master-Windows\lucene\build\analysis\common\classes\java
    [javac] Compiling 472 source files to C:\Users\jenkins\workspace\Lucene-Solr-master-Windows\lucene\build\analysis\common\classes\java
    [javac] Note: Some input files use or override a deprecated API.
    [javac] Note: Recompile with -Xlint:deprecation for details.
    [javac] Creating empty C:\Users\jenkins\workspace\Lucene-Solr-master-Windows\lucene\build\analysis\common\classes\java\org\apache\lucene\analysis\hunspell\package-info.class
    [javac] Creating empty C:\Users\jenkins\workspace\Lucene-Solr-master-Windows\lucene\build\analysis\common\classes\java\org\apache\lucene\analysis\minhash\package-info.class
    [javac] Creating empty C:\Users\jenkins\workspace\Lucene-Solr-master-Windows\lucene\build\analysis\common\classes\java\org\apache\lucene\analysis\ga\package-info.class
    [javac] Creating empty C:\Users\jenkins\workspace\Lucene-Solr-master-Windows\lucene\build\analysis\common\classes\java\org\apache\lucene\analysis\ca\package-info.class
    [javac] Creating empty C:\Users\jenkins\workspace\Lucene-Solr-master-Windows\lucene\build\analysis\common\classes\java\org\apache\lucene\analysis\custom\package-info.class
    [javac] Creating empty C:\Users\jenkins\workspace\Lucene-Solr-master-Windows\lucene\build\analysis\common\classes\java\org\apache\lucene\analysis\sr\package-info.class
    [javac] Creating empty C:\Users\jenkins\workspace\Lucene-Solr-master-Windows\lucene\build\analysis\common\classes\java\org\apache\lucene\collation\package-info.class
    [javac] Creating empty C:\Users\jenkins\workspace\Lucene-Solr-master-Windows\lucene\build\analysis\common\classes\java\org\apache\lucene\analysis\sv\package-info.class
    [javac] Creating empty C:\Users\jenkins\workspace\Lucene-Solr-master-Windows\lucene\build\analysis\common\classes\java\org\apache\lucene\analysis\bg\package-info.class
    [javac] Creating empty C:\Users\jenkins\workspace\Lucene-Solr-master-Windows\lucene\build\analysis\common\classes\java\org\apache\lucene\analysis\payloads\package-info.class
    [javac] Creating empty C:\Users\jenkins\workspace\Lucene-Solr-master-Windows\lucene\build\analysis\common\classes\java\org\apache\lucene\analysis\ngram\package-info.class
    [javac] Creating empty C:\Users\jenkins\workspace\Lucene-Solr-master-Windows\lucene\build\analysis\common\classes\java\org\apache\lucene\analysis\core\package-info.class
    [javac] Creating empty C:\Users\jenkins\workspace\Lucene-Solr-master-Windows\lucene\build\analysis\common\classes\java\org\apache\lucene\analysis\bn\package-info.class
    [javac] Creating empty C:\Users\jenkins\workspace\Lucene-Solr-master-Windows\lucene\build\analysis\common\classes\java\org\apache\lucene\analysis\fr\package-info.class
    [javac] Creating empty C:\Users\jenkins\workspace\Lucene-Solr-master-Windows\lucene\build\analysis\common\classes\java\org\tartarus\snowball\ext\package-info.class
    [javac] Creating empty C:\Users\jenkins\workspace\Lucene-Solr-master-Windows\lucene\build\analysis\common\classes\java\org\apache\lucene\analysis\br\package-info.class
    [javac] Creating empty C:\Users\jenkins\workspace\Lucene-Solr-master-Windows\lucene\build\analysis\common\classes\java\org\apache\lucene\analysis\miscellaneous\package-info.class
    [javac] Creating empty C:\Users\jenkins\workspace\Lucene-Solr-master-Windows\lucene\build\analysis\common\classes\java\org\apache\lucene\analysis\sinks\package-info.class
    [javac] Creating empty C:\Users\jenkins\workspace\Lucene-Solr-master-Windows\lucene\build\analysis\common\classes\java\org\apache\lucene\analysis\cjk\package-info.class
    [javac] Creating empty C:\Users\jenkins\workspace\Lucene-Solr-master-Windows\lucene\build\analysis\common\classes\java\org\apache\lucene\analysis\synonym\package-info.class
    [javac] Creating empty C:\Users\jenkins\workspace\Lucene-Solr-master-Windows\lucene\build\analysis\common\classes\java\org\apache\lucene\analysis\wikipedia\package-info.class
    [javac] Creating empty C:\Users\jenkins\workspace\Lucene-Solr-master-Windows\lucene\build\analysis\common\classes\java\org\apache\lucene\analysis\fa\package-info.class
    [javac] Creating empty C:\Users\jenkins\workspace\Lucene-Solr-master-Windows\lucene\build\analysis\common\classes\java\org\apache\lucene\analysis\reverse\package-info.class
    [javac] Creating empty C:\Users\jenkins\workspace\Lucene-Solr-master-Windows\lucene\build\analysis\common\classes\java\org\apache\lucene\analysis\nl\package-info.class
    [javac] Creating empty C:\Users\jenkins\workspace\Lucene-Solr-master-Windows\lucene\build\analysis\common\classes\java\org\apache\lucene\analysis\ro\package-info.class
    [javac] Creating empty C:\Users\jenkins\workspace\Lucene-Solr-master-Windows\lucene\build\analysis\common\classes\java\org\apache\lucene\analysis\fi\package-info.class
    [javac] Creating empty C:\Users\jenkins\workspace\Lucene-Solr-master-Windows\lucene\build\analysis\common\classes\java\org\apache\lucene\analysis\ru\package-info.class
    [javac] Creating empty C:\Users\jenkins\workspace\Lucene-Solr-master-Windows\lucene\build\analysis\common\classes\java\org\apache\lucene\analysis\no\package-info.class
    [javac] Creating empty C:\Users\jenkins\workspace\Lucene-Solr-master-Windows\lucene\build\analysis\common\classes\java\org\apache\lucene\analysis\el\package-info.class
    [javac] Creating empty C:\Users\jenkins\workspace\Lucene-Solr-master-Windows\lucene\build\analysis\common\classes\java\org\apache\lucene\analysis\ckb\package-info.class
    [javac] Creating empty C:\Users\jenkins\workspace\Lucene-Solr-master-Windows\lucene\build\analysis\common\classes\java\org\tartarus\snowball\package-info.class
    [javac] Creating empty C:\Users\jenkins\workspace\Lucene-Solr-master-Windows\lucene\build\analysis\common\classes\java\org\apache\lucene\analysis\in\package-info.class
    [javac] Creating empty C:\Users\jenkins\workspace\Lucene-Solr-master-Windows\lucene\build\analysis\common\classes\java\org\apache\lucene\analysis\util\package-info.class
    [javac] Creating empty C:\Users\jenkins\workspace\Lucene-Solr-master-Windows\lucene\build\analysis\common\classes\java\org\apache\lucene\analysis\it\package-info.class
    [javac] Creating empty C:\Users\jenkins\workspace\Lucene-Solr-master-Windows\lucene\build\analysis\common\classes\java\org\apache\lucene\analysis\snowball\package-info.class
    [javac] Creating empty C:\Users\jenkins\workspace\Lucene-Solr-master-Windows\lucene\build\analysis\common\classes\java\org\apache\lucene\analysis\en\package-info.class
    [javac] Creating empty C:\Users\jenkins\workspace\Lucene-Solr-master-Windows\lucene\build\analysis\common\classes\java\org\apache\lucene\analysis\es\package-info.class
    [javac] Creating empty C:\Users\jenkins\workspace\Lucene-Solr-master-Windows\lucene\build\analysis\common\classes\java\org\apache\lucene\analysis\shingle\package-info.class
    [javac] Creating empty C:\Users\jenkins\workspace\Lucene-Solr-master-Windows\lucene\build\analysis\common\classes\java\org\apache\lucene\analysis\eu\package-info.class
    [javac] Creating empty C:\Users\jenkins\workspace\Lucene-Solr-master-Windows\lucene\build\analysis\common\classes\java\org\apache\lucene\analysis\ar\package-info.class
    [javac] Creating empty C:\Users\jenkins\workspace\Lucene-Solr-master-Windows\lucene\build\analysis\common\classes\java\org\apache\lucene\analysis\query\package-info.class
    [javac] Creating empty C:\Users\jenkins\workspace\Lucene-Solr-master-Windows\lucene\build\analysis\common\classes\java\org\apache\lucene\analysis\id\package-info.class
    [javac] Creating empty C:\Users\jenkins\workspace\Lucene-Solr-master-Windows\lucene\build\analysis\common\classes\java\org\apache\lucene\analysis\compound\hyphenation\package-info.class
    [javac] Creating empty C:\Users\jenkins\workspace\Lucene-Solr-master-Windows\lucene\build\analysis\common\classes\java\org\apache\lucene\analysis\charfilter\package-info.class
    [javac] Creating empty C:\Users\jenkins\workspace\Lucene-Solr-master-Windows\lucene\build\analysis\common\classes\java\org\apache\lucene\analysis\pt\package-info.class
    [javac] Creating empty C:\Users\jenkins\workspace\Lucene-Solr-master-Windows\lucene\build\analysis\common\classes\java\org\apache\lucene\analysis\lv\package-info.class
    [javac] Creating empty C:\Users\jenkins\workspace\Lucene-Solr-master-Windows\lucene\build\analysis\common\classes\java\org\apache\lucene\analysis\lt\package-info.class
    [javac] Creating empty C:\Users\jenkins\workspace\Lucene-Solr-master-Windows\lucene\build\analysis\common\classes\java\org\apache\lucene\analysis\hu\package-info.class
    [javac] Creating empty C:\Users\jenkins\workspace\Lucene-Solr-master-Windows\lucene\build\analysis\common\classes\java\org\apache\lucene\analysis\hy\package-info.class
    [javac] Creating empty C:\Users\jenkins\workspace\Lucene-Solr-master-Windows\lucene\build\analysis\common\classes\java\org\apache\lucene\analysis\pattern\package-info.class
    [javac] Creating empty C:\Users\jenkins\workspace\Lucene-Solr-master-Windows\lucene\build\analysis\common\classes\java\org\apache\lucene\analysis\cz\package-info.class
    [javac] Creating empty C:\Users\jenkins\workspace\Lucene-Solr-master-Windows\lucene\build\analysis\common\classes\java\org\apache\lucene\analysis\th\package-info.class
    [javac] Creating empty C:\Users\jenkins\workspace\Lucene-Solr-master-Windows\lucene\build\analysis\common\classes\java\org\apache\lucene\analysis\path\package-info.class
    [javac] Creating empty C:\Users\jenkins\workspace\Lucene-Solr-master-Windows\lucene\build\analysis\common\classes\java\org\apache\lucene\analysis\tr\package-info.class
    [javac] Creating empty C:\Users\jenkins\workspace\Lucene-Solr-master-Windows\lucene\build\analysis\common\classes\java\org\apache\lucene\analysis\da\package-info.class
    [javac] Creating empty C:\Users\jenkins\workspace\Lucene-Solr-master-Windows\lucene\build\analysis\common\classes\java\org\apache\lucene\analysis\de\package-info.class
    [javac] Creating empty C:\Users\jenkins\workspace\Lucene-Solr-master-Windows\lucene\build\analysis\common\classes\java\org\apache\lucene\analysis\hi\package-info.class
    [javac] Creating empty C:\Users\jenkins\workspace\Lucene-Solr-master-Windows\lucene\build\analysis\common\classes\java\org\apache\lucene\collation\tokenattributes\package-info.class
    [javac] Creating empty C:\Users\jenkins\workspace\Lucene-Solr-master-Windows\lucene\build\analysis\common\classes\java\org\apache\lucene\analysis\gl\package-info.class
    [javac] Creating empty C:\Users\jenkins\workspace\Lucene-Solr-master-Windows\lucene\build\analysis\common\classes\java\org\apache\lucene\analysis\commongrams\package-info.class
    [javac] Creating empty C:\Users\jenkins\workspace\Lucene-Solr-master-Windows\lucene\build\analysis\common\classes\java\org\apache\lucene\analysis\compound\package-info.class
     [copy] Copying 40 files to C:\Users\jenkins\workspace\Lucene-Solr-master-Windows\lucene\build\analysis\common\classes\java

jar-core:
     [exec] Execute failed: java.io.IOException: Cannot run program "git" (in directory "C:\Users\jenkins\workspace\Lucene-Solr-master-Windows\lucene\analysis\common"): CreateProcess error=2, The system cannot find the file specified
      [jar] Building jar: C:\Users\jenkins\workspace\Lucene-Solr-master-Windows\lucene\build\analysis\common\lucene-analyzers-common-9.0.0-SNAPSHOT.jar

-check-git-state:

-git-cleanroot:

-copy-git-state:

git-autoclean:

ivy-availability-check:
[loadresource] Do not set property disallowed.ivy.jars.list as its length is 0.

-ivy-fail-disallowed-ivy-version:

ivy-fail:

ivy-configure:
[ivy:configure] :: loading settings :: file = C:\Users\jenkins\workspace\Lucene-Solr-master-Windows\lucene\top-level-ivy-settings.xml

resolve:

common.init:

compile-lucene-core:

-check-git-state:

-git-cleanroot:

-copy-git-state:

git-autoclean:

ivy-availability-check:
[loadresource] Do not set property disallowed.ivy.jars.list as its length is 0.

-ivy-fail-disallowed-ivy-version:

ivy-fail:

ivy-configure:
[ivy:configure] :: loading settings :: file = C:\Users\jenkins\workspace\Lucene-Solr-master-Windows\lucene\top-level-ivy-settings.xml

resolve:

init:

-clover.disable:

-clover.load:

-clover.classpath:

-clover.setup:

clover:

compile-core:

init:

-clover.disable:

-clover.load:

-clover.classpath:

-clover.setup:

clover:

common.compile-core:
    [mkdir] Created dir: C:\Users\jenkins\workspace\Lucene-Solr-master-Windows\lucene\build\analysis\phonetic\classes\java
    [javac] Compiling 9 source files to C:\Users\jenkins\workspace\Lucene-Solr-master-Windows\lucene\build\analysis\phonetic\classes\java
    [javac] Creating empty C:\Users\jenkins\workspace\Lucene-Solr-master-Windows\lucene\build\analysis\phonetic\classes\java\org\apache\lucene\analysis\phonetic\package-info.class
     [copy] Copying 1 file to C:\Users\jenkins\workspace\Lucene-Solr-master-Windows\lucene\build\analysis\phonetic\classes\java

compile-core:

jar-core:
     [exec] Execute failed: java.io.IOException: Cannot run program "git" (in directory "C:\Users\jenkins\workspace\Lucene-Solr-master-Windows\lucene\analysis\phonetic"): CreateProcess error=2, The system cannot find the file specified
      [jar] Building jar: C:\Users\jenkins\workspace\Lucene-Solr-master-Windows\lucene\build\analysis\phonetic\lucene-analyzers-phonetic-9.0.0-SNAPSHOT.jar

check-analyzers-kuromoji-uptodate:

jar-analyzers-kuromoji:

check-analyzers-common-uptodate:

jar-analyzers-common:

-check-git-state:

-git-cleanroot:

-copy-git-state:

git-autoclean:

ivy-availability-check:
[loadresource] Do not set property disallowed.ivy.jars.list as its length is 0.

-ivy-fail-disallowed-ivy-version:

ivy-fail:

ivy-configure:
[ivy:configure] :: loading settings :: file = C:\Users\jenkins\workspace\Lucene-Solr-master-Windows\lucene\top-level-ivy-settings.xml

resolve:

common.init:

compile-lucene-core:

-check-git-state:

-git-cleanroot:

-copy-git-state:

git-autoclean:

ivy-availability-check:
[loadresource] Do not set property disallowed.ivy.jars.list as its length is 0.

-ivy-fail-disallowed-ivy-version:

ivy-fail:

ivy-configure:
[ivy:configure] :: loading settings :: file = C:\Users\jenkins\workspace\Lucene-Solr-master-Windows\lucene\top-level-ivy-settings.xml

resolve:

init:

-clover.disable:

-clover.load:

-clover.classpath:

-clover.setup:

clover:

compile-core:

init:

-clover.disable:

-clover.load:

-clover.classpath:

-clover.setup:

clover:

common.compile-core:
    [mkdir] Created dir: C:\Users\jenkins\workspace\Lucene-Solr-master-Windows\lucene\build\analysis\kuromoji\classes\java
    [javac] Compiling 39 source files to C:\Users\jenkins\workspace\Lucene-Solr-master-Windows\lucene\build\analysis\kuromoji\classes\java
    [javac] Creating empty C:\Users\jenkins\workspace\Lucene-Solr-master-Windows\lucene\build\analysis\kuromoji\classes\java\org\apache\lucene\analysis\ja\dict\package-info.class
    [javac] Creating empty C:\Users\jenkins\workspace\Lucene-Solr-master-Windows\lucene\build\analysis\kuromoji\classes\java\org\apache\lucene\analysis\ja\package-info.class
    [javac] Creating empty C:\Users\jenkins\workspace\Lucene-Solr-master-Windows\lucene\build\analysis\kuromoji\classes\java\org\apache\lucene\analysis\ja\util\package-info.class
    [javac] Creating empty C:\Users\jenkins\workspace\Lucene-Solr-master-Windows\lucene\build\analysis\kuromoji\classes\java\org\apache\lucene\analysis\ja\tokenattributes\package-info.class
     [copy] Copying 14 files to C:\Users\jenkins\workspace\Lucene-Solr-master-Windows\lucene\build\analysis\kuromoji\classes\java

compile-core:

jar-core:
     [exec] Execute failed: java.io.IOException: Cannot run program "git" (in directory "C:\Users\jenkins\workspace\Lucene-Solr-master-Windows\lucene\analysis\kuromoji"): CreateProcess error=2, The system cannot find the file specified
      [jar] Building jar: C:\Users\jenkins\workspace\Lucene-Solr-master-Windows\lucene\build\analysis\kuromoji\lucene-analyzers-kuromoji-9.0.0-SNAPSHOT.jar

check-analyzers-nori-uptodate:

jar-analyzers-nori:

check-analyzers-common-uptodate:

jar-analyzers-common:

-check-git-state:

-git-cleanroot:

-copy-git-state:

git-autoclean:

ivy-availability-check:
[loadresource] Do not set property disallowed.ivy.jars.list as its length is 0.

-ivy-fail-disallowed-ivy-version:

ivy-fail:

ivy-configure:
[ivy:configure] :: loading settings :: file = C:\Users\jenkins\workspace\Lucene-Solr-master-Windows\lucene\top-level-ivy-settings.xml

resolve:

common.init:

compile-lucene-core:

-check-git-state:

-git-cleanroot:

-copy-git-state:

git-autoclean:

ivy-availability-check:
[loadresource] Do not set property disallowed.ivy.jars.list as its length is 0.

-ivy-fail-disallowed-ivy-version:

ivy-fail:

ivy-configure:
[ivy:configure] :: loading settings :: file = C:\Users\jenkins\workspace\Lucene-Solr-master-Windows\lucene\top-level-ivy-settings.xml

resolve:

init:

-clover.disable:

-clover.load:

-clover.classpath:

-clover.setup:

clover:

compile-core:

init:

-clover.disable:

-clover.load:

-clover.classpath:

-clover.setup:

clover:

common.compile-core:
    [mkdir] Created dir: C:\Users\jenkins\workspace\Lucene-Solr-master-Windows\lucene\build\analysis\nori\classes\java
    [javac] Compiling 29 source files to C:\Users\jenkins\workspace\Lucene-Solr-master-Windows\lucene\build\analysis\nori\classes\java
    [javac] Creating empty C:\Users\jenkins\workspace\Lucene-Solr-master-Windows\lucene\build\analysis\nori\classes\java\org\apache\lucene\analysis\ko\package-info.class
    [javac] Creating empty C:\Users\jenkins\workspace\Lucene-Solr-master-Windows\lucene\build\analysis\nori\classes\java\org\apache\lucene\analysis\ko\tokenattributes\package-info.class
    [javac] Creating empty C:\Users\jenkins\workspace\Lucene-Solr-master-Windows\lucene\build\analysis\nori\classes\java\org\apache\lucene\analysis\ko\util\package-info.class
    [javac] Creating empty C:\Users\jenkins\workspace\Lucene-Solr-master-Windows\lucene\build\analysis\nori\classes\java\org\apache\lucene\analysis\ko\dict\package-info.class
     [copy] Copying 11 files to C:\Users\jenkins\workspace\Lucene-Solr-master-Windows\lucene\build\analysis\nori\classes\java

compile-core:

jar-core:
     [exec] Execute failed: java.io.IOException: Cannot run program "git" (in directory "C:\Users\jenkins\workspace\Lucene-Solr-master-Windows\lucene\analysis\nori"): CreateProcess error=2, The system cannot find the file specified
      [jar] Building jar: C:\Users\jenkins\workspace\Lucene-Solr-master-Windows\lucene\build\analysi

[...truncated too long message...]

[junit4] OK      1.75s J0 | OverseerTaskQueueTest.testLocallyOffer
   [junit4] OK      3.24s J0 | OverseerTaskQueueTest.testDistributedQueue
   [junit4] OK      1.26s J0 | OverseerTaskQueueTest.testLeakChildWatcher
   [junit4] OK      1.19s J0 | OverseerTaskQueueTest.testContainsTaskWithRequestId
   [junit4] OK      5.26s J0 | OverseerTaskQueueTest.testDistributedQueueBlocking
   [junit4] Completed [2/5] on J0 in 29.27s, 7 tests
   [junit4] 
   [junit4] Suite: org.apache.solr.cloud.OverseerTaskQueueTest
   [junit4] OK      1.29s J0 | OverseerTaskQueueTest.testDistributedQueueCache
   [junit4] OK      2.70s J0 | OverseerTaskQueueTest.testPeekElements
   [junit4] OK      1.81s J0 | OverseerTaskQueueTest.testLocallyOffer
   [junit4] OK      3.17s J0 | OverseerTaskQueueTest.testDistributedQueue
   [junit4] OK      1.27s J0 | OverseerTaskQueueTest.testLeakChildWatcher
   [junit4] OK      1.14s J0 | OverseerTaskQueueTest.testContainsTaskWithRequestId
   [junit4] OK      5.27s J0 | OverseerTaskQueueTest.testDistributedQueueBlocking
   [junit4] Completed [3/5] on J0 in 16.86s, 7 tests
   [junit4] 
   [junit4] Suite: org.apache.solr.cloud.OverseerTaskQueueTest
   [junit4] OK      1.19s J1 | OverseerTaskQueueTest.testDistributedQueueCache
   [junit4] OK      2.77s J1 | OverseerTaskQueueTest.testPeekElements
   [junit4] OK      1.92s J1 | OverseerTaskQueueTest.testLocallyOffer
   [junit4] OK      3.16s J1 | OverseerTaskQueueTest.testDistributedQueue
   [junit4] OK      1.26s J1 | OverseerTaskQueueTest.testLeakChildWatcher
   [junit4] OK      1.14s J1 | OverseerTaskQueueTest.testContainsTaskWithRequestId
   [junit4] OK      5.52s J1 | OverseerTaskQueueTest.testDistributedQueueBlocking
   [junit4] Completed [4/5] on J1 in 17.37s, 7 tests
   [junit4] 
   [junit4] Suite: org.apache.solr.cloud.OverseerTaskQueueTest
   [junit4] OK      1.21s J0 | OverseerTaskQueueTest.testDistributedQueueCache
   [junit4] OK      2.67s J0 | OverseerTaskQueueTest.testPeekElements
   [junit4] OK      1.87s J0 | OverseerTaskQueueTest.testLocallyOffer
   [junit4] OK      3.16s J0 | OverseerTaskQueueTest.testDistributedQueue
   [junit4] OK      1.28s J0 | OverseerTaskQueueTest.testLeakChildWatcher
   [junit4] OK      1.15s J0 | OverseerTaskQueueTest.testContainsTaskWithRequestId
   [junit4] OK      5.24s J0 | OverseerTaskQueueTest.testDistributedQueueBlocking
   [junit4] Completed [5/5] on J0 in 16.79s, 7 tests
   [junit4] 
   [junit4] JVM J0:     1.87 ..    66.52 =    64.65s
   [junit4] JVM J1:     1.69 ..    50.16 =    48.47s
   [junit4] Execution time total: 1 minute 6 seconds
   [junit4] Tests summary: 5 suites, 35 tests
   [junit4] Could not remove temporary path: C:\Users\jenkins\workspace\Lucene-Solr-master-Windows\solr\build\solr-core\test\J0 (java.nio.file.DirectoryNotEmptyException: Remaining files: [C:\Users\jenkins\workspace\Lucene-Solr-master-Windows\solr\build\solr-core\test\J0\temp])
   [junit4] Could not remove temporary path: C:\Users\jenkins\workspace\Lucene-Solr-master-Windows\solr\build\solr-core\test\J1 (java.nio.file.DirectoryNotEmptyException: Remaining files: [C:\Users\jenkins\workspace\Lucene-Solr-master-Windows\solr\build\solr-core\test\J1\temp])
     [echo] 5 slowest tests:
[junit4:tophints] 277.17s | org.apache.solr.cloud.api.collections.ShardSplitTest
[junit4:tophints] 269.33s | org.apache.solr.cloud.autoscaling.IndexSizeTriggerTest
[junit4:tophints] 128.72s | org.apache.solr.search.facet.TestJsonFacets
[junit4:tophints] 122.51s | org.apache.solr.handler.TestReplicationHandler
[junit4:tophints] 112.06s | org.apache.solr.update.processor.CategoryRoutedAliasUpdateProcessorTest

-check-totals:
WARNING: An illegal reflective access operation has occurred
WARNING: Illegal reflective access by org.codehaus.groovy.reflection.CachedClass (file:/C:/Users/jenkins/.ivy2/cache/org.codehaus.groovy/groovy-all/jars/groovy-all-2.4.16.jar) to method java.lang.Object.finalize()
WARNING: Please consider reporting this to the maintainers of org.codehaus.groovy.reflection.CachedClass
WARNING: Use --illegal-access=warn to enable warnings of further illegal reflective access operations
WARNING: All illegal access operations will be denied in a future release

test-nocompile:

BUILD SUCCESSFUL
Total time: 1 minute 12 seconds
[repro] Failures:
[repro]   0/5 failed: org.apache.solr.cloud.OverseerTaskQueueTest
[repro]   0/5 failed: org.apache.solr.prometheus.exporter.SolrExporterIntegrationTest
[repro] Exiting with code 0

C:\Users\jenkins\workspace\Lucene-Solr-master-Windows>IF EXIST lucene\build move /y lucene\build lucene\build.repro 
        1 dir(s) moved.

C:\Users\jenkins\workspace\Lucene-Solr-master-Windows>IF EXIST solr\build move /y solr\build solr\build.repro 
        1 dir(s) moved.

C:\Users\jenkins\workspace\Lucene-Solr-master-Windows>IF EXIST lucene\build.orig move /y lucene\build.orig lucene\build 
        1 dir(s) moved.

C:\Users\jenkins\workspace\Lucene-Solr-master-Windows>IF EXIST solr\build.orig move /y solr\build.orig solr\build 
        1 dir(s) moved.

C:\Users\jenkins\workspace\Lucene-Solr-master-Windows>exit 0 
Archiving artifacts
Setting ANT_1_8_2_HOME=C:\Users\jenkins\tools\hudson.tasks.Ant_AntInstallation\ANT_1.8.2
java.lang.InterruptedException: no matches found within 10000
	at hudson.FilePath$ValidateAntFileMask.hasMatch(FilePath.java:2805)
	at hudson.FilePath$ValidateAntFileMask.invoke(FilePath.java:2684)
	at hudson.FilePath$ValidateAntFileMask.invoke(FilePath.java:2665)
	at hudson.FilePath$FileCallableWrapper.call(FilePath.java:3052)
Also:   hudson.remoting.Channel$CallSiteStackTrace: Remote call to Windows VBOX
		at hudson.remoting.Channel.attachCallSiteStackTrace(Channel.java:1743)
		at hudson.remoting.UserRequest$ExceptionResponse.retrieve(UserRequest.java:357)
		at hudson.remoting.Channel.call(Channel.java:957)
		at hudson.FilePath.act(FilePath.java:1072)
		at hudson.FilePath.act(FilePath.java:1061)
		at hudson.FilePath.validateAntFileMask(FilePath.java:2663)
		at hudson.tasks.ArtifactArchiver.perform(ArtifactArchiver.java:248)
		at hudson.tasks.BuildStepCompatibilityLayer.perform(BuildStepCompatibilityLayer.java:79)
		at hudson.tasks.BuildStepMonitor$1.perform(BuildStepMonitor.java:20)
		at hudson.model.AbstractBuild$AbstractBuildExecution.perform(AbstractBuild.java:741)
		at hudson.model.AbstractBuild$AbstractBuildExecution.performAllBuildSteps(AbstractBuild.java:690)
		at hudson.model.Build$BuildExecution.post2(Build.java:186)
		at hudson.model.AbstractBuild$AbstractBuildExecution.post(AbstractBuild.java:635)
		at hudson.model.Run.execute(Run.java:1843)
		at hudson.model.FreeStyleBuild.run(FreeStyleBuild.java:43)
		at hudson.model.ResourceController.execute(ResourceController.java:97)
		at hudson.model.Executor.run(Executor.java:429)
Caused: hudson.FilePath$TunneledInterruptedException
	at hudson.FilePath$FileCallableWrapper.call(FilePath.java:3054)
	at hudson.remoting.UserRequest.perform(UserRequest.java:212)
	at hudson.remoting.UserRequest.perform(UserRequest.java:54)
	at hudson.remoting.Request$2.run(Request.java:369)
	at hudson.remoting.InterceptingExecutorService$1.call(InterceptingExecutorService.java:72)
	at java.util.concurrent.FutureTask.run(Unknown Source)
	at java.util.concurrent.ThreadPoolExecutor.runWorker(Unknown Source)
	at java.util.concurrent.ThreadPoolExecutor$Worker.run(Unknown Source)
	at java.lang.Thread.run(Unknown Source)
Caused: java.lang.InterruptedException: java.lang.InterruptedException: no matches found within 10000
	at hudson.FilePath.act(FilePath.java:1074)
	at hudson.FilePath.act(FilePath.java:1061)
	at hudson.FilePath.validateAntFileMask(FilePath.java:2663)
	at hudson.tasks.ArtifactArchiver.perform(ArtifactArchiver.java:248)
	at hudson.tasks.BuildStepCompatibilityLayer.perform(BuildStepCompatibilityLayer.java:79)
	at hudson.tasks.BuildStepMonitor$1.perform(BuildStepMonitor.java:20)
	at hudson.model.AbstractBuild$AbstractBuildExecution.perform(AbstractBuild.java:741)
	at hudson.model.AbstractBuild$AbstractBuildExecution.performAllBuildSteps(AbstractBuild.java:690)
	at hudson.model.Build$BuildExecution.post2(Build.java:186)
	at hudson.model.AbstractBuild$AbstractBuildExecution.post(AbstractBuild.java:635)
	at hudson.model.Run.execute(Run.java:1843)
	at hudson.model.FreeStyleBuild.run(FreeStyleBuild.java:43)
	at hudson.model.ResourceController.execute(ResourceController.java:97)
	at hudson.model.Executor.run(Executor.java:429)
No artifacts found that match the file pattern "**/*.events,heapdumps/**,**/*_pid*.log". Configuration error?
[WARNINGS] Parsing warnings in console log with parser Java Compiler (javac)
Setting ANT_1_8_2_HOME=C:\Users\jenkins\tools\hudson.tasks.Ant_AntInstallation\ANT_1.8.2
No credentials specified
Setting ANT_1_8_2_HOME=C:\Users\jenkins\tools\hudson.tasks.Ant_AntInstallation\ANT_1.8.2
<Git Blamer> Using GitBlamer to create author and commit information for all warnings.
<Git Blamer> GIT_COMMIT=90e0d1eba10b3d611b2f8692f57e33beb91823b0, workspace=C:\Users\jenkins\workspace\Lucene-Solr-master-Windows
[WARNINGS] Computing warning deltas based on reference build #7964
Recording test results
Setting ANT_1_8_2_HOME=C:\Users\jenkins\tools\hudson.tasks.Ant_AntInstallation\ANT_1.8.2
Build step 'Publish JUnit test result report' changed build result to UNSTABLE
Email was triggered for: Unstable (Test Failures)
Sending email for trigger: Unstable (Test Failures)
Setting ANT_1_8_2_HOME=C:\Users\jenkins\tools\hudson.tasks.Ant_AntInstallation\ANT_1.8.2
Setting ANT_1_8_2_HOME=C:\Users\jenkins\tools\hudson.tasks.Ant_AntInstallation\ANT_1.8.2
Setting ANT_1_8_2_HOME=C:\Users\jenkins\tools\hudson.tasks.Ant_AntInstallation\ANT_1.8.2
Setting ANT_1_8_2_HOME=C:\Users\jenkins\tools\hudson.tasks.Ant_AntInstallation\ANT_1.8.2
Setting ANT_1_8_2_HOME=C:\Users\jenkins\tools\hudson.tasks.Ant_AntInstallation\ANT_1.8.2
Setting ANT_1_8_2_HOME=C:\Users\jenkins\tools\hudson.tasks.Ant_AntInstallation\ANT_1.8.2

Mime
View raw message