lucene-dev mailing list archives

Site index · List index
Message view « Date » · « Thread »
Top « Date » · « Thread »
From Apache Jenkins Server <jenk...@builds.apache.org>
Subject [JENKINS] Lucene-Solr-NightlyTests-8.x - Build # 91 - Failure
Date Sun, 05 May 2019 15:49:47 GMT
Build: https://builds.apache.org/job/Lucene-Solr-NightlyTests-8.x/91/

9 tests failed.
FAILED:  org.apache.solr.cloud.RollingRestartTest.test

Error Message:
Timeout occurred while waiting response from server at: http://127.0.0.1:44734

Stack Trace:
org.apache.solr.client.solrj.SolrServerException: Timeout occurred while waiting response from server at: http://127.0.0.1:44734
	at __randomizedtesting.SeedInfo.seed([DCE78960684CF7B7:54B3B6BAC6B09A4F]:0)
	at org.apache.solr.client.solrj.impl.HttpSolrClient.executeMethod(HttpSolrClient.java:660)
	at org.apache.solr.client.solrj.impl.HttpSolrClient.request(HttpSolrClient.java:255)
	at org.apache.solr.client.solrj.impl.HttpSolrClient.request(HttpSolrClient.java:244)
	at org.apache.solr.client.solrj.impl.LBSolrClient.doRequest(LBSolrClient.java:368)
	at org.apache.solr.client.solrj.impl.LBSolrClient.request(LBSolrClient.java:296)
	at org.apache.solr.client.solrj.impl.BaseCloudSolrClient.sendRequest(BaseCloudSolrClient.java:1068)
	at org.apache.solr.client.solrj.impl.BaseCloudSolrClient.requestWithRetryOnStaleState(BaseCloudSolrClient.java:837)
	at org.apache.solr.client.solrj.impl.BaseCloudSolrClient.request(BaseCloudSolrClient.java:769)
	at org.apache.solr.client.solrj.SolrRequest.process(SolrRequest.java:207)
	at org.apache.solr.client.solrj.SolrRequest.process(SolrRequest.java:224)
	at org.apache.solr.cloud.RollingRestartTest.restartWithRolesTest(RollingRestartTest.java:74)
	at org.apache.solr.cloud.RollingRestartTest.test(RollingRestartTest.java:53)
	at sun.reflect.NativeMethodAccessorImpl.invoke0(Native Method)
	at sun.reflect.NativeMethodAccessorImpl.invoke(NativeMethodAccessorImpl.java:62)
	at sun.reflect.DelegatingMethodAccessorImpl.invoke(DelegatingMethodAccessorImpl.java:43)
	at java.lang.reflect.Method.invoke(Method.java:498)
	at com.carrotsearch.randomizedtesting.RandomizedRunner.invoke(RandomizedRunner.java:1750)
	at com.carrotsearch.randomizedtesting.RandomizedRunner$8.evaluate(RandomizedRunner.java:938)
	at com.carrotsearch.randomizedtesting.RandomizedRunner$9.evaluate(RandomizedRunner.java:974)
	at com.carrotsearch.randomizedtesting.RandomizedRunner$10.evaluate(RandomizedRunner.java:988)
	at org.apache.solr.BaseDistributedSearchTestCase$ShardsRepeatRule$ShardsFixedStatement.callStatement(BaseDistributedSearchTestCase.java:1082)
	at org.apache.solr.BaseDistributedSearchTestCase$ShardsRepeatRule$ShardsStatement.evaluate(BaseDistributedSearchTestCase.java:1054)
	at com.carrotsearch.randomizedtesting.rules.SystemPropertiesRestoreRule$1.evaluate(SystemPropertiesRestoreRule.java:57)
	at org.apache.lucene.util.TestRuleSetupTeardownChained$1.evaluate(TestRuleSetupTeardownChained.java:49)
	at org.apache.lucene.util.AbstractBeforeAfterRule$1.evaluate(AbstractBeforeAfterRule.java:45)
	at org.apache.lucene.util.TestRuleThreadAndTestName$1.evaluate(TestRuleThreadAndTestName.java:48)
	at org.apache.lucene.util.TestRuleIgnoreAfterMaxFailures$1.evaluate(TestRuleIgnoreAfterMaxFailures.java:64)
	at org.apache.lucene.util.TestRuleMarkFailure$1.evaluate(TestRuleMarkFailure.java:47)
	at com.carrotsearch.randomizedtesting.rules.StatementAdapter.evaluate(StatementAdapter.java:36)
	at com.carrotsearch.randomizedtesting.ThreadLeakControl$StatementRunner.run(ThreadLeakControl.java:368)
	at com.carrotsearch.randomizedtesting.ThreadLeakControl.forkTimeoutingTask(ThreadLeakControl.java:817)
	at com.carrotsearch.randomizedtesting.ThreadLeakControl$3.evaluate(ThreadLeakControl.java:468)
	at com.carrotsearch.randomizedtesting.RandomizedRunner.runSingleTest(RandomizedRunner.java:947)
	at com.carrotsearch.randomizedtesting.RandomizedRunner$5.evaluate(RandomizedRunner.java:832)
	at com.carrotsearch.randomizedtesting.RandomizedRunner$6.evaluate(RandomizedRunner.java:883)
	at com.carrotsearch.randomizedtesting.RandomizedRunner$7.evaluate(RandomizedRunner.java:894)
	at com.carrotsearch.randomizedtesting.rules.StatementAdapter.evaluate(StatementAdapter.java:36)
	at com.carrotsearch.randomizedtesting.rules.SystemPropertiesRestoreRule$1.evaluate(SystemPropertiesRestoreRule.java:57)
	at org.apache.lucene.util.AbstractBeforeAfterRule$1.evaluate(AbstractBeforeAfterRule.java:45)
	at com.carrotsearch.randomizedtesting.rules.StatementAdapter.evaluate(StatementAdapter.java:36)
	at org.apache.lucene.util.TestRuleStoreClassName$1.evaluate(TestRuleStoreClassName.java:41)
	at com.carrotsearch.randomizedtesting.rules.NoShadowingOrOverridesOnMethodsRule$1.evaluate(NoShadowingOrOverridesOnMethodsRule.java:40)
	at com.carrotsearch.randomizedtesting.rules.NoShadowingOrOverridesOnMethodsRule$1.evaluate(NoShadowingOrOverridesOnMethodsRule.java:40)
	at com.carrotsearch.randomizedtesting.rules.StatementAdapter.evaluate(StatementAdapter.java:36)
	at com.carrotsearch.randomizedtesting.rules.StatementAdapter.evaluate(StatementAdapter.java:36)
	at com.carrotsearch.randomizedtesting.rules.StatementAdapter.evaluate(StatementAdapter.java:36)
	at org.apache.lucene.util.TestRuleAssertionsRequired$1.evaluate(TestRuleAssertionsRequired.java:53)
	at org.apache.lucene.util.TestRuleMarkFailure$1.evaluate(TestRuleMarkFailure.java:47)
	at org.apache.lucene.util.TestRuleIgnoreAfterMaxFailures$1.evaluate(TestRuleIgnoreAfterMaxFailures.java:64)
	at org.apache.lucene.util.TestRuleIgnoreTestSuites$1.evaluate(TestRuleIgnoreTestSuites.java:54)
	at com.carrotsearch.randomizedtesting.rules.StatementAdapter.evaluate(StatementAdapter.java:36)
	at com.carrotsearch.randomizedtesting.ThreadLeakControl$StatementRunner.run(ThreadLeakControl.java:368)
	at java.lang.Thread.run(Thread.java:748)
Caused by: java.net.SocketTimeoutException: Read timed out
	at java.net.SocketInputStream.socketRead0(Native Method)
	at java.net.SocketInputStream.socketRead(SocketInputStream.java:116)
	at java.net.SocketInputStream.read(SocketInputStream.java:171)
	at java.net.SocketInputStream.read(SocketInputStream.java:141)
	at org.apache.http.impl.io.SessionInputBufferImpl.streamRead(SessionInputBufferImpl.java:137)
	at org.apache.http.impl.io.SessionInputBufferImpl.fillBuffer(SessionInputBufferImpl.java:153)
	at org.apache.http.impl.io.SessionInputBufferImpl.readLine(SessionInputBufferImpl.java:282)
	at org.apache.http.impl.conn.DefaultHttpResponseParser.parseHead(DefaultHttpResponseParser.java:138)
	at org.apache.http.impl.conn.DefaultHttpResponseParser.parseHead(DefaultHttpResponseParser.java:56)
	at org.apache.http.impl.io.AbstractMessageParser.parse(AbstractMessageParser.java:259)
	at org.apache.http.impl.DefaultBHttpClientConnection.receiveResponseHeader(DefaultBHttpClientConnection.java:163)
	at org.apache.http.impl.conn.CPoolProxy.receiveResponseHeader(CPoolProxy.java:165)
	at org.apache.http.protocol.HttpRequestExecutor.doReceiveResponse(HttpRequestExecutor.java:273)
	at org.apache.http.protocol.HttpRequestExecutor.execute(HttpRequestExecutor.java:125)
	at org.apache.http.impl.execchain.MainClientExec.execute(MainClientExec.java:272)
	at org.apache.http.impl.execchain.ProtocolExec.execute(ProtocolExec.java:185)
	at org.apache.http.impl.execchain.RetryExec.execute(RetryExec.java:89)
	at org.apache.http.impl.execchain.RedirectExec.execute(RedirectExec.java:110)
	at org.apache.http.impl.client.InternalHttpClient.doExecute(InternalHttpClient.java:185)
	at org.apache.http.impl.client.CloseableHttpClient.execute(CloseableHttpClient.java:83)
	at org.apache.http.impl.client.CloseableHttpClient.execute(CloseableHttpClient.java:56)
	at org.apache.solr.client.solrj.impl.HttpSolrClient.executeMethod(HttpSolrClient.java:548)
	... 52 more


FAILED:  org.apache.solr.core.TestSolrDeletionPolicy1.testNumCommitsConfigured

Error Message:


Stack Trace:
java.lang.AssertionError
	at __randomizedtesting.SeedInfo.seed([DCE78960684CF7B7:1E21EB7A442D77]:0)
	at org.junit.Assert.fail(Assert.java:86)
	at org.junit.Assert.assertTrue(Assert.java:41)
	at org.junit.Assert.assertTrue(Assert.java:52)
	at org.apache.solr.core.TestSolrDeletionPolicy1.testNumCommitsConfigured(TestSolrDeletionPolicy1.java:108)
	at sun.reflect.NativeMethodAccessorImpl.invoke0(Native Method)
	at sun.reflect.NativeMethodAccessorImpl.invoke(NativeMethodAccessorImpl.java:62)
	at sun.reflect.DelegatingMethodAccessorImpl.invoke(DelegatingMethodAccessorImpl.java:43)
	at java.lang.reflect.Method.invoke(Method.java:498)
	at com.carrotsearch.randomizedtesting.RandomizedRunner.invoke(RandomizedRunner.java:1750)
	at com.carrotsearch.randomizedtesting.RandomizedRunner$8.evaluate(RandomizedRunner.java:938)
	at com.carrotsearch.randomizedtesting.RandomizedRunner$9.evaluate(RandomizedRunner.java:974)
	at com.carrotsearch.randomizedtesting.RandomizedRunner$10.evaluate(RandomizedRunner.java:988)
	at com.carrotsearch.randomizedtesting.rules.SystemPropertiesRestoreRule$1.evaluate(SystemPropertiesRestoreRule.java:57)
	at org.apache.lucene.util.TestRuleSetupTeardownChained$1.evaluate(TestRuleSetupTeardownChained.java:49)
	at org.apache.lucene.util.AbstractBeforeAfterRule$1.evaluate(AbstractBeforeAfterRule.java:45)
	at org.apache.lucene.util.TestRuleThreadAndTestName$1.evaluate(TestRuleThreadAndTestName.java:48)
	at org.apache.lucene.util.TestRuleIgnoreAfterMaxFailures$1.evaluate(TestRuleIgnoreAfterMaxFailures.java:64)
	at org.apache.lucene.util.TestRuleMarkFailure$1.evaluate(TestRuleMarkFailure.java:47)
	at com.carrotsearch.randomizedtesting.rules.StatementAdapter.evaluate(StatementAdapter.java:36)
	at com.carrotsearch.randomizedtesting.ThreadLeakControl$StatementRunner.run(ThreadLeakControl.java:368)
	at com.carrotsearch.randomizedtesting.ThreadLeakControl.forkTimeoutingTask(ThreadLeakControl.java:817)
	at com.carrotsearch.randomizedtesting.ThreadLeakControl$3.evaluate(ThreadLeakControl.java:468)
	at com.carrotsearch.randomizedtesting.RandomizedRunner.runSingleTest(RandomizedRunner.java:947)
	at com.carrotsearch.randomizedtesting.RandomizedRunner$5.evaluate(RandomizedRunner.java:832)
	at com.carrotsearch.randomizedtesting.RandomizedRunner$6.evaluate(RandomizedRunner.java:883)
	at com.carrotsearch.randomizedtesting.RandomizedRunner$7.evaluate(RandomizedRunner.java:894)
	at com.carrotsearch.randomizedtesting.rules.StatementAdapter.evaluate(StatementAdapter.java:36)
	at com.carrotsearch.randomizedtesting.rules.SystemPropertiesRestoreRule$1.evaluate(SystemPropertiesRestoreRule.java:57)
	at org.apache.lucene.util.AbstractBeforeAfterRule$1.evaluate(AbstractBeforeAfterRule.java:45)
	at com.carrotsearch.randomizedtesting.rules.StatementAdapter.evaluate(StatementAdapter.java:36)
	at org.apache.lucene.util.TestRuleStoreClassName$1.evaluate(TestRuleStoreClassName.java:41)
	at com.carrotsearch.randomizedtesting.rules.NoShadowingOrOverridesOnMethodsRule$1.evaluate(NoShadowingOrOverridesOnMethodsRule.java:40)
	at com.carrotsearch.randomizedtesting.rules.NoShadowingOrOverridesOnMethodsRule$1.evaluate(NoShadowingOrOverridesOnMethodsRule.java:40)
	at com.carrotsearch.randomizedtesting.rules.StatementAdapter.evaluate(StatementAdapter.java:36)
	at com.carrotsearch.randomizedtesting.rules.StatementAdapter.evaluate(StatementAdapter.java:36)
	at com.carrotsearch.randomizedtesting.rules.StatementAdapter.evaluate(StatementAdapter.java:36)
	at org.apache.lucene.util.TestRuleAssertionsRequired$1.evaluate(TestRuleAssertionsRequired.java:53)
	at org.apache.lucene.util.TestRuleMarkFailure$1.evaluate(TestRuleMarkFailure.java:47)
	at org.apache.lucene.util.TestRuleIgnoreAfterMaxFailures$1.evaluate(TestRuleIgnoreAfterMaxFailures.java:64)
	at org.apache.lucene.util.TestRuleIgnoreTestSuites$1.evaluate(TestRuleIgnoreTestSuites.java:54)
	at com.carrotsearch.randomizedtesting.rules.StatementAdapter.evaluate(StatementAdapter.java:36)
	at com.carrotsearch.randomizedtesting.ThreadLeakControl$StatementRunner.run(ThreadLeakControl.java:368)
	at java.lang.Thread.run(Thread.java:748)


FAILED:  org.apache.solr.uninverting.TestDocTermOrdsUninvertLimit.testTriggerUnInvertLimit

Error Message:
GC overhead limit exceeded

Stack Trace:
java.lang.OutOfMemoryError: GC overhead limit exceeded
	at __randomizedtesting.SeedInfo.seed([DCE78960684CF7B7:EF55A1A465FB2D00]:0)
	at org.apache.lucene.util.packed.DeltaPackedLongValues$Builder.<init>(DeltaPackedLongValues.java:59)
	at org.apache.lucene.util.packed.PackedLongValues.deltaPackedBuilder(PackedLongValues.java:53)
	at org.apache.lucene.util.packed.PackedLongValues.deltaPackedBuilder(PackedLongValues.java:58)
	at org.apache.lucene.index.NormValuesWriter.<init>(NormValuesWriter.java:42)
	at org.apache.lucene.index.DefaultIndexingChain$PerField.setInvertState(DefaultIndexingChain.java:750)
	at org.apache.lucene.index.DefaultIndexingChain$PerField.<init>(DefaultIndexingChain.java:740)
	at org.apache.lucene.index.DefaultIndexingChain.getOrAddField(DefaultIndexingChain.java:670)
	at org.apache.lucene.index.DefaultIndexingChain.processField(DefaultIndexingChain.java:440)
	at org.apache.lucene.index.DefaultIndexingChain.processDocument(DefaultIndexingChain.java:406)
	at org.apache.lucene.index.DocumentsWriterPerThread.updateDocument(DocumentsWriterPerThread.java:250)
	at org.apache.lucene.index.DocumentsWriter.updateDocument(DocumentsWriter.java:494)
	at org.apache.lucene.index.IndexWriter.updateDocument(IndexWriter.java:1594)
	at org.apache.lucene.index.IndexWriter.addDocument(IndexWriter.java:1213)
	at org.apache.lucene.index.RandomIndexWriter.addDocument(RandomIndexWriter.java:191)
	at org.apache.solr.uninverting.TestDocTermOrdsUninvertLimit.testTriggerUnInvertLimit(TestDocTermOrdsUninvertLimit.java:65)
	at sun.reflect.NativeMethodAccessorImpl.invoke0(Native Method)
	at sun.reflect.NativeMethodAccessorImpl.invoke(NativeMethodAccessorImpl.java:62)
	at sun.reflect.DelegatingMethodAccessorImpl.invoke(DelegatingMethodAccessorImpl.java:43)
	at java.lang.reflect.Method.invoke(Method.java:498)
	at com.carrotsearch.randomizedtesting.RandomizedRunner.invoke(RandomizedRunner.java:1750)
	at com.carrotsearch.randomizedtesting.RandomizedRunner$8.evaluate(RandomizedRunner.java:938)
	at com.carrotsearch.randomizedtesting.RandomizedRunner$9.evaluate(RandomizedRunner.java:974)
	at com.carrotsearch.randomizedtesting.RandomizedRunner$10.evaluate(RandomizedRunner.java:988)
	at org.apache.lucene.util.TestRuleSetupTeardownChained$1.evaluate(TestRuleSetupTeardownChained.java:49)
	at org.apache.lucene.util.AbstractBeforeAfterRule$1.evaluate(AbstractBeforeAfterRule.java:45)
	at org.apache.lucene.util.TestRuleThreadAndTestName$1.evaluate(TestRuleThreadAndTestName.java:48)
	at org.apache.lucene.util.TestRuleIgnoreAfterMaxFailures$1.evaluate(TestRuleIgnoreAfterMaxFailures.java:64)
	at org.apache.lucene.util.TestRuleMarkFailure$1.evaluate(TestRuleMarkFailure.java:47)
	at com.carrotsearch.randomizedtesting.rules.StatementAdapter.evaluate(StatementAdapter.java:36)
	at com.carrotsearch.randomizedtesting.ThreadLeakControl$StatementRunner.run(ThreadLeakControl.java:368)
	at com.carrotsearch.randomizedtesting.ThreadLeakControl.forkTimeoutingTask(ThreadLeakControl.java:817)
	at com.carrotsearch.randomizedtesting.ThreadLeakControl$3.evaluate(ThreadLeakControl.java:468)


FAILED:  junit.framework.TestSuite.org.apache.solr.uninverting.TestDocTermOrdsUninvertLimit

Error Message:
Captured an uncaught exception in thread: Thread[id=2536, name=Lucene Merge Thread #150, state=RUNNABLE, group=TGRP-TestDocTermOrdsUninvertLimit]

Stack Trace:
com.carrotsearch.randomizedtesting.UncaughtExceptionError: Captured an uncaught exception in thread: Thread[id=2536, name=Lucene Merge Thread #150, state=RUNNABLE, group=TGRP-TestDocTermOrdsUninvertLimit]
Caused by: org.apache.lucene.index.MergePolicy$MergeException: java.lang.OutOfMemoryError: Java heap space
	at __randomizedtesting.SeedInfo.seed([DCE78960684CF7B7]:0)
	at org.apache.lucene.index.ConcurrentMergeScheduler.handleMergeException(ConcurrentMergeScheduler.java:704)
	at org.apache.lucene.index.ConcurrentMergeScheduler$MergeThread.run(ConcurrentMergeScheduler.java:684)
Caused by: java.lang.OutOfMemoryError: Java heap space
	at org.apache.lucene.codecs.memory.DirectPostingsFormat$DirectField.<init>(DirectPostingsFormat.java:420)
	at org.apache.lucene.codecs.memory.DirectPostingsFormat$DirectFields.<init>(DirectPostingsFormat.java:132)
	at org.apache.lucene.codecs.memory.DirectPostingsFormat.fieldsProducer(DirectPostingsFormat.java:116)
	at org.apache.lucene.codecs.perfield.PerFieldPostingsFormat$FieldsReader.<init>(PerFieldPostingsFormat.java:288)
	at org.apache.lucene.codecs.perfield.PerFieldPostingsFormat.fieldsProducer(PerFieldPostingsFormat.java:368)
	at org.apache.lucene.index.SegmentCoreReaders.<init>(SegmentCoreReaders.java:114)
	at org.apache.lucene.index.SegmentReader.<init>(SegmentReader.java:84)
	at org.apache.lucene.index.ReadersAndUpdates.getReader(ReadersAndUpdates.java:177)
	at org.apache.lucene.index.IndexWriter.mergeMiddle(IndexWriter.java:4607)
	at org.apache.lucene.index.IndexWriter.merge(IndexWriter.java:4056)
	at org.apache.lucene.index.ConcurrentMergeScheduler.doMerge(ConcurrentMergeScheduler.java:625)
	at org.apache.lucene.index.ConcurrentMergeScheduler$MergeThread.run(ConcurrentMergeScheduler.java:662)


FAILED:  junit.framework.TestSuite.org.apache.solr.uninverting.TestDocTermOrdsUninvertLimit

Error Message:
Captured an uncaught exception in thread: Thread[id=2543, name=Lucene Merge Thread #157, state=RUNNABLE, group=TGRP-TestDocTermOrdsUninvertLimit]

Stack Trace:
com.carrotsearch.randomizedtesting.UncaughtExceptionError: Captured an uncaught exception in thread: Thread[id=2543, name=Lucene Merge Thread #157, state=RUNNABLE, group=TGRP-TestDocTermOrdsUninvertLimit]
Caused by: org.apache.lucene.index.MergePolicy$MergeException: java.lang.IllegalStateException: this writer hit an unrecoverable error; cannot complete merge
	at __randomizedtesting.SeedInfo.seed([DCE78960684CF7B7]:0)
	at org.apache.lucene.index.ConcurrentMergeScheduler.handleMergeException(ConcurrentMergeScheduler.java:704)
	at org.apache.lucene.index.ConcurrentMergeScheduler$MergeThread.run(ConcurrentMergeScheduler.java:684)
Caused by: java.lang.IllegalStateException: this writer hit an unrecoverable error; cannot complete merge
	at org.apache.lucene.index.IndexWriter.commitMerge(IndexWriter.java:3879)
	at org.apache.lucene.index.IndexWriter.mergeMiddle(IndexWriter.java:4618)
	at org.apache.lucene.index.IndexWriter.merge(IndexWriter.java:4056)
	at org.apache.lucene.index.ConcurrentMergeScheduler.doMerge(ConcurrentMergeScheduler.java:625)
	at org.apache.lucene.index.ConcurrentMergeScheduler$MergeThread.run(ConcurrentMergeScheduler.java:662)
Caused by: java.lang.OutOfMemoryError: GC overhead limit exceeded
	at __randomizedtesting.SeedInfo.seed([DCE78960684CF7B7:EF55A1A465FB2D00]:0)
	at org.apache.lucene.util.packed.DeltaPackedLongValues$Builder.<init>(DeltaPackedLongValues.java:59)
	at org.apache.lucene.util.packed.PackedLongValues.deltaPackedBuilder(PackedLongValues.java:53)
	at org.apache.lucene.util.packed.PackedLongValues.deltaPackedBuilder(PackedLongValues.java:58)
	at org.apache.lucene.index.NormValuesWriter.<init>(NormValuesWriter.java:42)
	at org.apache.lucene.index.DefaultIndexingChain$PerField.setInvertState(DefaultIndexingChain.java:750)
	at org.apache.lucene.index.DefaultIndexingChain$PerField.<init>(DefaultIndexingChain.java:740)
	at org.apache.lucene.index.DefaultIndexingChain.getOrAddField(DefaultIndexingChain.java:670)
	at org.apache.lucene.index.DefaultIndexingChain.processField(DefaultIndexingChain.java:440)
	at org.apache.lucene.index.DefaultIndexingChain.processDocument(DefaultIndexingChain.java:406)
	at org.apache.lucene.index.DocumentsWriterPerThread.updateDocument(DocumentsWriterPerThread.java:250)
	at org.apache.lucene.index.DocumentsWriter.updateDocument(DocumentsWriter.java:494)
	at org.apache.lucene.index.IndexWriter.updateDocument(IndexWriter.java:1594)
	at org.apache.lucene.index.IndexWriter.addDocument(IndexWriter.java:1213)
	at org.apache.lucene.index.RandomIndexWriter.addDocument(RandomIndexWriter.java:191)
	at org.apache.solr.uninverting.TestDocTermOrdsUninvertLimit.testTriggerUnInvertLimit(TestDocTermOrdsUninvertLimit.java:65)
	at sun.reflect.NativeMethodAccessorImpl.invoke0(Native Method)
	at sun.reflect.NativeMethodAccessorImpl.invoke(NativeMethodAccessorImpl.java:62)
	at sun.reflect.DelegatingMethodAccessorImpl.invoke(DelegatingMethodAccessorImpl.java:43)
	at java.lang.reflect.Method.invoke(Method.java:498)
	at com.carrotsearch.randomizedtesting.RandomizedRunner.invoke(RandomizedRunner.java:1750)
	at com.carrotsearch.randomizedtesting.RandomizedRunner$8.evaluate(RandomizedRunner.java:938)
	at com.carrotsearch.randomizedtesting.RandomizedRunner$9.evaluate(RandomizedRunner.java:974)
	at com.carrotsearch.randomizedtesting.RandomizedRunner$10.evaluate(RandomizedRunner.java:988)
	at org.apache.lucene.util.TestRuleSetupTeardownChained$1.evaluate(TestRuleSetupTeardownChained.java:49)
	at org.apache.lucene.util.AbstractBeforeAfterRule$1.evaluate(AbstractBeforeAfterRule.java:45)
	at org.apache.lucene.util.TestRuleThreadAndTestName$1.evaluate(TestRuleThreadAndTestName.java:48)
	at org.apache.lucene.util.TestRuleIgnoreAfterMaxFailures$1.evaluate(TestRuleIgnoreAfterMaxFailures.java:64)
	at org.apache.lucene.util.TestRuleMarkFailure$1.evaluate(TestRuleMarkFailure.java:47)
	at com.carrotsearch.randomizedtesting.rules.StatementAdapter.evaluate(StatementAdapter.java:36)
	at com.carrotsearch.randomizedtesting.ThreadLeakControl$StatementRunner.run(ThreadLeakControl.java:368)
	at com.carrotsearch.randomizedtesting.ThreadLeakControl.forkTimeoutingTask(ThreadLeakControl.java:817)
	at com.carrotsearch.randomizedtesting.ThreadLeakControl$3.evaluate(ThreadLeakControl.java:468)


FAILED:  junit.framework.TestSuite.org.apache.solr.uninverting.TestDocTermOrdsUninvertLimit

Error Message:
Captured an uncaught exception in thread: Thread[id=2542, name=Lucene Merge Thread #156, state=RUNNABLE, group=TGRP-TestDocTermOrdsUninvertLimit]

Stack Trace:
com.carrotsearch.randomizedtesting.UncaughtExceptionError: Captured an uncaught exception in thread: Thread[id=2542, name=Lucene Merge Thread #156, state=RUNNABLE, group=TGRP-TestDocTermOrdsUninvertLimit]
Caused by: org.apache.lucene.index.MergePolicy$MergeException: java.lang.IllegalStateException: this writer hit an unrecoverable error; cannot complete merge
	at __randomizedtesting.SeedInfo.seed([DCE78960684CF7B7]:0)
	at org.apache.lucene.index.ConcurrentMergeScheduler.handleMergeException(ConcurrentMergeScheduler.java:704)
	at org.apache.lucene.index.ConcurrentMergeScheduler$MergeThread.run(ConcurrentMergeScheduler.java:684)
Caused by: java.lang.IllegalStateException: this writer hit an unrecoverable error; cannot complete merge
	at org.apache.lucene.index.IndexWriter.commitMerge(IndexWriter.java:3879)
	at org.apache.lucene.index.IndexWriter.mergeMiddle(IndexWriter.java:4618)
	at org.apache.lucene.index.IndexWriter.merge(IndexWriter.java:4056)
	at org.apache.lucene.index.ConcurrentMergeScheduler.doMerge(ConcurrentMergeScheduler.java:625)
	at org.apache.lucene.index.ConcurrentMergeScheduler$MergeThread.run(ConcurrentMergeScheduler.java:662)
Caused by: java.lang.OutOfMemoryError: GC overhead limit exceeded
	at __randomizedtesting.SeedInfo.seed([DCE78960684CF7B7:EF55A1A465FB2D00]:0)
	at org.apache.lucene.util.packed.DeltaPackedLongValues$Builder.<init>(DeltaPackedLongValues.java:59)
	at org.apache.lucene.util.packed.PackedLongValues.deltaPackedBuilder(PackedLongValues.java:53)
	at org.apache.lucene.util.packed.PackedLongValues.deltaPackedBuilder(PackedLongValues.java:58)
	at org.apache.lucene.index.NormValuesWriter.<init>(NormValuesWriter.java:42)
	at org.apache.lucene.index.DefaultIndexingChain$PerField.setInvertState(DefaultIndexingChain.java:750)
	at org.apache.lucene.index.DefaultIndexingChain$PerField.<init>(DefaultIndexingChain.java:740)
	at org.apache.lucene.index.DefaultIndexingChain.getOrAddField(DefaultIndexingChain.java:670)
	at org.apache.lucene.index.DefaultIndexingChain.processField(DefaultIndexingChain.java:440)
	at org.apache.lucene.index.DefaultIndexingChain.processDocument(DefaultIndexingChain.java:406)
	at org.apache.lucene.index.DocumentsWriterPerThread.updateDocument(DocumentsWriterPerThread.java:250)
	at org.apache.lucene.index.DocumentsWriter.updateDocument(DocumentsWriter.java:494)
	at org.apache.lucene.index.IndexWriter.updateDocument(IndexWriter.java:1594)
	at org.apache.lucene.index.IndexWriter.addDocument(IndexWriter.java:1213)
	at org.apache.lucene.index.RandomIndexWriter.addDocument(RandomIndexWriter.java:191)
	at org.apache.solr.uninverting.TestDocTermOrdsUninvertLimit.testTriggerUnInvertLimit(TestDocTermOrdsUninvertLimit.java:65)
	at sun.reflect.NativeMethodAccessorImpl.invoke0(Native Method)
	at sun.reflect.NativeMethodAccessorImpl.invoke(NativeMethodAccessorImpl.java:62)
	at sun.reflect.DelegatingMethodAccessorImpl.invoke(DelegatingMethodAccessorImpl.java:43)
	at java.lang.reflect.Method.invoke(Method.java:498)
	at com.carrotsearch.randomizedtesting.RandomizedRunner.invoke(RandomizedRunner.java:1750)
	at com.carrotsearch.randomizedtesting.RandomizedRunner$8.evaluate(RandomizedRunner.java:938)
	at com.carrotsearch.randomizedtesting.RandomizedRunner$9.evaluate(RandomizedRunner.java:974)
	at com.carrotsearch.randomizedtesting.RandomizedRunner$10.evaluate(RandomizedRunner.java:988)
	at org.apache.lucene.util.TestRuleSetupTeardownChained$1.evaluate(TestRuleSetupTeardownChained.java:49)
	at org.apache.lucene.util.AbstractBeforeAfterRule$1.evaluate(AbstractBeforeAfterRule.java:45)
	at org.apache.lucene.util.TestRuleThreadAndTestName$1.evaluate(TestRuleThreadAndTestName.java:48)
	at org.apache.lucene.util.TestRuleIgnoreAfterMaxFailures$1.evaluate(TestRuleIgnoreAfterMaxFailures.java:64)
	at org.apache.lucene.util.TestRuleMarkFailure$1.evaluate(TestRuleMarkFailure.java:47)
	at com.carrotsearch.randomizedtesting.rules.StatementAdapter.evaluate(StatementAdapter.java:36)
	at com.carrotsearch.randomizedtesting.ThreadLeakControl$StatementRunner.run(ThreadLeakControl.java:368)
	at com.carrotsearch.randomizedtesting.ThreadLeakControl.forkTimeoutingTask(ThreadLeakControl.java:817)
	at com.carrotsearch.randomizedtesting.ThreadLeakControl$3.evaluate(ThreadLeakControl.java:468)


FAILED:  junit.framework.TestSuite.org.apache.solr.uninverting.TestDocTermOrdsUninvertLimit

Error Message:
Captured an uncaught exception in thread: Thread[id=2541, name=Lucene Merge Thread #155, state=RUNNABLE, group=TGRP-TestDocTermOrdsUninvertLimit]

Stack Trace:
com.carrotsearch.randomizedtesting.UncaughtExceptionError: Captured an uncaught exception in thread: Thread[id=2541, name=Lucene Merge Thread #155, state=RUNNABLE, group=TGRP-TestDocTermOrdsUninvertLimit]
Caused by: org.apache.lucene.index.MergePolicy$MergeException: org.apache.lucene.store.AlreadyClosedException: refusing to delete any files: this IndexWriter hit an unrecoverable exception
	at __randomizedtesting.SeedInfo.seed([DCE78960684CF7B7]:0)
	at org.apache.lucene.index.ConcurrentMergeScheduler.handleMergeException(ConcurrentMergeScheduler.java:704)
	at org.apache.lucene.index.ConcurrentMergeScheduler$MergeThread.run(ConcurrentMergeScheduler.java:684)
Caused by: org.apache.lucene.store.AlreadyClosedException: refusing to delete any files: this IndexWriter hit an unrecoverable exception
	at org.apache.lucene.index.IndexFileDeleter.ensureOpen(IndexFileDeleter.java:349)
	at org.apache.lucene.index.IndexFileDeleter.deleteFiles(IndexFileDeleter.java:669)
	at org.apache.lucene.index.IndexFileDeleter.decRef(IndexFileDeleter.java:589)
	at org.apache.lucene.index.IndexFileDeleter.checkpoint(IndexFileDeleter.java:531)
	at org.apache.lucene.index.IndexWriter.checkpoint(IndexWriter.java:2565)
	at org.apache.lucene.index.IndexWriter.commitMerge(IndexWriter.java:3990)
	at org.apache.lucene.index.IndexWriter.mergeMiddle(IndexWriter.java:4618)
	at org.apache.lucene.index.IndexWriter.merge(IndexWriter.java:4056)
	at org.apache.lucene.index.ConcurrentMergeScheduler.doMerge(ConcurrentMergeScheduler.java:625)
	at org.apache.lucene.index.ConcurrentMergeScheduler$MergeThread.run(ConcurrentMergeScheduler.java:662)
Caused by: java.lang.OutOfMemoryError: GC overhead limit exceeded
	at __randomizedtesting.SeedInfo.seed([DCE78960684CF7B7:EF55A1A465FB2D00]:0)
	at org.apache.lucene.util.packed.DeltaPackedLongValues$Builder.<init>(DeltaPackedLongValues.java:59)
	at org.apache.lucene.util.packed.PackedLongValues.deltaPackedBuilder(PackedLongValues.java:53)
	at org.apache.lucene.util.packed.PackedLongValues.deltaPackedBuilder(PackedLongValues.java:58)
	at org.apache.lucene.index.NormValuesWriter.<init>(NormValuesWriter.java:42)
	at org.apache.lucene.index.DefaultIndexingChain$PerField.setInvertState(DefaultIndexingChain.java:750)
	at org.apache.lucene.index.DefaultIndexingChain$PerField.<init>(DefaultIndexingChain.java:740)
	at org.apache.lucene.index.DefaultIndexingChain.getOrAddField(DefaultIndexingChain.java:670)
	at org.apache.lucene.index.DefaultIndexingChain.processField(DefaultIndexingChain.java:440)
	at org.apache.lucene.index.DefaultIndexingChain.processDocument(DefaultIndexingChain.java:406)
	at org.apache.lucene.index.DocumentsWriterPerThread.updateDocument(DocumentsWriterPerThread.java:250)
	at org.apache.lucene.index.DocumentsWriter.updateDocument(DocumentsWriter.java:494)
	at org.apache.lucene.index.IndexWriter.updateDocument(IndexWriter.java:1594)
	at org.apache.lucene.index.IndexWriter.addDocument(IndexWriter.java:1213)
	at org.apache.lucene.index.RandomIndexWriter.addDocument(RandomIndexWriter.java:191)
	at org.apache.solr.uninverting.TestDocTermOrdsUninvertLimit.testTriggerUnInvertLimit(TestDocTermOrdsUninvertLimit.java:65)
	at sun.reflect.NativeMethodAccessorImpl.invoke0(Native Method)
	at sun.reflect.NativeMethodAccessorImpl.invoke(NativeMethodAccessorImpl.java:62)
	at sun.reflect.DelegatingMethodAccessorImpl.invoke(DelegatingMethodAccessorImpl.java:43)
	at java.lang.reflect.Method.invoke(Method.java:498)
	at com.carrotsearch.randomizedtesting.RandomizedRunner.invoke(RandomizedRunner.java:1750)
	at com.carrotsearch.randomizedtesting.RandomizedRunner$8.evaluate(RandomizedRunner.java:938)
	at com.carrotsearch.randomizedtesting.RandomizedRunner$9.evaluate(RandomizedRunner.java:974)
	at com.carrotsearch.randomizedtesting.RandomizedRunner$10.evaluate(RandomizedRunner.java:988)
	at org.apache.lucene.util.TestRuleSetupTeardownChained$1.evaluate(TestRuleSetupTeardownChained.java:49)
	at org.apache.lucene.util.AbstractBeforeAfterRule$1.evaluate(AbstractBeforeAfterRule.java:45)
	at org.apache.lucene.util.TestRuleThreadAndTestName$1.evaluate(TestRuleThreadAndTestName.java:48)
	at org.apache.lucene.util.TestRuleIgnoreAfterMaxFailures$1.evaluate(TestRuleIgnoreAfterMaxFailures.java:64)
	at org.apache.lucene.util.TestRuleMarkFailure$1.evaluate(TestRuleMarkFailure.java:47)
	at com.carrotsearch.randomizedtesting.rules.StatementAdapter.evaluate(StatementAdapter.java:36)
	at com.carrotsearch.randomizedtesting.ThreadLeakControl$StatementRunner.run(ThreadLeakControl.java:368)
	at com.carrotsearch.randomizedtesting.ThreadLeakControl.forkTimeoutingTask(ThreadLeakControl.java:817)
	at com.carrotsearch.randomizedtesting.ThreadLeakControl$3.evaluate(ThreadLeakControl.java:468)


FAILED:  org.apache.solr.update.processor.DistributedUpdateProcessorTest.testVersionAdd

Error Message:


Stack Trace:
java.lang.NullPointerException
	at __randomizedtesting.SeedInfo.seed([DCE78960684CF7B7:740D7A9D9F5C1772]:0)
	at org.mockito.Mockito.spy(Mockito.java:1980)
	at org.apache.solr.update.processor.DistributedUpdateProcessorTest.runCommands(DistributedUpdateProcessorTest.java:144)
	at org.apache.solr.update.processor.DistributedUpdateProcessorTest.testVersionAdd(DistributedUpdateProcessorTest.java:101)
	at sun.reflect.NativeMethodAccessorImpl.invoke0(Native Method)
	at sun.reflect.NativeMethodAccessorImpl.invoke(NativeMethodAccessorImpl.java:62)
	at sun.reflect.DelegatingMethodAccessorImpl.invoke(DelegatingMethodAccessorImpl.java:43)
	at java.lang.reflect.Method.invoke(Method.java:498)
	at com.carrotsearch.randomizedtesting.RandomizedRunner.invoke(RandomizedRunner.java:1750)
	at com.carrotsearch.randomizedtesting.RandomizedRunner$8.evaluate(RandomizedRunner.java:938)
	at com.carrotsearch.randomizedtesting.RandomizedRunner$9.evaluate(RandomizedRunner.java:974)
	at com.carrotsearch.randomizedtesting.RandomizedRunner$10.evaluate(RandomizedRunner.java:988)
	at org.mockito.internal.junit.JUnitRule$1.evaluateSafely(JUnitRule.java:52)
	at org.mockito.internal.junit.JUnitRule$1.evaluate(JUnitRule.java:43)
	at com.carrotsearch.randomizedtesting.rules.SystemPropertiesRestoreRule$1.evaluate(SystemPropertiesRestoreRule.java:57)
	at org.apache.lucene.util.TestRuleSetupTeardownChained$1.evaluate(TestRuleSetupTeardownChained.java:49)
	at org.apache.lucene.util.AbstractBeforeAfterRule$1.evaluate(AbstractBeforeAfterRule.java:45)
	at org.apache.lucene.util.TestRuleThreadAndTestName$1.evaluate(TestRuleThreadAndTestName.java:48)
	at org.apache.lucene.util.TestRuleIgnoreAfterMaxFailures$1.evaluate(TestRuleIgnoreAfterMaxFailures.java:64)
	at org.apache.lucene.util.TestRuleMarkFailure$1.evaluate(TestRuleMarkFailure.java:47)
	at com.carrotsearch.randomizedtesting.rules.StatementAdapter.evaluate(StatementAdapter.java:36)
	at com.carrotsearch.randomizedtesting.ThreadLeakControl$StatementRunner.run(ThreadLeakControl.java:368)
	at com.carrotsearch.randomizedtesting.ThreadLeakControl.forkTimeoutingTask(ThreadLeakControl.java:817)
	at com.carrotsearch.randomizedtesting.ThreadLeakControl$3.evaluate(ThreadLeakControl.java:468)
	at com.carrotsearch.randomizedtesting.RandomizedRunner.runSingleTest(RandomizedRunner.java:947)
	at com.carrotsearch.randomizedtesting.RandomizedRunner$5.evaluate(RandomizedRunner.java:832)
	at com.carrotsearch.randomizedtesting.RandomizedRunner$6.evaluate(RandomizedRunner.java:883)
	at com.carrotsearch.randomizedtesting.RandomizedRunner$7.evaluate(RandomizedRunner.java:894)
	at com.carrotsearch.randomizedtesting.rules.StatementAdapter.evaluate(StatementAdapter.java:36)
	at com.carrotsearch.randomizedtesting.rules.SystemPropertiesRestoreRule$1.evaluate(SystemPropertiesRestoreRule.java:57)
	at org.apache.lucene.util.AbstractBeforeAfterRule$1.evaluate(AbstractBeforeAfterRule.java:45)
	at com.carrotsearch.randomizedtesting.rules.StatementAdapter.evaluate(StatementAdapter.java:36)
	at org.apache.lucene.util.TestRuleStoreClassName$1.evaluate(TestRuleStoreClassName.java:41)
	at com.carrotsearch.randomizedtesting.rules.NoShadowingOrOverridesOnMethodsRule$1.evaluate(NoShadowingOrOverridesOnMethodsRule.java:40)
	at com.carrotsearch.randomizedtesting.rules.NoShadowingOrOverridesOnMethodsRule$1.evaluate(NoShadowingOrOverridesOnMethodsRule.java:40)
	at com.carrotsearch.randomizedtesting.rules.StatementAdapter.evaluate(StatementAdapter.java:36)
	at com.carrotsearch.randomizedtesting.rules.StatementAdapter.evaluate(StatementAdapter.java:36)
	at com.carrotsearch.randomizedtesting.rules.StatementAdapter.evaluate(StatementAdapter.java:36)
	at org.apache.lucene.util.TestRuleAssertionsRequired$1.evaluate(TestRuleAssertionsRequired.java:53)
	at org.apache.lucene.util.TestRuleMarkFailure$1.evaluate(TestRuleMarkFailure.java:47)
	at org.apache.lucene.util.TestRuleIgnoreAfterMaxFailures$1.evaluate(TestRuleIgnoreAfterMaxFailures.java:64)
	at org.apache.lucene.util.TestRuleIgnoreTestSuites$1.evaluate(TestRuleIgnoreTestSuites.java:54)
	at com.carrotsearch.randomizedtesting.rules.StatementAdapter.evaluate(StatementAdapter.java:36)
	at com.carrotsearch.randomizedtesting.ThreadLeakControl$StatementRunner.run(ThreadLeakControl.java:368)
	at java.lang.Thread.run(Thread.java:748)


FAILED:  org.apache.solr.update.processor.DistributedUpdateProcessorTest.testVersionDelete

Error Message:


Stack Trace:
java.lang.NullPointerException
	at __randomizedtesting.SeedInfo.seed([DCE78960684CF7B7:2FA9DDDD31A0DE0D]:0)
	at org.mockito.Mockito.spy(Mockito.java:1980)
	at org.apache.solr.update.processor.DistributedUpdateProcessorTest.runCommands(DistributedUpdateProcessorTest.java:144)
	at org.apache.solr.update.processor.DistributedUpdateProcessorTest.testVersionDelete(DistributedUpdateProcessorTest.java:125)
	at sun.reflect.NativeMethodAccessorImpl.invoke0(Native Method)
	at sun.reflect.NativeMethodAccessorImpl.invoke(NativeMethodAccessorImpl.java:62)
	at sun.reflect.DelegatingMethodAccessorImpl.invoke(DelegatingMethodAccessorImpl.java:43)
	at java.lang.reflect.Method.invoke(Method.java:498)
	at com.carrotsearch.randomizedtesting.RandomizedRunner.invoke(RandomizedRunner.java:1750)
	at com.carrotsearch.randomizedtesting.RandomizedRunner$8.evaluate(RandomizedRunner.java:938)
	at com.carrotsearch.randomizedtesting.RandomizedRunner$9.evaluate(RandomizedRunner.java:974)
	at com.carrotsearch.randomizedtesting.RandomizedRunner$10.evaluate(RandomizedRunner.java:988)
	at org.mockito.internal.junit.JUnitRule$1.evaluateSafely(JUnitRule.java:52)
	at org.mockito.internal.junit.JUnitRule$1.evaluate(JUnitRule.java:43)
	at com.carrotsearch.randomizedtesting.rules.SystemPropertiesRestoreRule$1.evaluate(SystemPropertiesRestoreRule.java:57)
	at org.apache.lucene.util.TestRuleSetupTeardownChained$1.evaluate(TestRuleSetupTeardownChained.java:49)
	at org.apache.lucene.util.AbstractBeforeAfterRule$1.evaluate(AbstractBeforeAfterRule.java:45)
	at org.apache.lucene.util.TestRuleThreadAndTestName$1.evaluate(TestRuleThreadAndTestName.java:48)
	at org.apache.lucene.util.TestRuleIgnoreAfterMaxFailures$1.evaluate(TestRuleIgnoreAfterMaxFailures.java:64)
	at org.apache.lucene.util.TestRuleMarkFailure$1.evaluate(TestRuleMarkFailure.java:47)
	at com.carrotsearch.randomizedtesting.rules.StatementAdapter.evaluate(StatementAdapter.java:36)
	at com.carrotsearch.randomizedtesting.ThreadLeakControl$StatementRunner.run(ThreadLeakControl.java:368)
	at com.carrotsearch.randomizedtesting.ThreadLeakControl.forkTimeoutingTask(ThreadLeakControl.java:817)
	at com.carrotsearch.randomizedtesting.ThreadLeakControl$3.evaluate(ThreadLeakControl.java:468)
	at com.carrotsearch.randomizedtesting.RandomizedRunner.runSingleTest(RandomizedRunner.java:947)
	at com.carrotsearch.randomizedtesting.RandomizedRunner$5.evaluate(RandomizedRunner.java:832)
	at com.carrotsearch.randomizedtesting.RandomizedRunner$6.evaluate(RandomizedRunner.java:883)
	at com.carrotsearch.randomizedtesting.RandomizedRunner$7.evaluate(RandomizedRunner.java:894)
	at com.carrotsearch.randomizedtesting.rules.StatementAdapter.evaluate(StatementAdapter.java:36)
	at com.carrotsearch.randomizedtesting.rules.SystemPropertiesRestoreRule$1.evaluate(SystemPropertiesRestoreRule.java:57)
	at org.apache.lucene.util.AbstractBeforeAfterRule$1.evaluate(AbstractBeforeAfterRule.java:45)
	at com.carrotsearch.randomizedtesting.rules.StatementAdapter.evaluate(StatementAdapter.java:36)
	at org.apache.lucene.util.TestRuleStoreClassName$1.evaluate(TestRuleStoreClassName.java:41)
	at com.carrotsearch.randomizedtesting.rules.NoShadowingOrOverridesOnMethodsRule$1.evaluate(NoShadowingOrOverridesOnMethodsRule.java:40)
	at com.carrotsearch.randomizedtesting.rules.NoShadowingOrOverridesOnMethodsRule$1.evaluate(NoShadowingOrOverridesOnMethodsRule.java:40)
	at com.carrotsearch.randomizedtesting.rules.StatementAdapter.evaluate(StatementAdapter.java:36)
	at com.carrotsearch.randomizedtesting.rules.StatementAdapter.evaluate(StatementAdapter.java:36)
	at com.carrotsearch.randomizedtesting.rules.StatementAdapter.evaluate(StatementAdapter.java:36)
	at org.apache.lucene.util.TestRuleAssertionsRequired$1.evaluate(TestRuleAssertionsRequired.java:53)
	at org.apache.lucene.util.TestRuleMarkFailure$1.evaluate(TestRuleMarkFailure.java:47)
	at org.apache.lucene.util.TestRuleIgnoreAfterMaxFailures$1.evaluate(TestRuleIgnoreAfterMaxFailures.java:64)
	at org.apache.lucene.util.TestRuleIgnoreTestSuites$1.evaluate(TestRuleIgnoreTestSuites.java:54)
	at com.carrotsearch.randomizedtesting.rules.StatementAdapter.evaluate(StatementAdapter.java:36)
	at com.carrotsearch.randomizedtesting.ThreadLeakControl$StatementRunner.run(ThreadLeakControl.java:368)
	at java.lang.Thread.run(Thread.java:748)




Build Log:
[...truncated 13494 lines...]
   [junit4] Suite: org.apache.solr.uninverting.TestDocTermOrdsUninvertLimit
   [junit4]   2> NOTE: download the large Jenkins line-docs file by running 'ant get-jenkins-line-docs' in the lucene directory.
   [junit4]   2> NOTE: reproduce with: ant test  -Dtestcase=TestDocTermOrdsUninvertLimit -Dtests.method=testTriggerUnInvertLimit -Dtests.seed=DCE78960684CF7B7 -Dtests.multiplier=2 -Dtests.nightly=true -Dtests.slow=true -Dtests.linedocsfile=/home/jenkins/jenkins-slave/workspace/Lucene-Solr-NightlyTests-8.x/test-data/enwiki.random.lines.txt -Dtests.locale=he -Dtests.timezone=Africa/Ndjamena -Dtests.asserts=true -Dtests.file.encoding=US-ASCII
   [junit4] ERROR   89.2s J1 | TestDocTermOrdsUninvertLimit.testTriggerUnInvertLimit <<<
   [junit4]    > Throwable #1: java.lang.OutOfMemoryError: GC overhead limit exceeded
   [junit4]    > 	at __randomizedtesting.SeedInfo.seed([DCE78960684CF7B7:EF55A1A465FB2D00]:0)
   [junit4]    > 	at org.apache.lucene.util.packed.DeltaPackedLongValues$Builder.<init>(DeltaPackedLongValues.java:59)
   [junit4]    > 	at org.apache.lucene.util.packed.PackedLongValues.deltaPackedBuilder(PackedLongValues.java:53)
   [junit4]    > 	at org.apache.lucene.util.packed.PackedLongValues.deltaPackedBuilder(PackedLongValues.java:58)
   [junit4]    > 	at org.apache.lucene.index.NormValuesWriter.<init>(NormValuesWriter.java:42)
   [junit4]    > 	at org.apache.lucene.index.DefaultIndexingChain$PerField.setInvertState(DefaultIndexingChain.java:750)
   [junit4]    > 	at org.apache.lucene.index.DefaultIndexingChain$PerField.<init>(DefaultIndexingChain.java:740)
   [junit4]    > 	at org.apache.lucene.index.DefaultIndexingChain.getOrAddField(DefaultIndexingChain.java:670)
   [junit4]    > 	at org.apache.lucene.index.DefaultIndexingChain.processField(DefaultIndexingChain.java:440)
   [junit4]    > 	at org.apache.lucene.index.DefaultIndexingChain.processDocument(DefaultIndexingChain.java:406)
   [junit4]    > 	at org.apache.lucene.index.DocumentsWriterPerThread.updateDocument(DocumentsWriterPerThread.java:250)
   [junit4]    > 	at org.apache.lucene.index.DocumentsWriter.updateDocument(DocumentsWriter.java:494)
   [junit4]    > 	at org.apache.lucene.index.IndexWriter.updateDocument(IndexWriter.java:1594)
   [junit4]    > 	at org.apache.lucene.index.IndexWriter.addDocument(IndexWriter.java:1213)
   [junit4]    > 	at org.apache.lucene.index.RandomIndexWriter.addDocument(RandomIndexWriter.java:191)
   [junit4]    > 	at org.apache.solr.uninverting.TestDocTermOrdsUninvertLimit.testTriggerUnInvertLimit(TestDocTermOrdsUninvertLimit.java:65)
   [junit4]   2> ??? 05, 2019 3:19:03 PM com.carrotsearch.randomizedtesting.RandomizedRunner$QueueUncaughtExceptionsHandler uncaughtException
   [junit4]   2> WARNING: Uncaught exception in thread: Thread[Lucene Merge Thread #150,5,TGRP-TestDocTermOrdsUninvertLimit]
   [junit4]   2> org.apache.lucene.index.MergePolicy$MergeException: java.lang.OutOfMemoryError: Java heap space
   [junit4]   2> 	at __randomizedtesting.SeedInfo.seed([DCE78960684CF7B7]:0)
   [junit4]   2> 	at org.apache.lucene.index.ConcurrentMergeScheduler.handleMergeException(ConcurrentMergeScheduler.java:704)
   [junit4]   2> 	at org.apache.lucene.index.ConcurrentMergeScheduler$MergeThread.run(ConcurrentMergeScheduler.java:684)
   [junit4]   2> Caused by: java.lang.OutOfMemoryError: Java heap space
   [junit4]   2> 	at org.apache.lucene.codecs.memory.DirectPostingsFormat$DirectField.<init>(DirectPostingsFormat.java:420)
   [junit4]   2> 	at org.apache.lucene.codecs.memory.DirectPostingsFormat$DirectFields.<init>(DirectPostingsFormat.java:132)
   [junit4]   2> 	at org.apache.lucene.codecs.memory.DirectPostingsFormat.fieldsProducer(DirectPostingsFormat.java:116)
   [junit4]   2> 	at org.apache.lucene.codecs.perfield.PerFieldPostingsFormat$FieldsReader.<init>(PerFieldPostingsFormat.java:288)
   [junit4]   2> 	at org.apache.lucene.codecs.perfield.PerFieldPostingsFormat.fieldsProducer(PerFieldPostingsFormat.java:368)
   [junit4]   2> 	at org.apache.lucene.index.SegmentCoreReaders.<init>(SegmentCoreReaders.java:114)
   [junit4]   2> 	at org.apache.lucene.index.SegmentReader.<init>(SegmentReader.java:84)
   [junit4]   2> 	at org.apache.lucene.index.ReadersAndUpdates.getReader(ReadersAndUpdates.java:177)
   [junit4]   2> 	at org.apache.lucene.index.IndexWriter.mergeMiddle(IndexWriter.java:4607)
   [junit4]   2> 	at org.apache.lucene.index.IndexWriter.merge(IndexWriter.java:4056)
   [junit4]   2> 	at org.apache.lucene.index.ConcurrentMergeScheduler.doMerge(ConcurrentMergeScheduler.java:625)
   [junit4]   2> 	at org.apache.lucene.index.ConcurrentMergeScheduler$MergeThread.run(ConcurrentMergeScheduler.java:662)
   [junit4]   2> 
   [junit4]   2> ??? 05, 2019 3:19:03 PM com.carrotsearch.randomizedtesting.RandomizedRunner$QueueUncaughtExceptionsHandler uncaughtException
   [junit4]   2> WARNING: Uncaught exception in thread: Thread[Lucene Merge Thread #157,5,TGRP-TestDocTermOrdsUninvertLimit]
   [junit4]   2> org.apache.lucene.index.MergePolicy$MergeException: java.lang.IllegalStateException: this writer hit an unrecoverable error; cannot complete merge
   [junit4]   2> 	at __randomizedtesting.SeedInfo.seed([DCE78960684CF7B7]:0)
   [junit4]   2> 	at org.apache.lucene.index.ConcurrentMergeScheduler.handleMergeException(ConcurrentMergeScheduler.java:704)
   [junit4]   2> 	at org.apache.lucene.index.ConcurrentMergeScheduler$MergeThread.run(ConcurrentMergeScheduler.java:684)
   [junit4]   2> Caused by: java.lang.IllegalStateException: this writer hit an unrecoverable error; cannot complete merge
   [junit4]   2> 	at org.apache.lucene.index.IndexWriter.commitMerge(IndexWriter.java:3879)
   [junit4]   2> 	at org.apache.lucene.index.IndexWriter.mergeMiddle(IndexWriter.java:4618)
   [junit4]   2> 	at org.apache.lucene.index.IndexWriter.merge(IndexWriter.java:4056)
   [junit4]   2> 	at org.apache.lucene.index.ConcurrentMergeScheduler.doMerge(ConcurrentMergeScheduler.java:625)
   [junit4]   2> 	at org.apache.lucene.index.ConcurrentMergeScheduler$MergeThread.run(ConcurrentMergeScheduler.java:662)
   [junit4]   2> Caused by: java.lang.OutOfMemoryError: GC overhead limit exceeded
   [junit4]   2> 	at __randomizedtesting.SeedInfo.seed([DCE78960684CF7B7:EF55A1A465FB2D00]:0)
   [junit4]   2> 	at org.apache.lucene.util.packed.DeltaPackedLongValues$Builder.<init>(DeltaPackedLongValues.java:59)
   [junit4]   2> 	at org.apache.lucene.util.packed.PackedLongValues.deltaPackedBuilder(PackedLongValues.java:53)
   [junit4]   2> 	at org.apache.lucene.util.packed.PackedLongValues.deltaPackedBuilder(PackedLongValues.java:58)
   [junit4]   2> 	at org.apache.lucene.index.NormValuesWriter.<init>(NormValuesWriter.java:42)
   [junit4]   2> 	at org.apache.lucene.index.DefaultIndexingChain$PerField.setInvertState(DefaultIndexingChain.java:750)
   [junit4]   2> 	at org.apache.lucene.index.DefaultIndexingChain$PerField.<init>(DefaultIndexingChain.java:740)
   [junit4]   2> 	at org.apache.lucene.index.DefaultIndexingChain.getOrAddField(DefaultIndexingChain.java:670)
   [junit4]   2> 	at org.apache.lucene.index.DefaultIndexingChain.processField(DefaultIndexingChain.java:440)
   [junit4]   2> 	at org.apache.lucene.index.DefaultIndexingChain.processDocument(DefaultIndexingChain.java:406)
   [junit4]   2> 	at org.apache.lucene.index.DocumentsWriterPerThread.updateDocument(DocumentsWriterPerThread.java:250)
   [junit4]   2> 	at org.apache.lucene.index.DocumentsWriter.updateDocument(DocumentsWriter.java:494)
   [junit4]   2> 	at org.apache.lucene.index.IndexWriter.updateDocument(IndexWriter.java:1594)
   [junit4]   2> 	at org.apache.lucene.index.IndexWriter.addDocument(IndexWriter.java:1213)
   [junit4]   2> 	at org.apache.lucene.index.RandomIndexWriter.addDocument(RandomIndexWriter.java:191)
   [junit4]   2> 	at org.apache.solr.uninverting.TestDocTermOrdsUninvertLimit.testTriggerUnInvertLimit(TestDocTermOrdsUninvertLimit.java:65)
   [junit4]   2> 	at sun.reflect.NativeMethodAccessorImpl.invoke0(Native Method)
   [junit4]   2> 	at sun.reflect.NativeMethodAccessorImpl.invoke(NativeMethodAccessorImpl.java:62)
   [junit4]   2> 	at sun.reflect.DelegatingMethodAccessorImpl.invoke(DelegatingMethodAccessorImpl.java:43)
   [junit4]   2> 	at java.lang.reflect.Method.invoke(Method.java:498)
   [junit4]   2> 	at com.carrotsearch.randomizedtesting.RandomizedRunner.invoke(RandomizedRunner.java:1750)
   [junit4]   2> 	at com.carrotsearch.randomizedtesting.RandomizedRunner$8.evaluate(RandomizedRunner.java:938)
   [junit4]   2> 	at com.carrotsearch.randomizedtesting.RandomizedRunner$9.evaluate(RandomizedRunner.java:974)
   [junit4]   2> 	at com.carrotsearch.randomizedtesting.RandomizedRunner$10.evaluate(RandomizedRunner.java:988)
   [junit4]   2> 	at org.apache.lucene.util.TestRuleSetupTeardownChained$1.evaluate(TestRuleSetupTeardownChained.java:49)
   [junit4]   2> 	at org.apache.lucene.util.AbstractBeforeAfterRule$1.evaluate(AbstractBeforeAfterRule.java:45)
   [junit4]   2> 	at org.apache.lucene.util.TestRuleThreadAndTestName$1.evaluate(TestRuleThreadAndTestName.java:48)
   [junit4]   2> 	at org.apache.lucene.util.TestRuleIgnoreAfterMaxFailures$1.evaluate(TestRuleIgnoreAfterMaxFailures.java:64)
   [junit4]   2> 	at org.apache.lucene.util.TestRuleMarkFailure$1.evaluate(TestRuleMarkFailure.java:47)
   [junit4]   2> 	at com.carrotsearch.randomizedtesting.rules.StatementAdapter.evaluate(StatementAdapter.java:36)
   [junit4]   2> 	at com.carrotsearch.randomizedtesting.ThreadLeakControl$StatementRunner.run(ThreadLeakControl.java:368)
   [junit4]   2> 	at com.carrotsearch.randomizedtesting.ThreadLeakControl.forkTimeoutingTask(ThreadLeakControl.java:817)
   [junit4]   2> 	at com.carrotsearch.randomizedtesting.ThreadLeakControl$3.evaluate(ThreadLeakControl.java:468)
   [junit4]   2> 
   [junit4]   2> ??? 05, 2019 3:19:03 PM com.carrotsearch.randomizedtesting.RandomizedRunner$QueueUncaughtExceptionsHandler uncaughtException
   [junit4]   2> WARNING: Uncaught exception in thread: Thread[Lucene Merge Thread #156,5,TGRP-TestDocTermOrdsUninvertLimit]
   [junit4]   2> org.apache.lucene.index.MergePolicy$MergeException: java.lang.IllegalStateException: this writer hit an unrecoverable error; cannot complete merge
   [junit4]   2> 	at __randomizedtesting.SeedInfo.seed([DCE78960684CF7B7]:0)
   [junit4]   2> 	at org.apache.lucene.index.ConcurrentMergeScheduler.handleMergeException(ConcurrentMergeScheduler.java:704)
   [junit4]   2> 	at org.apache.lucene.index.ConcurrentMergeScheduler$MergeThread.run(ConcurrentMergeScheduler.java:684)
   [junit4]   2> Caused by: java.lang.IllegalStateException: this writer hit an unrecoverable error; cannot complete merge
   [junit4]   2> 	at org.apache.lucene.index.IndexWriter.commitMerge(IndexWriter.java:3879)
   [junit4]   2> 	at org.apache.lucene.index.IndexWriter.mergeMiddle(IndexWriter.java:4618)
   [junit4]   2> 	at org.apache.lucene.index.IndexWriter.merge(IndexWriter.java:4056)
   [junit4]   2> 	at org.apache.lucene.index.ConcurrentMergeScheduler.doMerge(ConcurrentMergeScheduler.java:625)
   [junit4]   2> 	at org.apache.lucene.index.ConcurrentMergeScheduler$MergeThread.run(ConcurrentMergeScheduler.java:662)
   [junit4]   2> Caused by: java.lang.OutOfMemoryError: GC overhead limit exceeded
   [junit4]   2> 	at __randomizedtesting.SeedInfo.seed([DCE78960684CF7B7:EF55A1A465FB2D00]:0)
   [junit4]   2> 	at org.apache.lucene.util.packed.DeltaPackedLongValues$Builder.<init>(DeltaPackedLongValues.java:59)
   [junit4]   2> 	at org.apache.lucene.util.packed.PackedLongValues.deltaPackedBuilder(PackedLongValues.java:53)
   [junit4]   2> 	at org.apache.lucene.util.packed.PackedLongValues.deltaPackedBuilder(PackedLongValues.java:58)
   [junit4]   2> 	at org.apache.lucene.index.NormValuesWriter.<init>(NormValuesWriter.java:42)
   [junit4]   2> 	at org.apache.lucene.index.DefaultIndexingChain$PerField.setInvertState(DefaultIndexingChain.java:750)
   [junit4]   2> 	at org.apache.lucene.index.DefaultIndexingChain$PerField.<init>(DefaultIndexingChain.java:740)
   [junit4]   2> 	at org.apache.lucene.index.DefaultIndexingChain.getOrAddField(DefaultIndexingChain.java:670)
   [junit4]   2> 	at org.apache.lucene.index.DefaultIndexingChain.processField(DefaultIndexingChain.java:440)
   [junit4]   2> 	at org.apache.lucene.index.DefaultIndexingChain.processDocument(DefaultIndexingChain.java:406)
   [junit4]   2> 	at org.apache.lucene.index.DocumentsWriterPerThread.updateDocument(DocumentsWriterPerThread.java:250)
   [junit4]   2> 	at org.apache.lucene.index.DocumentsWriter.updateDocument(DocumentsWriter.java:494)
   [junit4]   2> 	at org.apache.lucene.index.IndexWriter.updateDocument(IndexWriter.java:1594)
   [junit4]   2> 	at org.apache.lucene.index.IndexWriter.addDocument(IndexWriter.java:1213)
   [junit4]   2> 	at org.apache.lucene.index.RandomIndexWriter.addDocument(RandomIndexWriter.java:191)
   [junit4]   2> 	at org.apache.solr.uninverting.TestDocTermOrdsUninvertLimit.testTriggerUnInvertLimit(TestDocTermOrdsUninvertLimit.java:65)
   [junit4]   2> 	at sun.reflect.NativeMethodAccessorImpl.invoke0(Native Method)
   [junit4]   2> 	at sun.reflect.NativeMethodAccessorImpl.invoke(NativeMethodAccessorImpl.java:62)
   [junit4]   2> 	at sun.reflect.DelegatingMethodAccessorImpl.invoke(DelegatingMethodAccessorImpl.java:43)
   [junit4]   2> 	at java.lang.reflect.Method.invoke(Method.java:498)
   [junit4]   2> 	at com.carrotsearch.randomizedtesting.RandomizedRunner.invoke(RandomizedRunner.java:1750)
   [junit4]   2> 	at com.carrotsearch.randomizedtesting.RandomizedRunner$8.evaluate(RandomizedRunner.java:938)
   [junit4]   2> 	at com.carrotsearch.randomizedtesting.RandomizedRunner$9.evaluate(RandomizedRunner.java:974)
   [junit4]   2> 	at com.carrotsearch.randomizedtesting.RandomizedRunner$10.evaluate(RandomizedRunner.java:988)
   [junit4]   2> 	at org.apache.lucene.util.TestRuleSetupTeardownChained$1.evaluate(TestRuleSetupTeardownChained.java:49)
   [junit4]   2> 	at org.apache.lucene.util.AbstractBeforeAfterRule$1.evaluate(AbstractBeforeAfterRule.java:45)
   [junit4]   2> 	at org.apache.lucene.util.TestRuleThreadAndTestName$1.evaluate(TestRuleThreadAndTestName.java:48)
   [junit4]   2> 	at org.apache.lucene.util.TestRuleIgnoreAfterMaxFailures$1.evaluate(TestRuleIgnoreAfterMaxFailures.java:64)
   [junit4]   2> 	at org.apache.lucene.util.TestRuleMarkFailure$1.evaluate(TestRuleMarkFailure.java:47)
   [junit4]   2> 	at com.carrotsearch.randomizedtesting.rules.StatementAdapter.evaluate(StatementAdapter.java:36)
   [junit4]   2> 	at com.carrotsearch.randomizedtesting.ThreadLeakControl$StatementRunner.run(ThreadLeakControl.java:368)
   [junit4]   2> 	at com.carrotsearch.randomizedtesting.ThreadLeakControl.forkTimeoutingTask(ThreadLeakControl.java:817)
   [junit4]   2> 	at com.carrotsearch.randomizedtesting.ThreadLeakControl$3.evaluate(ThreadLeakControl.java:468)
   [junit4]   2> 
   [junit4]   2> NOTE: leaving temporary files on disk at: /x1/jenkins/jenkins-slave/workspace/Lucene-Solr-NightlyTests-8.x/checkout/solr/build/solr-core/test/J1/temp/solr.uninverting.TestDocTermOrdsUninvertLimit_DCE78960684CF7B7-001
   [junit4]   2> May 05, 2019 2:19:03 PM com.carrotsearch.randomizedtesting.RandomizedRunner$QueueUncaughtExceptionsHandler uncaughtException
   [junit4]   2> WARNING: Uncaught exception in thread: Thread[Lucene Merge Thread #155,5,TGRP-TestDocTermOrdsUninvertLimit]
   [junit4]   2> org.apache.lucene.index.MergePolicy$MergeException: org.apache.lucene.store.AlreadyClosedException: refusing to delete any files: this IndexWriter hit an unrecoverable exception
   [junit4]   2> 	at __randomizedtesting.SeedInfo.seed([DCE78960684CF7B7]:0)
   [junit4]   2> 	at org.apache.lucene.index.ConcurrentMergeScheduler.handleMergeException(ConcurrentMergeScheduler.java:704)
   [junit4]   2> 	at org.apache.lucene.index.ConcurrentMergeScheduler$MergeThread.run(ConcurrentMergeScheduler.java:684)
   [junit4]   2> Caused by: org.apache.lucene.store.AlreadyClosedException: refusing to delete any files: this IndexWriter hit an unrecoverable exception
   [junit4]   2> 	at org.apache.lucene.index.IndexFileDeleter.ensureOpen(IndexFileDeleter.java:349)
   [junit4]   2> 	at org.apache.lucene.index.IndexFileDeleter.deleteFiles(IndexFileDeleter.java:669)
   [junit4]   2> 	at org.apache.lucene.index.IndexFileDeleter.decRef(IndexFileDeleter.java:589)
   [junit4]   2> 	at org.apache.lucene.index.IndexFileDeleter.checkpoint(IndexFileDeleter.java:531)
   [junit4]   2> 	at org.apache.lucene.index.IndexWriter.checkpoint(IndexWriter.java:2565)
   [junit4]   2> 	at org.apache.lucene.index.IndexWriter.commitMerge(IndexWriter.java:3990)
   [junit4]   2> 	at org.apache.lucene.index.IndexWriter.mergeMiddle(IndexWriter.java:4618)
   [junit4]   2> 	at org.apache.lucene.index.IndexWriter.merge(IndexWriter.java:4056)
   [junit4]   2> 	at org.apache.lucene.index.ConcurrentMergeScheduler.doMerge(ConcurrentMergeScheduler.java:625)
   [junit4]   2> 	at org.apache.lucene.index.ConcurrentMergeScheduler$MergeThread.run(ConcurrentMergeScheduler.java:662)
   [junit4]   2> Caused by: java.lang.OutOfMemoryError: GC overhead limit exceeded
   [junit4]   2> 	at __randomizedtesting.SeedInfo.seed([DCE78960684CF7B7:EF55A1A465FB2D00]:0)
   [junit4]   2> 	at org.apache.lucene.util.packed.DeltaPackedLongValues$Builder.<init>(DeltaPackedLongValues.java:59)
   [junit4]   2> 	at org.apache.lucene.util.packed.PackedLongValues.deltaPackedBuilder(PackedLongValues.java:53)
   [junit4]   2> 	at org.apache.lucene.util.packed.PackedLongValues.deltaPackedBuilder(PackedLongValues.java:58)
   [junit4]   2> 	at org.apache.lucene.index.NormValuesWriter.<init>(NormValuesWriter.java:42)
   [junit4]   2> 	at org.apache.lucene.index.DefaultIndexingChain$PerField.setInvertState(DefaultIndexingChain.java:750)
   [junit4]   2> 	at org.apache.lucene.index.DefaultIndexingChain$PerField.<init>(DefaultIndexingChain.java:740)
   [junit4]   2> 	at org.apache.lucene.index.DefaultIndexingChain.getOrAddField(DefaultIndexingChain.java:670)
   [junit4]   2> 	at org.apache.lucene.index.DefaultIndexingChain.processField(DefaultIndexingChain.java:440)
   [junit4]   2> 	at org.apache.lucene.index.DefaultIndexingChain.processDocument(DefaultIndexingChain.java:406)
   [junit4]   2> 	at org.apache.lucene.index.DocumentsWriterPerThread.updateDocument(DocumentsWriterPerThread.java:250)
   [junit4]   2> 	at org.apache.lucene.index.DocumentsWriter.updateDocument(DocumentsWriter.java:494)
   [junit4]   2> 	at org.apache.lucene.index.IndexWriter.updateDocument(IndexWriter.java:1594)
   [junit4]   2> 	at org.apache.lucene.index.IndexWriter.addDocument(IndexWriter.java:1213)
   [junit4]   2> 	at org.apache.lucene.index.RandomIndexWriter.addDocument(RandomIndexWriter.java:191)
   [junit4]   2> 	at org.apache.solr.uninverting.TestDocTermOrdsUninvertLimit.testTriggerUnInvertLimit(TestDocTermOrdsUninvertLimit.java:65)
   [junit4]   2> 	at sun.reflect.NativeMethodAccessorImpl.invoke0(Native Method)
   [junit4]   2> 	at sun.reflect.NativeMethodAccessorImpl.invoke(NativeMethodAccessorImpl.java:62)
   [junit4]   2> 	at sun.reflect.DelegatingMethodAccessorImpl.invoke(DelegatingMethodAccessorImpl.java:43)
   [junit4]   2> 	at java.lang.reflect.Method.invoke(Method.java:498)
   [junit4]   2> 	at com.carrotsearch.randomizedtesting.RandomizedRunner.invoke(RandomizedRunner.java:1750)
   [junit4]   2> 	at com.carrotsearch.randomizedtesting.RandomizedRunner$8.evaluate(RandomizedRunner.java:938)
   [junit4]   2> 	at com.carrotsearch.randomizedtesting.RandomizedRunner$9.evaluate(RandomizedRunner.java:974)
   [junit4]   2> 	at com.carrotsearch.randomizedtesting.RandomizedRunner$10.evaluate(RandomizedRunner.java:988)
   [junit4]   2> 	at org.apache.lucene.util.TestRuleSetupTeardownChained$1.evaluate(TestRuleSetupTeardownChained.java:49)
   [junit4]   2> 	at org.apache.lucene.util.AbstractBeforeAfterRule$1.evaluate(AbstractBeforeAfterRule.java:45)
   [junit4]   2> 	at org.apache.lucene.util.TestRuleThreadAndTestName$1.evaluate(TestRuleThreadAndTestName.java:48)
   [junit4]   2> 	at org.apache.lucene.util.TestRuleIgnoreAfterMaxFailures$1.evaluate(TestRuleIgnoreAfterMaxFailures.java:64)
   [junit4]   2> 	at org.apache.lucene.util.TestRuleMarkFailure$1.evaluate(TestRuleMarkFailure.java:47)
   [junit4]   2> 	at com.carrotsearch.randomizedtesting.rules.StatementAdapter.evaluate(StatementAdapter.java:36)
   [junit4]   2> 	at com.carrotsearch.randomizedtesting.ThreadLeakControl$StatementRunner.run(ThreadLeakControl.java:368)
   [junit4]   2> 	at com.carrotsearch.randomizedtesting.ThreadLeakControl.forkTimeoutingTask(ThreadLeakControl.java:817)
   [junit4]   2> 	at com.carrotsearch.randomizedtesting.ThreadLeakControl$3.evaluate(ThreadLeakControl.java:468)
   [junit4]   2> 
   [junit4]   2> NOTE: test params are: codec=Asserting(Lucene80): {field=PostingsFormat(name=Direct)}, docValues:{}, maxPointsInLeafNode=1929, maxMBSortInHeap=6.303707516662035, sim=Asserting(org.apache.lucene.search.similarities.AssertingSimilarity@77f09065), locale=he, timezone=Africa/Ndjamena
   [junit4]   2> NOTE: Linux 4.4.0-137-generic amd64/Oracle Corporation 1.8.0_191 (64-bit)/cpus=4,threads=1,free=234536952,total=477626368
   [junit4]   2> NOTE: All tests run in this JVM: [TestDistributedStatsComponentCardinality, TestExceedMaxTermLength, MoreLikeThisHandlerTest, SolrInfoBeanTest, ConfigureRecoveryStrategyTest, NodeAddedTriggerIntegrationTest, TestSSLRandomization, BasicDistributedZkTest, AssignTest, TestPolicyCloud, TestStressVersions, TestDocTermOrdsUninvertLimit]
   [junit4]   2> NOTE: download the large Jenkins line-docs file by running 'ant get-jenkins-line-docs' in the lucene directory.
   [junit4]   2> NOTE: reproduce with: ant test  -Dtestcase=TestDocTermOrdsUninvertLimit -Dtests.seed=DCE78960684CF7B7 -Dtests.multiplier=2 -Dtests.nightly=true -Dtests.slow=true -Dtests.linedocsfile=/home/jenkins/jenkins-slave/workspace/Lucene-Solr-NightlyTests-8.x/test-data/enwiki.random.lines.txt -Dtests.locale=he -Dtests.timezone=Africa/Ndjamena -Dtests.asserts=true -Dtests.file.encoding=US-ASCII
   [junit4] ERROR   0.00s J1 | TestDocTermOrdsUninvertLimit (suite) <<<
   [junit4]    > Throwable #1: com.carrotsearch.randomizedtesting.UncaughtExceptionError: Captured an uncaught exception in thread: Thread[id=2536, name=Lucene Merge Thread #150, state=RUNNABLE, group=TGRP-TestDocTermOrdsUninvertLimit]
   [junit4]    > Caused by: org.apache.lucene.index.MergePolicy$MergeException: java.lang.OutOfMemoryError: Java heap space
   [junit4]    > 	at __randomizedtesting.SeedInfo.seed([DCE78960684CF7B7]:0)
   [junit4]    > 	at org.apache.lucene.index.ConcurrentMergeScheduler.handleMergeException(ConcurrentMergeScheduler.java:704)
   [junit4]    > 	at org.apache.lucene.index.ConcurrentMergeScheduler$MergeThread.run(ConcurrentMergeScheduler.java:684)
   [junit4]    > Caused by: java.lang.OutOfMemoryError: Java heap space
   [junit4]    > 	at org.apache.lucene.codecs.memory.DirectPostingsFormat$DirectField.<init>(DirectPostingsFormat.java:420)
   [junit4]    > 	at org.apache.lucene.codecs.memory.DirectPostingsFormat$DirectFields.<init>(DirectPostingsFormat.java:132)
   [junit4]    > 	at org.apache.lucene.codecs.memory.DirectPostingsFormat.fieldsProducer(DirectPostingsFormat.java:116)
   [junit4]    > 	at org.apache.lucene.codecs.perfield.PerFieldPostingsFormat$FieldsReader.<init>(PerFieldPostingsFormat.java:288)
   [junit4]    > 	at org.apache.lucene.codecs.perfield.PerFieldPostingsFormat.fieldsProducer(PerFieldPostingsFormat.java:368)
   [junit4]    > 	at org.apache.lucene.index.SegmentCoreReaders.<init>(SegmentCoreReaders.java:114)
   [junit4]    > 	at org.apache.lucene.index.SegmentReader.<init>(SegmentReader.java:84)
   [junit4]    > 	at org.apache.lucene.index.ReadersAndUpdates.getReader(ReadersAndUpdates.java:177)
   [junit4]    > 	at org.apache.lucene.index.IndexWriter.mergeMiddle(IndexWriter.java:4607)
   [junit4]    > 	at org.apache.lucene.index.IndexWriter.merge(IndexWriter.java:4056)
   [junit4]    > 	at org.apache.lucene.index.ConcurrentMergeScheduler.doMerge(ConcurrentMergeScheduler.java:625)
   [junit4]    > 	at org.apache.lucene.index.ConcurrentMergeScheduler$MergeThread.run(ConcurrentMergeScheduler.java:662)Throwable #2: com.carrotsearch.randomizedtesting.UncaughtExceptionError: Captured an uncaught exception in thread: Thread[id=2543, name=Lucene Merge Thread #157, state=RUNNABLE, group=TGRP-TestDocTermOrdsUninvertLimit]
   [junit4]    > Caused by: org.apache.lucene.index.MergePolicy$MergeException: java.lang.IllegalStateException: this writer hit an unrecoverable error; cannot complete merge
   [junit4]    > 	at __randomizedtesting.SeedInfo.seed([DCE78960684CF7B7]:0)
   [junit4]    > 	at org.apache.lucene.index.ConcurrentMergeScheduler.handleMergeException(ConcurrentMergeScheduler.java:704)
   [junit4]    > 	at org.apache.lucene.index.ConcurrentMergeScheduler$MergeThread.run(ConcurrentMergeScheduler.java:684)
   [junit4]    > Caused by: java.lang.IllegalStateException: this writer hit an unrecoverable error; cannot complete merge
   [junit4]    > 	at org.apache.lucene.index.IndexWriter.commitMerge(IndexWriter.java:3879)
   [junit4]    > 	at org.apache.lucene.index.IndexWriter.mergeMiddle(IndexWriter.java:4618)
   [junit4]    > 	at org.apache.lucene.index.IndexWriter.merge(IndexWriter.java:4056)
   [junit4]    > 	at org.apache.lucene.index.ConcurrentMergeScheduler.doMerge(ConcurrentMergeScheduler.java:625)
   [junit4]    > 	at org.apache.lucene.index.ConcurrentMergeScheduler$MergeThread.run(ConcurrentMergeScheduler.java:662)
   [junit4]    > Caused by: java.lang.OutOfMemoryError: GC overhead limit exceeded
   [junit4]    > 	at __randomizedtesting.SeedInfo.seed([DCE78960684CF7B7:EF55A1A465FB2D00]:0)
   [junit4]    > 	at org.apache.lucene.util.packed.DeltaPackedLongValues$Builder.<init>(DeltaPackedLongValues.java:59)
   [junit4]    > 	at org.apache.lucene.util.packed.PackedLongValues.deltaPackedBuilder(PackedLongValues.java:53)
   [junit4]    > 	at org.apache.lucene.util.packed.PackedLongValues.deltaPackedBuilder(PackedLongValues.java:58)
   [junit4]    > 	at org.apache.lucene.index.NormValuesWriter.<init>(NormValuesWriter.java:42)
   [junit4]    > 	at org.apache.lucene.index.DefaultIndexingChain$PerField.setInvertState(DefaultIndexingChain.java:750)
   [junit4]    > 	at org.apache.lucene.index.DefaultIndexingChain$PerField.<init>(DefaultIndexingChain.java:740)
   [junit4]    > 	at org.apache.lucene.index.DefaultIndexingChain.getOrAddField(DefaultIndexingChain.java:670)
   [junit4]    > 	at org.apache.lucene.index.DefaultIndexingChain.processField(DefaultIndexingChain.java:440)
   [junit4]    > 	at org.apache.lucene.index.DefaultIndexingChain.processDocument(DefaultIndexingChain.java:406)
   [junit4]    > 	at org.apache.lucene.index.DocumentsWriterPerThread.updateDocument(DocumentsWriterPerThread.java:250)
   [junit4]    > 	at org.apache.lucene.index.DocumentsWriter.updateDocument(DocumentsWriter.java:494)
   [junit4]    > 	at org.apache.lucene.index.IndexWriter.updateDocument(IndexWriter.java:1594)
   [junit4]    > 	at org.apache.lucene.index.IndexWriter.addDocument(IndexWriter.java:1213)
   [junit4]    > 	at org.apache.lucene.index.RandomIndexWriter.addDocument(RandomIndexWriter.java:191)
   [junit4]    > 	at org.apache.solr.uninverting.TestDocTermOrdsUninvertLimit.testTriggerUnInvertLimit(TestDocTermOrdsUninvertLimit.java:65)Throwable #3: com.carrotsearch.randomizedtesting.UncaughtExceptionError: Captured an uncaught exception in thread: Thread[id=2542, name=Lucene Merge Thread #156, state=RUNNABLE, group=TGRP-TestDocTermOrdsUninvertLimit]
   [junit4]    > Caused by: org.apache.lucene.index.MergePolicy$MergeException: java.lang.IllegalStateException: this writer hit an unrecoverable error; cannot complete merge
   [junit4]    > 	at __randomizedtesting.SeedInfo.seed([DCE78960684CF7B7]:0)
   [junit4]    > 	at org.apache.lucene.index.ConcurrentMergeScheduler.handleMergeException(ConcurrentMergeScheduler.java:704)
   [junit4]    > 	at org.apache.lucene.index.ConcurrentMergeScheduler$MergeThread.run(ConcurrentMergeScheduler.java:684)
   [junit4]    > Caused by: java.lang.IllegalStateException: this writer hit an unrecoverable error; cannot complete merge
   [junit4]    > 	at org.apache.lucene.index.IndexWriter.commitMerge(IndexWriter.java:3879)
   [junit4]    > 	at org.apache.lucene.index.IndexWriter.mergeMiddle(IndexWriter.java:4618)
   [junit4]    > 	at org.apache.lucene.index.IndexWriter.merge(IndexWriter.java:4056)
   [junit4]    > 	at org.apache.lucene.index.ConcurrentMergeScheduler.doMerge(ConcurrentMergeScheduler.java:625)
   [junit4]    > 	at org.apache.lucene.index.ConcurrentMergeScheduler$MergeThread.run(ConcurrentMergeScheduler.java:662)
   [junit4]    > Caused by: java.lang.OutOfMemoryError: GC overhead limit exceeded
   [junit4]    > 	at __randomizedtesting.SeedInfo.seed([DCE78960684CF7B7:EF55A1A465FB2D00]:0)
   [junit4]    > 	at org.apache.lucene.util.packed.DeltaPackedLongValues$Builder.<init>(DeltaPackedLongValues.java:59)
   [junit4]    > 	at org.apache.lucene.util.packed.PackedLongValues.deltaPackedBuilder(PackedLongValues.java:53)
   [junit4]    > 	at org.apache.lucene.util.packed.PackedLongValues.deltaPackedBuilder(PackedLongValues.java:58)
   [junit4]    > 	at org.apache.lucene.index.NormValuesWriter.<init>(NormValuesWriter.java:42)
   [junit4]    > 	at org.apache.lucene.index.DefaultIndexingChain$PerField.setInvertState(DefaultIndexingChain.java:750)
   [junit4]    > 	at org.apache.lucene.index.DefaultIndexingChain$PerField.<init>(DefaultIndexingChain.java:740)
   [junit4]    > 	at org.apache.lucene.index.DefaultIndexingChain.getOrAddField(DefaultIndexingChain.java:670)
   [junit4]    > 	at org.apache.lucene.index.DefaultIndexingChain.processField(DefaultIndexingChain.java:440)
   [junit4]    > 	at org.apache.lucene.index.DefaultIndexingChain.processDocument(DefaultIndexingChain.java:406)
   [junit4]    > 	at org.apache.lucene.index.DocumentsWriterPerThread.updateDocument(DocumentsWriterPerThread.java:250)
   [junit4]    > 	at org.apache.lucene.index.DocumentsWriter.updateDocument(DocumentsWriter.java:494)
   [junit4]    > 	at org.apache.lucene.index.IndexWriter.updateDocument(IndexWriter.java:1594)
   [junit4]    > 	at org.apache.lucene.index.IndexWriter.addDocument(IndexWriter.java:1213)
   [junit4]    > 	at org.apache.lucene.index.RandomIndexWriter.addDocument(RandomIndexWriter.java:191)
   [junit4]    > 	at org.apache.solr.uninverting.TestDocTermOrdsUninvertLimit.testTriggerUnInvertLimit(TestDocTermOrdsUninvertLimit.java:65)Throwable #4: com.carrotsearch.randomizedtesting.UncaughtExceptionError: Captured an uncaught exception in thread: Thread[id=2541, name=Lucene Merge Thread #155, state=RUNNABLE, group=TGRP-TestDocTermOrdsUninvertLimit]
   [junit4]    > Caused by: org.apache.lucene.index.MergePolicy$MergeException: org.apache.lucene.store.AlreadyClosedException: refusing to delete any files: this IndexWriter hit an unrecoverable exception
   [junit4]    > 	at __randomizedtesting.SeedInfo.seed([DCE78960684CF7B7]:0)
   [junit4]    > 	at org.apache.lucene.index.ConcurrentMergeScheduler.handleMergeException(ConcurrentMergeScheduler.java:704)
   [junit4]    > 	at org.apache.lucene.index.ConcurrentMergeScheduler$MergeThread.run(ConcurrentMergeScheduler.java:684)
   [junit4]    > Caused by: org.apache.lucene.store.AlreadyClosedException: refusing to delete any files: this IndexWriter hit an unrecoverable exception
   [junit4]    > 	at org.apache.lucene.index.IndexFileDeleter.ensureOpen(IndexFileDeleter.java:349)
   [junit4]    > 	at org.apache.lucene.index.IndexFileDeleter.deleteFiles(IndexFileDeleter.java:669)
   [junit4]    > 	at org.apache.lucene.index.IndexFileDeleter.decRef(IndexFileDeleter.java:589)
   [junit4]    > 	at org.apache.lucene.index.IndexFileDeleter.checkpoint(IndexFileDeleter.java:531)
   [junit4]    > 	at org.apache.lucene.index.IndexWriter.checkpoint(IndexWriter.java:2565)
   [junit4]    > 	at org.apache.lucene.index.IndexWriter.commitMerge(IndexWriter.java:3990)
   [junit4]    > 	at org.apache.lucene.index.IndexWriter.mergeMiddle(IndexWriter.java:4618)
   [junit4]    > 	at org.apache.lucene.index.IndexWriter.merge(IndexWriter.java:4056)
   [junit4]    > 	at org.apache.lucene.index.ConcurrentMergeScheduler.doMerge(ConcurrentMergeScheduler.java:625)
   [junit4]    > 	at org.apache.lucene.index.ConcurrentMergeScheduler$MergeThread.run(ConcurrentMergeScheduler.java:662)
   [junit4]    > Caused by: java.lang.OutOfMemoryError: GC overhead limit exceeded
   [junit4]    > 	at __randomizedtesting.SeedInfo.seed([DCE78960684CF7B7:EF55A1A465FB2D00]:0)
   [junit4]    > 	at org.apache.lucene.util.packed.DeltaPackedLongValues$Builder.<init>(DeltaPackedLongValues.java:59)
   [junit4]    > 	at org.apache.lucene.util.packed.PackedLongValues.deltaPackedBuilder(PackedLongValues.java:53)
   [junit4]    > 	at org.apache.lucene.util.packed.PackedLongValues.deltaPackedBuilder(PackedLongValues.java:58)
   [junit4]    > 	at org.apache.lucene.index.NormValuesWriter.<init>(NormValuesWriter.java:42)
   [junit4]    > 	at org.apache.lucene.index.DefaultIndexingChain$PerField.setInvertState(DefaultIndexingChain.java:750)
   [junit4]    > 	at org.apache.lucene.index.DefaultIndexingChain$PerField.<init>(DefaultIndexingChain.java:740)
   [junit4]    > 	at org.apache.lucene.index.DefaultIndexingChain.getOrAddField(DefaultIndexingChain.java:670)
   [junit4]    > 	at org.apache.lucene.index.DefaultIndexingChain.processField(DefaultIndexingChain.java:440)
   [junit4]    > 	at org.apache.lucene.index.DefaultIndexingChain.processDocument(DefaultIndexingChain.java:406)
   [junit4]    > 	at org.apache.lucene.index.DocumentsWriterPerThread.updateDocument(DocumentsWriterPerThread.java:250)
   [junit4]    > 	at org.apache.lucene.index.DocumentsWriter.updateDocument(DocumentsWriter.java:494)
   [junit4]    > 	at org.apache.lucene.index.IndexWriter.updateDocument(IndexWriter.java:1594)
   [junit4]    > 	at org.apache.lucene.index.IndexWriter.addDocument(IndexWriter.java:1213)
   [junit4]    > 	at org.apache.lucene.index.RandomIndexWriter.addDocument(RandomIndexWriter.java:191)
   [junit4]    > 	at org.apache.solr.uninverting.TestDocTermOrdsUninvertLimit.testTriggerUnInvertLimit(TestDocTermOrdsUninvertLimit.java:65)
   [junit4] Completed [47/855 (1!)] on J1 in 89.47s, 1 test, 5 errors <<< FAILURES!

[...truncated 532 lines...]
   [junit4] Suite: org.apache.solr.core.TestSolrDeletionPolicy1
   [junit4]   2> 1015170 INFO  (SUITE-TestSolrDeletionPolicy1-seed#[DCE78960684CF7B7]-worker) [    ] o.a.s.SolrTestCaseJ4 SecureRandom sanity checks: test.solr.allowed.securerandom=null & java.security.egd=file:/dev/./urandom
   [junit4]   2> Creating dataDir: /x1/jenkins/jenkins-slave/workspace/Lucene-Solr-NightlyTests-8.x/checkout/solr/build/solr-core/test/J0/temp/solr.core.TestSolrDeletionPolicy1_DCE78960684CF7B7-001/init-core-data-001
   [junit4]   2> 1015171 WARN  (SUITE-TestSolrDeletionPolicy1-seed#[DCE78960684CF7B7]-worker) [    ] o.a.s.SolrTestCaseJ4 startTrackingSearchers: numOpens=24 numCloses=24
   [junit4]   2> 1015171 INFO  (SUITE-TestSolrDeletionPolicy1-seed#[DCE78960684CF7B7]-worker) [    ] o.a.s.SolrTestCaseJ4 Using PointFields (NUMERIC_POINTS_SYSPROP=true) w/NUMERIC_DOCVALUES_SYSPROP=false
   [junit4]   2> 1015173 INFO  (SUITE-TestSolrDeletionPolicy1-seed#[DCE78960684CF7B7]-worker) [    ] o.a.s.SolrTestCaseJ4 Randomized ssl (true) and clientAuth (false) via: @org.apache.solr.util.RandomizeSSL(reason=, ssl=NaN, value=NaN, clientAuth=NaN)
   [junit4]   2> 1015174 INFO  (SUITE-TestSolrDeletionPolicy1-seed#[DCE78960684CF7B7]-worker) [    ] o.a.s.SolrTestCaseJ4 ####initCore
   [junit4]   2> 1015175 INFO  (SUITE-TestSolrDeletionPolicy1-seed#[DCE78960684CF7B7]-worker) [    ] o.a.s.c.SolrResourceLoader [null] Added 2 libs to classloader, from paths: [/x1/jenkins/jenkins-slave/workspace/Lucene-Solr-NightlyTests-8.x/checkout/solr/core/src/test-files/solr/collection1/lib, /x1/jenkins/jenkins-slave/workspace/Lucene-Solr-NightlyTests-8.x/checkout/solr/core/src/test-files/solr/collection1/lib/classes]
   [junit4]   2> 1015204 INFO  (SUITE-TestSolrDeletionPolicy1-seed#[DCE78960684CF7B7]-worker) [    ] o.a.s.c.SolrConfig Using Lucene MatchVersion: 8.2.0
   [junit4]   2> 1015216 INFO  (SUITE-TestSolrDeletionPolicy1-seed#[DCE78960684CF7B7]-worker) [    ] o.a.s.s.IndexSchema [null] Schema name=test
   [junit4]   2> 1015337 INFO  (SUITE-TestSolrDeletionPolicy1-seed#[DCE78960684CF7B7]-worker) [    ] o.a.s.s.IndexSchema Loaded schema test/1.0 with uniqueid field id
   [junit4]   2> 1015441 INFO  (SUITE-TestSolrDeletionPolicy1-seed#[DCE78960684CF7B7]-worker) [    ] o.a.s.h.c.HttpShardHandlerFactory Host whitelist initialized: WhitelistHostChecker [whitelistHosts=null, whitelistHostCheckingEnabled=true]
   [junit4]   2> 1015442 WARN  (SUITE-TestSolrDeletionPolicy1-seed#[DCE78960684CF7B7]-worker) [    ] o.a.s.c.s.i.Http2SolrClient Create Http2SolrClient with HTTP/1.1 transport since Java 8 or lower versions does not support SSL + HTTP/2
   [junit4]   2> 1015444 WARN  (SUITE-TestSolrDeletionPolicy1-seed#[DCE78960684CF7B7]-worker) [    ] o.e.j.u.s.S.config No Client EndPointIdentificationAlgorithm configured for SslContextFactory@a6a91f3[provider=null,keyStore=null,trustStore=null]
   [junit4]   2> 1015453 WARN  (SUITE-TestSolrDeletionPolicy1-seed#[DCE78960684CF7B7]-worker) [    ] o.a.s.c.s.i.Http2SolrClient Create Http2SolrClient with HTTP/1.1 transport since Java 8 or lower versions does not support SSL + HTTP/2
   [junit4]   2> 1015454 WARN  (SUITE-TestSolrDeletionPolicy1-seed#[DCE78960684CF7B7]-worker) [    ] o.e.j.u.s.S.config No Client EndPointIdentificationAlgorithm configured for SslContextFactory@39efb4bc[provider=null,keyStore=null,trustStore=null]
   [junit4]   2> 1015480 INFO  (SUITE-TestSolrDeletionPolicy1-seed#[DCE78960684CF7B7]-worker) [    ] o.a.s.c.TransientSolrCoreCacheDefault Allocating transient cache for 2147483647 transient cores
   [junit4]   2> 1015481 INFO  (SUITE-TestSolrDeletionPolicy1-seed#[DCE78960684CF7B7]-worker) [    ] o.a.s.h.a.MetricsHistoryHandler No .system collection, keeping metrics history in memory.
   [junit4]   2> 1015503 INFO  (SUITE-TestSolrDeletionPolicy1-seed#[DCE78960684CF7B7]-worker) [    ] o.a.s.m.r.SolrJmxReporter JMX monitoring for 'solr.node' (registry 'solr.node') enabled at server: com.sun.jmx.mbeanserver.JmxMBeanServer@6eac4fc3
   [junit4]   2> 1015514 INFO  (SUITE-TestSolrDeletionPolicy1-seed#[DCE78960684CF7B7]-worker) [    ] o.a.s.m.r.SolrJmxReporter JMX monitoring for 'solr.jvm' (registry 'solr.jvm') enabled at server: com.sun.jmx.mbeanserver.JmxMBeanServer@6eac4fc3
   [junit4]   2> 1015514 INFO  (SUITE-TestSolrDeletionPolicy1-seed#[DCE78960684CF7B7]-worker) [    ] o.a.s.m.r.SolrJmxReporter JMX monitoring for 'solr.jetty' (registry 'solr.jetty') enabled at server: com.sun.jmx.mbeanserver.JmxMBeanServer@6eac4fc3
   [junit4]   2> 1015517 INFO  (coreLoadExecutor-4709-thread-1) [    x:collection1] o.a.s.c.SolrResourceLoader [null] Added 2 libs to classloader, from paths: [/x1/jenkins/jenkins-slave/workspace/Lucene-Solr-NightlyTests-8.x/checkout/solr/core/src/test-files/solr/collection1/lib, /x1/jenkins/jenkins-slave/workspace/Lucene-Solr-NightlyTests-8.x/checkout/solr/core/src/test-files/solr/collection1/lib/classes]
   [junit4]   2> 1015557 INFO  (coreLoadExecutor-4709-thread-1) [    x:collection1] o.a.s.c.SolrConfig Using Lucene MatchVersion: 8.2.0
   [junit4]   2> 1015582 INFO  (coreLoadExecutor-4709-thread-1) [    x:collection1] o.a.s.s.IndexSchema [collection1] Schema name=test
   [junit4]   2> 1015708 INFO  (coreLoadExecutor-4709-thread-1) [    x:collection1] o.a.s.s.IndexSchema Loaded schema test/1.0 with uniqueid field id
   [junit4]   2> 1015717 INFO  (coreLoadExecutor-4709-thread-1) [    x:collection1] o.a.s.c.CoreContainer Creating SolrCore 'collection1' using configuration from instancedir /x1/jenkins/jenkins-slave/workspace/Lucene-Solr-NightlyTests-8.x/checkout/solr/core/src/test-files/solr/collection1, trusted=true
   [junit4]   2> 1015718 INFO  (coreLoadExecutor-4709-thread-1) [    x:collection1] o.a.s.m.r.SolrJmxReporter JMX monitoring for 'solr.core.collection1' (registry 'solr.core.collection1') enabled at server: com.sun.jmx.mbeanserver.JmxMBeanServer@6eac4fc3
   [junit4]   2> 1015718 INFO  (coreLoadExecutor-4709-thread-1) [    x:collection1] o.a.s.c.SolrCore [[collection1] ] Opening new SolrCore at [/x1/jenkins/jenkins-slave/workspace/Lucene-Solr-NightlyTests-8.x/checkout/solr/core/src/test-files/solr/collection1], dataDir=[/x1/jenkins/jenkins-slave/workspace/Lucene-Solr-NightlyTests-8.x/checkout/solr/build/solr-core/test/J0/temp/solr.core.TestSolrDeletionPolicy1_DCE78960684CF7B7-001/init-core-data-001/]
   [junit4]   2> 1015732 INFO  (coreLoadExecutor-4709-thread-1) [    x:collection1] o.a.s.u.RandomMergePolicy RandomMergePolicy wrapping class org.apache.lucene.index.AlcoholicMergePolicy: [AlcoholicMergePolicy: minMergeSize=0, mergeFactor=10, maxMergeSize=1280615416, maxMergeSizeForForcedMerge=9223372036854775807, calibrateSizeByDeletes=true, maxMergeDocs=2147483647, maxCFSSegmentSizeMB=8.796093022207999E12, noCFSRatio=0.1]
   [junit4]   2> 1015788 INFO  (coreLoadExecutor-4709-thread-1) [    x:collection1] o.a.s.u.CommitTracker Hard AutoCommit: disabled
   [junit4]   2> 1015788 INFO  (coreLoadExecutor-4709-thread-1) [    x:collection1] o.a.s.u.CommitTracker Soft AutoCommit: disabled
   [junit4]   2> 1015789 INFO  (coreLoadExecutor-4709-thread-1) [    x:collection1] o.a.s.u.RandomMergePolicy RandomMergePolicy wrapping class org.apache.lucene.index.LogDocMergePolicy: [LogDocMergePolicy: minMergeSize=1000, mergeFactor=4, maxMergeSize=9223372036854775807, maxMergeSizeForForcedMerge=9223372036854775807, calibrateSizeByDeletes=true, maxMergeDocs=2147483647, maxCFSSegmentSizeMB=8.796093022207999E12, noCFSRatio=1.0]
   [junit4]   2> 1015789 INFO  (coreLoadExecutor-4709-thread-1) [    x:collection1] o.a.s.s.SolrIndexSearcher Opening [Searcher@73afba93[collection1] main]
   [junit4]   2> 1015790 WARN  (coreLoadExecutor-4709-thread-1) [    x:collection1] o.a.s.r.ManagedResourceStorage Cannot write to config directory /x1/jenkins/jenkins-slave/workspace/Lucene-Solr-NightlyTests-8.x/checkout/solr/core/src/test-files/solr/collection1/conf; switching to use InMemory storage instead.
   [junit4]   2> 1015790 INFO  (coreLoadExecutor-4709-thread-1) [    x:collection1] o.a.s.h.ReplicationHandler Commits will be reserved for 10000ms.
   [junit4]   2> 1015791 INFO  (searcherExecutor-4710-thread-1-processing-x:collection1) [    x:collection1] o.a.s.c.SolrCore [collection1] Registered new searcher Searcher@73afba93[collection1] main{ExitableDirectoryReader(UninvertingDirectoryReader())}
   [junit4]   2> 1015792 INFO  (SUITE-TestSolrDeletionPolicy1-seed#[DCE78960684CF7B7]-worker) [    ] o.a.s.SolrTestCaseJ4 ####initCore end
   [junit4]   2> 1015806 INFO  (TEST-TestSolrDeletionPolicy1.testCommitAge-seed#[DCE78960684CF7B7]) [    ] o.a.s.SolrTestCaseJ4 ###Starting testCommitAge
   [junit4]   2> 1015806 INFO  (TEST-TestSolrDeletionPolicy1.testCommitAge-seed#[DCE78960684CF7B7]) [    ] o.a.s.u.DirectUpdateHandler2 [collection1] REMOVING ALL DOCUMENTS FROM INDEX
   [junit4]   2> 1015807 INFO  (TEST-TestSolrDeletionPolicy1.testCommitAge-seed#[DCE78960684CF7B7]) [    ] o.a.s.u.p.LogUpdateProcessorFactory [collection1]  webapp=null path=null params={_version_=-9223372036854775807&update.distrib=FROMLEADER&versions=true&wt=json&indent=true}{deleteByQuery=*:*} 0 1
   [junit4]   2> 1015808 INFO  (TEST-TestSolrDeletionPolicy1.testCommitAge-seed#[DCE78960684CF7B7]) [    ] o.a.s.u.p.LogUpdateProcessorFactory [collection1]  webapp=null path=null params={}{add=[1]} 0 0
   [junit4]   2> 1015812 INFO  (TEST-TestSolrDeletionPolicy1.testCommitAge-seed#[DCE78960684CF7B7]) [    ] o.a.s.u.DirectUpdateHandler2 start commit{,optimize=false,openSearcher=true,waitSearcher=true,expungeDeletes=false,softCommit=false,prepareCommit=false}
   [junit4]   2> 1015812 INFO  (TEST-TestSolrDeletionPolicy1.testCommitAge-seed#[DCE78960684CF7B7]) [    ] o.a.s.u.SolrIndexWriter Calling setCommitData with IW:org.apache.solr.update.SolrIndexWriter@5e2d98d0 commitCommandVersion:0
   [junit4]   2> 1015819 INFO  (TEST-TestSolrDeletionPolicy1.testCommitAge-seed#[DCE78960684CF7B7]) [    ] o.a.s.s.SolrIndexSearcher Opening [Searcher@5a28ec52[collection1] main]
   [junit4]   2> 1015820 INFO  (TEST-TestSolrDeletionPolicy1.testCommitAge-seed#[DCE78960684CF7B7]) [    ] o.a.s.u.DirectUpdateHandler2 end_commit_flush
   [junit4]   2> 1015821 INFO  (searcherExecutor-4710-thread-1) [    ] o.a.s.c.SolrCore [collection1] Registered new searcher Searcher@5a28ec52[collection1] main{ExitableDirectoryReader(UninvertingDirectoryReader(Uninverting(_0(8.2.0):c1:[diagnostics={os=Linux, java.vendor=Oracle Corporation, java.version=1.8.0_191, java.vm.version=25.191-b12, lucene.version=8.2.0, os.arch=amd64, java.runtime.version=1.8.0_191-b12, source=flush, os.version=4.4.0-137-generic, timestamp=1557066636110}]:[attributes={Lucene50StoredFieldsFormat.mode=BEST_SPEED}])))}
   [junit4]   2> 1015822 INFO  (TEST-TestSolrDeletionPolicy1.testCommitAge-seed#[DCE78960684CF7B7]) [    ] o.a.s.u.p.LogUpdateProcessorFactory [collection1]  webapp=null path=null params={}{commit=} 0 10
   [junit4]   2> 1015823 INFO  (TEST-TestSolrDeletionPolicy1.testCommitAge-seed#[DCE78960684CF7B7]) [    ] o.a.s.c.S.Request [collection1]  webapp=null path=null params={q=id:[0+TO+1]&qt=&start=0&rows=20&version=2.2} hits=1 status=0 QTime=0
   [junit4]   2> 1015824 INFO  (TEST-TestSolrDeletionPolicy1.testCommitAge-seed#[DCE78960684CF7B7]) [    ] o.a.s.u.p.LogUpdateProcessorFactory [collection1]  webapp=null path=null params={}{add=[2]} 0 0
   [junit4]   2> 1015824 INFO  (TEST-TestSolrDeletionPolicy1.testCommitAge-seed#[DCE78960684CF7B7]) [    ] o.a.s.u.DirectUpdateHandler2 start commit{,optimize=false,openSearcher=true,waitSearcher=true,expungeDeletes=false,softCommit=false,prepareCommit=false}
   [junit4]   2> 1015824 INFO  (TEST-TestSolrDeletionPolicy1.testCommitAge-seed#[DCE78960684CF7B7]) [    ] o.a.s.u.SolrIndexWriter Calling setCommitData with IW:org.apache.solr.update.SolrIndexWriter@5e2d98d0 commitCommandVersion:0
   [junit4]   2> 1015826 INFO  (TEST-TestSolrDeletionPolicy1.testCommitAge-seed#[DCE78960684CF7B7]) [    ] o.a.s.s.SolrIndexSearcher Opening [Searcher@244e5826[collection1] main]
   [junit4]   2> 1015826 INFO  (TEST-TestSolrDeletionPolicy1.testCommitAge-seed#[DCE78960684CF7B7]) [    ] o.a.s.u.DirectUpdateHandler2 end_commit_flush
   [junit4]   2> 1015827 INFO  (searcherExecutor-4710-thread-1) [    ] o.a.s.c.SolrCore [collection1] Registered new searcher Searcher@244e5826[collection1] main{ExitableDirectoryReader(UninvertingDirectoryReader(Uninverting(_0(8.2.0):c1:[diagnostics={os=Linux, java.vendor=Oracle Corporation, java.version=1.8.0_191, java.vm.version=25.191-b12, lucene.version=8.2.0, os.arch=amd64, java.runtime.version=1.8.0_191-b12, source=flush, os.version=4.4.0-137-generic, timestamp=1557066636110}]:[attributes={Lucene50StoredFieldsFormat.mode=BEST_SPEED}]) Uninverting(_1(8.2.0):c1:[diagnostics={os=Linux, java.vendor=Oracle Corporation, java.version=1.8.0_191, java.vm.version=25.191-b12, lucene.version=8.2.0, os.arch=amd64, java.runtime.version=1.8.0_191-b12, source=flush, os.version=4.4.0-137-generic, timestamp=1557066636122}]:[attributes={Lucene50StoredFieldsFormat.mode=BEST_SPEED}])))}
   [junit4]   2> 1015828 INFO  (TEST-TestSolrDeletionPolicy1.testCommitAge-seed#[DCE78960684CF7B7]) [    ] o.a.s.u.p.LogUpdateProcessorFactory [collection1]  webapp=null path=null params={}{commit=} 0 3
   [junit4]   2> 1015828 INFO  (TEST-TestSolrDeletionPolicy1.testCommitAge-seed#[DCE78960684CF7B7]) [    ] o.a.s.c.S.Request [collection1]  webapp=null path=null params={q=id:[0+TO+2]&qt=&start=0&rows=20&version=2.2} hits=2 status=0 QTime=0
   [junit4]   2> 1015829 INFO  (TEST-TestSolrDeletionPolicy1.testCommitAge-seed#[DCE78960684CF7B7]) [    ] o.a.s.u.p.LogUpdateProcessorFactory [collection1]  webapp=null path=null params={}{add=[3]} 0 0
   [junit4]   2> 1015829 INFO  (TEST-TestSolrDeletionPolicy1.testCommitAge-seed#[DCE78960684CF7B7]) [    ] o.a.s.u.DirectUpdateHandler2 start commit{,optimize=true,openSearcher=true,waitSearcher=true,expungeDeletes=false,softCommit=false,prepareCommit=false}
   [junit4]   2> 1015829 WARN  (TEST-TestSolrDeletionPolicy1.testCommitAge-seed#[DCE78960684CF7B7]) [    ] o.a.s.u.DirectUpdateHandler2 Starting optimize... Reading and rewriting a potentially large percent of the entire index, reducing to 2147483647 segments
   [junit4]   2> 1015830 INFO  (TEST-TestSolrDeletionPolicy1.testCommitAge-seed#[DCE78960684CF7B7]) [    ] o.a.s.u.SolrIndexWriter Calling setCommitData with IW:org.apache.solr.update.SolrIndexWriter@5e2d98d0 commitCommandVersion:0
   [junit4]   2> 1015833 INFO  (TEST-TestSolrDeletionPolicy1.testCommitAge-seed#[DCE78960684CF7B7]) [    ] o.a.s.s.SolrIndexSearcher Opening [Searcher@6837e6d5[collection1] main]
   [junit4]   2> 1015833 INFO  (TEST-TestSolrDeletionPolicy1.testCommitAge-seed#[DCE78960684CF7B7]) [    ] o.a.s.u.DirectUpdateHandler2 end_commit_flush
   [junit4]   2> 1015835 INFO  (searcherExecutor-4710-thread-1) [    ] o.a.s.c.SolrCore [collection1] Registered new searcher Searcher@6837e6d5[collection1] main{ExitableDirectoryReader(UninvertingDirectoryReader(Uninverting(_0(8.2.0):c1:[diagnostics={os=Linux, java.vendor=Oracle Corporation, java.version=1.8.0_191, java.vm.version=25.191-b12, lucene.version=8.2.0, os.arch=amd64, java.runtime.version=1.8.0_191-b12, source=flush, os.version=4.4.0-137-generic, timestamp=1557066636110}]:[attributes={Lucene50StoredFieldsFormat.mode=BEST_SPEED}]) Uninverting(_1(8.2.0):c1:[diagnostics={os=Linux, java.vendor=Oracle Corporation, java.version=1.8.0_191, java.vm.version=25.191-b12, lucene.version=8.2.0, os.arch=amd64, java.runtime.version

[...truncated too long message...]

	at org.apache.solr.update.processor.DistributedUpdateProcessorTest.runCommands(DistributedUpdateProcessorTest.java:144)
   [junit4]    > 	at org.apache.solr.update.processor.DistributedUpdateProcessorTest.testVersionAdd(DistributedUpdateProcessorTest.java:101)
   [junit4]    > 	at org.mockito.internal.junit.JUnitRule$1.evaluateSafely(JUnitRule.java:52)
   [junit4]    > 	at org.mockito.internal.junit.JUnitRule$1.evaluate(JUnitRule.java:43)
   [junit4]    > 	at java.lang.Thread.run(Thread.java:748)
   [junit4]   2> 1925831 INFO  (TEST-DistributedUpdateProcessorTest.testVersionDelete-seed#[DCE78960684CF7B7]) [    ] o.a.s.SolrTestCaseJ4 ###Starting testVersionDelete
   [junit4]   2> 1925832 INFO  (TEST-DistributedUpdateProcessorTest.testVersionDelete-seed#[DCE78960684CF7B7]) [    ] o.a.s.SolrTestCaseJ4 ###Ending testVersionDelete
   [junit4]   2> NOTE: download the large Jenkins line-docs file by running 'ant get-jenkins-line-docs' in the lucene directory.
   [junit4]   2> NOTE: reproduce with: ant test  -Dtestcase=DistributedUpdateProcessorTest -Dtests.method=testVersionDelete -Dtests.seed=DCE78960684CF7B7 -Dtests.multiplier=2 -Dtests.nightly=true -Dtests.slow=true -Dtests.linedocsfile=/home/jenkins/jenkins-slave/workspace/Lucene-Solr-NightlyTests-8.x/test-data/enwiki.random.lines.txt -Dtests.locale=es-MX -Dtests.timezone=Asia/Pontianak -Dtests.asserts=true -Dtests.file.encoding=US-ASCII
   [junit4] ERROR   0.02s J0 | DistributedUpdateProcessorTest.testVersionDelete <<<
   [junit4]    > Throwable #1: java.lang.NullPointerException
   [junit4]    > 	at __randomizedtesting.SeedInfo.seed([DCE78960684CF7B7:2FA9DDDD31A0DE0D]:0)
   [junit4]    > 	at org.mockito.Mockito.spy(Mockito.java:1980)
   [junit4]    > 	at org.apache.solr.update.processor.DistributedUpdateProcessorTest.runCommands(DistributedUpdateProcessorTest.java:144)
   [junit4]    > 	at org.apache.solr.update.processor.DistributedUpdateProcessorTest.testVersionDelete(DistributedUpdateProcessorTest.java:125)
   [junit4]    > 	at org.mockito.internal.junit.JUnitRule$1.evaluateSafely(JUnitRule.java:52)
   [junit4]    > 	at org.mockito.internal.junit.JUnitRule$1.evaluate(JUnitRule.java:43)
   [junit4]    > 	at java.lang.Thread.run(Thread.java:748)
   [junit4]   2> 1925833 INFO  (SUITE-DistributedUpdateProcessorTest-seed#[DCE78960684CF7B7]-worker) [    ] o.a.s.SolrTestCaseJ4 ###deleteCore
   [junit4]   2> 1925833 INFO  (SUITE-DistributedUpdateProcessorTest-seed#[DCE78960684CF7B7]-worker) [    ] o.a.s.c.CoreContainer Shutting down CoreContainer instance=988929005
   [junit4]   2> 1925834 INFO  (coreCloseExecutor-8702-thread-1) [    x:collection1] o.a.s.c.SolrCore [collection1]  CLOSING SolrCore org.apache.solr.core.SolrCore@a6caec8
   [junit4]   2> 1925834 INFO  (coreCloseExecutor-8702-thread-1) [    x:collection1] o.a.s.m.SolrMetricManager Closing metric reporters for registry=solr.core.collection1, tag=a6caec8
   [junit4]   2> 1925834 INFO  (coreCloseExecutor-8702-thread-1) [    x:collection1] o.a.s.m.r.SolrJmxReporter Closing reporter [org.apache.solr.metrics.reporters.SolrJmxReporter@6c945465: rootName = null, domain = solr.core.collection1, service url = null, agent id = null] for registry solr.core.collection1 / com.codahale.metrics.MetricRegistry@3b66af97
   [junit4]   2> 1925855 INFO  (SUITE-DistributedUpdateProcessorTest-seed#[DCE78960684CF7B7]-worker) [    ] o.a.s.m.SolrMetricManager Closing metric reporters for registry=solr.node, tag=null
   [junit4]   2> 1925855 INFO  (SUITE-DistributedUpdateProcessorTest-seed#[DCE78960684CF7B7]-worker) [    ] o.a.s.m.r.SolrJmxReporter Closing reporter [org.apache.solr.metrics.reporters.SolrJmxReporter@524ecf44: rootName = null, domain = solr.node, service url = null, agent id = null] for registry solr.node / com.codahale.metrics.MetricRegistry@1bf398da
   [junit4]   2> 1925861 INFO  (SUITE-DistributedUpdateProcessorTest-seed#[DCE78960684CF7B7]-worker) [    ] o.a.s.m.SolrMetricManager Closing metric reporters for registry=solr.jvm, tag=null
   [junit4]   2> 1925861 INFO  (SUITE-DistributedUpdateProcessorTest-seed#[DCE78960684CF7B7]-worker) [    ] o.a.s.m.r.SolrJmxReporter Closing reporter [org.apache.solr.metrics.reporters.SolrJmxReporter@14c7abde: rootName = null, domain = solr.jvm, service url = null, agent id = null] for registry solr.jvm / com.codahale.metrics.MetricRegistry@155953de
   [junit4]   2> 1925864 INFO  (SUITE-DistributedUpdateProcessorTest-seed#[DCE78960684CF7B7]-worker) [    ] o.a.s.m.SolrMetricManager Closing metric reporters for registry=solr.jetty, tag=null
   [junit4]   2> 1925864 INFO  (SUITE-DistributedUpdateProcessorTest-seed#[DCE78960684CF7B7]-worker) [    ] o.a.s.m.r.SolrJmxReporter Closing reporter [org.apache.solr.metrics.reporters.SolrJmxReporter@d4e6c77: rootName = null, domain = solr.jetty, service url = null, agent id = null] for registry solr.jetty / com.codahale.metrics.MetricRegistry@5d811dc7
   [junit4]   2> NOTE: leaving temporary files on disk at: /x1/jenkins/jenkins-slave/workspace/Lucene-Solr-NightlyTests-8.x/checkout/solr/build/solr-core/test/J0/temp/solr.update.processor.DistributedUpdateProcessorTest_DCE78960684CF7B7-001
   [junit4]   2> NOTE: test params are: codec=Lucene80, sim=Asserting(org.apache.lucene.search.similarities.AssertingSimilarity@2904bad8), locale=es-MX, timezone=Asia/Pontianak
   [junit4]   2> NOTE: Linux 4.4.0-137-generic amd64/Oracle Corporation 1.8.0_191 (64-bit)/cpus=4,threads=1,free=182440968,total=517996544
   [junit4]   2> NOTE: All tests run in this JVM: [TermsComponentTest, TestAtomicUpdateErrorCases, JsonLoaderTest, SampleTest, CachingDirectoryFactoryTest, MetricTriggerTest, TestRequestForwarding, BasicDistributedZk2Test, ZkSolrClientTest, SystemLogListenerTest, TestStressUserVersions, TestDocTermOrds, CursorMarkTest, TestSweetSpotSimilarityFactory, TestExportWriter, TestSolrQueryParser, TestStressCloudBlindAtomicUpdates, DeleteLastCustomShardedReplicaTest, TestSimGenericDistributedQueue, TestAnalyzedSuggestions, BaseCdcrDistributedZkTest, TestConfigSets, DistributedDebugComponentTest, TestHalfAndHalfDocValues, BlockJoinFacetRandomTest, TestDFISimilarityFactory, SolrRrdBackendFactoryTest, TestSolrConfigHandlerCloud, TestLRUStatsCache, EnumFieldTest, OverseerCollectionConfigSetProcessorTest, TestLegacyField, RequestLoggingTest, TestLegacyTerms, DistributedFacetPivotSmallTest, RandomizedTaggerTest, TaggingAttributeTest, JvmMetricsTest, CurrencyFieldTypeTest, SpatialHeatmapFacetsTest, ForceLeaderWithTlogReplicasTest, TestWordDelimiterFilterFactory, CursorPagingTest, DistributedSpellCheckComponentTest, RequestHandlersTest, TestRandomDVFaceting, TestCloudSchemaless, TestMinMaxOnMultiValuedField, ZkFailoverTest, IndexBasedSpellCheckerTest, MetricsHistoryWithAuthIntegrationTest, TestFieldCacheReopen, CollectionsAPIDistributedZkTest, SubstringBytesRefFilterTest, TestDistribIDF, BasicAuthIntegrationTest, CacheHeaderTest, NumericFieldsTest, SearchHandlerTest, RequiredFieldsTest, IndexSchemaTest, TestSolrCloudSnapshots, TestSolrDeletionPolicy1, SuggesterTest, SpellPossibilityIteratorTest, NumberUtilsTest, SpellCheckComponentTest, TestDeprecatedFilters, TestManagedResourceStorage, DocValuesMissingTest, TestGraphTermsQParserPlugin, TestSolrCoreParser, TestBinaryResponseWriter, TestSimNodeLostTrigger, JWTAuthPluginTest, OverseerStatusTest, PreAnalyzedFieldManagedSchemaCloudTest, TestChildDocTransformer, DirectoryFactoryTest, UpdateParamsTest, TestCopyFieldCollectionResource, RestoreTriggerStateTest, LeaderVoteWaitTimeoutTest, ChaosMonkeyNothingIsSafeTest, CollectionReloadTest, TestFilteredDocIdSet, CdcrVersionReplicationTest, DistributedFacetPivotLargeTest, TestCollectionAPI, TestPseudoReturnFields, TestDynamicLoading, TlogReplayBufferedWhileIndexingTest, TestRuleBasedAuthorizationPlugin, DistanceFunctionTest, SpatialFilterTest, CoreAdminRequestStatusTest, QueryElevationComponentTest, TestQuerySenderListener, BooleanFieldTest, TestCoreAdminApis, ChaosMonkeySafeLeaderWithPullReplicasTest, TestSolrCoreProperties, TestUpdate, SliceStateTest, TestRTGBase, TestSolrXml, CreateCollectionCleanupTest, TimeRoutedAliasUpdateProcessorTest, TestReRankQParserPlugin, TestShortCircuitedRequests, AddReplicaTest, TestDistributedMap, CustomHighlightComponentTest, TestPHPSerializedResponseWriter, HighlighterConfigTest, TestGeoJSONResponseWriter, TestDocBasedVersionConstraints, SimplePostToolTest, PluginInfoTest, TestPostingsSolrHighlighter, TestPrepRecovery, RollingRestartTest, CSVRequestHandlerTest, TestLazyCores, TestReplicationHandlerBackup, SolrXmlInZkTest, TestGroupingSearch, TestBadConfig, TestUseDocValuesAsStored, ReindexCollectionTest, ComputePlanActionTest, DistributedUpdateProcessorTest]
   [junit4] Completed [405/855 (4!)] on J0 in 0.77s, 3 tests, 2 errors <<< FAILURES!

[...truncated 1518 lines...]
   [junit4] JVM J1: stdout was not empty, see: /x1/jenkins/jenkins-slave/workspace/Lucene-Solr-NightlyTests-8.x/checkout/solr/build/solr-core/test/temp/junit4-J1-20190505_141340_1438308156032380241415.sysout
   [junit4] >>> JVM J1 emitted unexpected output (verbatim) ----
   [junit4] java.lang.OutOfMemoryError: GC overhead limit exceeded
   [junit4] Dumping heap to /x1/jenkins/jenkins-slave/workspace/Lucene-Solr-NightlyTests-8.x/checkout/heapdumps/java_pid15319.hprof ...
   [junit4] Heap dump file created [257961526 bytes in 12.994 secs]
   [junit4] <<< JVM J1: EOF ----

[...truncated 8970 lines...]
BUILD FAILED
/x1/jenkins/jenkins-slave/workspace/Lucene-Solr-NightlyTests-8.x/checkout/build.xml:652: The following error occurred while executing this line:
/x1/jenkins/jenkins-slave/workspace/Lucene-Solr-NightlyTests-8.x/checkout/build.xml:586: Some of the tests produced a heap dump, but did not fail. Maybe a suppressed OutOfMemoryError? Dumps created:
* java_pid15319.hprof

Total time: 313 minutes 45 seconds
Build step 'Invoke Ant' marked build as failure
Archiving artifacts
Recording test results
Email was triggered for: Failure - Any
Sending email for trigger: Failure - Any

Mime
View raw message