lucene-dev mailing list archives

Site index · List index
Message view « Date » · « Thread »
Top « Date » · « Thread »
From Policeman Jenkins Server <jenk...@thetaphi.de>
Subject [JENKINS] Lucene-Solr-8.x-Linux (32bit/jdk1.8.0_201) - Build # 494 - Still Failing!
Date Wed, 01 May 2019 09:33:11 GMT
Build: https://jenkins.thetaphi.de/job/Lucene-Solr-8.x-Linux/494/
Java: 32bit/jdk1.8.0_201 -server -XX:+UseConcMarkSweepGC

2 tests failed.
FAILED:  org.apache.solr.update.PeerSyncTest.test

Error Message:
Unexpected exception type, expected SolrException but got org.apache.solr.client.solrj.SolrServerException: Timeout occurred while waiting response from server at: http://127.0.0.1:36427/rml/collection1

Stack Trace:
junit.framework.AssertionFailedError: Unexpected exception type, expected SolrException but got org.apache.solr.client.solrj.SolrServerException: Timeout occurred while waiting response from server at: http://127.0.0.1:36427/rml/collection1
	at __randomizedtesting.SeedInfo.seed([5264C3167144BF37:DA30FCCCDFB8D2CF]:0)
	at org.apache.lucene.util.LuceneTestCase.expectThrows(LuceneTestCase.java:2700)
	at org.apache.lucene.util.LuceneTestCase.expectThrows(LuceneTestCase.java:2689)
	at org.apache.solr.update.PeerSyncTest.test(PeerSyncTest.java:279)
	at sun.reflect.NativeMethodAccessorImpl.invoke0(Native Method)
	at sun.reflect.NativeMethodAccessorImpl.invoke(NativeMethodAccessorImpl.java:62)
	at sun.reflect.DelegatingMethodAccessorImpl.invoke(DelegatingMethodAccessorImpl.java:43)
	at java.lang.reflect.Method.invoke(Method.java:498)
	at com.carrotsearch.randomizedtesting.RandomizedRunner.invoke(RandomizedRunner.java:1750)
	at com.carrotsearch.randomizedtesting.RandomizedRunner$8.evaluate(RandomizedRunner.java:938)
	at com.carrotsearch.randomizedtesting.RandomizedRunner$9.evaluate(RandomizedRunner.java:974)
	at com.carrotsearch.randomizedtesting.RandomizedRunner$10.evaluate(RandomizedRunner.java:988)
	at org.apache.solr.BaseDistributedSearchTestCase$ShardsRepeatRule$ShardsFixedStatement.callStatement(BaseDistributedSearchTestCase.java:1082)
	at org.apache.solr.BaseDistributedSearchTestCase$ShardsRepeatRule$ShardsStatement.evaluate(BaseDistributedSearchTestCase.java:1054)
	at com.carrotsearch.randomizedtesting.rules.SystemPropertiesRestoreRule$1.evaluate(SystemPropertiesRestoreRule.java:57)
	at org.apache.lucene.util.TestRuleSetupTeardownChained$1.evaluate(TestRuleSetupTeardownChained.java:49)
	at org.apache.lucene.util.AbstractBeforeAfterRule$1.evaluate(AbstractBeforeAfterRule.java:45)
	at org.apache.lucene.util.TestRuleThreadAndTestName$1.evaluate(TestRuleThreadAndTestName.java:48)
	at org.apache.lucene.util.TestRuleIgnoreAfterMaxFailures$1.evaluate(TestRuleIgnoreAfterMaxFailures.java:64)
	at org.apache.lucene.util.TestRuleMarkFailure$1.evaluate(TestRuleMarkFailure.java:47)
	at com.carrotsearch.randomizedtesting.rules.StatementAdapter.evaluate(StatementAdapter.java:36)
	at com.carrotsearch.randomizedtesting.ThreadLeakControl$StatementRunner.run(ThreadLeakControl.java:368)
	at com.carrotsearch.randomizedtesting.ThreadLeakControl.forkTimeoutingTask(ThreadLeakControl.java:817)
	at com.carrotsearch.randomizedtesting.ThreadLeakControl$3.evaluate(ThreadLeakControl.java:468)
	at com.carrotsearch.randomizedtesting.RandomizedRunner.runSingleTest(RandomizedRunner.java:947)
	at com.carrotsearch.randomizedtesting.RandomizedRunner$5.evaluate(RandomizedRunner.java:832)
	at com.carrotsearch.randomizedtesting.RandomizedRunner$6.evaluate(RandomizedRunner.java:883)
	at com.carrotsearch.randomizedtesting.RandomizedRunner$7.evaluate(RandomizedRunner.java:894)
	at com.carrotsearch.randomizedtesting.rules.StatementAdapter.evaluate(StatementAdapter.java:36)
	at com.carrotsearch.randomizedtesting.rules.SystemPropertiesRestoreRule$1.evaluate(SystemPropertiesRestoreRule.java:57)
	at org.apache.lucene.util.AbstractBeforeAfterRule$1.evaluate(AbstractBeforeAfterRule.java:45)
	at com.carrotsearch.randomizedtesting.rules.StatementAdapter.evaluate(StatementAdapter.java:36)
	at org.apache.lucene.util.TestRuleStoreClassName$1.evaluate(TestRuleStoreClassName.java:41)
	at com.carrotsearch.randomizedtesting.rules.NoShadowingOrOverridesOnMethodsRule$1.evaluate(NoShadowingOrOverridesOnMethodsRule.java:40)
	at com.carrotsearch.randomizedtesting.rules.NoShadowingOrOverridesOnMethodsRule$1.evaluate(NoShadowingOrOverridesOnMethodsRule.java:40)
	at com.carrotsearch.randomizedtesting.rules.StatementAdapter.evaluate(StatementAdapter.java:36)
	at com.carrotsearch.randomizedtesting.rules.StatementAdapter.evaluate(StatementAdapter.java:36)
	at com.carrotsearch.randomizedtesting.rules.StatementAdapter.evaluate(StatementAdapter.java:36)
	at org.apache.lucene.util.TestRuleAssertionsRequired$1.evaluate(TestRuleAssertionsRequired.java:53)
	at org.apache.lucene.util.TestRuleMarkFailure$1.evaluate(TestRuleMarkFailure.java:47)
	at org.apache.lucene.util.TestRuleIgnoreAfterMaxFailures$1.evaluate(TestRuleIgnoreAfterMaxFailures.java:64)
	at org.apache.lucene.util.TestRuleIgnoreTestSuites$1.evaluate(TestRuleIgnoreTestSuites.java:54)
	at com.carrotsearch.randomizedtesting.rules.StatementAdapter.evaluate(StatementAdapter.java:36)
	at com.carrotsearch.randomizedtesting.ThreadLeakControl$StatementRunner.run(ThreadLeakControl.java:368)
	at java.lang.Thread.run(Thread.java:748)
Caused by: org.apache.solr.client.solrj.SolrServerException: Timeout occurred while waiting response from server at: http://127.0.0.1:36427/rml/collection1
	at org.apache.solr.client.solrj.impl.HttpSolrClient.executeMethod(HttpSolrClient.java:660)
	at org.apache.solr.client.solrj.impl.HttpSolrClient.request(HttpSolrClient.java:255)
	at org.apache.solr.client.solrj.impl.HttpSolrClient.request(HttpSolrClient.java:244)
	at org.apache.solr.client.solrj.SolrRequest.process(SolrRequest.java:207)
	at org.apache.solr.client.solrj.SolrRequest.process(SolrRequest.java:224)
	at org.apache.solr.BaseDistributedSearchTestCase.add(BaseDistributedSearchTestCase.java:576)
	at org.apache.solr.update.PeerSyncTest.lambda$test$0(PeerSyncTest.java:281)
	at org.apache.lucene.util.LuceneTestCase.expectThrows(LuceneTestCase.java:2695)
	... 43 more
Caused by: java.net.SocketTimeoutException: Read timed out
	at java.net.SocketInputStream.socketRead0(Native Method)
	at java.net.SocketInputStream.socketRead(SocketInputStream.java:116)
	at java.net.SocketInputStream.read(SocketInputStream.java:171)
	at java.net.SocketInputStream.read(SocketInputStream.java:141)
	at org.apache.http.impl.io.SessionInputBufferImpl.streamRead(SessionInputBufferImpl.java:137)
	at org.apache.http.impl.io.SessionInputBufferImpl.fillBuffer(SessionInputBufferImpl.java:153)
	at org.apache.http.impl.io.SessionInputBufferImpl.readLine(SessionInputBufferImpl.java:282)
	at org.apache.http.impl.conn.DefaultHttpResponseParser.parseHead(DefaultHttpResponseParser.java:138)
	at org.apache.http.impl.conn.DefaultHttpResponseParser.parseHead(DefaultHttpResponseParser.java:56)
	at org.apache.http.impl.io.AbstractMessageParser.parse(AbstractMessageParser.java:259)
	at org.apache.http.impl.DefaultBHttpClientConnection.receiveResponseHeader(DefaultBHttpClientConnection.java:163)
	at org.apache.http.impl.conn.CPoolProxy.receiveResponseHeader(CPoolProxy.java:165)
	at org.apache.http.protocol.HttpRequestExecutor.doReceiveResponse(HttpRequestExecutor.java:273)
	at org.apache.http.protocol.HttpRequestExecutor.execute(HttpRequestExecutor.java:125)
	at org.apache.http.impl.execchain.MainClientExec.execute(MainClientExec.java:272)
	at org.apache.http.impl.execchain.ProtocolExec.execute(ProtocolExec.java:185)
	at org.apache.http.impl.execchain.RetryExec.execute(RetryExec.java:89)
	at org.apache.http.impl.execchain.RedirectExec.execute(RedirectExec.java:110)
	at org.apache.http.impl.client.InternalHttpClient.doExecute(InternalHttpClient.java:185)
	at org.apache.http.impl.client.CloseableHttpClient.execute(CloseableHttpClient.java:83)
	at org.apache.http.impl.client.CloseableHttpClient.execute(CloseableHttpClient.java:56)
	at org.apache.solr.client.solrj.impl.HttpSolrClient.executeMethod(HttpSolrClient.java:548)
	... 50 more


FAILED:  org.apache.solr.update.PeerSyncWithLeaderTest.test

Error Message:
Unexpected exception type, expected SolrException but got org.apache.solr.client.solrj.SolrServerException: Timeout occurred while waiting response from server at: http://127.0.0.1:40023/s_xuj/f/collection1

Stack Trace:
junit.framework.AssertionFailedError: Unexpected exception type, expected SolrException but got org.apache.solr.client.solrj.SolrServerException: Timeout occurred while waiting response from server at: http://127.0.0.1:40023/s_xuj/f/collection1
	at __randomizedtesting.SeedInfo.seed([5264C3167144BF37:DA30FCCCDFB8D2CF]:0)
	at org.apache.lucene.util.LuceneTestCase.expectThrows(LuceneTestCase.java:2700)
	at org.apache.lucene.util.LuceneTestCase.expectThrows(LuceneTestCase.java:2689)
	at org.apache.solr.update.PeerSyncTest.test(PeerSyncTest.java:279)
	at sun.reflect.NativeMethodAccessorImpl.invoke0(Native Method)
	at sun.reflect.NativeMethodAccessorImpl.invoke(NativeMethodAccessorImpl.java:62)
	at sun.reflect.DelegatingMethodAccessorImpl.invoke(DelegatingMethodAccessorImpl.java:43)
	at java.lang.reflect.Method.invoke(Method.java:498)
	at com.carrotsearch.randomizedtesting.RandomizedRunner.invoke(RandomizedRunner.java:1750)
	at com.carrotsearch.randomizedtesting.RandomizedRunner$8.evaluate(RandomizedRunner.java:938)
	at com.carrotsearch.randomizedtesting.RandomizedRunner$9.evaluate(RandomizedRunner.java:974)
	at com.carrotsearch.randomizedtesting.RandomizedRunner$10.evaluate(RandomizedRunner.java:988)
	at org.apache.solr.BaseDistributedSearchTestCase$ShardsRepeatRule$ShardsFixedStatement.callStatement(BaseDistributedSearchTestCase.java:1082)
	at org.apache.solr.BaseDistributedSearchTestCase$ShardsRepeatRule$ShardsStatement.evaluate(BaseDistributedSearchTestCase.java:1054)
	at com.carrotsearch.randomizedtesting.rules.SystemPropertiesRestoreRule$1.evaluate(SystemPropertiesRestoreRule.java:57)
	at org.apache.lucene.util.TestRuleSetupTeardownChained$1.evaluate(TestRuleSetupTeardownChained.java:49)
	at org.apache.lucene.util.AbstractBeforeAfterRule$1.evaluate(AbstractBeforeAfterRule.java:45)
	at org.apache.lucene.util.TestRuleThreadAndTestName$1.evaluate(TestRuleThreadAndTestName.java:48)
	at org.apache.lucene.util.TestRuleIgnoreAfterMaxFailures$1.evaluate(TestRuleIgnoreAfterMaxFailures.java:64)
	at org.apache.lucene.util.TestRuleMarkFailure$1.evaluate(TestRuleMarkFailure.java:47)
	at com.carrotsearch.randomizedtesting.rules.StatementAdapter.evaluate(StatementAdapter.java:36)
	at com.carrotsearch.randomizedtesting.ThreadLeakControl$StatementRunner.run(ThreadLeakControl.java:368)
	at com.carrotsearch.randomizedtesting.ThreadLeakControl.forkTimeoutingTask(ThreadLeakControl.java:817)
	at com.carrotsearch.randomizedtesting.ThreadLeakControl$3.evaluate(ThreadLeakControl.java:468)
	at com.carrotsearch.randomizedtesting.RandomizedRunner.runSingleTest(RandomizedRunner.java:947)
	at com.carrotsearch.randomizedtesting.RandomizedRunner$5.evaluate(RandomizedRunner.java:832)
	at com.carrotsearch.randomizedtesting.RandomizedRunner$6.evaluate(RandomizedRunner.java:883)
	at com.carrotsearch.randomizedtesting.RandomizedRunner$7.evaluate(RandomizedRunner.java:894)
	at com.carrotsearch.randomizedtesting.rules.StatementAdapter.evaluate(StatementAdapter.java:36)
	at com.carrotsearch.randomizedtesting.rules.SystemPropertiesRestoreRule$1.evaluate(SystemPropertiesRestoreRule.java:57)
	at org.apache.lucene.util.AbstractBeforeAfterRule$1.evaluate(AbstractBeforeAfterRule.java:45)
	at com.carrotsearch.randomizedtesting.rules.StatementAdapter.evaluate(StatementAdapter.java:36)
	at org.apache.lucene.util.TestRuleStoreClassName$1.evaluate(TestRuleStoreClassName.java:41)
	at com.carrotsearch.randomizedtesting.rules.NoShadowingOrOverridesOnMethodsRule$1.evaluate(NoShadowingOrOverridesOnMethodsRule.java:40)
	at com.carrotsearch.randomizedtesting.rules.NoShadowingOrOverridesOnMethodsRule$1.evaluate(NoShadowingOrOverridesOnMethodsRule.java:40)
	at com.carrotsearch.randomizedtesting.rules.StatementAdapter.evaluate(StatementAdapter.java:36)
	at com.carrotsearch.randomizedtesting.rules.StatementAdapter.evaluate(StatementAdapter.java:36)
	at com.carrotsearch.randomizedtesting.rules.StatementAdapter.evaluate(StatementAdapter.java:36)
	at org.apache.lucene.util.TestRuleAssertionsRequired$1.evaluate(TestRuleAssertionsRequired.java:53)
	at org.apache.lucene.util.TestRuleMarkFailure$1.evaluate(TestRuleMarkFailure.java:47)
	at org.apache.lucene.util.TestRuleIgnoreAfterMaxFailures$1.evaluate(TestRuleIgnoreAfterMaxFailures.java:64)
	at org.apache.lucene.util.TestRuleIgnoreTestSuites$1.evaluate(TestRuleIgnoreTestSuites.java:54)
	at com.carrotsearch.randomizedtesting.rules.StatementAdapter.evaluate(StatementAdapter.java:36)
	at com.carrotsearch.randomizedtesting.ThreadLeakControl$StatementRunner.run(ThreadLeakControl.java:368)
	at java.lang.Thread.run(Thread.java:748)
Caused by: org.apache.solr.client.solrj.SolrServerException: Timeout occurred while waiting response from server at: http://127.0.0.1:40023/s_xuj/f/collection1
	at org.apache.solr.client.solrj.impl.HttpSolrClient.executeMethod(HttpSolrClient.java:660)
	at org.apache.solr.client.solrj.impl.HttpSolrClient.request(HttpSolrClient.java:255)
	at org.apache.solr.client.solrj.impl.HttpSolrClient.request(HttpSolrClient.java:244)
	at org.apache.solr.client.solrj.SolrRequest.process(SolrRequest.java:207)
	at org.apache.solr.client.solrj.SolrRequest.process(SolrRequest.java:224)
	at org.apache.solr.BaseDistributedSearchTestCase.add(BaseDistributedSearchTestCase.java:576)
	at org.apache.solr.update.PeerSyncTest.lambda$test$0(PeerSyncTest.java:281)
	at org.apache.lucene.util.LuceneTestCase.expectThrows(LuceneTestCase.java:2695)
	... 43 more
Caused by: java.net.SocketTimeoutException: Read timed out
	at java.net.SocketInputStream.socketRead0(Native Method)
	at java.net.SocketInputStream.socketRead(SocketInputStream.java:116)
	at java.net.SocketInputStream.read(SocketInputStream.java:171)
	at java.net.SocketInputStream.read(SocketInputStream.java:141)
	at org.apache.http.impl.io.SessionInputBufferImpl.streamRead(SessionInputBufferImpl.java:137)
	at org.apache.http.impl.io.SessionInputBufferImpl.fillBuffer(SessionInputBufferImpl.java:153)
	at org.apache.http.impl.io.SessionInputBufferImpl.readLine(SessionInputBufferImpl.java:282)
	at org.apache.http.impl.conn.DefaultHttpResponseParser.parseHead(DefaultHttpResponseParser.java:138)
	at org.apache.http.impl.conn.DefaultHttpResponseParser.parseHead(DefaultHttpResponseParser.java:56)
	at org.apache.http.impl.io.AbstractMessageParser.parse(AbstractMessageParser.java:259)
	at org.apache.http.impl.DefaultBHttpClientConnection.receiveResponseHeader(DefaultBHttpClientConnection.java:163)
	at org.apache.http.impl.conn.CPoolProxy.receiveResponseHeader(CPoolProxy.java:165)
	at org.apache.http.protocol.HttpRequestExecutor.doReceiveResponse(HttpRequestExecutor.java:273)
	at org.apache.http.protocol.HttpRequestExecutor.execute(HttpRequestExecutor.java:125)
	at org.apache.http.impl.execchain.MainClientExec.execute(MainClientExec.java:272)
	at org.apache.http.impl.execchain.ProtocolExec.execute(ProtocolExec.java:185)
	at org.apache.http.impl.execchain.RetryExec.execute(RetryExec.java:89)
	at org.apache.http.impl.execchain.RedirectExec.execute(RedirectExec.java:110)
	at org.apache.http.impl.client.InternalHttpClient.doExecute(InternalHttpClient.java:185)
	at org.apache.http.impl.client.CloseableHttpClient.execute(CloseableHttpClient.java:83)
	at org.apache.http.impl.client.CloseableHttpClient.execute(CloseableHttpClient.java:56)
	at org.apache.solr.client.solrj.impl.HttpSolrClient.executeMethod(HttpSolrClient.java:548)
	... 50 more




Build Log:
[...truncated 14322 lines...]
   [junit4] Suite: org.apache.solr.update.PeerSyncTest
   [junit4]   2> Creating dataDir: /home/jenkins/workspace/Lucene-Solr-8.x-Linux/solr/build/solr-core/test/J1/temp/solr.update.PeerSyncTest_5264C3167144BF37-001/init-core-data-001
   [junit4]   2> 1132037 WARN  (SUITE-PeerSyncTest-seed#[5264C3167144BF37]-worker) [    ] o.a.s.SolrTestCaseJ4 startTrackingSearchers: numOpens=4 numCloses=4
   [junit4]   2> 1132037 INFO  (SUITE-PeerSyncTest-seed#[5264C3167144BF37]-worker) [    ] o.a.s.SolrTestCaseJ4 Using PointFields (NUMERIC_POINTS_SYSPROP=true) w/NUMERIC_DOCVALUES_SYSPROP=false
   [junit4]   2> 1132039 INFO  (SUITE-PeerSyncTest-seed#[5264C3167144BF37]-worker) [    ] o.a.s.SolrTestCaseJ4 Randomized ssl (false) and clientAuth (false) via: @org.apache.solr.SolrTestCaseJ4$SuppressSSL(bugUrl=https://issues.apache.org/jira/browse/SOLR-5776)
   [junit4]   2> 1132039 INFO  (SUITE-PeerSyncTest-seed#[5264C3167144BF37]-worker) [    ] o.a.s.SolrTestCaseJ4 SecureRandom sanity checks: test.solr.allowed.securerandom=null & java.security.egd=file:/dev/./urandom
   [junit4]   2> 1132039 INFO  (SUITE-PeerSyncTest-seed#[5264C3167144BF37]-worker) [    ] o.a.s.BaseDistributedSearchTestCase Setting hostContext system property: /rml/
   [junit4]   2> 1132040 INFO  (TEST-PeerSyncTest.test-seed#[5264C3167144BF37]) [    ] o.a.s.SolrTestCaseJ4 ####initCore
   [junit4]   2> 1132040 INFO  (TEST-PeerSyncTest.test-seed#[5264C3167144BF37]) [    ] o.a.s.c.SolrResourceLoader [null] Added 2 libs to classloader, from paths: [/home/jenkins/workspace/Lucene-Solr-8.x-Linux/solr/core/src/test-files/solr/collection1/lib, /home/jenkins/workspace/Lucene-Solr-8.x-Linux/solr/core/src/test-files/solr/collection1/lib/classes]
   [junit4]   2> 1132060 INFO  (TEST-PeerSyncTest.test-seed#[5264C3167144BF37]) [    ] o.a.s.c.SolrConfig Using Lucene MatchVersion: 8.1.0
   [junit4]   2> 1132082 INFO  (TEST-PeerSyncTest.test-seed#[5264C3167144BF37]) [    ] o.a.s.s.IndexSchema [null] Schema name=test
   [junit4]   2> 1132188 INFO  (TEST-PeerSyncTest.test-seed#[5264C3167144BF37]) [    ] o.a.s.s.IndexSchema Loaded schema test/1.0 with uniqueid field id
   [junit4]   2> 1132679 INFO  (TEST-PeerSyncTest.test-seed#[5264C3167144BF37]) [    ] o.a.s.h.c.HttpShardHandlerFactory Host whitelist initialized: WhitelistHostChecker [whitelistHosts=null, whitelistHostCheckingEnabled=false]
   [junit4]   2> 1132681 WARN  (TEST-PeerSyncTest.test-seed#[5264C3167144BF37]) [    ] o.e.j.u.s.S.config No Client EndPointIdentificationAlgorithm configured for SslContextFactory@cd9f7b[provider=null,keyStore=null,trustStore=null]
   [junit4]   2> 1132684 WARN  (TEST-PeerSyncTest.test-seed#[5264C3167144BF37]) [    ] o.e.j.u.s.S.config No Client EndPointIdentificationAlgorithm configured for SslContextFactory@422a99[provider=null,keyStore=null,trustStore=null]
   [junit4]   2> 1132704 INFO  (TEST-PeerSyncTest.test-seed#[5264C3167144BF37]) [    ] o.a.s.c.TransientSolrCoreCacheDefault Allocating transient cache for 2147483647 transient cores
   [junit4]   2> 1132704 INFO  (TEST-PeerSyncTest.test-seed#[5264C3167144BF37]) [    ] o.a.s.h.a.MetricsHistoryHandler No .system collection, keeping metrics history in memory.
   [junit4]   2> 1132719 INFO  (TEST-PeerSyncTest.test-seed#[5264C3167144BF37]) [    ] o.a.s.m.r.SolrJmxReporter JMX monitoring for 'solr.node' (registry 'solr.node') enabled at server: com.sun.jmx.mbeanserver.JmxMBeanServer@b7cac1
   [junit4]   2> 1132726 INFO  (TEST-PeerSyncTest.test-seed#[5264C3167144BF37]) [    ] o.a.s.m.r.SolrJmxReporter JMX monitoring for 'solr.jvm' (registry 'solr.jvm') enabled at server: com.sun.jmx.mbeanserver.JmxMBeanServer@b7cac1
   [junit4]   2> 1132726 INFO  (TEST-PeerSyncTest.test-seed#[5264C3167144BF37]) [    ] o.a.s.m.r.SolrJmxReporter JMX monitoring for 'solr.jetty' (registry 'solr.jetty') enabled at server: com.sun.jmx.mbeanserver.JmxMBeanServer@b7cac1
   [junit4]   2> 1132728 INFO  (coreLoadExecutor-6107-thread-1) [    x:collection1] o.a.s.c.SolrResourceLoader [null] Added 2 libs to classloader, from paths: [/home/jenkins/workspace/Lucene-Solr-8.x-Linux/solr/core/src/test-files/solr/collection1/lib, /home/jenkins/workspace/Lucene-Solr-8.x-Linux/solr/core/src/test-files/solr/collection1/lib/classes]
   [junit4]   2> 1132756 INFO  (coreLoadExecutor-6107-thread-1) [    x:collection1] o.a.s.c.SolrConfig Using Lucene MatchVersion: 8.1.0
   [junit4]   2> 1132770 INFO  (coreLoadExecutor-6107-thread-1) [    x:collection1] o.a.s.s.IndexSchema [collection1] Schema name=test
   [junit4]   2> 1132882 INFO  (coreLoadExecutor-6107-thread-1) [    x:collection1] o.a.s.s.IndexSchema Loaded schema test/1.0 with uniqueid field id
   [junit4]   2> 1132887 INFO  (coreLoadExecutor-6107-thread-1) [    x:collection1] o.a.s.c.CoreContainer Creating SolrCore 'collection1' using configuration from instancedir /home/jenkins/workspace/Lucene-Solr-8.x-Linux/solr/core/src/test-files/solr/collection1, trusted=true
   [junit4]   2> 1132888 INFO  (coreLoadExecutor-6107-thread-1) [    x:collection1] o.a.s.m.r.SolrJmxReporter JMX monitoring for 'solr.core.collection1' (registry 'solr.core.collection1') enabled at server: com.sun.jmx.mbeanserver.JmxMBeanServer@b7cac1
   [junit4]   2> 1132888 INFO  (coreLoadExecutor-6107-thread-1) [    x:collection1] o.a.s.c.SolrCore [[collection1] ] Opening new SolrCore at [/home/jenkins/workspace/Lucene-Solr-8.x-Linux/solr/core/src/test-files/solr/collection1], dataDir=[/home/jenkins/workspace/Lucene-Solr-8.x-Linux/solr/build/solr-core/test/J1/temp/solr.update.PeerSyncTest_5264C3167144BF37-001/init-core-data-001/]
   [junit4]   2> 1132889 INFO  (coreLoadExecutor-6107-thread-1) [    x:collection1] o.a.s.u.RandomMergePolicy RandomMergePolicy wrapping class org.apache.lucene.index.LogByteSizeMergePolicy: [LogByteSizeMergePolicy: minMergeSize=1677721, mergeFactor=36, maxMergeSize=2147483648, maxMergeSizeForForcedMerge=9223372036854775807, calibrateSizeByDeletes=false, maxMergeDocs=2147483647, maxCFSSegmentSizeMB=1.39453125, noCFSRatio=0.0]
   [junit4]   2> 1132893 WARN  (coreLoadExecutor-6107-thread-1) [    x:collection1] o.a.s.c.RequestHandlers INVALID paramSet a in requestHandler {type = requestHandler,name = /dump,class = DumpRequestHandler,attributes = {initParams=a, name=/dump, class=DumpRequestHandler},args = {defaults={a=A,b=B}}}
   [junit4]   2> 1132923 INFO  (coreLoadExecutor-6107-thread-1) [    x:collection1] o.a.s.u.UpdateHandler Using UpdateLog implementation: org.apache.solr.update.UpdateLog
   [junit4]   2> 1132923 INFO  (coreLoadExecutor-6107-thread-1) [    x:collection1] o.a.s.u.UpdateLog Initializing UpdateLog: dataDir= defaultSyncLevel=FLUSH numRecordsToKeep=100 maxNumLogsToKeep=10 numVersionBuckets=65536
   [junit4]   2> 1132923 INFO  (coreLoadExecutor-6107-thread-1) [    x:collection1] o.a.s.u.CommitTracker Hard AutoCommit: disabled
   [junit4]   2> 1132923 INFO  (coreLoadExecutor-6107-thread-1) [    x:collection1] o.a.s.u.CommitTracker Soft AutoCommit: disabled
   [junit4]   2> 1132924 INFO  (coreLoadExecutor-6107-thread-1) [    x:collection1] o.a.s.u.RandomMergePolicy RandomMergePolicy wrapping class org.apache.lucene.index.TieredMergePolicy: [TieredMergePolicy: maxMergeAtOnce=37, maxMergeAtOnceExplicit=50, maxMergedSegmentMB=84.513671875, floorSegmentMB=1.7578125, forceMergeDeletesPctAllowed=14.947239500150442, segmentsPerTier=47.0, maxCFSSegmentSizeMB=8.796093022207999E12, noCFSRatio=0.0, deletesPctAllowed=43.637076555318245
   [junit4]   2> 1132924 INFO  (coreLoadExecutor-6107-thread-1) [    x:collection1] o.a.s.s.SolrIndexSearcher Opening [Searcher@1c17de8[collection1] main]
   [junit4]   2> 1132924 WARN  (coreLoadExecutor-6107-thread-1) [    x:collection1] o.a.s.r.ManagedResourceStorage Cannot write to config directory /home/jenkins/workspace/Lucene-Solr-8.x-Linux/solr/core/src/test-files/solr/collection1/conf; switching to use InMemory storage instead.
   [junit4]   2> 1132925 INFO  (coreLoadExecutor-6107-thread-1) [    x:collection1] o.a.s.h.ReplicationHandler Commits will be reserved for 10000ms.
   [junit4]   2> 1132925 INFO  (coreLoadExecutor-6107-thread-1) [    x:collection1] o.a.s.u.UpdateLog Could not find max version in index or recent updates, using new clock 1632319388334948352
   [junit4]   2> 1132927 INFO  (searcherExecutor-6108-thread-1-processing-x:collection1) [    x:collection1] o.a.s.c.SolrCore [collection1] Registered new searcher Searcher@1c17de8[collection1] main{ExitableDirectoryReader(UninvertingDirectoryReader())}
   [junit4]   2> 1132927 INFO  (TEST-PeerSyncTest.test-seed#[5264C3167144BF37]) [    ] o.a.s.SolrTestCaseJ4 ####initCore end
   [junit4]   2> 1133031 INFO  (TEST-PeerSyncTest.test-seed#[5264C3167144BF37]) [    ] o.a.s.SolrTestCaseJ4 Writing core.properties file to /home/jenkins/workspace/Lucene-Solr-8.x-Linux/solr/build/solr-core/test/J1/temp/solr.update.PeerSyncTest_5264C3167144BF37-001/tempDir-001/control/cores/collection1
   [junit4]   2> 1133032 WARN  (TEST-PeerSyncTest.test-seed#[5264C3167144BF37]) [    ] o.e.j.s.AbstractConnector Ignoring deprecated socket close linger time
   [junit4]   2> 1133032 INFO  (TEST-PeerSyncTest.test-seed#[5264C3167144BF37]) [    ] o.a.s.c.s.e.JettySolrRunner Start Jetty (original configured port=0)
   [junit4]   2> 1133032 INFO  (TEST-PeerSyncTest.test-seed#[5264C3167144BF37]) [    ] o.a.s.c.s.e.JettySolrRunner Trying to start Jetty on port 0 try number 1 ...
   [junit4]   2> 1133032 INFO  (TEST-PeerSyncTest.test-seed#[5264C3167144BF37]) [    ] o.e.j.s.Server jetty-9.4.14.v20181114; built: 2018-11-14T21:20:31.478Z; git: c4550056e785fb5665914545889f21dc136ad9e6; jvm 1.8.0_201-b09
   [junit4]   2> 1133044 INFO  (TEST-PeerSyncTest.test-seed#[5264C3167144BF37]) [    ] o.e.j.s.session DefaultSessionIdManager workerName=node0
   [junit4]   2> 1133044 INFO  (TEST-PeerSyncTest.test-seed#[5264C3167144BF37]) [    ] o.e.j.s.session No SessionScavenger set, using defaults
   [junit4]   2> 1133044 INFO  (TEST-PeerSyncTest.test-seed#[5264C3167144BF37]) [    ] o.e.j.s.session node0 Scavenging every 660000ms
   [junit4]   2> 1133047 INFO  (TEST-PeerSyncTest.test-seed#[5264C3167144BF37]) [    ] o.e.j.s.h.ContextHandler Started o.e.j.s.ServletContextHandler@1afdcbc{/rml,null,AVAILABLE}
   [junit4]   2> 1133049 INFO  (TEST-PeerSyncTest.test-seed#[5264C3167144BF37]) [    ] o.e.j.s.AbstractConnector Started ServerConnector@1290b99{HTTP/1.1,[http/1.1, h2c]}{127.0.0.1:40067}
   [junit4]   2> 1133049 INFO  (TEST-PeerSyncTest.test-seed#[5264C3167144BF37]) [    ] o.e.j.s.Server Started @1133087ms
   [junit4]   2> 1133049 INFO  (TEST-PeerSyncTest.test-seed#[5264C3167144BF37]) [    ] o.a.s.c.s.e.JettySolrRunner Jetty properties: {schema=schema.xml, solrconfig=solrconfig-tlog.xml, hostContext=/rml, hostPort=40067, coreRootDirectory=/home/jenkins/workspace/Lucene-Solr-8.x-Linux/solr/build/solr-core/test/J1/temp/solr.update.PeerSyncTest_5264C3167144BF37-001/tempDir-001/control/cores}
   [junit4]   2> 1133050 ERROR (TEST-PeerSyncTest.test-seed#[5264C3167144BF37]) [    ] o.a.s.u.StartupLoggingUtils Missing Java Option solr.log.dir. Logging may be missing or incomplete.
   [junit4]   2> 1133050 INFO  (TEST-PeerSyncTest.test-seed#[5264C3167144BF37]) [    ] o.a.s.s.SolrDispatchFilter Using logger factory org.apache.logging.slf4j.Log4jLoggerFactory
   [junit4]   2> 1133050 INFO  (TEST-PeerSyncTest.test-seed#[5264C3167144BF37]) [    ] o.a.s.s.SolrDispatchFilter  ___      _       Welcome to Apache Solr™ version 8.1.0
   [junit4]   2> 1133050 INFO  (TEST-PeerSyncTest.test-seed#[5264C3167144BF37]) [    ] o.a.s.s.SolrDispatchFilter / __| ___| |_ _   Starting in standalone mode on port null
   [junit4]   2> 1133050 INFO  (TEST-PeerSyncTest.test-seed#[5264C3167144BF37]) [    ] o.a.s.s.SolrDispatchFilter \__ \/ _ \ | '_|  Install dir: null
   [junit4]   2> 1133050 INFO  (TEST-PeerSyncTest.test-seed#[5264C3167144BF37]) [    ] o.a.s.s.SolrDispatchFilter |___/\___/_|_|    Start time: 2019-05-01T08:57:56.952Z
   [junit4]   2> 1133050 INFO  (TEST-PeerSyncTest.test-seed#[5264C3167144BF37]) [    ] o.a.s.c.SolrXmlConfig Loading container configuration from /home/jenkins/workspace/Lucene-Solr-8.x-Linux/solr/build/solr-core/test/J1/temp/solr.update.PeerSyncTest_5264C3167144BF37-001/tempDir-001/control/solr.xml
   [junit4]   2> 1133052 INFO  (TEST-PeerSyncTest.test-seed#[5264C3167144BF37]) [    ] o.a.s.c.SolrXmlConfig Configuration parameter autoReplicaFailoverWorkLoopDelay is ignored
   [junit4]   2> 1133052 INFO  (TEST-PeerSyncTest.test-seed#[5264C3167144BF37]) [    ] o.a.s.c.SolrXmlConfig Configuration parameter autoReplicaFailoverBadNodeExpiration is ignored
   [junit4]   2> 1133053 INFO  (TEST-PeerSyncTest.test-seed#[5264C3167144BF37]) [    ] o.a.s.c.SolrXmlConfig MBean server found: com.sun.jmx.mbeanserver.JmxMBeanServer@b7cac1, but no JMX reporters were configured - adding default JMX reporter.
   [junit4]   2> 1134285 INFO  (TEST-PeerSyncTest.test-seed#[5264C3167144BF37]) [    ] o.a.s.h.c.HttpShardHandlerFactory Host whitelist initialized: WhitelistHostChecker [whitelistHosts=null, whitelistHostCheckingEnabled=false]
   [junit4]   2> 1134286 WARN  (TEST-PeerSyncTest.test-seed#[5264C3167144BF37]) [    ] o.e.j.u.s.S.config No Client EndPointIdentificationAlgorithm configured for SslContextFactory@69d6d0[provider=null,keyStore=null,trustStore=null]
   [junit4]   2> 1134299 WARN  (TEST-PeerSyncTest.test-seed#[5264C3167144BF37]) [    ] o.e.j.u.s.S.config No Client EndPointIdentificationAlgorithm configured for SslContextFactory@809254[provider=null,keyStore=null,trustStore=null]
   [junit4]   2> 1134313 INFO  (TEST-PeerSyncTest.test-seed#[5264C3167144BF37]) [    ] o.a.s.c.TransientSolrCoreCacheDefault Allocating transient cache for 4 transient cores
   [junit4]   2> 1134313 INFO  (TEST-PeerSyncTest.test-seed#[5264C3167144BF37]) [    ] o.a.s.h.a.MetricsHistoryHandler No .system collection, keeping metrics history in memory.
   [junit4]   2> 1134334 INFO  (TEST-PeerSyncTest.test-seed#[5264C3167144BF37]) [    ] o.a.s.m.r.SolrJmxReporter JMX monitoring for 'solr.node' (registry 'solr.node') enabled at server: com.sun.jmx.mbeanserver.JmxMBeanServer@b7cac1
   [junit4]   2> 1134343 INFO  (TEST-PeerSyncTest.test-seed#[5264C3167144BF37]) [    ] o.a.s.m.r.SolrJmxReporter JMX monitoring for 'solr.jvm' (registry 'solr.jvm') enabled at server: com.sun.jmx.mbeanserver.JmxMBeanServer@b7cac1
   [junit4]   2> 1134343 INFO  (TEST-PeerSyncTest.test-seed#[5264C3167144BF37]) [    ] o.a.s.m.r.SolrJmxReporter JMX monitoring for 'solr.jetty' (registry 'solr.jetty') enabled at server: com.sun.jmx.mbeanserver.JmxMBeanServer@b7cac1
   [junit4]   2> 1134345 INFO  (TEST-PeerSyncTest.test-seed#[5264C3167144BF37]) [    ] o.a.s.c.CorePropertiesLocator Found 1 core definitions underneath /home/jenkins/workspace/Lucene-Solr-8.x-Linux/solr/build/solr-core/test/J1/temp/solr.update.PeerSyncTest_5264C3167144BF37-001/tempDir-001/control/cores
   [junit4]   2> 1134345 INFO  (TEST-PeerSyncTest.test-seed#[5264C3167144BF37]) [    ] o.a.s.c.CorePropertiesLocator Cores are: [collection1]
   [junit4]   2> 1134345 INFO  (coreLoadExecutor-6121-thread-1) [    x:collection1] o.a.s.c.SolrResourceLoader [null] Added 2 libs to classloader, from paths: [/home/jenkins/workspace/Lucene-Solr-8.x-Linux/solr/core/src/test-files/solr/collection1/lib, /home/jenkins/workspace/Lucene-Solr-8.x-Linux/solr/core/src/test-files/solr/collection1/lib/classes]
   [junit4]   2> 1134384 INFO  (coreLoadExecutor-6121-thread-1) [    x:collection1] o.a.s.c.SolrConfig Using Lucene MatchVersion: 8.1.0
   [junit4]   2> 1134397 INFO  (coreLoadExecutor-6121-thread-1) [    x:collection1] o.a.s.s.IndexSchema [collection1] Schema name=test
   [junit4]   2> 1134517 INFO  (coreLoadExecutor-6121-thread-1) [    x:collection1] o.a.s.s.IndexSchema Loaded schema test/1.0 with uniqueid field id
   [junit4]   2> 1134522 INFO  (coreLoadExecutor-6121-thread-1) [    x:collection1] o.a.s.c.CoreContainer Creating SolrCore 'collection1' using configuration from configset /home/jenkins/workspace/Lucene-Solr-8.x-Linux/solr/core/src/test-files/solr/collection1, trusted=true
   [junit4]   2> 1134523 INFO  (coreLoadExecutor-6121-thread-1) [    x:collection1] o.a.s.m.r.SolrJmxReporter JMX monitoring for 'solr.core.collection1' (registry 'solr.core.collection1') enabled at server: com.sun.jmx.mbeanserver.JmxMBeanServer@b7cac1
   [junit4]   2> 1134523 INFO  (coreLoadExecutor-6121-thread-1) [    x:collection1] o.a.s.c.SolrCore [[collection1] ] Opening new SolrCore at [/home/jenkins/workspace/Lucene-Solr-8.x-Linux/solr/core/src/test-files/solr/collection1], dataDir=[/home/jenkins/workspace/Lucene-Solr-8.x-Linux/solr/build/solr-core/test/J1/temp/solr.update.PeerSyncTest_5264C3167144BF37-001/tempDir-001/control/cores/collection1/data/]
   [junit4]   2> 1134524 INFO  (coreLoadExecutor-6121-thread-1) [    x:collection1] o.a.s.u.RandomMergePolicy RandomMergePolicy wrapping class org.apache.lucene.index.LogByteSizeMergePolicy: [LogByteSizeMergePolicy: minMergeSize=1677721, mergeFactor=36, maxMergeSize=2147483648, maxMergeSizeForForcedMerge=9223372036854775807, calibrateSizeByDeletes=false, maxMergeDocs=2147483647, maxCFSSegmentSizeMB=1.39453125, noCFSRatio=0.0]
   [junit4]   2> 1134525 WARN  (coreLoadExecutor-6121-thread-1) [    x:collection1] o.a.s.c.RequestHandlers INVALID paramSet a in requestHandler {type = requestHandler,name = /dump,class = DumpRequestHandler,attributes = {initParams=a, name=/dump, class=DumpRequestHandler},args = {defaults={a=A,b=B}}}
   [junit4]   2> 1134557 INFO  (coreLoadExecutor-6121-thread-1) [    x:collection1] o.a.s.u.UpdateHandler Using UpdateLog implementation: org.apache.solr.update.UpdateLog
   [junit4]   2> 1134557 INFO  (coreLoadExecutor-6121-thread-1) [    x:collection1] o.a.s.u.UpdateLog Initializing UpdateLog: dataDir= defaultSyncLevel=FLUSH numRecordsToKeep=100 maxNumLogsToKeep=10 numVersionBuckets=65536
   [junit4]   2> 1134558 INFO  (coreLoadExecutor-6121-thread-1) [    x:collection1] o.a.s.u.CommitTracker Hard AutoCommit: disabled
   [junit4]   2> 1134558 INFO  (coreLoadExecutor-6121-thread-1) [    x:collection1] o.a.s.u.CommitTracker Soft AutoCommit: disabled
   [junit4]   2> 1134559 INFO  (coreLoadExecutor-6121-thread-1) [    x:collection1] o.a.s.u.RandomMergePolicy RandomMergePolicy wrapping class org.apache.lucene.index.TieredMergePolicy: [TieredMergePolicy: maxMergeAtOnce=37, maxMergeAtOnceExplicit=50, maxMergedSegmentMB=84.513671875, floorSegmentMB=1.7578125, forceMergeDeletesPctAllowed=14.947239500150442, segmentsPerTier=47.0, maxCFSSegmentSizeMB=8.796093022207999E12, noCFSRatio=0.0, deletesPctAllowed=43.637076555318245
   [junit4]   2> 1134559 INFO  (coreLoadExecutor-6121-thread-1) [    x:collection1] o.a.s.s.SolrIndexSearcher Opening [Searcher@cbdfb7[collection1] main]
   [junit4]   2> 1134560 WARN  (coreLoadExecutor-6121-thread-1) [    x:collection1] o.a.s.r.ManagedResourceStorage Cannot write to config directory /home/jenkins/workspace/Lucene-Solr-8.x-Linux/solr/core/src/test-files/solr/collection1/conf; switching to use InMemory storage instead.
   [junit4]   2> 1134560 INFO  (coreLoadExecutor-6121-thread-1) [    x:collection1] o.a.s.h.ReplicationHandler Commits will be reserved for 10000ms.
   [junit4]   2> 1134560 INFO  (coreLoadExecutor-6121-thread-1) [    x:collection1] o.a.s.u.UpdateLog Could not find max version in index or recent updates, using new clock 1632319390049370112
   [junit4]   2> 1134563 INFO  (searcherExecutor-6122-thread-1-processing-x:collection1) [    x:collection1] o.a.s.c.SolrCore [collection1] Registered new searcher Searcher@cbdfb7[collection1] main{ExitableDirectoryReader(UninvertingDirectoryReader())}
   [junit4]   2> 1134669 INFO  (TEST-PeerSyncTest.test-seed#[5264C3167144BF37]) [    ] o.a.s.SolrTestCaseJ4 Writing core.properties file to /home/jenkins/workspace/Lucene-Solr-8.x-Linux/solr/build/solr-core/test/J1/temp/solr.update.PeerSyncTest_5264C3167144BF37-001/tempDir-001/shard0/cores/collection1
   [junit4]   2> 1134670 WARN  (TEST-PeerSyncTest.test-seed#[5264C3167144BF37]) [    ] o.e.j.s.AbstractConnector Ignoring deprecated socket close linger time
   [junit4]   2> 1134670 INFO  (TEST-PeerSyncTest.test-seed#[5264C3167144BF37]) [    ] o.a.s.c.s.e.JettySolrRunner Start Jetty (original configured port=0)
   [junit4]   2> 1134670 INFO  (TEST-PeerSyncTest.test-seed#[5264C3167144BF37]) [    ] o.a.s.c.s.e.JettySolrRunner Trying to start Jetty on port 0 try number 1 ...
   [junit4]   2> 1134670 INFO  (TEST-PeerSyncTest.test-seed#[5264C3167144BF37]) [    ] o.e.j.s.Server jetty-9.4.14.v20181114; built: 2018-11-14T21:20:31.478Z; git: c4550056e785fb5665914545889f21dc136ad9e6; jvm 1.8.0_201-b09
   [junit4]   2> 1134680 INFO  (TEST-PeerSyncTest.test-seed#[5264C3167144BF37]) [    ] o.e.j.s.session DefaultSessionIdManager workerName=node0
   [junit4]   2> 1134680 INFO  (TEST-PeerSyncTest.test-seed#[5264C3167144BF37]) [    ] o.e.j.s.session No SessionScavenger set, using defaults
   [junit4]   2> 1134680 INFO  (TEST-PeerSyncTest.test-seed#[5264C3167144BF37]) [    ] o.e.j.s.session node0 Scavenging every 660000ms
   [junit4]   2> 1134681 INFO  (TEST-PeerSyncTest.test-seed#[5264C3167144BF37]) [    ] o.e.j.s.h.ContextHandler Started o.e.j.s.ServletContextHandler@b363d7{/rml,null,AVAILABLE}
   [junit4]   2> 1134682 INFO  (TEST-PeerSyncTest.test-seed#[5264C3167144BF37]) [    ] o.e.j.s.AbstractConnector Started ServerConnector@1d3bf{HTTP/1.1,[http/1.1, h2c]}{127.0.0.1:36427}
   [junit4]   2> 1134682 INFO  (TEST-PeerSyncTest.test-seed#[5264C3167144BF37]) [    ] o.e.j.s.Server Started @1134719ms
   [junit4]   2> 1134682 INFO  (TEST-PeerSyncTest.test-seed#[5264C3167144BF37]) [    ] o.a.s.c.s.e.JettySolrRunner Jetty properties: {schema=schema.xml, solrconfig=solrconfig-tlog.xml, hostContext=/rml, hostPort=36427, coreRootDirectory=/home/jenkins/workspace/Lucene-Solr-8.x-Linux/solr/build/solr-core/test/J1/temp/solr.update.PeerSyncTest_5264C3167144BF37-001/tempDir-001/shard0/cores}
   [junit4]   2> 1134682 ERROR (TEST-PeerSyncTest.test-seed#[5264C3167144BF37]) [    ] o.a.s.u.StartupLoggingUtils Missing Java Option solr.log.dir. Logging may be missing or incomplete.
   [junit4]   2> 1134682 INFO  (TEST-PeerSyncTest.test-seed#[5264C3167144BF37]) [    ] o.a.s.s.SolrDispatchFilter Using logger factory org.apache.logging.slf4j.Log4jLoggerFactory
   [junit4]   2> 1134682 INFO  (TEST-PeerSyncTest.test-seed#[5264C3167144BF37]) [    ] o.a.s.s.SolrDispatchFilter  ___      _       Welcome to Apache Solr™ version 8.1.0
   [junit4]   2> 1134682 INFO  (TEST-PeerSyncTest.test-seed#[5264C3167144BF37]) [    ] o.a.s.s.SolrDispatchFilter / __| ___| |_ _   Starting in standalone mode on port null
   [junit4]   2> 1134682 INFO  (TEST-PeerSyncTest.test-seed#[5264C3167144BF37]) [    ] o.a.s.s.SolrDispatchFilter \__ \/ _ \ | '_|  Install dir: null
   [junit4]   2> 1134682 INFO  (TEST-PeerSyncTest.test-seed#[5264C3167144BF37]) [    ] o.a.s.s.SolrDispatchFilter |___/\___/_|_|    Start time: 2019-05-01T08:57:58.584Z
   [junit4]   2> 1134682 INFO  (TEST-PeerSyncTest.test-seed#[5264C3167144BF37]) [    ] o.a.s.c.SolrXmlConfig Loading container configuration from /home/jenkins/workspace/Lucene-Solr-8.x-Linux/solr/build/solr-core/test/J1/temp/solr.update.PeerSyncTest_5264C3167144BF37-001/tempDir-001/shard0/solr.xml
   [junit4]   2> 1134685 INFO  (TEST-PeerSyncTest.test-seed#[5264C3167144BF37]) [    ] o.a.s.c.SolrXmlConfig Configuration parameter autoReplicaFailoverWorkLoopDelay is ignored
   [junit4]   2> 1134685 INFO  (TEST-PeerSyncTest.test-seed#[5264C3167144BF37]) [    ] o.a.s.c.SolrXmlConfig Configuration parameter autoReplicaFailoverBadNodeExpiration is ignored
   [junit4]   2> 1134686 INFO  (TEST-PeerSyncTest.test-seed#[5264C3167144BF37]) [    ] o.a.s.c.SolrXmlConfig MBean server found: com.sun.jmx.mbeanserver.JmxMBeanServer@b7cac1, but no JMX reporters were configured - adding default JMX reporter.
   [junit4]   2> 1135667 INFO  (TEST-PeerSyncTest.test-seed#[5264C3167144BF37]) [    ] o.a.s.h.c.HttpShardHandlerFactory Host whitelist initialized: WhitelistHostChecker [whitelistHosts=null, whitelistHostCheckingEnabled=false]
   [junit4]   2> 1135682 WARN  (TEST-PeerSyncTest.test-seed#[5264C3167144BF37]) [    ] o.e.j.u.s.S.config No Client EndPointIdentificationAlgorithm configured for SslContextFactory@eb03c9[provider=null,keyStore=null,trustStore=null]
   [junit4]   2> 1135722 WARN  (TEST-PeerSyncTest.test-seed#[5264C3167144BF37]) [    ] o.e.j.u.s.S.config No Client EndPointIdentificationAlgorithm configured for SslContextFactory@bb5690[provider=null,keyStore=null,trustStore=null]
   [junit4]   2> 1135753 INFO  (TEST-PeerSyncTest.test-seed#[5264C3167144BF37]) [    ] o.a.s.c.TransientSolrCoreCacheDefault Allocating transient cache for 4 transient cores
   [junit4]   2> 1135753 INFO  (TEST-PeerSyncTest.test-seed#[5264C3167144BF37]) [    ] o.a.s.h.a.MetricsHistoryHandler No .system collection, keeping metrics history in memory.
   [junit4]   2> 1135777 INFO  (TEST-PeerSyncTest.test-seed#[5264C3167144BF37]) [    ] o.a.s.m.r.SolrJmxReporter JMX monitoring for 'solr.node' (registry 'solr.node') enabled at server: com.sun.jmx.mbeanserver.JmxMBeanServer@b7cac1
   [junit4]   2> 1135791 INFO  (TEST-PeerSyncTest.test-seed#[5264C3167144BF37]) [    ] o.a.s.m.r.SolrJmxReporter JMX monitoring for 'solr.jvm' (registry 'solr.jvm') enabled at server: com.sun.jmx.mbeanserver.JmxMBeanServer@b7cac1
   [junit4]   2> 1135791 INFO  (TEST-PeerSyncTest.test-seed#[5264C3167144BF37]) [    ] o.a.s.m.r.SolrJmxReporter JMX monitoring for 'solr.jetty' (registry 'solr.jetty') enabled at server: com.sun.jmx.mbeanserver.JmxMBeanServer@b7cac1
   [junit4]   2> 1135793 INFO  (TEST-PeerSyncTest.test-seed#[5264C3167144BF37]) [    ] o.a.s.c.CorePropertiesLocator Found 1 core definitions underneath /home/jenkins/workspace/Lucene-Solr-8.x-Linux/solr/build/solr-core/test/J1/temp/solr.update.PeerSyncTest_5264C3167144BF37-001/tempDir-001/shard0/cores
   [junit4]   2> 1135793 INFO  (TEST-PeerSyncTest.test-seed#[5264C3167144BF37]) [    ] o.a.s.c.CorePropertiesLocator Cores are: [collection1]
   [junit4]   2> 1135793 INFO  (coreLoadExecutor-6135-thread-1) [    x:collection1] o.a.s.c.SolrResourceLoader [null] Added 2 libs to classloader, from paths: [/home/jenkins/workspace/Lucene-Solr-8.x-Linux/solr/core/src/test-files/solr/collection1/lib, /home/jenkins/workspace/Lucene-Solr-8.x-Linux/solr/core/src/test-files/solr/collection1/lib/classes]
   [junit4]   2> 1135885 INFO  (coreLoadExecutor-6135-thread-1) [    x:collection1] o.a.s.c.SolrConfig Using Lucene MatchVersion: 8.1.0
   [junit4]   2> 1135904 INFO  (coreLoadExecutor-6135-thread-1) [    x:collection1] o.a.s.s.IndexSchema [collection1] Schema name=test
   [junit4]   2> 1136019 INFO  (coreLoadExecutor-6135-thread-1) [    x:collection1] o.a.s.s.IndexSchema Loaded schema test/1.0 with uniqueid field id
   [junit4]   2> 1136025 INFO  (coreLoadExecutor-6135-thread-1) [    x:collection1] o.a.s.c.CoreContainer Creating SolrCore 'collection1' using configuration from configset /home/jenkins/workspace/Lucene-Solr-8.x-Linux/solr/core/src/test-files/solr/collection1, trusted=true
   [junit4]   2> 1136025 INFO  (coreLoadExecutor-6135-thread-1) [    x:collection1] o.a.s.m.r.SolrJmxReporter JMX monitoring for 'solr.core.collection1' (registry 'solr.core.collection1') enabled at server: com.sun.jmx.mbeanserver.JmxMBeanServer@b7cac1
   [junit4]   2> 1136025 INFO  (coreLoadExecutor-6135-thread-1) [    x:collection1] o.a.s.c.SolrCore [[collection1] ] Opening new SolrCore at [/home/jenkins/workspace/Lucene-Solr-8.x-Linux/solr/core/src/test-files/solr/collection1], dataDir=[/home/jenkins/workspace/Lucene-Solr-8.x-Linux/solr/build/solr-core/test/J1/temp/solr.update.PeerSyncTest_5264C3167144BF37-001/tempDir-001/shard0/cores/collection1/data/]
   [junit4]   2> 1136026 INFO  (coreLoadExecutor-6135-thread-1) [    x:collection1] o.a.s.u.RandomMergePolicy RandomMergePolicy wrapping class org.apache.lucene.index.LogByteSizeMergePolicy: [LogByteSizeMergePolicy: minMergeSize=1677721, mergeFactor=36, maxMergeSize=2147483648, maxMergeSizeForForcedMerge=9223372036854775807, calibrateSizeByDeletes=false, maxMergeDocs=2147483647, maxCFSSegmentSizeMB=1.39453125, noCFSRatio=0.0]
   [junit4]   2> 1136030 WARN  (coreLoadExecutor-6135-thread-1) [    x:collection1] o.a.s.c.RequestHandlers INVALID paramSet a in requestHandler {type = requestHandler,name = /dump,class = DumpRequestHandler,attributes = {initParams=a, name=/dump, class=DumpRequestHandler},args = {defaults={a=A,b=B}}}
   [junit4]   2> 1136096 INFO  (coreLoadExecutor-6135-thread-1) [    x:collection1] o.a.s.u.UpdateHandler Using UpdateLog implementation: org.apache.solr.update.UpdateLog
   [junit4]   2> 1136096 INFO  (coreLoadExecutor-6135-thread-1) [    x:collection1] o.a.s.u.UpdateLog Initializing UpdateLog: dataDir= defaultSyncLevel=FLUSH numRecordsToKeep=100 maxNumLogsToKeep=10 numVersionBuckets=65536
   [junit4]   2> 1136097 INFO  (coreLoadExecutor-6135-thread-1) [    x:collection1] o.a.s.u.CommitTracker Hard AutoCommit: disabled
   [junit4]   2> 1136097 INFO  (coreLoadExecutor-6135-thread-1) [    x:collection1] o.a.s.u.CommitTracker Soft AutoCommit: disabled
   [junit4]   2> 1136097 INFO  (coreLoadExecutor-6135-thread-1) [    x:collection1] o.a.s.u.RandomMergePolicy RandomMergePolicy wrapping class org.apache.lucene.index.TieredMergePolicy: [TieredMergePolicy: maxMergeAtOnce=37, maxMergeAtOnceExplicit=50, maxMergedSegmentMB=84.513671875, floorSegmentMB=1.7578125, forceMergeDeletesPctAllowed=14.947239500150442, segmentsPerTier=47.0, maxCFSSegmentSizeMB=8.796093022207999E12, noCFSRatio=0.0, deletesPctAllowed=43.637076555318245
   [junit4]   2> 1136097 INFO  (coreLoadExecutor-6135-thread-1) [    x:collection1] o.a.s.s.SolrIndexSearcher Opening [Searcher@f477b2[collection1] main]
   [junit4]   2> 1136098 WARN  (coreLoadExecutor-6135-thread-1) [    x:collection1] o.a.s.r.ManagedResourceStorage Cannot write to config directory /home/jenkins/workspace/Lucene-Solr-8.x-Linux/solr/core/src/test-files/solr/collection1/conf; switching to use InMemory storage instead.
   [junit4]   2> 1136098 INFO  (coreLoadExecutor-6135-thread-1) [    x:collection1] o.a.s.h.ReplicationHandler Commits will be reserved for 10000ms.
   [junit4]   2> 1136098 INFO  (coreLoadExecutor-6135-thread-1) [    x:collection1] o.a.s.u.UpdateLog Could not find max version in index or recent updates, using new clock 1632319391662080000
   [junit4]   2> 1136100 INFO  (searcherExecutor-6136-thread-1-processing-x:collection1) [    x:collection1] o.a.s.c.SolrCore [collection1] Registered new searcher Searcher@f477b2[collection1] main{ExitableDirectoryReader(UninvertingDirectoryReader())}
   [junit4]   2> 1136210 INFO  (TEST-PeerSyncTest.test-seed#[5264C3167144BF37]) [    ] o.a.s.SolrTestCaseJ4 Writing core.properties file to /home/jenkins/workspace/Lucene-Solr-8.x-Linux/solr/build/solr-core/test/J1/temp/solr.update.PeerSyncTest_5264C3167144BF37-001/tempDir-001/shard1/cores/collection1
   [junit4]   2> 1136210 WARN  (TEST-PeerSyncTest.test-seed#[5264C3167144BF37]) [    ] o.e.j.s.AbstractConnector Ignoring deprecated socket close linger time
   [junit4]   2> 1136211 INFO  (TEST-PeerSyncTest.test-seed#[5264C3167144BF37]) [    ] o.a.s.c.s.e.JettySolrRunner Start Jetty (original configured port=0)
   [junit4]   2> 1136211 INFO  (TEST-PeerSyncTest.test-seed#[5264C3167144BF37]) [    ] o.a.s.c.s.e.JettySolrRunner Trying to start Jetty on port 0 try number 1 ...
   [junit4]   2> 1136211 INFO  (TEST-PeerSyncTest.test-seed#[5264C3167144BF37]) [    ] o.e.j.s.Server jetty-9.4.14.v20181114; built: 2018-11-14T21:20:31.478Z; git: c4550056e785fb5665914545889f21dc136ad9e6; jvm 1.8.0_201-b09
   [junit4]   2> 1136217 INFO  (TEST-PeerSyncTest.test-seed#[5264C3167144BF37]) [    ] o.e.j.s.session DefaultSessionIdManager workerName=node0
   [junit4]   2> 1136217 INFO  (TEST-PeerSyncTest.test-seed#[5264C3167144BF37]) [    ] o.e.j.s.session No SessionScavenger set, using defaults
   [junit4]   2> 1136217 INFO  (TEST-PeerSyncTest.test-seed#[5264C3167144BF37]) [    ] o.e.j.s.session node0 Scavenging every 600000ms
   [junit4]   2> 1136218 INFO  (TEST-PeerSyncTest.test-seed#[5264C3167144BF37]) [    ] o.e.j.s.h.ContextHandler Started o.e.j.s.ServletContextHandler@5d4340{/rml,null,AVAILABLE}
   [junit4]   2> 1136218 INFO  (TEST-PeerSyncTest.test-seed#[5264C3167144BF37]) [    ] o.e.j.s.AbstractConnector Started ServerConnector@12bb65{HTTP/1.1,[http/1.1, h2c]}{127.0.0.1:33341}
   [junit4]   2> 1136218 INFO  (TEST-PeerSyncTest.test-seed#[5264C3167144BF37]) [    ] o.e.j.s.Server Started @1136256ms
   [junit4]   2> 1136218 INFO  (TEST-PeerSyncTest.test-seed#[5264C3167144BF37]) [    ] o.a.s.c.s.e.JettySolrRunner Jetty properties: {schema=schema.xml, solrconfig=solrconfig-tlog.xml, hostContext=/rml, hostPort=33341, coreRootDirectory=/home/jenkins/workspace/Lucene-Solr-8.x-Linux/solr/build/solr-core/test/J1/temp/solr.update.PeerSyncTest_5264C3167144BF37-001/tempDir-001/shard1/cores}
   [junit4]   2> 1136219 ERROR (TEST-PeerSyncTest.test-seed#[5264C3167144BF37]) [    ] o.a.s.u.StartupLoggingUtils Missing Java Option solr.log.dir. Logging may be missing or incomplete.
   [junit4]   2> 1136219 INFO  (TEST-PeerSyncTest.test-seed#[5264C3167144BF37]) [    ] o.a.s.s.SolrDispatchFilter Using logger factory org.apache.logging.slf4j.Log4jLoggerFactory
   [junit4]   2> 1136219 INFO  (TEST-PeerSyncTest.test-seed#[5264C3167144BF37]) [    ] o.a.s.s.SolrDispatchFilter  ___      _       Welcome to Apache Solr™ version 8.1.0
   [junit4]   2> 1136219 INFO  (TEST-PeerSyncTest.test-seed#[5264C3167144BF37]) [    ] o.a.s.s.SolrDispatchFilter / __| ___| |_ _   Starting in standalone mode on port null
   [junit4]   2> 1136219 INFO  (TEST-PeerSyncTest.test-seed#[5264C3167144BF37]) [    ] o.a.s.s.SolrDispatchFilter \__ \/ _ \ | '_|  Install dir: null
   [junit4]   2> 1136219 INFO  (TEST-PeerSyncTest.test-seed#[5264C3167144BF37]) [    ] o.a.s.s.SolrDispatchFilter |___/\___/_|_|    Start time: 2019-05-01T08:58:00.121Z
   [junit4]   2> 1136219 INFO  (TEST-PeerSyncTest.test-seed#[5264C3167144BF37]) [    ] o.a.s.c.SolrXmlConfig Loading container configuration from /home/jenkins/workspace/Lucene-Solr-8.x-Linux/solr/build/solr-core/test/J1/temp/solr.update.PeerSyncTest_5264C3167144BF37-001/tempDir-001/shard1/solr.xml
   [junit4]   2> 1136223 INFO  (TEST-PeerSyncTest.test-seed#[5264C3167144BF37]) [    ] o.a.s.c.SolrXmlConfig Configuration parameter autoReplicaFailoverWorkLoopDelay is ignored
   [junit4]   2> 1136223 INFO  (TEST-PeerSyncTest.test-seed#[5264C3167144BF37]) [    ] o.a.s.c.SolrXmlConfig Configuration parameter autoReplicaFailoverBadNodeExpiration is ignored
   [junit4]   2> 1136224 INFO  (TEST-PeerSyncTest.test-seed#[5264C3167144BF37]) [    ] o.a.s.c.SolrXmlConfig MBean server found: com.sun.jmx.mbeanserver.JmxMBeanServer@b7cac1, but no JMX reporters were configured - adding default JMX reporter.
   [junit4]   2> 1136764 INFO  (TEST-PeerSyncTest.test-seed#[5264C3167144BF37]) [    ] o.a.s.h.c.HttpShardHandlerFactory Host whitelist initialized: WhitelistHostChecker [whitelistHosts=null, whitelistHostCheckingEnabled=false]
   [junit4]   2> 1136766 WARN  (TEST-PeerSyncTest.test-seed#[5264C3167144BF37]) [    ] o.e.j.u.s.S.config No Client EndPointIdentificationAlgorithm configured for SslContextFactory@248210[provider=null,keyStore=null,trustStore=null]
   [junit4]   2> 1136776 WARN  (TEST-PeerSyncTest.test-seed#[5264C3167144BF37]) [    ] o.e.j.u.s.S.config No Client EndPointIdentificationAlgorithm configured for SslContextFactory@18a66dd[provider=null,keyStore=null,trustStore=null]
   [junit4]   2> 1136793 INFO  (TEST-PeerSyncTest.test-seed#[5264C3167144BF37]) [    ] o.a.s.c.TransientSolrCoreCacheDefault Allocating transient cache for 4 transient cores
   [junit4]   2> 1136793 INFO  (TEST-PeerSyncTest.test-seed#[5264C3167144BF37]) [    ] o.a.s.h.a.MetricsHistoryHandler No .system collection, keeping metrics history in memory.
   [junit4]   2> 1136811 INFO  (TEST-PeerSyncTest.test-seed#[5264C3167144BF37]) [    ] o.a.s.m.r.SolrJmxReporter JMX monitoring for 'solr.node' (registry 'solr.node') enabled at server: com.sun.jmx.mbeanserver.JmxMBeanServer@b7cac1
   [junit4]   2> 1136823 INFO  (TEST-PeerSyncTest.test-seed#[5264C3167144BF37]) [    ] o.a.s.m.r.SolrJmxReporter JMX monitoring for 'solr.jvm' (registry 'solr.jvm') enabled at server: com.sun.jmx.mbeanserver.JmxMBeanServer@b7cac1
   [junit4]   2> 1136823 INFO  (TEST-PeerSyncTest.test-seed#[5264C3167144BF37]) [    ] o.a.s.m.r.SolrJmxReporter JMX monitoring for 'solr.jetty' (registry 'solr.jetty') enabled at server: com.sun.jmx.mbeanserver.JmxMBeanServer@b7cac1
   [junit4]   2> 1136825 INFO  (TEST-PeerSyncTest.test-seed#[5264C3167144BF37]) [    ] o.a.s.c.CorePropertiesLocator Found 1 core definitions underneath /home/jenkins/workspace/Lucene-Solr-8.x-Linux/solr/build/solr-core/test/J1/temp/solr.update.PeerSyncTest_5264C3167144BF37-001/tempDir-001/shard1/cores
   [junit4]   2> 1136825 INFO  (TEST-PeerSyncTest.test-seed#[5264C3167144BF37]) [    ] o.a.s.c.CorePropertiesLocator Cores are: [collection1]
   [junit4]   2> 1136829 INFO  (coreLoadExecutor-6149-thread-1) [    x:collection1] o.a.s.c.SolrResourceLoader [null] Added 2 libs to classloader, from paths: [/home/jenkins/workspace/Lucene-Solr-8.x-Linux/solr/core/src/test-files/solr/collection1/lib, /home/jenkins/workspace/Lucene-Solr-8.x-Linux/solr/core/src/test-files/solr/collection1/lib/classes]
   [junit4]   2> 1136849 INFO  (coreLoadExecutor-6149-thread-1) [    x:collection1] o.a.s.c.SolrConfig Using Lucene MatchVersion: 8.1.0
   [junit4]   2> 1136888 INFO  (coreLoadExecutor-6149-thread-1) [    x:collection1] o.a.s.s.IndexSchema [collection1] Schema name=test
   [junit4]   2> 1137058 INFO  (coreLoadExecutor-6149-thread-1) [    x:collection1] o.a.s.s.IndexSchema Loaded schema test/1.0 with uniqueid field id
   [junit4]   2> 1137065 INFO  (coreLoadExecutor-6149-thread-1) [    x:collection1] o.a.s.c.CoreContainer Creating SolrCore 'collection1' using configuration from configset /home/jenkins/workspace/Lucene-Solr-8.x-Linux/solr/core/src/test-files/solr/collection1, trusted=true
   [junit4]   2> 1137066 INFO  (coreLoadExecutor-6149-thread-1) [    x:collection1] o.a.s.m.r.SolrJmxReporter JMX monitoring for 'solr.core.collection1' (registry 'solr.core.collection1') enabled at server: com.sun.jmx.mbeanserver.JmxMBeanServer@b7cac1
   [junit4]   2> 1137066 INFO  (coreLoadExecutor-6149-thread-1) [    x:collection1] o.a.s.c.SolrCore [[collection1] ] Opening new SolrCore at [/home/jenkins/workspace/Lucene-Solr-8.x-Linux/solr/core/src/test-files/solr/collection1], dataDir=[/home/jenkins/workspace/Lucene-Solr-8.x-Linux/solr/build/solr-core/test/J1/temp/solr.update.PeerSyncTest_5264C3167144BF37-001/tempDir-001/shard1/cores/collection1/data/]
   [junit4]   2> 1137067 INFO  (coreLoadExecutor-6149-thread-1) [    x:collection1] o.a.s.u.RandomMergePolicy RandomMergePolicy wrapping class org.apache.lucene.index.LogByteSizeMergePolicy: [LogByteSizeMergePolicy: minMergeSize=1677721, mergeFactor=36, maxMergeSize=2147483648, maxMergeSizeForForcedMerge=9223372036854775807, calibrateSizeByDeletes=false, maxMergeDocs=2147483647, maxCFSSegmentSizeMB=1.39453125, noCFSRatio=0.0]
   [junit4]   2> 1137068 WARN  (coreLoadExecutor-6149-thread-1) [    x:collection1] o.a.s.c.RequestHandlers INVALID paramSet a in requestHandler {type = requestHandler,name = /dump,class = DumpRequestHandler,attributes = {initParams=a, name=/dump, class=DumpRequestHandler},args = {defaults={a=A,b=B}}}
   [junit4]   2> 1137133 INFO  (coreLoadExecutor-6149-thread-1) [    x:collection1] o.a.s.u.UpdateHandler Using UpdateLog implementation: org.apache.solr.update.UpdateLog
   [junit4]   2> 1137133 INFO  (coreLoadExecutor-6149-thread-1) [    x:collection1] o.a.s.u.UpdateLog Initializing UpdateLog: dataDir= defaultSyncLevel=FLUSH numRecordsToKeep=100 maxNumLogsToKeep=10 numVersionBuckets=65536
   [junit4]   2> 1137134 INFO  (coreLoadExecutor-6149-thread-1) [    x:collection1] o.a.s.u.CommitTracker Hard AutoCommit: disabled
   [junit4]   2> 1137134 INFO  (coreLoadExecutor-6149-thread-1) [    x:collection1] o.a.s.u.CommitTracker Soft AutoCommit: disabled
   [junit4]   2> 1137135 INFO  (coreLoadExecutor-6149-thread-1) [    x:collection1] o.a.s.u.RandomMergePolicy RandomMergePolicy wrapping class org.apache.lucene.index.TieredMergePolicy: [TieredMergePolicy: maxMergeAtOnce=37, maxMergeAtOnceExplicit=50, maxMergedSegmentMB=84.513671875, floorSegmentMB=1.7578125, forceMergeDeletesPctAllowed=14.947239500150442, segmentsPerTier=47.0, maxCFSSegmentSizeMB=8.796093022207999E12, noCFSRatio=0.0, deletesPctAllowed=43.637076555318245
   [junit4]   2> 1137135 INFO  (coreLoadExecutor-6149-thread-1) [    x:collection1] o.a.s.s.SolrIndexSearcher Opening [Searcher@cba024[collection1] main]
   [junit4]   2> 1137136 WARN  (coreLoadExecutor-6149-thread-1) [    x:collection1] o.a.s.r.ManagedResourceStorage Cannot write to config directory /home/jenkins/workspace/Lucene-Solr-8.x-Linux/solr/core/src/test-files/solr/collection1/conf; switching to use InMemory storage instead.
   [junit4]   2> 1137136 INFO  (coreLoadExecutor-6149-thread-1) [    x:collection1] o.a.s.h.ReplicationHandler Commits will be reserved for 10000ms.
   [junit4]   2> 1137136 INFO  (coreLoadExecutor-6149-thread-1) [    x:collection1] o.a.s.u.UpdateLog Could not find max version in index or recent updates, using new clock 1632319392750501888
   [junit4]   2> 1137138 INFO  (searcherExecutor-6150-thread-1-processing-x:collection1) [    x:collection1] o.a.s.c.SolrCore [collection1] Registered new searcher Searcher@cba024[collection1] main{ExitableDirectoryReader(UninvertingDirectoryReader())}
   [junit4]   2> 1137249 INFO  (TEST-PeerSyncTest.test-seed#[5264C3167144BF37]) [    ] o.a.s.SolrTestCaseJ4 Writing core.properties file to /home/jenkins/workspace/Lucene-Solr-8.x-Linux/solr/build/solr-core/test/J1/temp/solr.update.PeerSyncTest_5264C3167144BF37-001/tempDir-001/shard2/cores/collection1
   [junit4]   2> 1137249 WARN  (TEST-PeerSyncTest.test-seed#[5264C3167144BF37]) [    ] o.e.j.s.AbstractConnector Ignoring deprecated socket close linger time
   [junit4]   2> 1137249 INFO  (TEST-PeerSyncTest.test-seed#[5264C3167144BF37]) [    ] o.a.s.c.s.e.JettySolrRunner Start Jetty (original configured port=0)
   [junit4]   2> 1137250 INFO  (TEST-PeerSyncTest.test-seed#[5264C3167144BF37]) [    ] o.a.s.c.s.e.JettySolrRunner Trying to start Jetty on port 0 try number 1 ...
   [junit4]   2> 1137250 INFO  (TEST-PeerSyncTest.test-seed#[5264C3167144BF37]) [    ] o.e.j.s.Server jetty-9.4.14.v20181114; built: 2018-11-14T21:20:31.478Z; git: c4550056e785fb5665914545889f21dc136ad9e6; jvm 1.8.0_201-b09
   [junit4]   2> 1137321 INFO  (TEST-PeerSyncTest.test-seed#[5264C3167144BF37]) [    ] o.e.j.s.session DefaultSessionIdManager workerName=node0
   [junit4]   2> 1137321 INFO  (TEST-PeerSyncTest.test-seed#[5264C3167144BF37]) [    ] o.e.j.s.session No SessionScavenger set, using defaults
   [junit4]   2> 1137321 INFO  (TEST-PeerSyncTest.test-seed#[5264C3167144BF37]) [    ] o.e.j.s.session node0 Scavenging every 600000ms
   [junit4]   2> 1137341 INFO  (TEST-PeerSyncTest.test-seed#[5264C3167144BF37]) [    ] o.e.j.s.h.ContextHandler Started o.e.j.s.ServletContextHandler@1ddea03{/rml,null,AVAILABLE}
   [junit4]   2> 1137342 INFO  (TEST-PeerSyncTest.test-seed#[5264C3167144BF37]) [    ] o.e.j.s.AbstractConnector Started ServerConnector@119a272{HTTP/1.1,[http/1.1, h2c]}{127.0.0.1:44365}
   [junit4]   2> 1137342 INFO  (TEST-PeerSyncTest.test-seed#[5264C3167144BF37]) [    ] o.e.j.s.Server Started @1137379ms
   [junit4]   2> 1137342 INFO  (TEST-PeerSyncTest.test-seed#[5264C3167144BF37]) [    ] o.a.s.c.s.e.JettySolrRunner Jetty properties: {schema=schema.xml, solrconfig=solrconfig-tlog.xml, hostContext=/rml, hostPort=44365, coreRootDirectory=/home/jenkins/workspace/Lucene-Solr-8.x-Linux/solr/build/solr-core/test/J1/temp/solr.update.PeerSyncTest_5264C3167144BF37-001/tempDir-001/shard2/cores}
   [junit4]   2> 1137342 ERROR (TEST-PeerSyncTest.test-seed#[5264C3167144BF37]) [    ] o.a.s.u.StartupLoggingUtils Missing Java Option solr.log.dir. Logging may be missing or incomplete.
   [junit4]   2> 1137342 INFO  (TEST-PeerSyncTest.test-seed#[5264C3167144BF37]) [    ] o.a.s.s.SolrDispatchFilter Using logger factory org.apache.logging.slf4j.Log4jLoggerFactory
   [junit4]   2> 1137342 INFO  (TEST-PeerSyncTest.test-seed#[5264C3167144BF37]) [    ] o.a.s.s.SolrDispatchFilter  ___      _       Welcome to Apache Solr™ version 8.1.0
   [junit4]   2> 1137342 INFO  (TEST-PeerSyncTest.test-seed#[5264C3167144BF37]) [    ] o.a.s.s.SolrDispatchFilter / __| ___| |_ _   Starting in standalone mode on port null
   [junit4]   2> 1137342 INFO  (TEST-PeerSyncTest.test-seed#[5264C3167144BF37]) [    ] o.a.s.s.SolrDispatchFilter \__ \/ _ \ | '_|  Install dir: null
   [junit4]   2> 1137342 INFO  (TEST-PeerSyncTest.test-seed#[5264C3167144BF37]) [    ] o.a.s.s.SolrDispatchFilter |___/\___/_|_|    Start time: 2019-05-01T08:58:01.244Z
   [junit4]   2> 1137342 INFO  (TEST-PeerSyncTest.test-seed#[5264C3167144BF37]) [    ] o.a.s.c.SolrXmlConfig Loading container configuration from /home/jenkins/workspace/Lucene-Solr-8.x-Linux/solr/build/solr-core/test/J1/temp/solr.update.PeerSyncTest_5264C3167144BF37-001/tempDir-001/shard2/solr.xml
   [junit4]   2> 1137346 INFO  (TEST-PeerSyncTest.test-seed#[5264C3167144BF37]) [    ] o.a.s.c.SolrXmlConfig Configuration parameter autoReplicaFailoverWorkLoopDelay is ignored
   [junit4]   2> 1137346 INFO  (TEST-PeerSyncTest.test-seed#[5264C3167144BF37]) [    ] o.a.s.c.SolrXmlConfig Configuration parameter autoReplicaFailoverBadNodeExpiration is ignored
   [junit4]   2> 1137346 INFO  (TEST-PeerSyncTest.test-seed#[5264C3167144BF37]) [    ] o.a.s.c.SolrXmlConfig MBean server found: com.sun.jmx.mbeanserver.JmxMBeanServer@b7cac1, but no JMX reporters were configured - adding default JMX reporter.
   [junit4]   2> 1137629 INFO  (TEST-PeerSyncTest.test-seed#[5264C3167144BF37]) [    ] o.a.s.h.c.HttpShardHandlerFactory Host whitelist initialized: WhitelistHostChecker [whitelistHosts=null, whitelistHostCheckingEnabled=false]
   [junit4]   2> 1137630 WARN  (TEST-PeerSyncTest.test-seed#[5264C3167144BF37]) [    ] o.e.j.u.s.S.config No Client EndPointIdentificationAlgorithm configured for SslContextFactory@f4aa42[provider=null,keyStore=null,trustStore=null]
   [junit4]   2> 1137635 WARN  (TEST-PeerSyncTest.test-seed#[5264C3167144BF37]) [    ] o.e.j.u.s.S.config No Client EndPointIdentificationAlgorithm configured for SslContextFactory@176960c[provider=null,keyStore=null,trustStore=null]
   [junit4]   2> 1137649 INFO  (TEST-PeerSyncTest.test-seed#[5264C3167144BF37]) [    ] o.a.s.c.TransientSolrCoreCacheDefault Allocating transient cache for 4 transient cores
   [junit4]   2> 1137649 INFO  (TEST-PeerSyncTest.test-seed#[5264C3167144BF37]) [    ] o.a.s.h.a.MetricsHistoryHandler No .system collection, keeping metrics history in memory.
   [junit4]   2> 1137669 INFO  (TEST-PeerSyncTest.test-seed#[5264C3167144BF37]) [    ] o.a.s.m.r.SolrJmxReporter JMX monitoring for 'solr.node' (registry 'solr.node') enabled at server: com.sun.jmx.mbeanserver.JmxMBeanServer@b7cac1
   [junit4]   2> 1137682 INFO  (TEST-PeerSyncTest.test-seed#[5264C3167144BF37]) [    ] o.a.s.m.r.SolrJmxReporter JMX monitoring for 'solr.jvm' (registry 'solr.jvm') enabled at server: com.sun.jmx.mbeanserver.JmxMBeanServer@b7cac1
   [junit4]   2> 1137682 INFO  (TEST-PeerSyncTest.test-seed#[5264C3167144BF37]) [    ] o.a.s.m.r.SolrJmxReporter JMX monitoring for 'solr.jetty' (registry 'solr.jetty') enabled at server: com.sun.jmx.mbeanserver.JmxMBeanServer@b7cac1
   [junit4]   2> 1137684 INFO  (TEST-PeerSyncTest.test-seed#[5264C3167144BF37]) [    ] o.a.s.c.CorePropertiesLocator Found 1 core definitions underneath /home/jenkins/workspace/Lucene-Solr-8.x-Linux/solr/build/solr-core/test/J1/temp/solr.update.PeerSyncTest_5264C3167144BF37-001/tempDir-001/shard2/cores
   [junit4]   2> 1137684 INFO  (TEST-PeerSyncTest.test-seed#[5264C3167144BF37]) [    ] o.a.s.c.CorePropertiesLocator Cores are: [collection1]
   [junit4]   2> 1137709 INFO  (coreLoadExecutor-6163-thread-1) [    x:collection1] o.a.s.c.SolrResourceLoader [null] Added 2 libs to classloader, from paths: [/home/jenkins/workspace/Lucene-Solr-8.x-Linux/solr/core/src/test-files/solr/collection1/lib, /home/jenkins/workspace/Lucene-Solr-8.x-Linux/solr/core/src/test-files/solr/collection1/lib/classes]
   [junit4]   2> 1137730 INFO  (coreLoadExecutor-6163-thread-1) [    x:collection1] o.a.s.c.SolrConfig Using Lucene MatchVersion: 8.1.0
   [junit4]   2> 1137744 INFO  (coreLoadExecutor-6163-thread-1) [    x:collection1] o.a.s.s.IndexSchema [collection1] Schema name=test
   [junit4]   2> 1137854 INFO  (coreLoadExecutor-6163-thread-1) [    x:collection1] o.a.s.s.IndexSchema Loaded schema test/1.0 with uniqueid field id
   [junit4]   2> 1137860 INFO  (coreLoadExecutor-6163-thread-1) [    x:collection1] o.a.s.c.CoreContainer Creating SolrCore 'collection1' using configuration from configset /home/jenkins/workspace/Lucene-Solr-8.x-Linux/solr/core/src/test-files/solr/collection1, trusted=true
   [junit4]   2> 1137860 INFO  (coreLoadExecutor-6163-thread-1) [    x:collection1] o.a.s.m.r.SolrJmxReporter JMX monitoring for 'solr.core.collection1' (registry 'solr.core.collection1') enabled at server: com.sun.jmx.mbeanserver.JmxMBeanServer@b7cac1
   [junit4]   2> 1137860 INFO  (coreLoadExecutor-6163-thread-1) [    x:collection1] o.a.s.c.SolrCore [[collection1] ] Opening new SolrCore at [/home/jenkins/workspace/Lucene-Solr-8.x-Linux/solr/core/src/test-files/solr/collection1], dataDir=[/home/jenkins/workspace/Lucene-Solr-8.x-Linux/solr/build/solr-core/test/J1/temp/solr.update.PeerSyncTest_5264C3167144BF37-001/tempDir-001/shard2/cores/collection1/data/]
   [junit4]   2> 1137862 INFO  (coreLoadExecutor-6163-thread-1) [    x:collection1] o.a.s.u.RandomMergePolicy RandomMergePolicy wrapping class org.apache.lucene.index.LogByteSizeMergePolicy: [LogByteSizeMergePolicy: minMergeSize=1677721, mergeFactor=36, maxMergeSize=2147483648, maxMergeSizeForForcedMerge=9223372036854775807, calibrateSizeByDeletes=false, maxMergeDocs=2147483647, maxCFSSegmentSizeMB=1.39453125, noCFSRatio=0.0]
   [junit4]   2> 1137863 WARN  (coreLoadExecutor-6163-thread-1) [    x:collection1] o.a.s.c.RequestHandlers INVALID paramSet a in requestHandler {type = requestHandler,name = /dump,class = DumpRequestHandler,attributes = {initParams=a, name=/dump, class=DumpRequestHandler},args = {defaults={a=A,b=B}}}
   [junit4]   2> 1137902 INFO  (coreLoadExecutor-6163-thread-1) [    x:collection1] o.a.s.u.UpdateHandler Using UpdateLog implementation: org.apache.solr.update.UpdateLog
   [junit4]   2> 1137902 INFO  (coreLoadExecutor-6163-thread-1) [    x:collection1] o.a.s.u.UpdateLog Initializing UpdateLog: dataDir= defaultSyncLevel=FLUSH numRecordsToKeep=100 maxNumLogsToKeep=10 numVersionBuckets=65536
   [junit4]   2> 1137903 INFO  (coreLoadExecutor-6163-thread-1) [    x:collection1] o.a.s.u.CommitTracker Hard AutoCommit: disabled
   [junit4]   2> 1137903 INFO  (coreLoadExecutor-6163-thread-1) [    x:collection1] o.a.s.u.CommitTracker Soft AutoCommit: disabled
   [junit4]   2> 1137904 INFO  (coreLoadExecutor-6163-thread-1) [    x:collection1] o.a.s.u.RandomMergePolicy RandomMergePolicy wrapping class org.apache.lucene.index.TieredMergePolicy: [TieredMergePolicy: maxMergeAtOnce=37, maxMergeAtOnceExplicit=50, maxMergedSegmentMB=84.513671875, floorSegmentMB=1.7578125, forceMergeDeletesPctAllowed=14.947239500150442, segmentsPerTier=47.0, maxCFSSegmentSizeMB=8.796093022207999E12, noCFSRatio=0.0, deletesPctAllowed=43.637076555318245
   [junit4]   2> 1137904 INFO  (coreLoadExecutor-6163-thread-1) [    x:collection1] o.a.s.s.SolrIndexSearcher Opening [Searcher@1e05fa3[collection1] main]
   [junit4]   2> 1137904 WARN  (coreLoadExecutor-6163-thread-1) [    x:collection1] o.a.s.r.ManagedResourceStorage Cannot write to config directory /home/jenkins/workspace/Lucene-Solr-8.x-Linux/solr/core/src/test-files/solr/collection1/conf; switching to use InMemory storage instead.
   [junit4]   2> 1137905 INFO  (coreLoadExecutor-6163-thread-1) [    x:collection1] o.a.s.h.ReplicationHandler Commits will be reserved for 10000ms.
   [junit4]   2> 1137905 INFO  (coreLoadExecutor-6163-thread-1) [    x:collection1] o.a.s.u.UpdateLog Could not find max version in index or recent updates, using new clock 1632319393556856832
   [junit4]   2> 1137907 INFO  (searcherExecutor-6164-thread-1-processing-x:collection1) [    x:collection1] o.a.s.c.SolrCore [collection1] Registered new searcher Searcher@1e05fa3[collection1] main{ExitableDirectoryReader(UninvertingDirectoryReader())}
   [junit4]   2> 1138407 INFO  (TEST-PeerSyncTest.test-seed#[5264C3167144BF37]) [    ] o.a.s.SolrTestCaseJ4 ###Starting test
   [junit4]   2> 1138410 INFO  (qtp33191485-21318) [    x:collection1] o.a.s.u.p.LogUpdateProcessorFactory [collection1]  webapp=/rml path=/update params={update.distrib=FROMLEADER&wt=javabin&version=2}{add=[1 (1)]} 0 1
   [junit4]   2> 1138411 INFO  (qtp15343172-21339) [    x:collection1] o.a.s.u.PeerSync PeerSync: core=collection1 url= START replicas=[http://127.0.0.1:36427/rml/collection1] nUpdates=100
   [junit4]   2> 1138415 INFO  (qtp33191485-21317) [    x:collection1] o.a.s.s.SolrIndexSearcher Opening [Searcher@4d5117[collection1] realtime]
   [junit4]   2> 1138416 INFO  (qtp33191485-21317) [    x:collection1] o.a.s.u.IndexFingerprint IndexFingerprint millis:3.0 result:{maxVersionSpecified=9223372036854775807, maxVersionEncountered=1, maxInHash=1, versionsHash=-5451962507482445012, numVersions=1, numDocs=1, maxDoc=1}
   [junit4]   2> 1138416 INFO  (qtp33191485-21317) [    x:collection1] o.a.s.c.S.Request [collection1]  webapp=/rml path=/get params={distrib=false&qt=/get&getFingerprint=9223372036854775807&wt=javabin&version=2} status=0 QTime=3
   [junit4]   2> 1138417 INFO  (qtp15343172-21339) [    x:collection1] o.a.s.u.IndexFingerprint IndexFingerprint millis:1.0 result:{maxVersionSpecified=9223372036854775807, maxVersionEncountered=0, maxInHash=0, versionsHash=0, numVersions=0, numDocs=0, maxDoc=0}
   [junit4]   2> 1138417 INFO  (qtp15343172-21339) [    x:collection1] o.a.s.u.PeerSync PeerSync: core=collection1 url= DONE.  We have no versions.  sync failed.
   [junit4]   2> 1138418 INFO  (qtp33191485-21318) [    x:collection1] o.a.s.u.IndexFingerprint IndexFingerprint millis:0.0 result:{maxVersionSpecified=9223372036854775807, maxVersionEncountered=1, maxInHash=1, versionsHash=-5451962507482445012, numVersions=1, numDocs=1, maxDoc=1}
   [junit4]   2> 1138418 INFO  (qtp33191485-21318) [    x:collection1] o.a.s.c.S.Request [collection1]  webapp=/rml path=/get params={distrib=false&qt=/get&fingerprint=true&getVersions=100&wt=javabin&version=2} status=0 QTime=0
   [junit4]   2> 1138418 INFO  (qtp15343172-21339) [    x:collection1] o.a.s.c.S.Request [collection1]  webapp=/rml path=/get params={qt=/get&getVersions=100&sync=http://127.0.0.1:36427/rml/collection1&wt=javabin&version=2} status=0 QTime=6
   [junit4]   2> 1138419 INFO  (qtp15343172-21340) [    x:collection1] o.a.s.u.p.LogUpdateProcessorFactory [collection1]  webapp=/rml path=/update params={update.distrib=FROMLEADER&wt=javabin&version=2}{add=[1 (1)]} 0 1
   [junit4]   2> 1138420 INFO  (qtp15343172-21338) [    x:collection1] o.a.s.u.PeerSync PeerSync: core=collection1 url= START replicas=[http://127.0.0.1:36427/rml/collection1] nUpdates=100
   [junit4]   2> 1138421 INFO  (qtp33191485-21319) [    x:collection1] o.a.s.u.IndexFingerprint IndexFingerprint millis:0.0 result:{maxVersionSpecified=9223372036854775807, maxVersionEncountered=1, maxInHash=1, versionsHash=-5451962507482445012, numVersions=1, numDocs=1, maxDoc=1}
   [junit4]   2> 1138421 INFO  (qtp33191485-21319) [    x:collection1] o.a.s.c.S.Request [collection1]  webapp=/rml path=/get params={distrib=false&qt=/get&getFingerprint=9223372036854775807&wt=javabin&version=2} status=0 QTime=0
   [junit4]   2> 1138423 INFO  (qtp15343172-21338) [    x:collection1] o.a.s.s.SolrIndexSearcher Opening [Searcher@8ea9bf[collection1] realtime]
   [junit4]   2> 1138424 INFO  (qtp15343172-21338) [    x:collection1] o.a.s.u.IndexFingerprint IndexFingerprint millis:3.0 result:{maxVersionSpecified=9223372036854775807, maxVersionEncountered=1, maxInHash=1, versionsHash=-5451962507482445012, numVersions=1, numDocs=1, maxDoc=1}
   [junit4]   2> 1138424 INFO  (qtp15343172-21338) [    x:collection1] o.a.s.u.PeerSync We are already in sync. No need to do a PeerSync 
   [junit4]   2> 1138424 INFO  (qtp15343172-21338) [    x:collection1] o.a.s.c.S.Request [collection1]  webapp=/rml path=/get params={qt=/get&getVersions=100&sync=http://127.0.0.1:36427/rml/collection1&wt=javabin&version=2} status=0 QTime=4
   [junit4]   2> 1138424 INFO  (qtp33191485-21317) [    x:collection1] o.a.s.u.DirectUpdateHandler2 start commit{_version_=1632319394101067776,optimize=false,openSearcher=true,waitSearcher=true,expungeDeletes=false,softCommit=false,prepareCommit=false}
   [junit4]   2> 1138425 INFO  (qtp33191485-21317) [    x:collection1] o.a.s.u.SolrIndexWriter Calling setCommitData with IW:org.apache.solr.update.SolrIndexWriter@ce3288 commitCommandVersion:1632319394101067776
   [junit4]   2> 1138426 INFO  (qtp33191485-21317) [    x:collection1] o.a.s.s.SolrIndexSearcher Opening [Searcher@d6d650[collection1] main]
   [junit4]   2> 1138426 INFO  (qtp33191485-21317) [    x:collection1] o.a.s.u.DirectUpdateHandler2 end_commit_flush
   [junit4]   2> 1138427 INFO  (searcherExecutor-6136-thread-1-processing-x:collection1) [    x:collection1] o.a.s.c.SolrCore [collection1] Registered new searcher Searcher@d6d650[collection1] main{ExitableDirectoryReader(UninvertingDirectoryReader(Uninverting(_0(8.1.0):C1:[diagnostics={os=Linux, java.vendor=Oracle Corporation, java.version=1.8.0_201, java.vm.version=25.201-b09, lucene.version=8.1.0, os.arch=i386, java.runtime.version=1.8.0_201-b09, source=flush, os.version=4.18.0-17-generic, timestamp=1556701082316}]:[attributes={Lucene50StoredFieldsFormat.mode=BEST_SPEED}])))}
   [junit4]   2> 1138427 INFO  (qtp33191485-21317) [    x:collection1] o.a.s.u.p.LogUpdateProcessorFactory [collection1]  webapp=/rml path=/update params={waitSearcher=true&commit=true&softCommit=false&wt=javabin&version=2}{commit=} 0 3
   [junit4]   2> 1138428 INFO  (qtp15343172-21339) [    x:collection1] o.a.s.u.DirectUpdateHandler2 start commit{_version_=1632319394105262080,optimize=false,openSearcher=true,waitSearcher=true,expungeDeletes=false,softCommit=false,prepareCommit=false}
   [junit4]   2> 1138428 INFO  (qtp15343172-21339) [    x:collection1] o.a.s.u.SolrIndexWriter Calling setCommitData with IW:org.apache.solr.update.SolrIndexWriter@b99ee0 commitCommandVersion:1632319394105262080
   [junit4]   2> 1138429 INFO  (qtp15343172-21339) [    x:collection1] o.a.s.s.SolrIndexSearcher Opening [Searcher@4852ae[collection1] main]
   [junit4]   2> 1138429 INFO  (qtp15343172-21339) [    x:collection1] o.a.s.u.DirectUpdateHandler2 end_commit_flush
   [junit4]   2> 1138431 INFO  (searcherExecutor-6150-thread-1-processing-x:collection1) [    x:collection1] o.a.s.c.SolrCore [collection1] Registered new searcher Searcher@4852ae[collection1] main{ExitableDirectoryReader(UninvertingDirectoryReader(Uninverting(_0(8.1.0):C1:[diagnostics={os=Linux, java.vendor=Oracle Corporation, java.version=1.8.0_201, java.vm.version=25.201-b09, lucene.version=8.1.0, os.arch=i386, java.runtime.version=1.8.0_201-b09, source=flush, os.version=4.18.0-17-generic, timestamp=1556701082324}]:[attributes={Lucene50StoredFieldsFormat.mode=BEST_SPEED}])))}
   [junit4]   2> 1138431 INFO  (qtp15343172-21339) [    x:collection1] o.a.s.u.p.LogUpdateProcessorFactory [collection1]  webapp=/rml path=/update params={waitSearcher=true&commit=true&softCommit=false&wt=javabin&version=2}{commit=} 0 3
   [junit4]   2> 1138432 INFO  (qtp33191485-21318) [    x:collection1] o.a.s.c.S.Request [collection1]  webapp=/rml path=/select params={q=*:*&wt=javabin&version=2} hits=1 status=0 QTime=0
   [junit4]   2> 1138432 INFO  (qtp15343172-21340) [    x:collection1] o.a.s.c.S.Request [collection1]  webapp=/rml path=/select params={q=*:*&wt=javabin&version=2} hits=1 status=0 QTime=0
   [junit4]   2> 1138438 INFO  (qtp33191485-21319) [    x:collection1] o.a.s.u.p.LogUpdateProcessorFactory [collection1]  webapp=/rml path=/update params={update.distrib=FROMLEADER&wt=javabin&version=2}{add=[2 (2)]} 0 4
   [junit4]   2> 1138438 INFO  (qtp15343172-21338) [    x:collection1] o.a.s.u.PeerSync PeerSync: core=collection1 url= START replicas=[http://127.0.0.1:36427/rml/collection1] nUpdates=100
   [junit4]   2> 1138442 INFO  (qtp33191485-21317) [    x:collection1] o.a.s.s.SolrIndexSearcher Opening [Searcher@1f344c4[collection1] realtime]
   [junit4]   2> 1138442 INFO  (qtp33191485-21317) [    x:collection1] o.a.s.u.IndexFingerprint IndexFingerprint millis:3.0 result:{maxVersionSpecified=9223372036854775807, maxVersionEncountered=2, maxInHash=2, versionsHash=-1218814014108643565, numVersions=2, numDocs=2, maxDoc=1}
   [junit4]   2> 1138442 INFO  (qtp33191485-21317) [    x:collection1] o.a.s.c.S.Request [collection1]  webapp=/rml path=/get params={distrib=false&qt=/get&getFingerprint=9223372036854775807&wt=javabin&version=2} status=0 QTime=3
   [junit4]   2> 1138442 INFO  (qtp15343172-21338) [    x:collection1] o.a.s.u.IndexFingerprint IndexFingerprint millis:0.0 result:{maxVersionSpecified=9223372036854775807, maxVersionEncountered=1, maxInHash=1, versionsHash=-5451962507482445012, numVersions=1, numDocs=1, maxDoc=1}
   [junit4]   2> 1138462 INFO  (qtp33191485-21318) [    x:collection1] o.a.s.u.IndexFingerprint IndexFingerprint millis:0.0 result:{maxVersionSpecified=9223372036854775807, maxVersionEncountered=2, maxInHash=2, versionsHash=-1218814014108643565, numVersions=2, numDocs=2, maxDoc=1}
   [junit4]   2> 1138462 INFO  (qtp33191485-21318) [    x:collection1] o.a.s.c.S.Request [collection1]  webapp=/rml path=/get params={distrib=false&qt=/get&fingerprint=true&getVersions=100&wt=javabin&version=2} status=0 QTime=0
   [junit4]   2> 1138462 INFO  (qtp15343172-21338) [    x:collection1] o.a.s.u.PeerSync PeerSync: core=collection1 url=  Received 2 versions from http://127.0.0.1:36427/rml/collection1 fingerprint:{maxVersionSpecified=9223372036854775807, maxVersionEncountered=2, maxInHash=2, versionsHash=-1218814014108643565, numVersions=2, numDocs=2, maxDoc=1}
   [junit4]   2> 1138463 INFO  (qtp33191485-21319) [    x:collection1] o.a.s.c.S.Request [collection1]  webapp=/rml path=/get params={distrib=false&qt=/get&checkCanHandleVersionRanges=false&wt=javabin&version=2} status=0 QTime=0
   [junit4]   2> 1138463 INFO  (qtp15343172-21338) [    x:collection1] o.a.s.u.PeerSync PeerSync: core=collection1 url= Requesting updates from http://127.0.0.1:36427/rml/collection1n=1 versions=2...2
   [junit4]   2> 1138464 INFO  (qtp33191485-21317) [    x:collection1] o.a.s.u.IndexFingerprint IndexFingerprint millis:0.0 result:{maxVersionSpecified=2, maxVersionEncountered=2, maxInHash=2, versionsHash=-1218814014108643565, numVersions=2, numDocs=2, maxDoc=1}
   [junit4]   2> 1138464 INFO  (qtp33191485-21317) [    x:collection1] o.a.s.c.S.Request [collection1]  webapp=/rml path=/get params={getUpdates=2...2&distrib=false&qt=/get&fingerprint=true&onlyIfActive=false&wt=javabin&version=2} status=0 QTime=0
   [junit4]   2> 1138467 INFO  (qtp15343172-21338) [    x:collection1] o.a.s.u.p.LogUpdateProcessorFactory [collection1] {add=[2 (2)]} 0 2
   [junit4]   2> 1138470 INFO  (qtp15343172-21338) [    x:collection1] o.a.s.s.SolrIndexSearcher Opening [Searcher@7e0294[collection1] realtime]
   [junit4]   2> 1138470 INFO  (qtp15343172-21338) [    x:collection1] o.a.s.u.IndexFingerprint IndexFingerprint millis:3.0 result:{maxVersionSpecified=2, maxVersionEncountered=2, maxInHash=2, versionsHash=-1218814014108643565, numVersions=2, numDocs=2, maxDoc=1}
   [junit4]   2> 1138470 INFO  (qtp15343172-21338) [    x:collection1] o.a.s.u.PeerSync Fingerprint comparison: 0
   [junit4]   2> 1138470 INFO  (qtp15343172-21338) [    x:collection1] o.a.s.u.PeerSync PeerSync: core=collection1 url= DONE. sync succeeded
   [junit4]   2> 1138470 INFO  (qtp15343172-21338) [    x:collection1] o.a.s.c.S.Request [collection1]  webapp=/rml path=/get params={qt=/get&getVersions=100&sync=http://127.0.0.1:36427/rml/collection1&wt=javabin&version=2} status=0 QTime=32
   [junit4]   2> 1138476 INFO  (qtp33191485-21318) [    x:collection1] o.a.s.u.DirectUpdateHandler2 start commit{_version_=1632319394155593728,optimize=false,openSearcher=true,waitSearcher=true,expungeDeletes=false,softCommit=false,prepareCommit=false}
   [junit4]   2> 1138476 INFO  (qtp33191485-21318) [    x:collection1] o.a.s.u.SolrIndexWriter Calling setCommitData with IW:org.apache.solr.update.SolrIndexWriter@ce3288 commitCommandVersion:1632319394155593728
   [junit4]   2> 1138478 INFO  (qtp33191485-21318) [    x:collection1] o.a.s.s.SolrIndexSearcher Opening [Searcher@94c90c[collection1] main]
   [junit4]   2> 1138479 INFO  (qtp33191485-21318) [    x:collection1] o.a.s.u.DirectUpdateHandler2 end_commit_flush
   [junit4]   2> 1138480 INFO  (searcherExecutor-6136-thread-1-processing-x:collection1) [    x:collection1] o.a.s.c.SolrCore [collection1] Registered new searcher Searcher@94c90c[collection1] main{ExitableDirectoryReader(UninvertingDirectoryReader(Uninverting(_0(8.1.0):C1:[diagnostics={os=Linux, java.vendor=Oracle Corporation, java.version=1.8.0_201, java.vm.version=25.201-b09, lucene.version=8.1.0, os.arch=i386, java.runtime.version=1.8.0_201-b09, source=flush, os.version=4.18.0-17-generic, timestamp=1556701082316}]:[attributes={Lucene50StoredFieldsFormat.mode=BEST_SPEED}]) Uninverting(_1(8.1.0):C1:[diagnostics={os=Linux, java.vendor=Oracle Corporation, java.version=1.8.0_201, java.vm.version=25.201-b09, lucene.version=8.1.0, os.arch=i386, java.runtime.version=1.8.0_201-b09, source=flush, os.version=4.18.0-17-generic, timestamp=1556701082342}]:[attributes={Lucene50StoredFieldsFormat.mode=BEST_SPEED}])))}
   [junit4]   2> 1138480 INFO  (qtp33191485-21318) [    x:collection1] o.a.s.u.p.LogUpdateProcessorFactory [collection1]  webapp=/rml path=/update params={waitSearcher=true&commit=true&softCommit=false&wt=javabin&version=2}{commit=} 0 4
   [junit4]   2> 1138481 INFO  (qtp15343172-21339) [    x:collection1] o.a.s.u.DirectUpdateHandler2 start commit{_version_=1632319394160836608,optimize=false,openSearcher=true,waitSearcher=true,expungeDeletes=false,softCommit=false,prepareCommit=false}
   [junit4]   2> 1138481 INFO  (qtp15343172-21339) [    x:collection1] o.a.s.u.SolrIndexWriter Calling setCommitData with IW:org.apache.solr.update.SolrIndexWriter@b99ee0 commitCommandVersion:1632319394160836608
   [junit4]   2> 1138482 INFO  (qtp15343172-21339) [    x:collection1] o.a.s.s.SolrIndexSearcher Opening [Searcher@8f86df[collection1] main]
   [junit4]   2> 1138483 INFO  (qtp15343172-21339) [    x:collection1] o.a.s.u.DirectUpdateHandler2 end_commit_flush
   [junit4]   2> 1138484 INFO  (searcherExecutor-6150-thread-1-processing-x:collection1) [    x:collection1] o.a.s.c.SolrCore [collection1] Registered new searcher Searcher@8f86df[collection1] main{ExitableDirectoryReader(UninvertingDirectoryReader(Uninverting(_0(8.1.0):C1:[diagnostics={os=Linux, java.vendor=Oracle Corporation, java.version=1.8.0_201, java.vm.version=25.201-b09, lucene.version=8.1.0, os.arch=i386, java.runtime.version=1.8.0_201-b09, source=flush, os.version=4.18.0-17-generic, timestamp=1556701082324}]:[attributes={Lucene50StoredFieldsFormat.mode=BEST_SPEED}]) Uninverting(_1(8.1.0):C1:[diagnostics={os=Linux, java.vendor=Oracle Corporation, java.version=1.8.0_201, java.vm.version=25.201-b09, lucene.version=8.1.0, os.arch=i386, java.runtime.version=1.8.0_201-b09, source=flush, os.version=4.18.0-17-generic, timestamp=1556701082370}]:[attributes={Lucene50StoredFieldsFormat.mode=BEST_SPEED}])))}
   [junit4]   2> 1138484 INFO  (qtp15343172-21339) [    x:collection1] o.a.s.u.p.LogUpdateProcessorFactory [collection1]  webapp=/rml path=/update params={waitSearcher=true&commit=true&softCommit=false&wt=javabin&version=2}{commit=} 0 3
   [junit4]   2> 1138485 INFO  (qtp33191485-21319) [    x:collection1] o.a.s.c.S.Request [collection1]  webapp=/rml path=/select params={q=*:*&wt=javabin&version=2} hits=2 status=0 QTime=0
   [junit4]   2> 1138488 INFO  (qtp15343172-21340) [    x:collection1] o.a.s.c.S.Request [collection1]  webapp=/rml path=/select params={q=*:*&wt=javabin&version=2} hits=2 status=0 QTime=0
   [junit4]   2> 1138491 INFO  (qtp33191485-21317) [    x:collection1] o.a.s.u.p.LogUpdateProcessorFactory [collection1]  webapp=/rml path=/update params={update.distrib=FROMLEADER&wt=javabin&version=2}{add=[3 (3)]} 0 1
   [junit4]   2> 1138491 INFO  (qtp33191485-21318) [    x:collection1] o.a.s.u.p.LogUpdateProcessorFactory [collection1]  webapp=/rml path=/update params={update.distrib=FROMLEADER&wt=javabin&version=2}{add=[4 (4)]} 0 0
   [junit4]   2> 1138492 INFO  (qtp33191485-21319) [    x:collection1] o.a.s.u.p.LogUpdateProcessorFactory [collection1]  webapp=/rml path=/update params={update.distrib=FROMLEADER&wt=javabin&version=2}{add=[5 (5)]} 0 0
   [junit4]   2> 1138493 INFO  (qtp33191485-21317) [    x:collection1] o.a.s.u.p.LogUpdateProcessorFactory [collection1]  webapp=/rml path=/update params={update.distrib=FROMLEADER&wt=javabin&version=2}{add=[6 (6)]} 0 0
   [junit4]   2> 1138494 INFO  (qtp33191485-21318) [    x:collection1] o.a.s.u.p.LogUpdateProcessorFactory [collection1]  webapp=/rml path=/update params={update.distrib=FROMLEADER&wt=javabin&version=2}{add=[7 (7)]} 0 0
   [junit4]   2> 1138494 INFO  (qtp33191485-21319) [    x:collection1] o.a.s.u.p.LogUpdateProcessorFactory [collection1]  webapp=/rml path=/update params={update.distrib=FROMLEADER&wt=javabin&version=2}{add=[8 (8)]} 0 0
   [junit4]   2> 1138495 INFO  (qtp33191485-21317) [    x:collection1] o.a.s.u.p.LogUpdateProcessorFactory [collection1]  webapp=/rml path=/update params={update.distrib=FROMLEADER&wt=javabin&version=2}{add=[9 (9)]} 0 0
   [junit4]   2> 1138496 INFO  (qtp33191485-21318) [    x:collection1] o.a.s.u.p.LogUpdateProcessorFactory [collection1]  webapp=/rml path=/update params={update.distrib=FROMLEADER&wt=javabin&version=2}{add=[10 (10)]} 0 0
   [junit4]   2> 1138497 INFO  (qtp15343172-21338) [    x:collection1] o.a.s.u.PeerSync PeerSync: core=collection1 url= START replicas=[http://127.0.0.1:36427/rml/collection1] nUpdates=100
   [junit4]   2> 1138500 INFO  (qtp33191485-21319) [    x:collection1] o.a.s.s.SolrIndexSearcher Opening [Searcher@1a94f60[collection1] realtime]
   [junit4]   2> 1138500 INFO  (qtp33191485-21319) [    x:collection1] o.a.s.u.IndexFingerprint IndexFingerprint millis:3.0 result:{maxVersionSpecified=9223372036854775807, maxVersionEncountered=10, maxInHash=10, versionsHash=-5671163287542876028, numVersions=10, numDocs=10, maxDoc=8}
   [junit4]   2> 1138500 INFO  (qtp33191485-21319) [    x:collection1] o.a.s.c.S.Request [collection1]  webapp=/rml path=/get params={distrib=false&qt=/get&getFingerprint=9223372036854775807&wt=javabin&version=2} status=0 QTime=3
   [junit4]   2> 1138501 INFO  (qtp15343172-21338) [    x:collection1] o.a.s.u.IndexFingerprint IndexFingerprint millis:0.0 result:{maxVersionSpecified=9223372036854775807, maxVersionEncountered=2, maxInHash=2, versionsHash=-1218814014108643565, numVersions=2, numDocs=2, maxDoc=1}
   [junit4]   2> 1138501 INFO  (qtp33191485-21317) [    x:collection1] o.a.s.u.IndexFingerprint IndexFingerprint millis:0.0 result:{maxVersionSpecified=9223372036854775807, maxVersionEncountered=10, maxInHash=10, versionsHash=-5671163287542876028, numVersions=10, numDocs=10, maxDoc=8}
   [junit4]   2> 1138501 INFO  (qtp33191485-21317) [    x:collection1] o.a.s.c.S.Request [collection1]  webapp=/rml path=/get params={distrib=false&qt=/get&fingerprint=true&getVersions=100&wt=javabin&version=2} status=0 QTime=0
   [junit4]   2> 1138502 INFO  (qtp15343172-21338) [    x:collection1] o.a.s.u.PeerSync PeerSync: core=collection1 url=  Received 10 versions from http://127.0.0.1:36427/rml/collection1 fingerprint:{maxVersionSpecified=9223372036854775807, maxVersionEncountered=10, maxInHash=10, versionsHash=-5671163287542876028, numVersions=10, numDocs=10, maxDoc=8}
   [junit4]   2> 1138502 INFO  (qtp33191485-21318) [    x:collection1] o.a.s.c.S.Request [collection1]  webapp=/rml path=/get params={distrib=false&qt=/get&checkCanHandleVersionRanges=false&wt=javabin&version=2} status=0 QTime=0
   [junit4]   2> 1138502 INFO  (qtp15343172-21338) [    x:collection1] o.a.s.u.PeerSync PeerSync: core=collection1 url= Requesting updates from http://127.0.0.1:36427/rml/collection1n=8 versions=3...10
   [junit4]   2> 1138503 INFO  (qtp33191485-21319) [    x:collection1] o.a.s.u.IndexFingerprint IndexFingerprint millis:0.0 result:{maxVersionSpecified=10, maxVersionEncountered=10, maxInHash=10, versionsHash=-5671163287542876028, numVersions=10, numDocs=10, maxDoc=8}
   [junit4]   2> 1138503 INFO  (qtp33191485-21319) [    x:collection1] o.a.s.c.S.Request [collection1]  webapp=/rml path=/get params={getUpdates=3...10&distrib=false&qt=/get&fingerprint=true&onlyIfActive=false&wt=javabin&version=2} status=0 QTime=0
   [junit4]   2> 1138505 INFO  (qtp15343172-21338) [    x:collection1] o.a.s.u.p.LogUpdateProcessorFactory [collection1] {add=[3 (3), 4 (4), 5 (5), 6 (6), 7 (7), 8 (8), 9 (9), 10 (10)]} 0 2
   [junit4]   2> 1138508 INFO  (qtp15343172-21338) [    x:collection1] o.a.s.s.SolrIndexSearcher Opening [Searcher@1c03588[collection1] realtime]
   [junit4]   2> 1138509 INFO  (qtp15343172-21338) [    x:collection1] o.a.s.u.IndexFingerprint IndexFingerprint millis:3.0 result:{maxVersionSpecified=10, maxVersionEncountered=10, maxInHash=10, versionsHash=-5671163287542876028, numVersions=10, numDocs=10, maxDoc=8}
   [junit4]   2> 1138509 INFO  (qtp15343172-21338) [    x:collection1] o.a.s.u.PeerSync Fingerprint comparison: 0
   [junit4]   2> 1138509 INFO  (qtp15343172-21338) [    x:collection1] o.a.s.u.PeerSync PeerSync: core=collection1 url= DONE. sync succeeded
   [junit4]   2> 1138509 INFO  (qtp15343172-21338) [    x:collection1] o.a.s.c.S.Request [collection1]  webapp=/rml path=/get params={qt=/get&getVersions=100&sync=http://127.0.0.1:36427/rml/collection1&wt=javabin&version=2} statu

[...truncated too long message...]

erSyncWithLeaderTest-seed#[5264C3167144BF37]-worker) [    ] o.a.s.m.SolrMetricManager Closing metric reporters for registry=solr.node, tag=null
   [junit4]   2> 2590605 INFO  (SUITE-PeerSyncWithLeaderTest-seed#[5264C3167144BF37]-worker) [    ] o.a.s.m.r.SolrJmxReporter Closing reporter [org.apache.solr.metrics.reporters.SolrJmxReporter@118f17: rootName = null, domain = solr.node, service url = null, agent id = null] for registry solr.node / com.codahale.metrics.MetricRegistry@5c496c
   [junit4]   2> 2590606 INFO  (SUITE-PeerSyncWithLeaderTest-seed#[5264C3167144BF37]-worker) [    ] o.a.s.m.SolrMetricManager Closing metric reporters for registry=solr.jvm, tag=null
   [junit4]   2> 2590606 INFO  (SUITE-PeerSyncWithLeaderTest-seed#[5264C3167144BF37]-worker) [    ] o.a.s.m.r.SolrJmxReporter Closing reporter [org.apache.solr.metrics.reporters.SolrJmxReporter@101b0d4: rootName = null, domain = solr.jvm, service url = null, agent id = null] for registry solr.jvm / com.codahale.metrics.MetricRegistry@10a6796
   [junit4]   2> 2590606 INFO  (SUITE-PeerSyncWithLeaderTest-seed#[5264C3167144BF37]-worker) [    ] o.a.s.m.SolrMetricManager Closing metric reporters for registry=solr.jetty, tag=null
   [junit4]   2> 2590607 INFO  (SUITE-PeerSyncWithLeaderTest-seed#[5264C3167144BF37]-worker) [    ] o.a.s.m.r.SolrJmxReporter Closing reporter [org.apache.solr.metrics.reporters.SolrJmxReporter@1695c63: rootName = null, domain = solr.jetty, service url = null, agent id = null] for registry solr.jetty / com.codahale.metrics.MetricRegistry@837983
   [junit4]   2> NOTE: leaving temporary files on disk at: /home/jenkins/workspace/Lucene-Solr-8.x-Linux/solr/build/solr-core/test/J2/temp/solr.update.PeerSyncWithLeaderTest_5264C3167144BF37-001
   [junit4]   2> NOTE: test params are: codec=CheapBastard, sim=Asserting(org.apache.lucene.search.similarities.AssertingSimilarity@432ba7), locale=es-SV, timezone=Mexico/BajaSur
   [junit4]   2> NOTE: Linux 4.18.0-17-generic i386/Oracle Corporation 1.8.0_201 (32-bit)/cpus=8,threads=1,free=175643840,total=518979584
   [junit4]   2> NOTE: All tests run in this JVM: [TestCloudManagedSchema, TestClusterProperties, TestLegacyBM25SimilarityFactory, PhrasesIdentificationComponentTest, TestLRUCache, TestDocumentBuilder, BinaryUpdateRequestHandlerTest, TestEmbeddedSolrServerSchemaAPI, ZkShardTermsTest, TestTrackingShardHandlerFactory, TestJmxIntegration, TestExactStatsCache, ConnectionManagerTest, IndexSchemaRuntimeFieldTest, SolrIndexSplitterTest, TestJavabinTupleStreamParser, TestCloudJSONFacetSKG, OverriddenZkACLAndCredentialsProvidersTest, TestSystemCollAutoCreate, TestComponentsName, CdcrBootstrapTest, UUIDFieldTest, TestStressReorder, TestOnReconnectListenerSupport, ReplaceNodeNoTargetTest, NestedAtomicUpdateTest, TestSolrQueryResponse, SynonymTokenizerTest, TestNumericRangeQuery32, TestSuggestSpellingConverter, TestSQLHandlerNonCloud, TestReqParamsAPI, UnloadDistributedZkTest, CoreAdminOperationTest, TestTrie, ConvertedLegacyTest, DistributedIntervalFacetingTest, HLLSerializationTest, SolrJmxReporterTest, TestBackupRepositoryFactory, TestDirectoryFactory, EmbeddedSolrNoSerializeTest, TestClusterStateMutator, TestDistributedGrouping, ImplicitSnitchTest, TestSchemaResource, TestImplicitCoreProperties, SimpleCollectionCreateDeleteTest, BlockJoinFacetDistribTest, RAMDirectoryFactoryTest, SolrTestCaseJ4Test, TriggerSetPropertiesIntegrationTest, TestLegacyNumericUtils, TestDefaultStatsCache, TaggerTest, FastVectorHighlighterTest, RecoveryZkTest, TestCollapseQParserPlugin, BitVectorTest, TestPerFieldSimilarityWithDefaultOverride, CleanupOldIndexTest, HdfsChaosMonkeyNothingIsSafeTest, ResponseLogComponentTest, URLClassifyProcessorTest, DistribCursorPagingTest, CloudMLTQParserTest, JWTAuthPluginIntegrationTest, ClassificationUpdateProcessorIntegrationTest, DistributedQueryElevationComponentTest, CdcrRequestHandlerTest, TestCollationFieldDocValues, TestStreamBody, TestFaceting, TestRecovery, TestSkipOverseerOperations, TestRTimerTree, TestPullReplicaErrorHandling, TestReloadAndDeleteDocs, TestSolrConfigHandler, TestSolrJ, SyncSliceTest, SchemaVersionSpecificBehaviorTest, TestReloadDeadlock, OutputWriterTest, SolrCloudExampleTest, DefaultValueUpdateProcessorTest, HdfsUnloadDistributedZkTest, SOLR749Test, PolyFieldTest, SuggestComponentContextFilterQueryTest, TestQueryUtils, TestMacroExpander, OverseerTest, HdfsDirectoryFactoryTest, RegexBoostProcessorTest, DistributedQueueTest, TermVectorComponentTest, TestFunctionQuery, TestLeaderElectionZkExpiry, SharedFSAutoReplicaFailoverTest, TestZkChroot, TestIBSimilarityFactory, TestSortByMinMaxFunction, HDFSCollectionsAPITest, SystemInfoHandlerTest, TestCloudPhrasesIdentificationComponent, TestHdfsCloudBackupRestore, HighlighterTest, CoreSorterTest, TestBulkSchemaAPI, AtomicUpdatesTest, DeleteInactiveReplicaTest, TestCustomDocTransformer, ByteBuffersDirectoryFactoryTest, TestUninvertingReader, CheckHdfsIndexTest, CustomCollectionTest, SuggesterTSTTest, TestSortableTextField, PrimitiveFieldTypeTest, PeerSyncWithBufferUpdatesTest, TestZkAclsWithHadoopAuth, TestManagedSynonymFilterFactory, TestSolrIndexConfig, DocValuesTest, MetricsHistoryIntegrationTest, XmlUpdateRequestHandlerTest, DistributedFacetExistsSmallTest, MetricUtilsTest, TestStandardQParsers, CurrencyRangeFacetCloudTest, NodeAddedTriggerTest, UpdateRequestProcessorFactoryTest, TestConfigsApi, MissingSegmentRecoveryTest, TestClassicSimilarityFactory, BlockDirectoryTest, TestRebalanceLeaders, PrimUtilsTest, RankQueryTest, SolrRequestParserTest, TestGroupingSearch, TestHighlightDedupGrouping, TestJoin, TestRandomDVFaceting, TestRandomFaceting, TestSimpleTrackingShardHandler, PathHierarchyTokenizerFactoryTest, ProtectedTermFilterFactoryTest, TestCharFilters, TestDeprecatedFilters, TestLuceneMatchVersion, TestReversedWildcardFilterFactory, TestWordDelimiterFilterFactory, TokenizerChainTest, TestLuceneIndexBackCompat, TestJettySolrRunner, ConnectionReuseTest, ActionThrottleTest, AddReplicaTest, AliasIntegrationTest, AssignBackwardCompatibilityTest, BasicDistributedZk2Test, BasicDistributedZkTest, ChaosMonkeySafeLeaderTest, DeleteLastCustomShardedReplicaTest, DeleteReplicaTest, HttpPartitionTest, LeaderElectionTest, LeaderTragicEventTest, MoveReplicaHDFSFailoverTest, MoveReplicaHDFSTest, MoveReplicaTest, MultiThreadedOCPTest, NestedShardedAtomicUpdateTest, ReplaceNodeTest, SSLMigrationTest, SaslZkACLProviderTest, SystemCollectionCompatTest, TestAuthenticationFramework, TestCloudPivotFacet, TestCloudPseudoReturnFields, TestConfigSetsAPI, TestDistribDocBasedVersion, TestSSLRandomization, TestSolrCloudWithKerberosAlt, TestStressInPlaceUpdates, TestTolerantUpdateProcessorRandomCloud, ZkSolrClientTest, CollectionsAPIAsyncDistributedZkTest, AutoScalingHandlerTest, ComputePlanActionTest, ScheduledTriggerTest, SearchRateTriggerIntegrationTest, SearchRateTriggerTest, TriggerCooldownIntegrationTest, TestSimTriggerIntegration, HdfsRecoveryZkTest, HdfsRestartWhileUpdatingTest, HdfsSyncSliceTest, RuleEngineTest, RulesTest, TestCodecSupport, TestConfigOverlay, TestConfigSetProperties, TestConfigSets, TestCoreContainer, TestMergePolicyConfig, TestNRTOpen, CSVRequestHandlerTest, FieldAnalysisRequestHandlerTest, MoreLikeThisHandlerTest, PingRequestHandlerTest, TestCoreBackup, TestHdfsBackupRestoreCore, CoreAdminRequestStatusTest, CoreMergeIndexesAdminHandlerTest, DaemonStreamApiTest, InfoHandlerTest, LoggingHandlerTest, LukeRequestHandlerTest, MBeansHandlerTest, BadComponentTest, CustomHighlightComponentTest, DistributedFacetPivotLargeTest, DistributedFacetPivotWhiteBoxTest, DistributedTermsComponentTest, ShardsWhitelistTest, TestNumericTokenStream, TestLogWatcher, JvmMetricsTest, MetricsConfigTest, SolrMetricManagerTest, SolrMetricReporterTest, SolrMetricsIntegrationTest, SolrSlf4jReporterTest, SolrRrdBackendFactoryTest, TestChildDocTransformerHierarchy, TestSubQueryTransformerCrossCore, TestManagedResource, TestDynamicFieldCollectionResource, TestDynamicFieldResource, TestFieldResource, TestSchemaSimilarityResource, TestSerializedLuceneMatchVersion, TestManagedSynonymGraphFilterFactory, CurrencyFieldTypeTest, IndexSchemaTest, TestHalfAndHalfDocValues, TestManagedSchemaAPI, TestPointFields, TestElisionMultitermQuery, TestFastLRUCache, TestFieldSortValues, TestFilteredDocIdSet, TestFiltering, TestSearchPerf, TestSearcherReuse, TestSimpleQParserPlugin, TestSmileRequest, TestSolr4Spatial, TestSolr4Spatial2, TestStressUserVersions, TestStressVersions, TestSurroundQueryParser, TestTrieFacet, TestValueSourceCache, TestXmlQParser, TestXmlQParserPlugin, RangeFacetCloudTest, TestJsonFacets, PeerSyncWithLeaderTest]
   [junit4] Completed [833/855 (2!)] on J2 in 140.58s, 1 test, 1 failure <<< FAILURES!

[...truncated 9042 lines...]
BUILD FAILED
/home/jenkins/workspace/Lucene-Solr-8.x-Linux/build.xml:634: The following error occurred while executing this line:
/home/jenkins/workspace/Lucene-Solr-8.x-Linux/build.xml:128: Found 1 violations in source files (File uses Mockito but has no assumeWorkingMockito() call).

Total time: 91 minutes 28 seconds
Build step 'Invoke Ant' marked build as failure
Archiving artifacts
Setting ANT_1_8_2_HOME=/home/jenkins/tools/hudson.tasks.Ant_AntInstallation/ANT_1.8.2
[WARNINGS] Skipping publisher since build result is FAILURE
Recording test results
Setting ANT_1_8_2_HOME=/home/jenkins/tools/hudson.tasks.Ant_AntInstallation/ANT_1.8.2
Email was triggered for: Failure - Any
Sending email for trigger: Failure - Any
Setting ANT_1_8_2_HOME=/home/jenkins/tools/hudson.tasks.Ant_AntInstallation/ANT_1.8.2
Setting ANT_1_8_2_HOME=/home/jenkins/tools/hudson.tasks.Ant_AntInstallation/ANT_1.8.2
Setting ANT_1_8_2_HOME=/home/jenkins/tools/hudson.tasks.Ant_AntInstallation/ANT_1.8.2
Setting ANT_1_8_2_HOME=/home/jenkins/tools/hudson.tasks.Ant_AntInstallation/ANT_1.8.2
Setting ANT_1_8_2_HOME=/home/jenkins/tools/hudson.tasks.Ant_AntInstallation/ANT_1.8.2
Setting ANT_1_8_2_HOME=/home/jenkins/tools/hudson.tasks.Ant_AntInstallation/ANT_1.8.2

Mime
View raw message