lucene-dev mailing list archives

Site index · List index
Message view « Date » · « Thread »
Top « Date » · « Thread »
From Policeman Jenkins Server <jenk...@thetaphi.de>
Subject [JENKINS-EA] Lucene-Solr-8.1-Windows (64bit/jdk-13-ea+18) - Build # 105 - Unstable!
Date Mon, 13 May 2019 21:17:17 GMT
Build: https://jenkins.thetaphi.de/job/Lucene-Solr-8.1-Windows/105/
Java: 64bit/jdk-13-ea+18 -XX:-UseCompressedOops -XX:+UseConcMarkSweepGC

1 tests failed.
FAILED:  org.apache.solr.cloud.autoscaling.sim.TestSimComputePlanAction.testNodeWithMultipleReplicasLost

Error Message:
OverseerTriggerThread never caught up to the latest znodeVersion

Stack Trace:
java.util.concurrent.TimeoutException: OverseerTriggerThread never caught up to the latest znodeVersion
	at __randomizedtesting.SeedInfo.seed([25238CE346EF10A4:15E36D61CE9DF1F8]:0)
	at org.apache.solr.util.TimeOut.waitFor(TimeOut.java:66)
	at org.apache.solr.cloud.autoscaling.sim.SimSolrCloudTestCase.assertAutoscalingUpdateComplete(SimSolrCloudTestCase.java:89)
	at org.apache.solr.cloud.autoscaling.sim.TestSimComputePlanAction.testNodeWithMultipleReplicasLost(TestSimComputePlanAction.java:207)
	at java.base/jdk.internal.reflect.NativeMethodAccessorImpl.invoke0(Native Method)
	at java.base/jdk.internal.reflect.NativeMethodAccessorImpl.invoke(NativeMethodAccessorImpl.java:62)
	at java.base/jdk.internal.reflect.DelegatingMethodAccessorImpl.invoke(DelegatingMethodAccessorImpl.java:43)
	at java.base/java.lang.reflect.Method.invoke(Method.java:567)
	at com.carrotsearch.randomizedtesting.RandomizedRunner.invoke(RandomizedRunner.java:1750)
	at com.carrotsearch.randomizedtesting.RandomizedRunner$8.evaluate(RandomizedRunner.java:938)
	at com.carrotsearch.randomizedtesting.RandomizedRunner$9.evaluate(RandomizedRunner.java:974)
	at com.carrotsearch.randomizedtesting.RandomizedRunner$10.evaluate(RandomizedRunner.java:988)
	at com.carrotsearch.randomizedtesting.rules.SystemPropertiesRestoreRule$1.evaluate(SystemPropertiesRestoreRule.java:57)
	at org.apache.lucene.util.TestRuleSetupTeardownChained$1.evaluate(TestRuleSetupTeardownChained.java:49)
	at org.apache.lucene.util.AbstractBeforeAfterRule$1.evaluate(AbstractBeforeAfterRule.java:45)
	at org.apache.lucene.util.TestRuleThreadAndTestName$1.evaluate(TestRuleThreadAndTestName.java:48)
	at org.apache.lucene.util.TestRuleIgnoreAfterMaxFailures$1.evaluate(TestRuleIgnoreAfterMaxFailures.java:64)
	at org.apache.lucene.util.TestRuleMarkFailure$1.evaluate(TestRuleMarkFailure.java:47)
	at com.carrotsearch.randomizedtesting.rules.StatementAdapter.evaluate(StatementAdapter.java:36)
	at com.carrotsearch.randomizedtesting.ThreadLeakControl$StatementRunner.run(ThreadLeakControl.java:368)
	at com.carrotsearch.randomizedtesting.ThreadLeakControl.forkTimeoutingTask(ThreadLeakControl.java:817)
	at com.carrotsearch.randomizedtesting.ThreadLeakControl$3.evaluate(ThreadLeakControl.java:468)
	at com.carrotsearch.randomizedtesting.RandomizedRunner.runSingleTest(RandomizedRunner.java:947)
	at com.carrotsearch.randomizedtesting.RandomizedRunner$5.evaluate(RandomizedRunner.java:832)
	at com.carrotsearch.randomizedtesting.RandomizedRunner$6.evaluate(RandomizedRunner.java:883)
	at com.carrotsearch.randomizedtesting.RandomizedRunner$7.evaluate(RandomizedRunner.java:894)
	at com.carrotsearch.randomizedtesting.rules.StatementAdapter.evaluate(StatementAdapter.java:36)
	at com.carrotsearch.randomizedtesting.rules.SystemPropertiesRestoreRule$1.evaluate(SystemPropertiesRestoreRule.java:57)
	at org.apache.lucene.util.AbstractBeforeAfterRule$1.evaluate(AbstractBeforeAfterRule.java:45)
	at com.carrotsearch.randomizedtesting.rules.StatementAdapter.evaluate(StatementAdapter.java:36)
	at org.apache.lucene.util.TestRuleStoreClassName$1.evaluate(TestRuleStoreClassName.java:41)
	at com.carrotsearch.randomizedtesting.rules.NoShadowingOrOverridesOnMethodsRule$1.evaluate(NoShadowingOrOverridesOnMethodsRule.java:40)
	at com.carrotsearch.randomizedtesting.rules.NoShadowingOrOverridesOnMethodsRule$1.evaluate(NoShadowingOrOverridesOnMethodsRule.java:40)
	at com.carrotsearch.randomizedtesting.rules.StatementAdapter.evaluate(StatementAdapter.java:36)
	at com.carrotsearch.randomizedtesting.rules.StatementAdapter.evaluate(StatementAdapter.java:36)
	at org.apache.lucene.util.TestRuleAssertionsRequired$1.evaluate(TestRuleAssertionsRequired.java:53)
	at org.apache.lucene.util.TestRuleMarkFailure$1.evaluate(TestRuleMarkFailure.java:47)
	at org.apache.lucene.util.TestRuleIgnoreAfterMaxFailures$1.evaluate(TestRuleIgnoreAfterMaxFailures.java:64)
	at org.apache.lucene.util.TestRuleIgnoreTestSuites$1.evaluate(TestRuleIgnoreTestSuites.java:54)
	at com.carrotsearch.randomizedtesting.rules.StatementAdapter.evaluate(StatementAdapter.java:36)
	at com.carrotsearch.randomizedtesting.ThreadLeakControl$StatementRunner.run(ThreadLeakControl.java:368)
	at java.base/java.lang.Thread.run(Thread.java:835)




Build Log:
[...truncated 2106 lines...]
   [junit4] JVM J0: stderr was not empty, see: C:\Users\jenkins\workspace\Lucene-Solr-8.1-Windows\lucene\build\core\test\temp\junit4-J0-20190513_192259_21517193086438649450526.syserr
   [junit4] >>> JVM J0 emitted unexpected output (verbatim) ----
   [junit4] OpenJDK 64-Bit Server VM warning: Option UseConcMarkSweepGC was deprecated in version 9.0 and will likely be removed in a future release.
   [junit4] <<< JVM J0: EOF ----

[...truncated 5 lines...]
   [junit4] JVM J1: stderr was not empty, see: C:\Users\jenkins\workspace\Lucene-Solr-8.1-Windows\lucene\build\core\test\temp\junit4-J1-20190513_192259_21512064820903590685461.syserr
   [junit4] >>> JVM J1 emitted unexpected output (verbatim) ----
   [junit4] OpenJDK 64-Bit Server VM warning: Option UseConcMarkSweepGC was deprecated in version 9.0 and will likely be removed in a future release.
   [junit4] <<< JVM J1: EOF ----

[...truncated 319 lines...]
   [junit4] JVM J0: stderr was not empty, see: C:\Users\jenkins\workspace\Lucene-Solr-8.1-Windows\lucene\build\test-framework\test\temp\junit4-J0-20190513_193205_67012358840223054948325.syserr
   [junit4] >>> JVM J0 emitted unexpected output (verbatim) ----
   [junit4] OpenJDK 64-Bit Server VM warning: Option UseConcMarkSweepGC was deprecated in version 9.0 and will likely be removed in a future release.
   [junit4] <<< JVM J0: EOF ----

[...truncated 3 lines...]
   [junit4] JVM J1: stderr was not empty, see: C:\Users\jenkins\workspace\Lucene-Solr-8.1-Windows\lucene\build\test-framework\test\temp\junit4-J1-20190513_193205_67015912664021707834565.syserr
   [junit4] >>> JVM J1 emitted unexpected output (verbatim) ----
   [junit4] OpenJDK 64-Bit Server VM warning: Option UseConcMarkSweepGC was deprecated in version 9.0 and will likely be removed in a future release.
   [junit4] <<< JVM J1: EOF ----

[...truncated 1084 lines...]
   [junit4] JVM J1: stderr was not empty, see: C:\Users\jenkins\workspace\Lucene-Solr-8.1-Windows\lucene\build\analysis\common\test\temp\junit4-J1-20190513_193402_9885178517131683303248.syserr
   [junit4] >>> JVM J1 emitted unexpected output (verbatim) ----
   [junit4] OpenJDK 64-Bit Server VM warning: Option UseConcMarkSweepGC was deprecated in version 9.0 and will likely be removed in a future release.
   [junit4] <<< JVM J1: EOF ----

   [junit4] JVM J0: stderr was not empty, see: C:\Users\jenkins\workspace\Lucene-Solr-8.1-Windows\lucene\build\analysis\common\test\temp\junit4-J0-20190513_193402_98816007824971579613017.syserr
   [junit4] >>> JVM J0 emitted unexpected output (verbatim) ----
   [junit4] OpenJDK 64-Bit Server VM warning: Option UseConcMarkSweepGC was deprecated in version 9.0 and will likely be removed in a future release.
   [junit4] <<< JVM J0: EOF ----

[...truncated 257 lines...]
   [junit4] JVM J0: stderr was not empty, see: C:\Users\jenkins\workspace\Lucene-Solr-8.1-Windows\lucene\build\analysis\icu\test\temp\junit4-J0-20190513_193650_53815272390814585951238.syserr
   [junit4] >>> JVM J0 emitted unexpected output (verbatim) ----
   [junit4] OpenJDK 64-Bit Server VM warning: Option UseConcMarkSweepGC was deprecated in version 9.0 and will likely be removed in a future release.
   [junit4] <<< JVM J0: EOF ----

[...truncated 3 lines...]
   [junit4] JVM J1: stderr was not empty, see: C:\Users\jenkins\workspace\Lucene-Solr-8.1-Windows\lucene\build\analysis\icu\test\temp\junit4-J1-20190513_193650_53814903616830285216568.syserr
   [junit4] >>> JVM J1 emitted unexpected output (verbatim) ----
   [junit4] OpenJDK 64-Bit Server VM warning: Option UseConcMarkSweepGC was deprecated in version 9.0 and will likely be removed in a future release.
   [junit4] <<< JVM J1: EOF ----

[...truncated 251 lines...]
   [junit4] JVM J1: stderr was not empty, see: C:\Users\jenkins\workspace\Lucene-Solr-8.1-Windows\lucene\build\analysis\kuromoji\test\temp\junit4-J1-20190513_193704_4937892025713512343407.syserr
   [junit4] >>> JVM J1 emitted unexpected output (verbatim) ----
   [junit4] OpenJDK 64-Bit Server VM warning: Option UseConcMarkSweepGC was deprecated in version 9.0 and will likely be removed in a future release.
   [junit4] <<< JVM J1: EOF ----

[...truncated 6 lines...]
   [junit4] JVM J0: stderr was not empty, see: C:\Users\jenkins\workspace\Lucene-Solr-8.1-Windows\lucene\build\analysis\kuromoji\test\temp\junit4-J0-20190513_193704_49316317603506644816855.syserr
   [junit4] >>> JVM J0 emitted unexpected output (verbatim) ----
   [junit4] OpenJDK 64-Bit Server VM warning: Option UseConcMarkSweepGC was deprecated in version 9.0 and will likely be removed in a future release.
   [junit4] <<< JVM J0: EOF ----

[...truncated 166 lines...]
   [junit4] JVM J1: stderr was not empty, see: C:\Users\jenkins\workspace\Lucene-Solr-8.1-Windows\lucene\build\analysis\morfologik\test\temp\junit4-J1-20190513_193732_28717596088419531319274.syserr
   [junit4] >>> JVM J1 emitted unexpected output (verbatim) ----
   [junit4] OpenJDK 64-Bit Server VM warning: Option UseConcMarkSweepGC was deprecated in version 9.0 and will likely be removed in a future release.
   [junit4] <<< JVM J1: EOF ----

   [junit4] JVM J0: stderr was not empty, see: C:\Users\jenkins\workspace\Lucene-Solr-8.1-Windows\lucene\build\analysis\morfologik\test\temp\junit4-J0-20190513_193732_2879753884964327694357.syserr
   [junit4] >>> JVM J0 emitted unexpected output (verbatim) ----
   [junit4] OpenJDK 64-Bit Server VM warning: Option UseConcMarkSweepGC was deprecated in version 9.0 and will likely be removed in a future release.
   [junit4] <<< JVM J0: EOF ----

[...truncated 208 lines...]
   [junit4] JVM J0: stderr was not empty, see: C:\Users\jenkins\workspace\Lucene-Solr-8.1-Windows\lucene\build\analysis\nori\test\temp\junit4-J0-20190513_193738_8701998962052872871281.syserr
   [junit4] >>> JVM J0 emitted unexpected output (verbatim) ----
   [junit4] OpenJDK 64-Bit Server VM warning: Option UseConcMarkSweepGC was deprecated in version 9.0 and will likely be removed in a future release.
   [junit4] <<< JVM J0: EOF ----

[...truncated 3 lines...]
   [junit4] JVM J1: stderr was not empty, see: C:\Users\jenkins\workspace\Lucene-Solr-8.1-Windows\lucene\build\analysis\nori\test\temp\junit4-J1-20190513_193738_87015163653379737760617.syserr
   [junit4] >>> JVM J1 emitted unexpected output (verbatim) ----
   [junit4] OpenJDK 64-Bit Server VM warning: Option UseConcMarkSweepGC was deprecated in version 9.0 and will likely be removed in a future release.
   [junit4] <<< JVM J1: EOF ----

[...truncated 169 lines...]
   [junit4] JVM J1: stderr was not empty, see: C:\Users\jenkins\workspace\Lucene-Solr-8.1-Windows\lucene\build\analysis\opennlp\test\temp\junit4-J1-20190513_193751_36912428518520572932270.syserr
   [junit4] >>> JVM J1 emitted unexpected output (verbatim) ----
   [junit4] OpenJDK 64-Bit Server VM warning: Option UseConcMarkSweepGC was deprecated in version 9.0 and will likely be removed in a future release.
   [junit4] <<< JVM J1: EOF ----

[...truncated 3 lines...]
   [junit4] JVM J0: stderr was not empty, see: C:\Users\jenkins\workspace\Lucene-Solr-8.1-Windows\lucene\build\analysis\opennlp\test\temp\junit4-J0-20190513_193751_3694686114199520627980.syserr
   [junit4] >>> JVM J0 emitted unexpected output (verbatim) ----
   [junit4] OpenJDK 64-Bit Server VM warning: Option UseConcMarkSweepGC was deprecated in version 9.0 and will likely be removed in a future release.
   [junit4] <<< JVM J0: EOF ----

[...truncated 180 lines...]
   [junit4] JVM J0: stderr was not empty, see: C:\Users\jenkins\workspace\Lucene-Solr-8.1-Windows\lucene\build\analysis\phonetic\test\temp\junit4-J0-20190513_193757_05612614623521454804569.syserr
   [junit4] >>> JVM J0 emitted unexpected output (verbatim) ----
   [junit4] OpenJDK 64-Bit Server VM warning: Option UseConcMarkSweepGC was deprecated in version 9.0 and will likely be removed in a future release.
   [junit4] <<< JVM J0: EOF ----

   [junit4] JVM J1: stderr was not empty, see: C:\Users\jenkins\workspace\Lucene-Solr-8.1-Windows\lucene\build\analysis\phonetic\test\temp\junit4-J1-20190513_193757_05613975366284481194241.syserr
   [junit4] >>> JVM J1 emitted unexpected output (verbatim) ----
   [junit4] OpenJDK 64-Bit Server VM warning: Option UseConcMarkSweepGC was deprecated in version 9.0 and will likely be removed in a future release.
   [junit4] <<< JVM J1: EOF ----

[...truncated 160 lines...]
   [junit4] JVM J0: stderr was not empty, see: C:\Users\jenkins\workspace\Lucene-Solr-8.1-Windows\lucene\build\analysis\smartcn\test\temp\junit4-J0-20190513_193811_3449564548548065691685.syserr
   [junit4] >>> JVM J0 emitted unexpected output (verbatim) ----
   [junit4] OpenJDK 64-Bit Server VM warning: Option UseConcMarkSweepGC was deprecated in version 9.0 and will likely be removed in a future release.
   [junit4] <<< JVM J0: EOF ----

[...truncated 3 lines...]
   [junit4] JVM J1: stderr was not empty, see: C:\Users\jenkins\workspace\Lucene-Solr-8.1-Windows\lucene\build\analysis\smartcn\test\temp\junit4-J1-20190513_193811_3453990583235442747746.syserr
   [junit4] >>> JVM J1 emitted unexpected output (verbatim) ----
   [junit4] OpenJDK 64-Bit Server VM warning: Option UseConcMarkSweepGC was deprecated in version 9.0 and will likely be removed in a future release.
   [junit4] <<< JVM J1: EOF ----

[...truncated 165 lines...]
   [junit4] JVM J1: stderr was not empty, see: C:\Users\jenkins\workspace\Lucene-Solr-8.1-Windows\lucene\build\analysis\stempel\test\temp\junit4-J1-20190513_193819_77517196894407929488256.syserr
   [junit4] >>> JVM J1 emitted unexpected output (verbatim) ----
   [junit4] OpenJDK 64-Bit Server VM warning: Option UseConcMarkSweepGC was deprecated in version 9.0 and will likely be removed in a future release.
   [junit4] <<< JVM J1: EOF ----

[...truncated 3 lines...]
   [junit4] JVM J0: stderr was not empty, see: C:\Users\jenkins\workspace\Lucene-Solr-8.1-Windows\lucene\build\analysis\stempel\test\temp\junit4-J0-20190513_193819_7759737651613500923056.syserr
   [junit4] >>> JVM J0 emitted unexpected output (verbatim) ----
   [junit4] OpenJDK 64-Bit Server VM warning: Option UseConcMarkSweepGC was deprecated in version 9.0 and will likely be removed in a future release.
   [junit4] <<< JVM J0: EOF ----

[...truncated 194 lines...]
   [junit4] JVM J1: stderr was not empty, see: C:\Users\jenkins\workspace\Lucene-Solr-8.1-Windows\lucene\build\backward-codecs\test\temp\junit4-J1-20190513_193825_1271692994476582469908.syserr
   [junit4] >>> JVM J1 emitted unexpected output (verbatim) ----
   [junit4] OpenJDK 64-Bit Server VM warning: Option UseConcMarkSweepGC was deprecated in version 9.0 and will likely be removed in a future release.
   [junit4] <<< JVM J1: EOF ----

[...truncated 9 lines...]
   [junit4] JVM J0: stderr was not empty, see: C:\Users\jenkins\workspace\Lucene-Solr-8.1-Windows\lucene\build\backward-codecs\test\temp\junit4-J0-20190513_193825_1276173691875129955710.syserr
   [junit4] >>> JVM J0 emitted unexpected output (verbatim) ----
   [junit4] OpenJDK 64-Bit Server VM warning: Option UseConcMarkSweepGC was deprecated in version 9.0 and will likely be removed in a future release.
   [junit4] <<< JVM J0: EOF ----

[...truncated 1557 lines...]
   [junit4] JVM J1: stderr was not empty, see: C:\Users\jenkins\workspace\Lucene-Solr-8.1-Windows\lucene\build\benchmark\test\temp\junit4-J1-20190513_194032_5728012489445175319687.syserr
   [junit4] >>> JVM J1 emitted unexpected output (verbatim) ----
   [junit4] OpenJDK 64-Bit Server VM warning: Option UseConcMarkSweepGC was deprecated in version 9.0 and will likely be removed in a future release.
   [junit4] <<< JVM J1: EOF ----

[...truncated 3 lines...]
   [junit4] JVM J0: stderr was not empty, see: C:\Users\jenkins\workspace\Lucene-Solr-8.1-Windows\lucene\build\benchmark\test\temp\junit4-J0-20190513_194032_5729051737736378434329.syserr
   [junit4] >>> JVM J0 emitted unexpected output (verbatim) ----
   [junit4] OpenJDK 64-Bit Server VM warning: Option UseConcMarkSweepGC was deprecated in version 9.0 and will likely be removed in a future release.
   [junit4] <<< JVM J0: EOF ----

[...truncated 252 lines...]
   [junit4] JVM J0: stderr was not empty, see: C:\Users\jenkins\workspace\Lucene-Solr-8.1-Windows\lucene\build\classification\test\temp\junit4-J0-20190513_194048_15216387245810075853749.syserr
   [junit4] >>> JVM J0 emitted unexpected output (verbatim) ----
   [junit4] OpenJDK 64-Bit Server VM warning: Option UseConcMarkSweepGC was deprecated in version 9.0 and will likely be removed in a future release.
   [junit4] <<< JVM J0: EOF ----

[...truncated 3 lines...]
   [junit4] JVM J1: stderr was not empty, see: C:\Users\jenkins\workspace\Lucene-Solr-8.1-Windows\lucene\build\classification\test\temp\junit4-J1-20190513_194048_1527607884527668217144.syserr
   [junit4] >>> JVM J1 emitted unexpected output (verbatim) ----
   [junit4] OpenJDK 64-Bit Server VM warning: Option UseConcMarkSweepGC was deprecated in version 9.0 and will likely be removed in a future release.
   [junit4] <<< JVM J1: EOF ----

[...truncated 255 lines...]
   [junit4] JVM J1: stderr was not empty, see: C:\Users\jenkins\workspace\Lucene-Solr-8.1-Windows\lucene\build\codecs\test\temp\junit4-J1-20190513_194119_71316840253671212303700.syserr
   [junit4] >>> JVM J1 emitted unexpected output (verbatim) ----
   [junit4] OpenJDK 64-Bit Server VM warning: Option UseConcMarkSweepGC was deprecated in version 9.0 and will likely be removed in a future release.
   [junit4] <<< JVM J1: EOF ----

[...truncated 10 lines...]
   [junit4] JVM J0: stderr was not empty, see: C:\Users\jenkins\workspace\Lucene-Solr-8.1-Windows\lucene\build\codecs\test\temp\junit4-J0-20190513_194119_7131289765268701639562.syserr
   [junit4] >>> JVM J0 emitted unexpected output (verbatim) ----
   [junit4] OpenJDK 64-Bit Server VM warning: Option UseConcMarkSweepGC was deprecated in version 9.0 and will likely be removed in a future release.
   [junit4] <<< JVM J0: EOF ----

[...truncated 232 lines...]
   [junit4] JVM J1: stderr was not empty, see: C:\Users\jenkins\workspace\Lucene-Solr-8.1-Windows\lucene\build\demo\test\temp\junit4-J1-20190513_194315_64911273961401586080787.syserr
   [junit4] >>> JVM J1 emitted unexpected output (verbatim) ----
   [junit4] OpenJDK 64-Bit Server VM warning: Option UseConcMarkSweepGC was deprecated in version 9.0 and will likely be removed in a future release.
   [junit4] <<< JVM J1: EOF ----

[...truncated 3 lines...]
   [junit4] JVM J0: stderr was not empty, see: C:\Users\jenkins\workspace\Lucene-Solr-8.1-Windows\lucene\build\demo\test\temp\junit4-J0-20190513_194315_6493101736570579404261.syserr
   [junit4] >>> JVM J0 emitted unexpected output (verbatim) ----
   [junit4] OpenJDK 64-Bit Server VM warning: Option UseConcMarkSweepGC was deprecated in version 9.0 and will likely be removed in a future release.
   [junit4] <<< JVM J0: EOF ----

[...truncated 171 lines...]
   [junit4] JVM J0: stderr was not empty, see: C:\Users\jenkins\workspace\Lucene-Solr-8.1-Windows\lucene\build\expressions\test\temp\junit4-J0-20190513_194322_2856974851782015882334.syserr
   [junit4] >>> JVM J0 emitted unexpected output (verbatim) ----
   [junit4] OpenJDK 64-Bit Server VM warning: Option UseConcMarkSweepGC was deprecated in version 9.0 and will likely be removed in a future release.
   [junit4] <<< JVM J0: EOF ----

[...truncated 6 lines...]
   [junit4] JVM J1: stderr was not empty, see: C:\Users\jenkins\workspace\Lucene-Solr-8.1-Windows\lucene\build\expressions\test\temp\junit4-J1-20190513_194322_28510792782504652472188.syserr
   [junit4] >>> JVM J1 emitted unexpected output (verbatim) ----
   [junit4] OpenJDK 64-Bit Server VM warning: Option UseConcMarkSweepGC was deprecated in version 9.0 and will likely be removed in a future release.
   [junit4] <<< JVM J1: EOF ----

[...truncated 235 lines...]
   [junit4] JVM J0: stderr was not empty, see: C:\Users\jenkins\workspace\Lucene-Solr-8.1-Windows\lucene\build\facet\test\temp\junit4-J0-20190513_194332_25016687812531885153394.syserr
   [junit4] >>> JVM J0 emitted unexpected output (verbatim) ----
   [junit4] OpenJDK 64-Bit Server VM warning: Option UseConcMarkSweepGC was deprecated in version 9.0 and will likely be removed in a future release.
   [junit4] <<< JVM J0: EOF ----

[...truncated 3 lines...]
   [junit4] JVM J1: stderr was not empty, see: C:\Users\jenkins\workspace\Lucene-Solr-8.1-Windows\lucene\build\facet\test\temp\junit4-J1-20190513_194332_2509578869831657645687.syserr
   [junit4] >>> JVM J1 emitted unexpected output (verbatim) ----
   [junit4] OpenJDK 64-Bit Server VM warning: Option UseConcMarkSweepGC was deprecated in version 9.0 and will likely be removed in a future release.
   [junit4] <<< JVM J1: EOF ----

[...truncated 183 lines...]
   [junit4] JVM J0: stderr was not empty, see: C:\Users\jenkins\workspace\Lucene-Solr-8.1-Windows\lucene\build\grouping\test\temp\junit4-J0-20190513_194421_21918278014232468836156.syserr
   [junit4] >>> JVM J0 emitted unexpected output (verbatim) ----
   [junit4] OpenJDK 64-Bit Server VM warning: Option UseConcMarkSweepGC was deprecated in version 9.0 and will likely be removed in a future release.
   [junit4] <<< JVM J0: EOF ----

[...truncated 3 lines...]
   [junit4] JVM J1: stderr was not empty, see: C:\Users\jenkins\workspace\Lucene-Solr-8.1-Windows\lucene\build\grouping\test\temp\junit4-J1-20190513_194421_21914436303468755786013.syserr
   [junit4] >>> JVM J1 emitted unexpected output (verbatim) ----
   [junit4] OpenJDK 64-Bit Server VM warning: Option UseConcMarkSweepGC was deprecated in version 9.0 and will likely be removed in a future release.
   [junit4] <<< JVM J1: EOF ----

[...truncated 256 lines...]
   [junit4] JVM J0: stderr was not empty, see: C:\Users\jenkins\workspace\Lucene-Solr-8.1-Windows\lucene\build\highlighter\test\temp\junit4-J0-20190513_194434_0857999273032744499335.syserr
   [junit4] >>> JVM J0 emitted unexpected output (verbatim) ----
   [junit4] OpenJDK 64-Bit Server VM warning: Option UseConcMarkSweepGC was deprecated in version 9.0 and will likely be removed in a future release.
   [junit4] <<< JVM J0: EOF ----

[...truncated 3 lines...]
   [junit4] JVM J1: stderr was not empty, see: C:\Users\jenkins\workspace\Lucene-Solr-8.1-Windows\lucene\build\highlighter\test\temp\junit4-J1-20190513_194434_0855376473951428331505.syserr
   [junit4] >>> JVM J1 emitted unexpected output (verbatim) ----
   [junit4] OpenJDK 64-Bit Server VM warning: Option UseConcMarkSweepGC was deprecated in version 9.0 and will likely be removed in a future release.
   [junit4] <<< JVM J1: EOF ----

[...truncated 170 lines...]
   [junit4] JVM J1: stderr was not empty, see: C:\Users\jenkins\workspace\Lucene-Solr-8.1-Windows\lucene\build\join\test\temp\junit4-J1-20190513_194503_758138186265009742458.syserr
   [junit4] >>> JVM J1 emitted unexpected output (verbatim) ----
   [junit4] OpenJDK 64-Bit Server VM warning: Option UseConcMarkSweepGC was deprecated in version 9.0 and will likely be removed in a future release.
   [junit4] <<< JVM J1: EOF ----

[...truncated 3 lines...]
   [junit4] JVM J0: stderr was not empty, see: C:\Users\jenkins\workspace\Lucene-Solr-8.1-Windows\lucene\build\join\test\temp\junit4-J0-20190513_194503_758483374234394405962.syserr
   [junit4] >>> JVM J0 emitted unexpected output (verbatim) ----
   [junit4] OpenJDK 64-Bit Server VM warning: Option UseConcMarkSweepGC was deprecated in version 9.0 and will likely be removed in a future release.
   [junit4] <<< JVM J0: EOF ----

[...truncated 306 lines...]
   [junit4] JVM J1: stderr was not empty, see: C:\Users\jenkins\workspace\Lucene-Solr-8.1-Windows\lucene\build\luke\test\temp\junit4-J1-20190513_194525_5431229824261964301113.syserr
   [junit4] >>> JVM J1 emitted unexpected output (verbatim) ----
   [junit4] OpenJDK 64-Bit Server VM warning: Option UseConcMarkSweepGC was deprecated in version 9.0 and will likely be removed in a future release.
   [junit4] <<< JVM J1: EOF ----

   [junit4] JVM J0: stderr was not empty, see: C:\Users\jenkins\workspace\Lucene-Solr-8.1-Windows\lucene\build\luke\test\temp\junit4-J0-20190513_194525_54310784684674607886237.syserr
   [junit4] >>> JVM J0 emitted unexpected output (verbatim) ----
   [junit4] OpenJDK 64-Bit Server VM warning: Option UseConcMarkSweepGC was deprecated in version 9.0 and will likely be removed in a future release.
   [junit4] <<< JVM J0: EOF ----

[...truncated 156 lines...]
   [junit4] JVM J0: stderr was not empty, see: C:\Users\jenkins\workspace\Lucene-Solr-8.1-Windows\lucene\build\memory\test\temp\junit4-J0-20190513_194537_25617532368011589522387.syserr
   [junit4] >>> JVM J0 emitted unexpected output (verbatim) ----
   [junit4] OpenJDK 64-Bit Server VM warning: Option UseConcMarkSweepGC was deprecated in version 9.0 and will likely be removed in a future release.
   [junit4] <<< JVM J0: EOF ----

[...truncated 3 lines...]
   [junit4] JVM J1: stderr was not empty, see: C:\Users\jenkins\workspace\Lucene-Solr-8.1-Windows\lucene\build\memory\test\temp\junit4-J1-20190513_194537_25616527713689231866136.syserr
   [junit4] >>> JVM J1 emitted unexpected output (verbatim) ----
   [junit4] OpenJDK 64-Bit Server VM warning: Option UseConcMarkSweepGC was deprecated in version 9.0 and will likely be removed in a future release.
   [junit4] <<< JVM J1: EOF ----

[...truncated 192 lines...]
   [junit4] JVM J1: stderr was not empty, see: C:\Users\jenkins\workspace\Lucene-Solr-8.1-Windows\lucene\build\misc\test\temp\junit4-J1-20190513_194557_4338630643540353952196.syserr
   [junit4] >>> JVM J1 emitted unexpected output (verbatim) ----
   [junit4] OpenJDK 64-Bit Server VM warning: Option UseConcMarkSweepGC was deprecated in version 9.0 and will likely be removed in a future release.
   [junit4] <<< JVM J1: EOF ----

[...truncated 3 lines...]
   [junit4] JVM J0: stderr was not empty, see: C:\Users\jenkins\workspace\Lucene-Solr-8.1-Windows\lucene\build\misc\test\temp\junit4-J0-20190513_194557_4334388943020549795617.syserr
   [junit4] >>> JVM J0 emitted unexpected output (verbatim) ----
   [junit4] OpenJDK 64-Bit Server VM warning: Option UseConcMarkSweepGC was deprecated in version 9.0 and will likely be removed in a future release.
   [junit4] <<< JVM J0: EOF ----

[...truncated 307 lines...]
   [junit4] JVM J1: stderr was not empty, see: C:\Users\jenkins\workspace\Lucene-Solr-8.1-Windows\lucene\build\queries\test\temp\junit4-J1-20190513_194633_11915818581464962625736.syserr
   [junit4] >>> JVM J1 emitted unexpected output (verbatim) ----
   [junit4] OpenJDK 64-Bit Server VM warning: Option UseConcMarkSweepGC was deprecated in version 9.0 and will likely be removed in a future release.
   [junit4] <<< JVM J1: EOF ----

[...truncated 3 lines...]
   [junit4] JVM J0: stderr was not empty, see: C:\Users\jenkins\workspace\Lucene-Solr-8.1-Windows\lucene\build\queries\test\temp\junit4-J0-20190513_194633_119599706184287775411.syserr
   [junit4] >>> JVM J0 emitted unexpected output (verbatim) ----
   [junit4] OpenJDK 64-Bit Server VM warning: Option UseConcMarkSweepGC was deprecated in version 9.0 and will likely be removed in a future release.
   [junit4] <<< JVM J0: EOF ----

[...truncated 232 lines...]
   [junit4] JVM J0: stderr was not empty, see: C:\Users\jenkins\workspace\Lucene-Solr-8.1-Windows\lucene\build\queryparser\test\temp\junit4-J0-20190513_194648_2152295964132657227676.syserr
   [junit4] >>> JVM J0 emitted unexpected output (verbatim) ----
   [junit4] OpenJDK 64-Bit Server VM warning: Option UseConcMarkSweepGC was deprecated in version 9.0 and will likely be removed in a future release.
   [junit4] <<< JVM J0: EOF ----

[...truncated 3 lines...]
   [junit4] JVM J1: stderr was not empty, see: C:\Users\jenkins\workspace\Lucene-Solr-8.1-Windows\lucene\build\queryparser\test\temp\junit4-J1-20190513_194648_2152566875270747814866.syserr
   [junit4] >>> JVM J1 emitted unexpected output (verbatim) ----
   [junit4] OpenJDK 64-Bit Server VM warning: Option UseConcMarkSweepGC was deprecated in version 9.0 and will likely be removed in a future release.
   [junit4] <<< JVM J1: EOF ----

[...truncated 217 lines...]
   [junit4] JVM J0: stderr was not empty, see: C:\Users\jenkins\workspace\Lucene-Solr-8.1-Windows\lucene\build\replicator\test\temp\junit4-J0-20190513_194703_4858331744406768868864.syserr
   [junit4] >>> JVM J0 emitted unexpected output (verbatim) ----
   [junit4] OpenJDK 64-Bit Server VM warning: Option UseConcMarkSweepGC was deprecated in version 9.0 and will likely be removed in a future release.
   [junit4] <<< JVM J0: EOF ----

[...truncated 3 lines...]
   [junit4] JVM J1: stderr was not empty, see: C:\Users\jenkins\workspace\Lucene-Solr-8.1-Windows\lucene\build\replicator\test\temp\junit4-J1-20190513_194703_48512906905429394512945.syserr
   [junit4] >>> JVM J1 emitted unexpected output (verbatim) ----
   [junit4] OpenJDK 64-Bit Server VM warning: Option UseConcMarkSweepGC was deprecated in version 9.0 and will likely be removed in a future release.
   [junit4] <<< JVM J1: EOF ----

[...truncated 251 lines...]
   [junit4] JVM J0: stderr was not empty, see: C:\Users\jenkins\workspace\Lucene-Solr-8.1-Windows\lucene\build\sandbox\test\temp\junit4-J0-20190513_194728_1645108539636568218199.syserr
   [junit4] >>> JVM J0 emitted unexpected output (verbatim) ----
   [junit4] OpenJDK 64-Bit Server VM warning: Option UseConcMarkSweepGC was deprecated in version 9.0 and will likely be removed in a future release.
   [junit4] <<< JVM J0: EOF ----

[...truncated 3 lines...]
   [junit4] JVM J1: stderr was not empty, see: C:\Users\jenkins\workspace\Lucene-Solr-8.1-Windows\lucene\build\sandbox\test\temp\junit4-J1-20190513_194728_1655461202095467161837.syserr
   [junit4] >>> JVM J1 emitted unexpected output (verbatim) ----
   [junit4] OpenJDK 64-Bit Server VM warning: Option UseConcMarkSweepGC was deprecated in version 9.0 and will likely be removed in a future release.
   [junit4] <<< JVM J1: EOF ----

[...truncated 300 lines...]
   [junit4] JVM J0: stderr was not empty, see: C:\Users\jenkins\workspace\Lucene-Solr-8.1-Windows\lucene\build\spatial-extras\test\temp\junit4-J0-20190513_194804_9223837049722058593019.syserr
   [junit4] >>> JVM J0 emitted unexpected output (verbatim) ----
   [junit4] OpenJDK 64-Bit Server VM warning: Option UseConcMarkSweepGC was deprecated in version 9.0 and will likely be removed in a future release.
   [junit4] <<< JVM J0: EOF ----

[...truncated 3 lines...]
   [junit4] JVM J1: stderr was not empty, see: C:\Users\jenkins\workspace\Lucene-Solr-8.1-Windows\lucene\build\spatial-extras\test\temp\junit4-J1-20190513_194804_9223019387293255161334.syserr
   [junit4] >>> JVM J1 emitted unexpected output (verbatim) ----
   [junit4] OpenJDK 64-Bit Server VM warning: Option UseConcMarkSweepGC was deprecated in version 9.0 and will likely be removed in a future release.
   [junit4] <<< JVM J1: EOF ----

[...truncated 193 lines...]
   [junit4] JVM J1: stderr was not empty, see: C:\Users\jenkins\workspace\Lucene-Solr-8.1-Windows\lucene\build\spatial3d\test\temp\junit4-J1-20190513_194856_9894695115675390925259.syserr
   [junit4] >>> JVM J1 emitted unexpected output (verbatim) ----
   [junit4] OpenJDK 64-Bit Server VM warning: Option UseConcMarkSweepGC was deprecated in version 9.0 and will likely be removed in a future release.
   [junit4] <<< JVM J1: EOF ----

[...truncated 5 lines...]
   [junit4] JVM J0: stderr was not empty, see: C:\Users\jenkins\workspace\Lucene-Solr-8.1-Windows\lucene\build\spatial3d\test\temp\junit4-J0-20190513_194856_98916855699403477760592.syserr
   [junit4] >>> JVM J0 emitted unexpected output (verbatim) ----
   [junit4] OpenJDK 64-Bit Server VM warning: Option UseConcMarkSweepGC was deprecated in version 9.0 and will likely be removed in a future release.
   [junit4] <<< JVM J0: EOF ----

[...truncated 152 lines...]
   [junit4] JVM J0: stderr was not empty, see: C:\Users\jenkins\workspace\Lucene-Solr-8.1-Windows\lucene\build\spatial\test\temp\junit4-J0-20190513_194924_0396762494041879099811.syserr
   [junit4] >>> JVM J0 emitted unexpected output (verbatim) ----
   [junit4] OpenJDK 64-Bit Server VM warning: Option UseConcMarkSweepGC was deprecated in version 9.0 and will likely be removed in a future release.
   [junit4] <<< JVM J0: EOF ----

[...truncated 256 lines...]
   [junit4] JVM J0: stderr was not empty, see: C:\Users\jenkins\workspace\Lucene-Solr-8.1-Windows\lucene\build\suggest\test\temp\junit4-J0-20190513_194929_3739138004724725411293.syserr
   [junit4] >>> JVM J0 emitted unexpected output (verbatim) ----
   [junit4] OpenJDK 64-Bit Server VM warning: Option UseConcMarkSweepGC was deprecated in version 9.0 and will likely be removed in a future release.
   [junit4] <<< JVM J0: EOF ----

[...truncated 3 lines...]
   [junit4] JVM J1: stderr was not empty, see: C:\Users\jenkins\workspace\Lucene-Solr-8.1-Windows\lucene\build\suggest\test\temp\junit4-J1-20190513_194929_37317540996621035560144.syserr
   [junit4] >>> JVM J1 emitted unexpected output (verbatim) ----
   [junit4] OpenJDK 64-Bit Server VM warning: Option UseConcMarkSweepGC was deprecated in version 9.0 and will likely be removed in a future release.
   [junit4] <<< JVM J1: EOF ----

[...truncated 3598 lines...]
   [junit4] Suite: org.apache.solr.cloud.autoscaling.sim.TestSimComputePlanAction
   [junit4]   2> Creating dataDir: C:\Users\jenkins\workspace\Lucene-Solr-8.1-Windows\solr\build\solr-core\test\J1\temp\solr.cloud.autoscaling.sim.TestSimComputePlanAction_25238CE346EF10A4-001\init-core-data-001
   [junit4]   2> 2904249 WARN  (SUITE-TestSimComputePlanAction-seed#[25238CE346EF10A4]-worker) [    ] o.a.s.SolrTestCaseJ4 startTrackingSearchers: numOpens=5 numCloses=5
   [junit4]   2> 2904250 INFO  (SUITE-TestSimComputePlanAction-seed#[25238CE346EF10A4]-worker) [    ] o.a.s.SolrTestCaseJ4 Using TrieFields (NUMERIC_POINTS_SYSPROP=false) w/NUMERIC_DOCVALUES_SYSPROP=false
   [junit4]   2> 2904251 INFO  (SUITE-TestSimComputePlanAction-seed#[25238CE346EF10A4]-worker) [    ] o.a.s.SolrTestCaseJ4 Randomized ssl (false) and clientAuth (false) via: @org.apache.solr.util.RandomizeSSL(reason="", value=0.0/0.0, ssl=0.0/0.0, clientAuth=0.0/0.0)
   [junit4]   2> 2904251 INFO  (SUITE-TestSimComputePlanAction-seed#[25238CE346EF10A4]-worker) [    ] o.a.s.SolrTestCaseJ4 SecureRandom sanity checks: test.solr.allowed.securerandom=null & java.security.egd=file:/dev/./urandom
   [junit4]   2> 2904255 INFO  (TEST-TestSimComputePlanAction.testNodeWithMultipleReplicasLost-seed#[25238CE346EF10A4]) [    ] o.a.s.SolrTestCaseJ4 ###Starting testNodeWithMultipleReplicasLost
   [junit4]   2> 2904265 DEBUG (TEST-TestSimComputePlanAction.testNodeWithMultipleReplicasLost-seed#[25238CE346EF10A4]) [    ] o.a.s.c.a.s.SimClusterStateProvider --- new Overseer leader: 127.0.0.1:10015_solr
   [junit4]   2> 2904265 DEBUG (Simulated OverseerAutoScalingTriggerThread) [    ] o.a.s.c.a.OverseerTriggerThread Adding .auto_add_replicas and .scheduled_maintenance triggers
   [junit4]   2> 2904265 DEBUG (TEST-TestSimComputePlanAction.testNodeWithMultipleReplicasLost-seed#[25238CE346EF10A4]) [    ] o.a.s.c.a.s.SimClusterStateProvider ** creating new collection states, currentVersion=0
   [junit4]   2> 2904265 DEBUG (TEST-TestSimComputePlanAction.testNodeWithMultipleReplicasLost-seed#[25238CE346EF10A4]) [    ] o.a.s.c.a.s.SimClusterStateProvider ** saved cluster state version 0
   [junit4]   2> 2904265 INFO  (TEST-TestSimComputePlanAction.testNodeWithMultipleReplicasLost-seed#[25238CE346EF10A4]) [    ] o.a.s.h.a.MetricsHistoryHandler No .system collection, keeping metrics history in memory.
   [junit4]   2> 2904265 DEBUG (Simulated OverseerAutoScalingTriggerThread) [    ] o.a.s.c.a.OverseerTriggerThread Refreshing /autoscaling.json with znode version 1
   [junit4]   2> 2904266 DEBUG (Simulated OverseerAutoScalingTriggerThread) [    ] o.a.s.c.a.OverseerTriggerThread Current znodeVersion 1, lastZnodeVersion 0
   [junit4]   2> 2904266 DEBUG (Simulated OverseerAutoScalingTriggerThread) [    ] o.a.s.c.a.OverseerTriggerThread Processed trigger updates upto znodeVersion 1
   [junit4]   2> 2904266 DEBUG (Simulated OverseerAutoScalingTriggerThread) [    ] o.a.s.c.a.NodeLostTrigger NodeLostTrigger .auto_add_replicas - Initial livenodes: [127.0.0.1:10015_solr]
   [junit4]   2> 2904267 DEBUG (Simulated OverseerAutoScalingTriggerThread) [    ] o.a.s.c.a.OverseerTriggerThread -- cleaning old nodeLost / nodeAdded markers
   [junit4]   2> 2904267 DEBUG (Simulated OverseerAutoScalingTriggerThread) [    ] o.a.s.c.a.OverseerTriggerThread Current znodeVersion 1, lastZnodeVersion 1
   [junit4]   2> 2904268 DEBUG (ScheduledTrigger-15408-thread-1) [    ] o.a.s.c.a.NodeLostTrigger Running NodeLostTrigger: .auto_add_replicas with currently live nodes: 1 and last live nodes: 1
   [junit4]   2> 2904268 DEBUG (simCloudManagerPool-15407-thread-1) [    ] o.a.s.c.a.AutoScalingHandler Verified autoscaling configuration
   [junit4]   2> 2904268 DEBUG (simCloudManagerPool-15407-thread-1) [    ] o.a.s.c.a.OverseerTriggerThread Refreshing /autoscaling.json with znode version 2
   [junit4]   2> 2904271 DEBUG (Simulated OverseerAutoScalingTriggerThread) [    ] o.a.s.c.a.OverseerTriggerThread Processed trigger updates upto znodeVersion 2
   [junit4]   2> 2904271 DEBUG (Simulated OverseerAutoScalingTriggerThread) [    ] o.a.s.c.a.OverseerTriggerThread -- cleaning old nodeLost / nodeAdded markers
   [junit4]   2> 2904271 DEBUG (Simulated OverseerAutoScalingTriggerThread) [    ] o.a.s.c.a.OverseerTriggerThread Current znodeVersion 2, lastZnodeVersion 2
   [junit4]   2> 2904272 DEBUG (simCloudManagerPool-15407-thread-2) [    ] o.a.s.c.a.AutoScalingHandler Verified autoscaling configuration
   [junit4]   2> 2904272 DEBUG (simCloudManagerPool-15407-thread-2) [    ] o.a.s.c.a.OverseerTriggerThread Refreshing /autoscaling.json with znode version 3
   [junit4]   2> 2904273 DEBUG (Simulated OverseerAutoScalingTriggerThread) [    ] o.a.s.c.a.OverseerTriggerThread Processed trigger updates upto znodeVersion 3
   [junit4]   2> 2904273 DEBUG (Simulated OverseerAutoScalingTriggerThread) [    ] o.a.s.c.a.OverseerTriggerThread -- cleaning old nodeLost / nodeAdded markers
   [junit4]   2> 2904273 DEBUG (Simulated OverseerAutoScalingTriggerThread) [    ] o.a.s.c.a.OverseerTriggerThread Current znodeVersion 3, lastZnodeVersion 3
   [junit4]   2> 2904289 DEBUG (ScheduledTrigger-15408-thread-3) [    ] o.a.s.c.a.NodeLostTrigger Running NodeLostTrigger: .auto_add_replicas with currently live nodes: 1 and last live nodes: 1
   [junit4]   2> 2904310 DEBUG (ScheduledTrigger-15408-thread-2) [    ] o.a.s.c.a.NodeLostTrigger Running NodeLostTrigger: .auto_add_replicas with currently live nodes: 1 and last live nodes: 1
   [junit4]   2> 2904330 DEBUG (ScheduledTrigger-15408-thread-1) [    ] o.a.s.c.a.NodeLostTrigger Running NodeLostTrigger: .auto_add_replicas with currently live nodes: 1 and last live nodes: 1
   [junit4]   2> 2904352 DEBUG (ScheduledTrigger-15408-thread-4) [    ] o.a.s.c.a.NodeLostTrigger Running NodeLostTrigger: .auto_add_replicas with currently live nodes: 1 and last live nodes: 1
   [junit4]   2> 2904373 DEBUG (ScheduledTrigger-15408-thread-4) [    ] o.a.s.c.a.NodeLostTrigger Running NodeLostTrigger: .auto_add_replicas with currently live nodes: 1 and last live nodes: 1
   [junit4]   2> 2904381 DEBUG (simCloudManagerPool-15407-thread-3) [    ] o.a.s.c.a.AutoScalingHandler Verified autoscaling configuration
   [junit4]   2> 2904382 DEBUG (simCloudManagerPool-15407-thread-3) [    ] o.a.s.c.a.OverseerTriggerThread Refreshing /autoscaling.json with znode version 4
   [junit4]   2> 2904382 DEBUG (Simulated OverseerAutoScalingTriggerThread) [    ] o.a.s.c.a.OverseerTriggerThread Processed trigger updates upto znodeVersion 4
   [junit4]   2> 2904382 DEBUG (Simulated OverseerAutoScalingTriggerThread) [    ] o.a.s.c.a.NodeLostTrigger NodeLostTrigger node_lost_trigger - Initial livenodes: [127.0.0.1:10018_solr, 127.0.0.1:10016_solr, 127.0.0.1:10017_solr, 127.0.0.1:10015_solr]
   [junit4]   2> 2904383 DEBUG (Simulated OverseerAutoScalingTriggerThread) [    ] o.a.s.c.a.OverseerTriggerThread -- cleaning old nodeLost / nodeAdded markers
   [junit4]   2> 2905242 DEBUG (ScheduledTrigger-15408-thread-1) [    ] o.a.s.c.a.NodeLostTrigger Running NodeLostTrigger: .auto_add_replicas with currently live nodes: 4 and last live nodes: 1
   [junit4]   2> 2905245 DEBUG (Simulated OverseerAutoScalingTriggerThread) [    ] o.a.s.c.a.OverseerTriggerThread Current znodeVersion 4, lastZnodeVersion 4
   [junit4]   2> 2905245 DEBUG (ScheduledTrigger-15408-thread-3) [    ] o.a.s.c.a.NodeLostTrigger Running NodeLostTrigger: node_lost_trigger with currently live nodes: 4 and last live nodes: 4
   [junit4]   2> 2905245 INFO  (TEST-TestSimComputePlanAction.testNodeWithMultipleReplicasLost-seed#[25238CE346EF10A4]) [    ] o.a.s.c.a.s.TestSimComputePlanAction -------------_ FINAL STATE --------------
   [junit4]   2> 2905245 INFO  (TEST-TestSimComputePlanAction.testNodeWithMultipleReplicasLost-seed#[25238CE346EF10A4]) [    ] o.a.s.c.a.s.TestSimComputePlanAction * Node values: {
   [junit4]   2>   "127.0.0.1:10018_solr":{
   [junit4]   2>     "sysprop.java.vendor":"Oracle Corporation",
   [junit4]   2>     "cores":0,
   [junit4]   2>     "host":"127.0.0.1",
   [junit4]   2>     "freedisk":1024,
   [junit4]   2>     "sysprop.java.version":"13-ea",
   [junit4]   2>     "ip_1":"127",
   [junit4]   2>     "ip_3":"0",
   [junit4]   2>     "ip_2":"0",
   [junit4]   2>     "ip_4":"1",
   [junit4]   2>     "node":"127.0.0.1:10018_solr",
   [junit4]   2>     "metrics:solr.jvm:buffers.direct.Count":0,
   [junit4]   2>     "port":10018,
   [junit4]   2>     "heapUsage":123450000,
   [junit4]   2>     "sysLoadAvg":1.0,
   [junit4]   2>     "metrics:solr.node:ADMIN./admin/authorization.clientErrors:count":0,
   [junit4]   2>     "totaldisk":10240},
   [junit4]   2>   "127.0.0.1:10016_solr":{
   [junit4]   2>     "sysprop.java.vendor":"Oracle Corporation",
   [junit4]   2>     "cores":0,
   [junit4]   2>     "host":"127.0.0.1",
   [junit4]   2>     "freedisk":1024,
   [junit4]   2>     "sysprop.java.version":"13-ea",
   [junit4]   2>     "ip_1":"127",
   [junit4]   2>     "ip_3":"0",
   [junit4]   2>     "ip_2":"0",
   [junit4]   2>     "ip_4":"1",
   [junit4]   2>     "node":"127.0.0.1:10016_solr",
   [junit4]   2>     "metrics:solr.jvm:buffers.direct.Count":0,
   [junit4]   2>     "port":10016,
   [junit4]   2>     "heapUsage":123450000,
   [junit4]   2>     "sysLoadAvg":1.0,
   [junit4]   2>     "metrics:solr.node:ADMIN./admin/authorization.clientErrors:count":0,
   [junit4]   2>     "totaldisk":10240},
   [junit4]   2>   "127.0.0.1:10017_solr":{
   [junit4]   2>     "sysprop.java.vendor":"Oracle Corporation",
   [junit4]   2>     "cores":0,
   [junit4]   2>     "host":"127.0.0.1",
   [junit4]   2>     "freedisk":1024,
   [junit4]   2>     "sysprop.java.version":"13-ea",
   [junit4]   2>     "ip_1":"127",
   [junit4]   2>     "ip_3":"0",
   [junit4]   2>     "ip_2":"0",
   [junit4]   2>     "ip_4":"1",
   [junit4]   2>     "node":"127.0.0.1:10017_solr",
   [junit4]   2>     "metrics:solr.jvm:buffers.direct.Count":0,
   [junit4]   2>     "port":10017,
   [junit4]   2>     "heapUsage":123450000,
   [junit4]   2>     "sysLoadAvg":1.0,
   [junit4]   2>     "metrics:solr.node:ADMIN./admin/authorization.clientErrors:count":0,
   [junit4]   2>     "totaldisk":10240},
   [junit4]   2>   "127.0.0.1:10015_solr":{
   [junit4]   2>     "sysprop.java.vendor":"Oracle Corporation",
   [junit4]   2>     "cores":0,
   [junit4]   2>     "host":"127.0.0.1",
   [junit4]   2>     "freedisk":1024,
   [junit4]   2>     "sysprop.java.version":"13-ea",
   [junit4]   2>     "ip_1":"127",
   [junit4]   2>     "ip_3":"0",
   [junit4]   2>     "ip_2":"0",
   [junit4]   2>     "ip_4":"1",
   [junit4]   2>     "node":"127.0.0.1:10015_solr",
   [junit4]   2>     "metrics:solr.jvm:buffers.direct.Count":0,
   [junit4]   2>     "port":10015,
   [junit4]   2>     "heapUsage":123450000,
   [junit4]   2>     "sysLoadAvg":1.0,
   [junit4]   2>     "metrics:solr.node:ADMIN./admin/authorization.clientErrors:count":0,
   [junit4]   2>     "totaldisk":10240}}
   [junit4]   2> 2905245 INFO  (TEST-TestSimComputePlanAction.testNodeWithMultipleReplicasLost-seed#[25238CE346EF10A4]) [    ] o.a.s.c.a.s.TestSimComputePlanAction * Live nodes: [127.0.0.1:10018_solr, 127.0.0.1:10016_solr, 127.0.0.1:10017_solr, 127.0.0.1:10015_solr]
   [junit4]   2> 2905270 INFO  (Simulated OverseerAutoScalingTriggerThread) [    ] o.a.s.c.a.OverseerTriggerThread OverseerTriggerThread woken up but we are closed, exiting.
   [junit4]   2> 2905270 DEBUG (TEST-TestSimComputePlanAction.testNodeWithMultipleReplicasLost-seed#[25238CE346EF10A4]) [    ] o.a.s.c.a.ScheduledTriggers Shutting down scheduled thread pool executor now
   [junit4]   2> 2905270 DEBUG (TEST-TestSimComputePlanAction.testNodeWithMultipleReplicasLost-seed#[25238CE346EF10A4]) [    ] o.a.s.c.a.ScheduledTriggers Shutting down action executor now
   [junit4]   2> 2905270 DEBUG (TEST-TestSimComputePlanAction.testNodeWithMultipleReplicasLost-seed#[25238CE346EF10A4]) [    ] o.a.s.c.a.ScheduledTriggers Awaiting termination for action executor
   [junit4]   2> 2905270 DEBUG (TEST-TestSimComputePlanAction.testNodeWithMultipleReplicasLost-seed#[25238CE346EF10A4]) [    ] o.a.s.c.a.ScheduledTriggers Awaiting termination for scheduled thread pool executor
   [junit4]   2> 2905270 DEBUG (TEST-TestSimComputePlanAction.testNodeWithMultipleReplicasLost-seed#[25238CE346EF10A4]) [    ] o.a.s.c.a.ScheduledTriggers ScheduledTriggers closed completely
   [junit4]   2> 2905270 DEBUG (TEST-TestSimComputePlanAction.testNodeWithMultipleReplicasLost-seed#[25238CE346EF10A4]) [    ] o.a.s.c.a.OverseerTriggerThread OverseerTriggerThread has been closed explicitly
   [junit4]   2> 2905292 INFO  (TEST-TestSimComputePlanAction.testNodeWithMultipleReplicasLost-seed#[25238CE346EF10A4]) [    ] o.a.s.SolrTestCaseJ4 ###Ending testNodeWithMultipleReplicasLost
   [junit4]   2> NOTE: reproduce with: ant test  -Dtestcase=TestSimComputePlanAction -Dtests.method=testNodeWithMultipleReplicasLost -Dtests.seed=25238CE346EF10A4 -Dtests.slow=true -Dtests.locale=yue-Hant -Dtests.timezone=Etc/GMT+12 -Dtests.asserts=true -Dtests.file.encoding=UTF-8
   [junit4] ERROR   1.05s J1 | TestSimComputePlanAction.testNodeWithMultipleReplicasLost <<<
   [junit4]    > Throwable #1: java.util.concurrent.TimeoutException: OverseerTriggerThread never caught up to the latest znodeVersion
   [junit4]    > 	at __randomizedtesting.SeedInfo.seed([25238CE346EF10A4:15E36D61CE9DF1F8]:0)
   [junit4]    > 	at org.apache.solr.util.TimeOut.waitFor(TimeOut.java:66)
   [junit4]    > 	at org.apache.solr.cloud.autoscaling.sim.SimSolrCloudTestCase.assertAutoscalingUpdateComplete(SimSolrCloudTestCase.java:89)
   [junit4]    > 	at org.apache.solr.cloud.autoscaling.sim.TestSimComputePlanAction.testNodeWithMultipleReplicasLost(TestSimComputePlanAction.java:207)
   [junit4]    > 	at java.base/jdk.internal.reflect.NativeMethodAccessorImpl.invoke0(Native Method)
   [junit4]    > 	at java.base/jdk.internal.reflect.NativeMethodAccessorImpl.invoke(NativeMethodAccessorImpl.java:62)
   [junit4]    > 	at java.base/jdk.internal.reflect.DelegatingMethodAccessorImpl.invoke(DelegatingMethodAccessorImpl.java:43)
   [junit4]    > 	at java.base/java.lang.reflect.Method.invoke(Method.java:567)
   [junit4]    > 	at java.base/java.lang.Thread.run(Thread.java:835)
   [junit4]   2> 2905330 INFO  (TEST-TestSimComputePlanAction.testNodeAdded-seed#[25238CE346EF10A4]) [    ] o.a.s.SolrTestCaseJ4 ###Starting testNodeAdded
   [junit4]   2> 2905354 DEBUG (TEST-TestSimComputePlanAction.testNodeAdded-seed#[25238CE346EF10A4]) [    ] o.a.s.c.a.s.SimClusterStateProvider --- new Overseer leader: 127.0.0.1:10019_solr
   [junit4]   2> 2905354 DEBUG (TEST-TestSimComputePlanAction.testNodeAdded-seed#[25238CE346EF10A4]) [    ] o.a.s.c.a.s.SimClusterStateProvider ** creating new collection states, currentVersion=0
   [junit4]   2> 2905354 DEBUG (TEST-TestSimComputePlanAction.testNodeAdded-seed#[25238CE346EF10A4]) [    ] o.a.s.c.a.s.SimClusterStateProvider ** saved cluster state version 0
   [junit4]   2> 2905354 INFO  (TEST-TestSimComputePlanAction.testNodeAdded-seed#[25238CE346EF10A4]) [    ] o.a.s.h.a.MetricsHistoryHandler No .system collection, keeping metrics history in memory.
   [junit4]   2> 2905355 DEBUG (Simulated OverseerAutoScalingTriggerThread) [    ] o.a.s.c.a.OverseerTriggerThread Adding .auto_add_replicas and .scheduled_maintenance triggers
   [junit4]   2> 2905355 DEBUG (Simulated OverseerAutoScalingTriggerThread) [    ] o.a.s.c.a.OverseerTriggerThread Refreshing /autoscaling.json with znode version 1
   [junit4]   2> 2905355 DEBUG (Simulated OverseerAutoScalingTriggerThread) [    ] o.a.s.c.a.OverseerTriggerThread Current znodeVersion 1, lastZnodeVersion 0
   [junit4]   2> 2905355 DEBUG (Simulated OverseerAutoScalingTriggerThread) [    ] o.a.s.c.a.OverseerTriggerThread Processed trigger updates upto znodeVersion 1
   [junit4]   2> 2905355 DEBUG (Simulated OverseerAutoScalingTriggerThread) [    ] o.a.s.c.a.NodeLostTrigger NodeLostTrigger .auto_add_replicas - Initial livenodes: [127.0.0.1:10019_solr]
   [junit4]   2> 2905356 DEBUG (Simulated OverseerAutoScalingTriggerThread) [    ] o.a.s.c.a.OverseerTriggerThread -- cleaning old nodeLost / nodeAdded markers
   [junit4]   2> 2905356 DEBUG (Simulated OverseerAutoScalingTriggerThread) [    ] o.a.s.c.a.OverseerTriggerThread Current znodeVersion 1, lastZnodeVersion 1
   [junit4]   2> 2905356 DEBUG (simCloudManagerPool-15413-thread-1) [    ] o.a.s.c.a.AutoScalingHandler Verified autoscaling configuration
   [junit4]   2> 2905356 DEBUG (ScheduledTrigger-15414-thread-1) [    ] o.a.s.c.a.NodeLostTrigger Running NodeLostTrigger: .auto_add_replicas with currently live nodes: 1 and last live nodes: 1
   [junit4]   2> 2905356 DEBUG (simCloudManagerPool-15413-thread-1) [    ] o.a.s.c.a.OverseerTriggerThread Refreshing /autoscaling.json with znode version 2
   [junit4]   2> 2905362 DEBUG (Simulated OverseerAutoScalingTriggerThread) [    ] o.a.s.c.a.OverseerTriggerThread Processed trigger updates upto znodeVersion 2
   [junit4]   2> 2905362 DEBUG (Simulated OverseerAutoScalingTriggerThread) [    ] o.a.s.c.a.OverseerTriggerThread -- cleaning old nodeLost / nodeAdded markers
   [junit4]   2> 2905362 DEBUG (Simulated OverseerAutoScalingTriggerThread) [    ] o.a.s.c.a.OverseerTriggerThread Current znodeVersion 2, lastZnodeVersion 2
   [junit4]   2> 2905366 DEBUG (simCloudManagerPool-15413-thread-2) [    ] o.a.s.c.a.AutoScalingHandler Verified autoscaling configuration
   [junit4]   2> 2905366 DEBUG (simCloudManagerPool-15413-thread-2) [    ] o.a.s.c.a.OverseerTriggerThread Refreshing /autoscaling.json with znode version 3
   [junit4]   2> 2905366 DEBUG (Simulated OverseerAutoScalingTriggerThread) [    ] o.a.s.c.a.OverseerTriggerThread Processed trigger updates upto znodeVersion 3
   [junit4]   2> 2905366 DEBUG (Simulated OverseerAutoScalingTriggerThread) [    ] o.a.s.c.a.OverseerTriggerThread -- cleaning old nodeLost / nodeAdded markers
   [junit4]   2> 2905366 DEBUG (Simulated OverseerAutoScalingTriggerThread) [    ] o.a.s.c.a.OverseerTriggerThread Current znodeVersion 3, lastZnodeVersion 3
   [junit4]   2> 2905394 DEBUG (ScheduledTrigger-15414-thread-3) [    ] o.a.s.c.a.NodeLostTrigger Running NodeLostTrigger: .auto_add_replicas with currently live nodes: 1 and last live nodes: 1
   [junit4]   2> 2905414 DEBUG (ScheduledTrigger-15414-thread-1) [    ] o.a.s.c.a.NodeLostTrigger Running NodeLostTrigger: .auto_add_replicas with currently live nodes: 1 and last live nodes: 1
   [junit4]   2> 2905450 DEBUG (ScheduledTrigger-15414-thread-3) [    ] o.a.s.c.a.NodeLostTrigger Running NodeLostTrigger: .auto_add_replicas with currently live nodes: 1 and last live nodes: 1
   [junit4]   2> 2905467 DEBUG (simCloudManagerPool-15413-thread-3) [    ] o.a.s.c.a.AutoScalingHandler Verified autoscaling configuration
   [junit4]   2> 2905467 DEBUG (simCloudManagerPool-15413-thread-3) [    ] o.a.s.c.a.OverseerTriggerThread Refreshing /autoscaling.json with znode version 4
   [junit4]   2> 2905467 DEBUG (Simulated OverseerAutoScalingTriggerThread) [    ] o.a.s.c.a.OverseerTriggerThread Processed trigger updates upto znodeVersion 4
   [junit4]   2> 2905467 DEBUG (Simulated OverseerAutoScalingTriggerThread) [    ] o.a.s.c.a.NodeAddedTrigger NodeAddedTrigger node_added_trigger - Initial livenodes: [127.0.0.1:10019_solr]
   [junit4]   2> 2905467 DEBUG (Simulated OverseerAutoScalingTriggerThread) [    ] o.a.s.c.a.NodeAddedTrigger NodeAddedTrigger node_added_trigger instantiated with properties: {event=nodeAdded, waitFor=1, actions=[{name=compute_plan, class=solr.ComputePlanAction}, {name=test, class=org.apache.solr.cloud.autoscaling.sim.TestSimComputePlanAction$AssertingTriggerAction}], enabled=true}
   [junit4]   2> 2905467 DEBUG (Simulated OverseerAutoScalingTriggerThread) [    ] o.a.s.c.a.OverseerTriggerThread -- cleaning old nodeLost / nodeAdded markers
   [junit4]   2> 2905467 DEBUG (Simulated OverseerAutoScalingTriggerThread) [    ] o.a.s.c.a.OverseerTriggerThread Current znodeVersion 4, lastZnodeVersion 4
   [junit4]   2> 2905467 DEBUG (ScheduledTrigger-15414-thread-2) [    ] o.a.s.c.a.NodeAddedTrigger Running NodeAddedTrigger node_added_trigger
   [junit4]   2> 2905467 DEBUG (ScheduledTrigger-15414-thread-2) [    ] o.a.s.c.a.NodeAddedTrigger Found livenodes: 1
   [junit4]   2> 2905472 DEBUG (ScheduledTrigger-15414-thread-2) [    ] o.a.s.c.a.NodeLostTrigger Running NodeLostTrigger: .auto_add_replicas with currently live nodes: 1 and last live nodes: 1
   [junit4]   2> 2905472 DEBUG (simCloudManagerPool-15413-thread-4) [    ] o.a.s.c.a.AutoScalingHandler Verified autoscaling configuration
   [junit4]   2> 2905472 DEBUG (simCloudManagerPool-15413-thread-4) [    ] o.a.s.c.a.OverseerTriggerThread Refreshing /autoscaling.json with znode version 5
   [junit4]   2> 2905472 DEBUG (Simulated OverseerAutoScalingTriggerThread) [    ] o.a.s.c.a.OverseerTriggerThread Processed trigger updates upto znodeVersion 5
   [junit4]   2> 2905473 DEBUG (Simulated OverseerAutoScalingTriggerThread) [    ] o.a.s.c.a.OverseerTriggerThread -- cleaning old nodeLost / nodeAdded markers
   [junit4]   2> 2905473 DEBUG (Simulated OverseerAutoScalingTriggerThread) [    ] o.a.s.c.a.OverseerTriggerThread Current znodeVersion 5, lastZnodeVersion 5
   [junit4]   2> 2905474 DEBUG (simCloudManagerPool-15413-thread-5) [    ] o.a.s.c.a.s.SimClusterStateProvider -- simCreateCollection testNodeAdded, currentVersion=1
   [junit4]   2> 2905475 DEBUG (simCloudManagerPool-15413-thread-5) [    ] o.a.s.c.a.s.SimClusterStateProvider ** creating new collection states, currentVersion=1
   [junit4]   2> 2905475 DEBUG (simCloudManagerPool-15413-thread-5) [    ] o.a.s.c.a.s.SimClusterStateProvider ** saved cluster state version 1
   [junit4]   2> 2905475 DEBUG (simCloudManagerPool-15413-thread-5) [    ] o.a.s.c.o.ClusterStateMutator building a new cName: testNodeAdded
   [junit4]   2> 2905485 DEBUG (simCloudManagerPool-15413-thread-5) [    ] o.a.s.c.a.s.SimClusterStateProvider ** creating new collection states, currentVersion=2
   [junit4]   2> 2905485 DEBUG (simCloudManagerPool-15413-thread-5) [    ] o.a.s.c.a.s.SimClusterStateProvider ** saved cluster state version 2
   [junit4]   2> 2905485 WARN  (simCloudManagerPool-15413-thread-5) [    ] o.a.s.c.a.c.CreateCollectionCmd Specified number of replicas of 4 on collection testNodeAdded is higher than the number of Solr instances currently live or live and part of your createNodeSet(1). It's unusual to run two replica of the same slice on the same Solr-instance.
   [junit4]   2> 2905486 DEBUG (simCloudManagerPool-15413-thread-5) [    ] o.a.s.c.s.c.a.PolicyHelper Creating a new session
   [junit4]   2> 2905486 DEBUG (simCloudManagerPool-15413-thread-5) [    ] o.a.s.c.s.c.a.PolicyHelper New session created 
   [junit4]   2> 2905487 DEBUG (simCloudManagerPool-15413-thread-5) [    ] o.a.s.c.s.c.a.PolicyHelper returnSession, curr-time 990642300 sessionWrapper.createTime 990642236999100, this.sessionWrapper.createTime 990642236999100 
   [junit4]   2> 2905487 DEBUG (simCloudManagerPool-15413-thread-5) [    ] o.a.s.c.s.c.a.PolicyHelper session set to NULL
   [junit4]   2> 2905506 DEBUG (ScheduledTrigger-15414-thread-4) [    ] o.a.s.c.a.NodeLostTrigger Running NodeLostTrigger: .auto_add_replicas with currently live nodes: 1 and last live nodes: 1
   [junit4]   2> 2905506 DEBUG (ScheduledTrigger-15414-thread-2) [    ] o.a.s.c.a.NodeAddedTrigger Running NodeAddedTrigger node_added_trigger
   [junit4]   2> 2905506 DEBUG (ScheduledTrigger-15414-thread-2) [    ] o.a.s.c.a.NodeAddedTrigger Found livenodes: 1
   [junit4]   2> 2905506 DEBUG (simCloudManagerPool-15413-thread-6) [    ] o.a.s.c.a.s.SimClusterStateProvider ** creating new collection states, currentVersion=3
   [junit4]   2> 2905506 DEBUG (simCloudManagerPool-15413-thread-6) [    ] o.a.s.c.a.s.SimClusterStateProvider ** saved cluster state version 3
   [junit4]   2> 2905506 DEBUG (simCloudManagerPool-15413-thread-6) [    ] o.a.s.c.a.s.SimClusterStateProvider Running leader election (testNodeAdded / shard1)
   [junit4]   2> 2905506 DEBUG (simCloudManagerPool-15413-thread-6) [    ] o.a.s.c.a.s.SimClusterStateProvider -- elected new leader for testNodeAdded / shard1 (currentVersion=4): {"core_node1":{
   [junit4]   2>     "core":"testNodeAdded_shard1_replica_n1",
   [junit4]   2>     "shard":"shard1",
   [junit4]   2>     "collection":"testNodeAdded",
   [junit4]   2>     "node_name":"127.0.0.1:10019_solr",
   [junit4]   2>     "type":"NRT",
   [junit4]   2>     "leader":"true",
   [junit4]   2>     "SEARCHER.searcher.maxDoc":0,
   [junit4]   2>     "SEARCHER.searcher.deletedDocs":0,
   [junit4]   2>     "INDEX.sizeInBytes":10240,
   [junit4]   2>     "state":"active",
   [junit4]   2>     "INDEX.sizeInGB":9.5367431640625E-6,
   [junit4]   2>     "SEARCHER.searcher.numDocs":0}}
   [junit4]   2> 2905517 DEBUG (simCloudManagerPool-15413-thread-7) [    ] o.a.s.c.a.s.SimClusterStateProvider ** creating new collection states, currentVersion=4
   [junit4]   2> 2905518 DEBUG (simCloudManagerPool-15413-thread-7) [    ] o.a.s.c.a.s.SimClusterStateProvider ** saved cluster state version 4
   [junit4]   2> 2905526 DEBUG (ScheduledTrigger-15414-thread-3) [    ] o.a.s.c.a.NodeLostTrigger Running NodeLostTrigger: .auto_add_replicas with currently live nodes: 1 and last live nodes: 1
   [junit4]   2> 2905530 DEBUG (simCloudManagerPool-15413-thread-8) [    ] o.a.s.c.a.s.SimClusterStateProvider ** creating new collection states, currentVersion=5
   [junit4]   2> 2905538 DEBUG (simCloudManagerPool-15413-thread-8) [    ] o.a.s.c.a.s.SimClusterStateProvider ** saved cluster state version 5
   [junit4]   2> 2905549 DEBUG (simCloudManagerPool-15413-thread-9) [    ] o.a.s.c.a.s.SimClusterStateProvider ** creating new collection states, currentVersion=6
   [junit4]   2> 2905558 DEBUG (ScheduledTrigger-15414-thread-1) [    ] o.a.s.c.a.NodeAddedTrigger Running NodeAddedTrigger node_added_trigger
   [junit4]   2> 2905558 DEBUG (ScheduledTrigger-15414-thread-1) [    ] o.a.s.c.a.NodeAddedTrigger Found livenodes: 1
   [junit4]   2> 2905558 DEBUG (ScheduledTrigger-15414-thread-1) [    ] o.a.s.c.a.NodeLostTrigger Running NodeLostTrigger: .auto_add_replicas with currently live nodes: 1 and last live nodes: 1
   [junit4]   2> 2905569 DEBUG (simCloudManagerPool-15413-thread-9) [    ] o.a.s.c.a.s.SimClusterStateProvider ** saved cluster state version 6
   [junit4]   2> 2905569 DEBUG (simCloudManagerPool-15413-thread-5) [    ] o.a.s.c.a.s.SimClusterStateProvider -- finished createCollection testNodeAdded, currentVersion=7
   [junit4]   2> 2905571 DEBUG (TEST-TestSimComputePlanAction.testNodeAdded-seed#[25238CE346EF10A4]) [    ] o.a.s.c.a.s.SimClusterStateProvider ** creating new collection states, currentVersion=7
   [junit4]   2> 2905580 DEBUG (ScheduledTrigger-15414-thread-2) [    ] o.a.s.c.a.NodeAddedTrigger Running NodeAddedTrigger node_added_trigger
   [junit4]   2> 2905580 DEBUG (ScheduledTrigger-15414-thread-2) [    ] o.a.s.c.a.NodeAddedTrigger Found livenodes: 1
   [junit4]   2> 2905580 DEBUG (ScheduledTrigger-15414-thread-2) [    ] o.a.s.c.a.NodeLostTrigger Running NodeLostTrigger: .auto_add_replicas with currently live nodes: 1 and last live nodes: 1
   [junit4]   2> 2905598 DEBUG (TEST-TestSimComputePlanAction.testNodeAdded-seed#[25238CE346EF10A4]) [    ] o.a.s.c.a.s.SimClusterStateProvider ** saved cluster state version 7
   [junit4]   2> 2905601 DEBUG (simCloudManagerPool-15413-thread-10) [    ] o.a.s.c.a.AutoScalingHandler Verified autoscaling configuration
   [junit4]   2> 2905601 DEBUG (simCloudManagerPool-15413-thread-10) [    ] o.a.s.c.a.OverseerTriggerThread Refreshing /autoscaling.json with znode version 6
   [junit4]   2> 2905601 DEBUG (Simulated OverseerAutoScalingTriggerThread) [    ] o.a.s.c.a.OverseerTriggerThread Processed trigger updates upto znodeVersion 6
   [junit4]   2> 2905601 DEBUG (Simulated OverseerAutoScalingTriggerThread) [    ] o.a.s.c.a.OverseerTriggerThread -- cleaning old nodeLost / nodeAdded markers
   [junit4]   2> 2905601 DEBUG (Simulated OverseerAutoScalingTriggerThread) [    ] o.a.s.c.a.OverseerTriggerThread Current znodeVersion 6, lastZnodeVersion 6
   [junit4]   2> 2905602 DEBUG (TEST-TestSimComputePlanAction.testNodeAdded-seed#[25238CE346EF10A4]) [    ] o.a.s.c.a.s.SimClusterStateProvider -- creating marker: /autoscaling/nodeAdded/127.0.0.1:10020_solr
   [junit4]   2> 2905606 DEBUG (ScheduledTrigger-15414-thread-2) [    ] o.a.s.c.a.NodeAddedTrigger Running NodeAddedTrigger node_added_trigger
   [junit4]   2> 2905606 DEBUG (ScheduledTrigger-15414-thread-2) [    ] o.a.s.c.a.NodeAddedTrigger Found livenodes: 2
   [junit4]   2> 2905606 DEBUG (ScheduledTrigger-15414-thread-2) [    ] o.a.s.c.a.NodeAddedTrigger Tracking new node: 127.0.0.1:10020_solr at time 990648215084100
   [junit4]   2> 2905606 DEBUG (ScheduledTrigger-15414-thread-2) [    ] o.a.s.c.a.NodeLostTrigger Running NodeLostTrigger: .auto_add_replicas with currently live nodes: 2 and last live nodes: 1
   [junit4]   2> 2905634 DEBUG (ScheduledTrigger-15414-thread-2) [    ] o.a.s.c.a.NodeAddedTrigger Running NodeAddedTrigger node_added_trigger
   [junit4]   2> 2905634 DEBUG (ScheduledTrigger-15414-thread-2) [    ] o.a.s.c.a.NodeAddedTrigger Found livenodes: 2
   [junit4]   2> 2905634 DEBUG (ScheduledTrigger-15414-thread-2) [    ] o.a.s.c.a.NodeAddedTrigger NodeAddedTrigger node_added_trigger firing registered processor for nodes: [127.0.0.1:10020_solr] added at times [990648215084100], now=990649601364100
   [junit4]   2> 2905634 DEBUG (ScheduledTrigger-15414-thread-2) [    ] o.a.s.c.a.ScheduledTriggers ++++++++ Cooldown inactive - processing event: {
   [junit4]   2>   "id":"384fd42f51c44Teymk7ocjtlz1ignoz585h69g8",
   [junit4]   2>   "source":"node_added_trigger",
   [junit4]   2>   "eventTime":990648215084100,
   [junit4]   2>   "eventType":"NODEADDED",
   [junit4]   2>   "properties":{
   [junit4]   2>     "eventTimes":[990648215084100],
   [junit4]   2>     "preferredOperation":"movereplica",
   [junit4]   2>     "nodeNames":["127.0.0.1:10020_solr"]}}
   [junit4]   2> 2905635 DEBUG (ScheduledTrigger-15414-thread-2) [    ] o.a.s.c.a.ScheduledTriggers Pausing all triggers: [.auto_add_replicas, .scheduled_maintenance, node_added_trigger]
   [junit4]   2> 2905635 DEBUG (ScheduledTrigger-15414-thread-2) [    ] o.a.s.c.a.SystemLogListener Collection .system missing, skip sending event {
   [junit4]   2>   "id":"384fd42f51c44Teymk7ocjtlz1ignoz585h69g8",
   [junit4]   2>   "source":"node_added_trigger",
   [junit4]   2>   "eventTime":990648215084100,
   [junit4]   2>   "eventType":"NODEADDED",
   [junit4]   2>   "properties":{
   [junit4]   2>     "eventTimes":[990648215084100],
   [junit4]   2>     "preferredOperation":"movereplica",
   [junit4]   2>     "_enqueue_time_":990649646954100,
   [junit4]   2>     "nodeNames":["127.0.0.1:10020_solr"]}}
   [junit4]   2> 2905635 DEBUG (ScheduledTrigger-15414-thread-2) [    ] o.a.s.c.a.NodeAddedTrigger Removing new node from tracking: 127.0.0.1:10020_solr
   [junit4]   2> 2905636 DEBUG (AutoscalingActionExecutor-15415-thread-1) [    ] o.a.s.c.a.ScheduledTriggers -- processing actions for {
   [junit4]   2>   "id":"384fd42f51c44Teymk7ocjtlz1ignoz585h69g8",
   [junit4]   2>   "source":"node_added_trigger",
   [junit4]   2>   "eventTime":990648215084100,
   [junit4]   2>   "eventType":"NODEADDED",
   [junit4]   2>   "properties":{
   [junit4]   2>     "eventTimes":[990648215084100],
   [junit4]   2>     "preferredOperation":"movereplica",
   [junit4]   2>     "_enqueue_time_":990649646954100,
   [junit4]   2>     "nodeNames":["127.0.0.1:10020_solr"]}}
   [junit4]   2> 2905636 DEBUG (AutoscalingActionExecutor-15415-thread-1) [    ] o.a.s.c.a.ComputePlanAction -- processing event: {
   [junit4]   2>   "id":"384fd42f51c44Teymk7ocjtlz1ignoz585h69g8",
   [junit4]   2>   "source":"node_added_trigger",
   [junit4]   2>   "eventTime":990648215084100,
   [junit4]   2>   "eventType":"NODEADDED",
   [junit4]   2>   "properties":{
   [junit4]   2>     "eventTimes":[990648215084100],
   [junit4]   2>     "preferredOperation":"movereplica",
   [junit4]   2>     "_enqueue_time_":990649646954100,
   [junit4]   2>     "nodeNames":["127.0.0.1:10020_solr"]}} with context properties: {BEFORE_ACTION=[compute_plan]}
   [junit4]   2> 2905636 DEBUG (AutoscalingActionExecutor-15415-thread-1) [    ] o.a.s.c.s.c.a.PolicyHelper Creating a new session
   [junit4]   2> 2905638 DEBUG (AutoscalingActionExecutor-15415-thread-1) [    ] o.a.s.c.s.c.a.PolicyHelper New session created 
   [junit4]   2> 2905638 DEBUG (AutoscalingActionExecutor-15415-thread-1) [    ] o.a.s.c.a.ComputePlanAction Computed Plan: action=MOVEREPLICA&collection=testNodeAdded&targetNode=127.0.0.1:10020_solr&inPlaceMove=true&replica=core_node1
   [junit4]   2> 2905638 DEBUG (AutoscalingActionExecutor-15415-thread-1) [    ] o.a.s.c.a.ComputePlanAction Computed Plan: action=MOVEREPLICA&collection=testNodeAdded&targetNode=127.0.0.1:10020_solr&inPlaceMove=true&replica=core_node2
   [junit4]   2> 2905638 DEBUG (AutoscalingActionExecutor-15415-thread-1) [    ] o.a.s.c.s.c.a.PolicyHelper returnSession, curr-time 990649850 sessionWrapper.createTime 990649810674100, this.sessionWrapper.createTime 990649810674100 
   [junit4]   2> 2905638 DEBUG (AutoscalingActionExecutor-15415-thread-1) [    ] o.a.s.c.s.c.a.PolicyHelper session set to NULL
   [junit4]   2> 2905638 DEBUG (AutoscalingActionExecutor-15415-thread-1) [    ] o.a.s.c.a.SystemLogListener Collection .system missing, skip sending event {
   [junit4]   2>   "id":"384fd42f51c44Teymk7ocjtlz1ignoz585h69g8",
   [junit4]   2>   "source":"node_added_trigger",
   [junit4]   2>   "eventTime":990648215084100,
   [junit4]   2>   "eventType":"NODEADDED",
   [junit4]   2>   "properties":{
   [junit4]   2>     "eventTimes":[990648215084100],
   [junit4]   2>     "preferredOperation":"movereplica",
   [junit4]   2>     "_enqueue_time_":990649646954100,
   [junit4]   2>     "nodeNames":["127.0.0.1:10020_solr"]}}
   [junit4]   2> 2905638 INFO  (TEST-TestSimComputePlanAction.testNodeAdded-seed#[25238CE346EF10A4]) [    ] o.a.s.c.a.s.TestSimComputePlanAction Node values: {
   [junit4]   2>   "127.0.0.1:10020_solr":{
   [junit4]   2>     "sysprop.java.vendor":"Oracle Corporation",
   [junit4]   2>     "cores":0,
   [junit4]   2>     "host":"127.0.0.1",
   [junit4]   2>     "freedisk":1024,
   [junit4]   2>     "sysprop.java.version":"13-ea",
   [junit4]   2>     "ip_1":"127",
   [junit4]   2>     "ip_3":"0",
   [junit4]   2>     "ip_2":"0",
   [junit4]   2>     "ip_4":"1",
   [junit4]   2>     "node":"127.0.0.1:10020_solr",
   [junit4]   2>     "metrics:solr.jvm:buffers.direct.Count":0,
   [junit4]   2>     "port":10020,
   [junit4]   2>     "heapUsage":123450000,
   [junit4]   2>     "sysLoadAvg":1.0,
   [junit4]   2>     "metrics:solr.node:ADMIN./admin/authorization.clientErrors:count":0,
   [junit4]   2>     "totaldisk":10240},
   [junit4]   2>   "127.0.0.1:10019_solr":{
   [junit4]   2>     "sysprop.java.vendor":"Oracle Corporation",
   [junit4]   2>     "cores":4,
   [junit4]   2>     "host":"127.0.0.1",
   [junit4]   2>     "freedisk":1023.9999618530273,
   [junit4]   2>     "sysprop.java.version":"13-ea",
   [junit4]   2>     "ip_1":"127",
   [junit4]   2>     "ip_3":"0",
   [junit4]   2>     "ip_2":"0",
   [junit4]   2>     "ip_4":"1",
   [junit4]   2>     "node":"127.0.0.1:10019_solr",
   [junit4]   2>     "metrics:solr.jvm:buffers.direct.Count":0,
   [junit4]   2>     "port":10019,
   [junit4]   2>     "heapUsage":123450000,
   [junit4]   2>     "sysLoadAvg":1.0,
   [junit4]   2>     "metrics:solr.node:ADMIN./admin/authorization.clientErrors:count":0,
   [junit4]   2>     "totaldisk":10240}}
   [junit4]   2> 2905640 INFO  (TEST-TestSimComputePlanAction.testNodeAdded-seed#[25238CE346EF10A4]) [    ] o.a.s.c.a.s.TestSimComputePlanAction Live nodes: [127.0.0.1:10020_solr, 127.0.0.1:10019_solr], collection state: DocCollection(testNodeAdded//clusterstate.json/7)={
   [junit4]   2>   "replicationFactor":"1",
   [junit4]   2>   "pullReplicas":"0",
   [junit4]   2>   "router":{"name":"compositeId"},
   [junit4]   2>   "maxShardsPerNode":"-1",
   [junit4]   2>   "autoAddReplicas":"false",
   [junit4]   2>   "nrtReplicas":"4",
   [junit4]   2>   "tlogReplicas":"0",
   [junit4]   2>   "autoCreated":"true",
   [junit4]   2>   "shards":{"shard1":{
   [junit4]   2>       "replicas":{
   [junit4]   2>         "core_node1":{
   [junit4]   2>           "core":"testNodeAdded_shard1_replica_n1",
   [junit4]   2>           "leader":"true",
   [junit4]   2>           "SEARCHER.searcher.maxDoc":0,
   [junit4]   2>           "SEARCHER.searcher.deletedDocs":0,
   [junit4]   2>           "INDEX.sizeInBytes":10240,
   [junit4]   2>           "node_name":"127.0.0.1:10019_solr",
   [junit4]   2>           "state":"active",
   [junit4]   2>           "type":"NRT",
   [junit4]   2>           "INDEX.sizeInGB":9.5367431640625E-6,
   [junit4]   2>           "SEARCHER.searcher.numDocs":0},
   [junit4]   2>         "core_node2":{
   [junit4]   2>           "core":"testNodeAdded_shard1_replica_n2",
   [junit4]   2>           "SEARCHER.searcher.maxDoc":0,
   [junit4]   2>           "SEARCHER.searcher.deletedDocs":0,
   [junit4]   2>           "INDEX.sizeInBytes":10240,
   [junit4]   2>           "node_name":"127.0.0.1:10019_solr",
   [junit4]   2>           "state":"active",
   [junit4]   2>           "type":"NRT",
   [junit4]   2>           "INDEX.sizeInGB":9.5367431640625E-6,
   [junit4]   2>           "SEARCHER.searcher.numDocs":0},
   [junit4]   2>         "core_node3":{
   [junit4]   2>           "core":"testNodeAdded_shard1_replica_n3",
   [junit4]   2>           "SEARCHER.searcher.maxDoc":0,
   [junit4]   2>           "SEARCHER.searcher.deletedDocs":0,
   [junit4]   2>           "INDEX.sizeInBytes":10240,
   [junit4]   2>           "node_name":"127.0.0.1:10019_solr",
   [junit4]   2>           "state":"active",
   [junit4]   2>           "type":"NRT",
   [junit4]   2>           "INDEX.sizeInGB":9.5367431640625E-6,
   [junit4]   2>           "SEARCHER.searcher.numDocs":0},
   [junit4]   2>         "core_node4":{
   [junit4]   2>           "core":"testNodeAdded_shard1_replica_n4",
   [junit4]   2>           "SEARCHER.searcher.maxDoc":0,
   [junit4]   2>           "SEARCHER.searcher.deletedDocs":0,
   [junit4]   2>           "INDEX.sizeInBytes":10240,
   [junit4]   2>           "node_name":"127.0.0.1:10019_solr",
   [junit4]   2>           "state":"active",
   [junit4]   2>           "type":"NRT",
   [junit4]   2>           "INDEX.sizeInGB":9.5367431640625E-6,
   [junit4]   2>           "SEARCHER.searcher.numDocs":0}},
   [junit4]   2>       "range":"80000000-7fffffff",
   [junit4]   2>       "state":"active"}}}
   [junit4]   2> 2905640 INFO  (TEST-TestSimComputePlanAction.testNodeAdded-seed#[25238CE346EF10A4]) [    ] o.a.s.c.a.s.TestSimComputePlanAction -------------_ FINAL STATE --------------
   [junit4]   2> 2905640 INFO  (TEST-TestSimComputePlanAction.testNodeAdded-seed#[25238CE346EF10A4]) [    ] o.a.s.c.a.s.TestSimComputePlanAction * Node values: {
   [junit4]   2>   "127.0.0.1:10020_solr":{
   [junit4]   2>     "sysprop.java.vendor":"Oracle Corporation",
   [junit4]   2>     "cores":0,
   [junit4]   2>     "host":"127.0.0.1",
   [junit4]   2>     "freedisk":1024,
   [junit4]   2>     "sysprop.java.version":"13-ea",
   [junit4]   2>     "ip_1":"127",
   [junit4]   2>     "ip_3":"0",
   [junit4]   2>     "ip_2":"0",
   [junit4]   2>     "ip_4":"1",
   [junit4]   2>     "node":"127.0.0.1:10020_solr",
   [junit4]   2>     "metrics:solr.jvm:buffers.direct.Count":0,
   [junit4]   2>     "port":10020,
   [junit4]   2>     "heapUsage":123450000,
   [junit4]   2>     "sysLoadAvg":1.0,
   [junit4]   2>     "metrics:solr.node:ADMIN./admin/authorization.clientErrors:count":0,
   [junit4]   2>     "totaldisk":10240},
   [junit4]   2>   "127.0.0.1:10019_solr":{
   [junit4]   2>     "sysprop.java.vendor":"Oracle Corporation",
   [junit4]   2>     "cores":4,
   [junit4]   2>     "host":"127.0.0.1",
   [junit4]   2>     "freedisk":1023.9999618530273,
   [junit4]   2>     "sysprop.java.version":"13-ea",
   [junit4]   2>     "ip_1":"127",
   [junit4]   2>     "ip_3":"0",
   [junit4]   2>     "ip_2":"0",
   [junit4]   2>     "ip_4":"1",
   [junit4]   2>     "node":"127.0.0.1:10019_solr",
   [junit4]   2>     "metrics:solr.jvm:buffers.direct.Count":0,
   [junit4]   2>     "port":10019,
   [junit4]   2>     "heapUsage":123450000,
   [junit4]   2>     "sysLoadAvg":1.0,
   [junit4]   2>     "metrics:solr.node:ADMIN./admin/authorization.clientErrors:count":0,
   [junit4]   2>     "totaldisk":10240}}
   [junit4]   2> 2905640 INFO  (TEST-TestSimComputePlanAction.testNodeAdded-seed#[25238CE346EF10A4]) [    ] o.a.s.c.a.s.TestSimComputePlanAction * Live nodes: [127.0.0.1:10020_solr, 127.0.0.1:10019_solr]
   [junit4]   2> 2905640 INFO  (TEST-TestSimComputePlanAction.testNodeAdded-seed#[25238CE346EF10A4]) [    ] o.a.s.c.a.s.TestSimComputePlanAction * Collection testNodeAdded state: DocCollection(testNodeAdded//clusterstate.json/7)={
   [junit4]   2>   "replicationFactor":"1",
   [junit4]   2>   "pullReplicas":"0",
   [junit4]   2>   "router":{"name":"compositeId"},
   [junit4]   2>   "maxShardsPerNode":"-1",
   [junit4]   2>   "autoAddReplicas":"false",
   [junit4]   2>   "nrtReplicas":"4",
   [junit4]   2>   "tlogReplicas":"0",
   [junit4]   2>   "autoCreated":"true",
   [junit4]   2>   "shards":{"shard1":{
   [junit4]   2>       "replicas":{
   [junit4]   2>         "core_node1":{
   [junit4]   2>           "core":"testNodeAdded_shard1_replica_n1",
   [junit4]   2>           "leader":"true",
   [junit4]   2>           "SEARCHER.searcher.maxDoc":0,
   [junit4]   2>           "SEARCHER.searcher.deletedDocs":0,
   [junit4]   2>           "INDEX.sizeInBytes":10240,
   [junit4]   2>           "node_name":"127.0.0.1:10019_solr",
   [junit4]   2>           "state":"active",
   [junit4]   2>           "type":"NRT",
   [junit4]   2>           "INDEX.sizeInGB":9.5367431640625E-6,
   [junit4]   2>           "SEARCHER.searcher.numDocs":0},
   [junit4]   2>         "core_node2":{
   [junit4]   2>           "core":"testNodeAdded_shard1_replica_n2",
   [junit4]   2>           "SEARCHER.searcher.maxDoc":0,
   [junit4]   2>           "SEARCHER.searcher.deletedDocs":0,
   [junit4]   2>           "INDEX.sizeInBytes":10240,
   [junit4]   2>           "node_name":"127.0.0.1:10019_solr",
   [junit4]   2>           "state":"active",
   [junit4]   2>           "type":"NRT",
   [junit4]   2>           "INDEX.sizeInGB":9.5367431640625E-6,
   [junit4]   2>           "SEARCHER.searcher.numDocs":0},
   [junit4]   2>         "core_node3":{
   [junit4]   2>           "core":"testNodeAdded_shard1_replica_n3",
   [junit4]   2>           "SEARCHER.searcher.maxDoc":0,
   [junit4]   2>           "SEARCHER.searcher.deletedDocs":0,
   [junit4]   2>           "INDEX.sizeInBytes":10240,
   [junit4]   2>           "node_name":"127.0.0.1:10019_solr",
   [junit4]   2>           "state":"active",
   [junit4]   2>           "type":"NRT",
   [junit4]   2>           "INDEX.sizeInGB":9.5367431640625E-6,
   [junit4]   2>           "SEARCHER.searcher.numDocs":0},
   [junit4]   2>         "core_node4":{
   [junit4]   2>           "core":"testNodeAdded_shard1_replica_n4",
   [junit4]   2>           "SEARCHER.searcher.maxDoc":0,
   [junit4]   2>           "SEARCHER.searcher.deletedDocs":0,
   [junit4]   2>           "INDEX.sizeInBytes":10240,
   [junit4]   2>           "node_name":"127.0.0.1:10019_solr",
   [junit4]   2>           "state":"active",
   [junit4]   2>           "type":"NRT",
   [junit4]   2>           "INDEX.sizeInGB":9.5367431640625E-6,
   [junit4]   2>           "SEARCHER.searcher.numDocs":0}},
   [junit4]   2>       "range":"80000000-7fffffff",
   [junit4]   2>       "state":"active"}}}
   [junit4]   2> 2905641 DEBUG (TEST-TestSimComputePlanAction.testNodeAdded-seed#[25238CE346EF10A4]) [    ] o.a.s.c.a.ScheduledTriggers Shutting down scheduled thread pool executor now
   [junit4]   2> 2905641 DEBUG (TEST-TestSimComputePlanAction.testNodeAdded-seed#[25238CE346EF10A4]) [    ] o.a.s.c.a.ScheduledTriggers Shutting down action executor now
   [junit4]   2> 2905641 DEBUG (TEST-TestSimComputePlanAction.testNodeAdded-seed#[25238CE346EF10A4]) [    ] o.a.s.c.a.ScheduledTriggers Awaiting termination for action executor
   [junit4]   2> 2905641 INFO  (Simulated OverseerAutoScalingTriggerThread) [    ] o.a.s.c.a.OverseerTriggerThread OverseerTriggerThread woken up but we are closed, exiting.
   [junit4] IGNOR/A 0.00s J1 | TestSimComputePlanAction.testNodeLost
   [junit4]    > Assumption #1: 'awaitsfix' test group is disabled (@AwaitsFix(bugUrl="https://issues.apache.org/jira/browse/SOLR-12028"))
   [junit4]   2> 2905642 WARN  (AutoscalingActionExecutor-15415-thread-1) [    ] o.a.s.c.a.SystemLogListener Exception sending event. Collection: .system, event: {
   [junit4]   2>   "id":"384fd42f51c44Teymk7ocjtlz1ignoz585h69g8",
   [junit4]   2>   "source":"node_added_trigger",
   [junit4]   2>   "eventTime":990648215084100,
   [junit4]   2>   "eventType":"NODEADDED",
   [junit4]   2>   "properties":{
   [junit4]   2>     "eventTimes":[990648215084100],
   [junit4]   2>     "preferredOperation":"movereplica",
   [junit4]   2>     "_enqueue_time_":990649646954100,
   [junit4]   2>     "nodeNames":["127.0.0.1:10020_solr"]}}, exception: java.io.IOException: already closed
   [junit4]   2> 2905642 WARN  (AutoscalingActionExecutor-15415-thread-1) [    ] o.a.s.c.a.SystemLogListener Exception sending event. Collection: .system, event: {
   [junit4]   2>   "id":"384fd42f51c44Teymk7ocjtlz1ignoz585h69g8",
   [junit4]   2>   "source":"node_added_trigger",
   [junit4]   2>   "eventTime":990648215084100,
   [junit4]   2>   "eventType":"NODEADDED",
   [junit4]   2>   "properties":{
   [junit4]   2>     "eventTimes":[990648215084100],
   [junit4]   2>     "preferredOperation":"movereplica",
   [junit4]   2>     "_enqueue_time_":990649646954100,
   [junit4]   2>     "nodeNames":["127.0.0.1:10020_solr"]}}, exception: java.io.IOException: already closed
   [junit4]   2> NOTE: leaving temporary files on disk at: C:\Users\jenkins\workspace\Lucene-Solr-8.1-Windows\solr\build\solr-core\test\J1\temp\solr.cloud.autoscaling.sim.TestSimComputePlanAction_25238CE346EF10A4-001
   [junit4]   2> 2905642 WARN  (AutoscalingActionExecutor-15415-thread-1) [    ] o.a.s.c.a.ScheduledTriggers Unhandled exception executing actions
   [junit4]   2>           => org.apache.solr.common.AlreadyClosedException: ScheduledTrigger node_added_trigger has been closed.
   [junit4]   2> 	at org.apache.solr.cloud.autoscaling.ScheduledTriggers$TriggerWrapper.dequeue(ScheduledTriggers.java:583)
   [junit4]   2> org.apache.solr.common.AlreadyClosedException: ScheduledTrigger node_added_trigger has been closed.
   [junit4]   2> 	at org.apache.solr.cloud.autoscaling.ScheduledTriggers$TriggerWrapper.dequeue(ScheduledTriggers.java:583) ~[java/:?]
   [junit4]   2> 	at org.apache.solr.cloud.autoscaling.ScheduledTriggers.lambda$add$3(ScheduledTriggers.java:334) ~[java/:?]
   [junit4]   2> 	at java.util.concurrent.Executors$RunnableAdapter.call(Executors.java:515) ~[?:?]
   [junit4]   2> 	at java.util.concurrent.FutureTask.run(FutureTask.java:264) ~[?:?]
   [junit4]   2> 	at org.apache.solr.common.util.ExecutorUtil$MDCAwareThreadPoolExecutor.lambda$execute$0(ExecutorUtil.java:209) ~[java/:?]
   [junit4]   2> 	at java.util.concurrent.ThreadPoolExecutor.runWorker(ThreadPoolExecutor.java:1128) ~[?:?]
   [junit4]   2> 	at java.util.concurrent.ThreadPoolExecutor$Worker.run(ThreadPoolExecutor.java:628) ~[?:?]
   [junit4]   2> 	at java.lang.Thread.run(Thread.java:835) [?:?]
   [junit4]   2> 2905642 DEBUG (AutoscalingActionExecutor-15415-thread-1) [    ] o.a.s.c.a.ScheduledTriggers -- processing took 318 ms for event id=384fd42f51c44Teymk7ocjtlz1ignoz585h69g8
   [junit4]   2> 2905642 DEBUG (TEST-TestSimComputePlanAction.testNodeAdded-seed#[25238CE346EF10A4]) [    ] o.a.s.c.a.ScheduledTriggers Awaiting termination for scheduled thread pool executor
   [junit4]   2> 2905642 DEBUG (TEST-TestSimComputePlanAction.testNodeAdded-seed#[25238CE346EF10A4]) [    ] o.a.s.c.a.ScheduledTriggers ScheduledTriggers closed completely
   [junit4]   2> 2905642 DEBUG (TEST-TestSimComputePlanAction.testNodeAdded-seed#[25238CE346EF10A4]) [    ] o.a.s.c.a.OverseerTriggerThread OverseerTriggerThread has been closed explicitly
   [junit4]   2> 2905642 INFO  (TEST-TestSimComputePlanAction.testNodeAdded-seed#[25238CE346EF10A4]) [    ] o.a.s.SolrTestCaseJ4 ###Ending testNodeAdded
   [junit4]   2> NOTE: test params are: codec=Asserting(Lucene80): {}, docValues:{}, maxPointsInLeafNode=745, maxMBSortInHeap=7.0963973280735075, sim=Asserting(org.apache.lucene.search.similarities.AssertingSimilarity@680a3300), locale=yue-Hant, timezone=Etc/GMT+12
   [junit4]   2> NOTE: Windows 10 10.0 amd64/Oracle Corporation 13-ea (64-bit)/cpus=3,threads=1,free=318182288,total=518979584
   [junit4]   2> NOTE: All tests run in this JVM: [CollectionReloadTest, TestStreamBody, TestSha256AuthenticationProvider, TestDocumentBuilder, SearchHandlerTest, HdfsDirectoryTest, MetricsHistoryWithAuthIntegrationTest, PeerSyncWithLeaderAndIndexFingerprintCachingTest, TestUniqueKeyFieldResource, XmlUpdateRequestHandlerTest, TestBadConfig, SolrRrdBackendFactoryTest, TestCryptoKeys, MultiSolrCloudTestCaseTest, TestExtendedDismaxParser, SynonymTokenizerTest, ScheduledTriggerIntegrationTest, BasicAuthIntegrationTest, DirectUpdateHandlerTest, RestartWhileUpdatingTest, TestLuceneMatchVersion, NodeAddedTriggerTest, TestRequestStatusCollectionAPI, UnloadDistributedZkTest, TestJavabinTupleStreamParser, WordBreakSolrSpellCheckerTest, AtomicUpdateRemovalJavabinTest, MinimalSchemaTest, TestCSVResponseWriter, TestLuceneIndexBackCompat, TriggerCooldownIntegrationTest, TestCollectionsAPIViaSolrCloudCluster, ShardRoutingCustomTest, TestSolrQueryResponse, JvmMetricsTest, TestRTGBase, SolrCoreTest, XmlInterpolationTest, SpellingQueryConverterTest, TestRTimerTree, TestJsonFacetsStatsParsing, ZkStateReaderTest, DirectSolrConnectionTest, BigEndianAscendingWordSerializerTest, IndexSchemaTest, TestFieldCacheSort, JWTAuthPluginIntegrationTest, UUIDFieldTest, TestCharFilters, TestReloadDeadlock, QueryParsingTest, LukeRequestHandlerTest, StressHdfsTest, TestFileDictionaryLookup, TlogReplayBufferedWhileIndexingTest, CreateCollectionCleanupTest, TestOverriddenPrefixQueryForCustomFieldType, TestPointFields, NoCacheHeaderTest, TestDistributedMissingSort, TestSolrCloudWithSecureImpersonation, SolrGraphiteReporterTest, CustomHighlightComponentTest, TestSimExecutePlanAction, RecoveryZkTest, CdcrReplicationHandlerTest, TestHttpShardHandlerFactory, TestUseDocValuesAsStored, ZookeeperStatusHandlerTest, TestReplicationHandler, ZkShardTermsTest, PrimitiveFieldTypeTest, TimeRoutedAliasUpdateProcessorTest, TestSchemalessBufferedUpdates, TestTolerantUpdateProcessorRandomCloud, TestRecoveryHdfs, TestConfigSetImmutable, MergeStrategyTest, DistributedQueryElevationComponentTest, DistributedIntervalFacetingTest, TestTestInjection, DocValuesMissingTest, LeaderFailoverAfterPartitionTest, DirectoryFactoryTest, BasicFunctionalityTest, TemplateUpdateProcessorTest, CleanupOldIndexTest, TestCloudJSONFacetJoinDomain, TestNumericTerms64, ParsingFieldUpdateProcessorsTest, SolrRequestParserTest, IgnoreLargeDocumentProcessorFactoryTest, TestZkAclsWithHadoopAuth, CheckHdfsIndexTest, AdminHandlersProxyTest, TestJettySolrRunner, FacetPivotSmallTest, SolrCloudReportersTest, HttpPartitionOnCommitTest, TestSolrConfigHandler, TestLMJelinekMercerSimilarityFactory, TestSolrConfigHandlerConcurrent, CopyFieldTest, ClassificationUpdateProcessorIntegrationTest, MoveReplicaHDFSTest, DistributedVersionInfoTest, TestDocTermOrds, ExplicitHLLTest, UniqFieldsUpdateProcessorFactoryTest, SSLMigrationTest, TestMinMaxOnMultiValuedField, TestFieldTypeResource, LeaderElectionIntegrationTest, SolrXmlInZkTest, SimpleCollectionCreateDeleteTest, SolrPluginUtilsTest, TestDocSet, TestIntervalFaceting, OverseerRolesTest, TestTlogReplica, DistribJoinFromCollectionTest, SolrJmxReporterTest, TestPushWriter, TestShardHandlerFactory, HdfsAutoAddReplicasIntegrationTest, DistributedUpdateProcessorTest, TestMiniSolrCloudClusterSSL, SimpleFacetsTest, SearchRateTriggerIntegrationTest, TestRawTransformer, FullSolrCloudDistribCmdsTest, CSVRequestHandlerTest, CoreMergeIndexesAdminHandlerTest, TriggerIntegrationTest, TestFieldResource, TestSortByMinMaxFunction, SharedFSAutoReplicaFailoverTest, TestWordDelimiterFilterFactory, DateFieldTest, TestSolrFieldCacheBean, TestIndexSearcher, TestDistribIDF, SegmentsInfoRequestHandlerTest, PeerSyncWithBufferUpdatesTest, ZkCLITest, PathHierarchyTokenizerFactoryTest, IndexBasedSpellCheckerTest, TestTolerantSearch, TestHighlightDedupGrouping, TestQueryTypes, GraphQueryTest, HdfsRestartWhileUpdatingTest, TestCustomStream, ClusterStateTest, CursorMarkTest, RangeFacetCloudTest, DirectSolrSpellCheckerTest, OutOfBoxZkACLAndCredentialsProvidersTest, TestFuzzyAnalyzedSuggestions, TestFacetMethods, HdfsChaosMonkeySafeLeaderTest, CdcrUpdateLogTest, ConfigureRecoveryStrategyTest, TestLegacyNumericRangeQueryBuilder, ReplaceNodeTest, TestSolrDeletionPolicy2, TestSimNodeAddedTrigger, TestSubQueryTransformerCrossCore, PropertiesRequestHandlerTest, RootFieldTest, TestConfigsApi, TaggerTest, HighlighterConfigTest, TestDownShardTolerantSearch, PrimUtilsTest, TestReplicationHandlerDiskOverFlow, UpdateParamsTest, HdfsDirectoryFactoryTest, StatsComponentTest, CdcrBootstrapTest, ConfigSetsAPITest, SyncSliceTest, V2ApiIntegrationTest, TestClusterProperties, TestUnifiedSolrHighlighter, TestPhraseSuggestions, TestDynamicLoading, TestLazyCores, CursorPagingTest, ComputePlanActionTest, TestLegacyFieldCache, TestSolrCloudWithDelegationTokens, SortSpecParsingTest, StatsReloadRaceTest, TestRandomDVFaceting, ReturnFieldsTest, HttpPartitionWithTlogReplicasTest, RegexBoostProcessorTest, SuggestComponentTest, LegacyCloudClusterPropTest, TestGraphTermsQParserPlugin, TestConfigSetsAPIExclusivity, MissingSegmentRecoveryTest, DeleteShardTest, TestDynamicFieldResource, TestLegacyTerms, TestWriterPerf, OpenExchangeRatesOrgProviderTest, AnalysisAfterCoreReloadTest, EchoParamsTest, OutputWriterTest, SampleTest, SolrInfoBeanTest, SolrTestCaseJ4Test, TestCursorMarkWithoutUniqueKey, TestDistributedGrouping, TestDistributedSearch, TestJoin, TestRandomFaceting, TestSimpleTrackingShardHandler, TestTrie, ProtectedTermFilterFactoryTest, TestEmbeddedSolrServerAdminHandler, TestEmbeddedSolrServerConstructors, ConnectionReuseTest, ActionThrottleTest, AddReplicaTest, AliasIntegrationTest, BasicDistributedZk2Test, BasicZkTest, ChaosMonkeyNothingIsSafeTest, ChaosMonkeyNothingIsSafeWithPullReplicasTest, ChaosMonkeySafeLeaderTest, ChaosMonkeySafeLeaderWithPullReplicasTest, ClusterStateUpdateTest, CollectionStateFormat2Test, CollectionsAPISolrJTest, DistributedQueueTest, LeaderElectionContextKeyTest, LeaderTragicEventTest, MultiThreadedOCPTest, NestedShardedAtomicUpdateTest, NodeMutatorTest, OverseerCollectionConfigSetProcessorTest, OverseerStatusTest, OverseerTaskQueueTest, ReindexCollectionTest, ShardRoutingTest, SystemCollectionCompatTest, TestAuthenticationFramework, TestCloudDeleteByQuery, TestCloudInspectUtil, TestCloudPhrasesIdentifi

[...truncated too long message...]

pace\Lucene-Solr-8.1-Windows\solr\build\contrib\solr-analytics\test\temp\junit4-J0-20190513_210032_78316015542855551416039.syserr
   [junit4] >>> JVM J0 emitted unexpected output (verbatim) ----
   [junit4] OpenJDK 64-Bit Server VM warning: Option UseConcMarkSweepGC was deprecated in version 9.0 and will likely be removed in a future release.
   [junit4] <<< JVM J0: EOF ----

[...truncated 3 lines...]
   [junit4] JVM J1: stderr was not empty, see: C:\Users\jenkins\workspace\Lucene-Solr-8.1-Windows\solr\build\contrib\solr-analytics\test\temp\junit4-J1-20190513_210032_7833675072392886345345.syserr
   [junit4] >>> JVM J1 emitted unexpected output (verbatim) ----
   [junit4] OpenJDK 64-Bit Server VM warning: Option UseConcMarkSweepGC was deprecated in version 9.0 and will likely be removed in a future release.
   [junit4] <<< JVM J1: EOF ----

[...truncated 572 lines...]
   [junit4] JVM J0: stderr was not empty, see: C:\Users\jenkins\workspace\Lucene-Solr-8.1-Windows\solr\build\contrib\solr-clustering\test\temp\junit4-J0-20190513_210321_02312311071532680636774.syserr
   [junit4] >>> JVM J0 emitted unexpected output (verbatim) ----
   [junit4] OpenJDK 64-Bit Server VM warning: Option UseConcMarkSweepGC was deprecated in version 9.0 and will likely be removed in a future release.
   [junit4] <<< JVM J0: EOF ----

[...truncated 3 lines...]
   [junit4] JVM J1: stderr was not empty, see: C:\Users\jenkins\workspace\Lucene-Solr-8.1-Windows\solr\build\contrib\solr-clustering\test\temp\junit4-J1-20190513_210321_0238097854669773113475.syserr
   [junit4] >>> JVM J1 emitted unexpected output (verbatim) ----
   [junit4] OpenJDK 64-Bit Server VM warning: Option UseConcMarkSweepGC was deprecated in version 9.0 and will likely be removed in a future release.
   [junit4] <<< JVM J1: EOF ----

[...truncated 1301 lines...]
   [junit4] JVM J0: stderr was not empty, see: C:\Users\jenkins\workspace\Lucene-Solr-8.1-Windows\solr\build\contrib\solr-dataimporthandler-extras\test\temp\junit4-J0-20190513_210413_08013784451621808205999.syserr
   [junit4] >>> JVM J0 emitted unexpected output (verbatim) ----
   [junit4] OpenJDK 64-Bit Server VM warning: Option UseConcMarkSweepGC was deprecated in version 9.0 and will likely be removed in a future release.
   [junit4] <<< JVM J0: EOF ----

[...truncated 3 lines...]
   [junit4] JVM J1: stderr was not empty, see: C:\Users\jenkins\workspace\Lucene-Solr-8.1-Windows\solr\build\contrib\solr-dataimporthandler-extras\test\temp\junit4-J1-20190513_210413_08015235962072000614225.syserr
   [junit4] >>> JVM J1 emitted unexpected output (verbatim) ----
   [junit4] OpenJDK 64-Bit Server VM warning: Option UseConcMarkSweepGC was deprecated in version 9.0 and will likely be removed in a future release.
   [junit4] <<< JVM J1: EOF ----

[...truncated 667 lines...]
   [junit4] JVM J0: stderr was not empty, see: C:\Users\jenkins\workspace\Lucene-Solr-8.1-Windows\solr\build\contrib\solr-dataimporthandler\test\temp\junit4-J0-20190513_210439_4734884710068350398592.syserr
   [junit4] >>> JVM J0 emitted unexpected output (verbatim) ----
   [junit4] OpenJDK 64-Bit Server VM warning: Option UseConcMarkSweepGC was deprecated in version 9.0 and will likely be removed in a future release.
   [junit4] <<< JVM J0: EOF ----

[...truncated 3 lines...]
   [junit4] JVM J1: stderr was not empty, see: C:\Users\jenkins\workspace\Lucene-Solr-8.1-Windows\solr\build\contrib\solr-dataimporthandler\test\temp\junit4-J1-20190513_210439_4736905225804541242221.syserr
   [junit4] >>> JVM J1 emitted unexpected output (verbatim) ----
   [junit4] OpenJDK 64-Bit Server VM warning: Option UseConcMarkSweepGC was deprecated in version 9.0 and will likely be removed in a future release.
   [junit4] <<< JVM J1: EOF ----

[...truncated 574 lines...]
   [junit4] JVM J0: stderr was not empty, see: C:\Users\jenkins\workspace\Lucene-Solr-8.1-Windows\solr\build\contrib\solr-cell\test\temp\junit4-J0-20190513_210537_1448444468378973641472.syserr
   [junit4] >>> JVM J0 emitted unexpected output (verbatim) ----
   [junit4] OpenJDK 64-Bit Server VM warning: Option UseConcMarkSweepGC was deprecated in version 9.0 and will likely be removed in a future release.
   [junit4] <<< JVM J0: EOF ----

[...truncated 3 lines...]
   [junit4] JVM J1: stderr was not empty, see: C:\Users\jenkins\workspace\Lucene-Solr-8.1-Windows\solr\build\contrib\solr-cell\test\temp\junit4-J1-20190513_210537_1448651558384498031719.syserr
   [junit4] >>> JVM J1 emitted unexpected output (verbatim) ----
   [junit4] OpenJDK 64-Bit Server VM warning: Option UseConcMarkSweepGC was deprecated in version 9.0 and will likely be removed in a future release.
   [junit4] <<< JVM J1: EOF ----

[...truncated 582 lines...]
   [junit4] JVM J0: stderr was not empty, see: C:\Users\jenkins\workspace\Lucene-Solr-8.1-Windows\solr\build\contrib\solr-langid\test\temp\junit4-J0-20190513_210611_24614579844601681219706.syserr
   [junit4] >>> JVM J0 emitted unexpected output (verbatim) ----
   [junit4] OpenJDK 64-Bit Server VM warning: Option UseConcMarkSweepGC was deprecated in version 9.0 and will likely be removed in a future release.
   [junit4] <<< JVM J0: EOF ----

[...truncated 3 lines...]
   [junit4] JVM J1: stderr was not empty, see: C:\Users\jenkins\workspace\Lucene-Solr-8.1-Windows\solr\build\contrib\solr-langid\test\temp\junit4-J1-20190513_210611_246814537104143344281.syserr
   [junit4] >>> JVM J1 emitted unexpected output (verbatim) ----
   [junit4] OpenJDK 64-Bit Server VM warning: Option UseConcMarkSweepGC was deprecated in version 9.0 and will likely be removed in a future release.
   [junit4] <<< JVM J1: EOF ----

[...truncated 687 lines...]
   [junit4] JVM J1: stderr was not empty, see: C:\Users\jenkins\workspace\Lucene-Solr-8.1-Windows\solr\build\contrib\solr-ltr\test\temp\junit4-J1-20190513_210640_1417584521864567683833.syserr
   [junit4] >>> JVM J1 emitted unexpected output (verbatim) ----
   [junit4] OpenJDK 64-Bit Server VM warning: Option UseConcMarkSweepGC was deprecated in version 9.0 and will likely be removed in a future release.
   [junit4] <<< JVM J1: EOF ----

[...truncated 3 lines...]
   [junit4] JVM J0: stderr was not empty, see: C:\Users\jenkins\workspace\Lucene-Solr-8.1-Windows\solr\build\contrib\solr-ltr\test\temp\junit4-J0-20190513_210640_1412923817147454015722.syserr
   [junit4] >>> JVM J0 emitted unexpected output (verbatim) ----
   [junit4] OpenJDK 64-Bit Server VM warning: Option UseConcMarkSweepGC was deprecated in version 9.0 and will likely be removed in a future release.
   [junit4] <<< JVM J0: EOF ----

[...truncated 582 lines...]
   [junit4] JVM J1: stderr was not empty, see: C:\Users\jenkins\workspace\Lucene-Solr-8.1-Windows\solr\build\contrib\solr-prometheus-exporter\test\temp\junit4-J1-20190513_210807_1455949658618074010936.syserr
   [junit4] >>> JVM J1 emitted unexpected output (verbatim) ----
   [junit4] OpenJDK 64-Bit Server VM warning: Option UseConcMarkSweepGC was deprecated in version 9.0 and will likely be removed in a future release.
   [junit4] <<< JVM J1: EOF ----

[...truncated 3 lines...]
   [junit4] JVM J0: stderr was not empty, see: C:\Users\jenkins\workspace\Lucene-Solr-8.1-Windows\solr\build\contrib\solr-prometheus-exporter\test\temp\junit4-J0-20190513_210807_1454072121341556514092.syserr
   [junit4] >>> JVM J0 emitted unexpected output (verbatim) ----
   [junit4] OpenJDK 64-Bit Server VM warning: Option UseConcMarkSweepGC was deprecated in version 9.0 and will likely be removed in a future release.
   [junit4] <<< JVM J0: EOF ----

[...truncated 568 lines...]
   [junit4] JVM J0: stderr was not empty, see: C:\Users\jenkins\workspace\Lucene-Solr-8.1-Windows\solr\build\contrib\solr-velocity\test\temp\junit4-J0-20190513_210853_43615737424035444723227.syserr
   [junit4] >>> JVM J0 emitted unexpected output (verbatim) ----
   [junit4] OpenJDK 64-Bit Server VM warning: Option UseConcMarkSweepGC was deprecated in version 9.0 and will likely be removed in a future release.
   [junit4] <<< JVM J0: EOF ----

[...truncated 34164 lines...]
[repro] Jenkins log URL: https://jenkins.thetaphi.de/job/Lucene-Solr-8.1-Windows/105/consoleText

[repro] Revision: 47c4e4184a5482894753fb4f7aa5126cf9f035c8

[repro] Ant options: "-Dargs=-XX:-UseCompressedOops -XX:+UseConcMarkSweepGC"

[repro] ant clean

[...truncated 6 lines...]
[repro] Test suites by module:
[repro]    solr\core
[repro]       TestSimComputePlanAction
[repro] ant compile-test

[...truncated 3603 lines...]
[repro] ant test-nocompile -Dtests.dups=5 -Dtests.maxfailures=5 -Dtests.class="*.TestSimComputePlanAction" -Dtests.showOutput=onerror "-Dargs=-XX:-UseCompressedOops -XX:+UseConcMarkSweepGC" -Dtests.seed=25238CE346EF10A4 -Dtests.slow=true -Dtests.locale=yue-Hant -Dtests.timezone=Etc/GMT+12 -Dtests.asserts=true -Dtests.file.encoding=UTF-8

[...truncated 60 lines...]
   [junit4] JVM J1: stderr was not empty, see: C:\Users\jenkins\workspace\Lucene-Solr-8.1-Windows\solr\build\solr-core\test\temp\junit4-J1-20190513_211558_28113043350948579310125.syserr
   [junit4] >>> JVM J1 emitted unexpected output (verbatim) ----
   [junit4] OpenJDK 64-Bit Server VM warning: Option UseConcMarkSweepGC was deprecated in version 9.0 and will likely be removed in a future release.
   [junit4] <<< JVM J1: EOF ----

[...truncated 7 lines...]
   [junit4] JVM J0: stderr was not empty, see: C:\Users\jenkins\workspace\Lucene-Solr-8.1-Windows\solr\build\solr-core\test\temp\junit4-J0-20190513_211558_27616354238130307364163.syserr
   [junit4] >>> JVM J0 emitted unexpected output (verbatim) ----
   [junit4] OpenJDK 64-Bit Server VM warning: Option UseConcMarkSweepGC was deprecated in version 9.0 and will likely be removed in a future release.
   [junit4] <<< JVM J0: EOF ----

[...truncated 21 lines...]
[repro] Failures:
[repro]   0/5 failed: org.apache.solr.cloud.autoscaling.sim.TestSimComputePlanAction
[repro] Exiting with code 0

[...truncated 78 lines...]

Mime
View raw message