lucene-dev mailing list archives

Site index · List index
Message view « Date » · « Thread »
Top « Date » · « Thread »
From Policeman Jenkins Server <jenk...@thetaphi.de>
Subject [JENKINS] Lucene-Solr-8.x-MacOSX (64bit/jdk-9) - Build # 121 - Still Unstable!
Date Wed, 08 May 2019 22:23:07 GMT
Build: https://jenkins.thetaphi.de/job/Lucene-Solr-8.x-MacOSX/121/
Java: 64bit/jdk-9 -XX:-UseCompressedOops -XX:+UseConcMarkSweepGC

1 tests failed.
FAILED:  org.apache.solr.prometheus.exporter.SolrExporterIntegrationTest.jvmMetrics

Error Message:
expected:<36> but was:<48>

Stack Trace:
java.lang.AssertionError: expected:<36> but was:<48>
	at __randomizedtesting.SeedInfo.seed([3FEAC88952914342:EC5EF566477F8FD6]:0)
	at org.junit.Assert.fail(Assert.java:88)
	at org.junit.Assert.failNotEquals(Assert.java:834)
	at org.junit.Assert.assertEquals(Assert.java:645)
	at org.junit.Assert.assertEquals(Assert.java:631)
	at org.apache.solr.prometheus.exporter.SolrExporterIntegrationTest.jvmMetrics(SolrExporterIntegrationTest.java:71)
	at java.base/jdk.internal.reflect.NativeMethodAccessorImpl.invoke0(Native Method)
	at java.base/jdk.internal.reflect.NativeMethodAccessorImpl.invoke(NativeMethodAccessorImpl.java:62)
	at java.base/jdk.internal.reflect.DelegatingMethodAccessorImpl.invoke(DelegatingMethodAccessorImpl.java:43)
	at java.base/java.lang.reflect.Method.invoke(Method.java:564)
	at com.carrotsearch.randomizedtesting.RandomizedRunner.invoke(RandomizedRunner.java:1750)
	at com.carrotsearch.randomizedtesting.RandomizedRunner$8.evaluate(RandomizedRunner.java:938)
	at com.carrotsearch.randomizedtesting.RandomizedRunner$9.evaluate(RandomizedRunner.java:974)
	at com.carrotsearch.randomizedtesting.RandomizedRunner$10.evaluate(RandomizedRunner.java:988)
	at com.carrotsearch.randomizedtesting.rules.SystemPropertiesRestoreRule$1.evaluate(SystemPropertiesRestoreRule.java:57)
	at org.apache.lucene.util.TestRuleSetupTeardownChained$1.evaluate(TestRuleSetupTeardownChained.java:49)
	at org.apache.lucene.util.AbstractBeforeAfterRule$1.evaluate(AbstractBeforeAfterRule.java:45)
	at org.apache.lucene.util.TestRuleThreadAndTestName$1.evaluate(TestRuleThreadAndTestName.java:48)
	at org.apache.lucene.util.TestRuleIgnoreAfterMaxFailures$1.evaluate(TestRuleIgnoreAfterMaxFailures.java:64)
	at org.apache.lucene.util.TestRuleMarkFailure$1.evaluate(TestRuleMarkFailure.java:47)
	at com.carrotsearch.randomizedtesting.rules.StatementAdapter.evaluate(StatementAdapter.java:36)
	at com.carrotsearch.randomizedtesting.ThreadLeakControl$StatementRunner.run(ThreadLeakControl.java:368)
	at com.carrotsearch.randomizedtesting.ThreadLeakControl.forkTimeoutingTask(ThreadLeakControl.java:817)
	at com.carrotsearch.randomizedtesting.ThreadLeakControl$3.evaluate(ThreadLeakControl.java:468)
	at com.carrotsearch.randomizedtesting.RandomizedRunner.runSingleTest(RandomizedRunner.java:947)
	at com.carrotsearch.randomizedtesting.RandomizedRunner$5.evaluate(RandomizedRunner.java:832)
	at com.carrotsearch.randomizedtesting.RandomizedRunner$6.evaluate(RandomizedRunner.java:883)
	at com.carrotsearch.randomizedtesting.RandomizedRunner$7.evaluate(RandomizedRunner.java:894)
	at com.carrotsearch.randomizedtesting.rules.StatementAdapter.evaluate(StatementAdapter.java:36)
	at com.carrotsearch.randomizedtesting.rules.SystemPropertiesRestoreRule$1.evaluate(SystemPropertiesRestoreRule.java:57)
	at org.apache.lucene.util.AbstractBeforeAfterRule$1.evaluate(AbstractBeforeAfterRule.java:45)
	at com.carrotsearch.randomizedtesting.rules.StatementAdapter.evaluate(StatementAdapter.java:36)
	at org.apache.lucene.util.TestRuleStoreClassName$1.evaluate(TestRuleStoreClassName.java:41)
	at com.carrotsearch.randomizedtesting.rules.NoShadowingOrOverridesOnMethodsRule$1.evaluate(NoShadowingOrOverridesOnMethodsRule.java:40)
	at com.carrotsearch.randomizedtesting.rules.NoShadowingOrOverridesOnMethodsRule$1.evaluate(NoShadowingOrOverridesOnMethodsRule.java:40)
	at com.carrotsearch.randomizedtesting.rules.StatementAdapter.evaluate(StatementAdapter.java:36)
	at com.carrotsearch.randomizedtesting.rules.StatementAdapter.evaluate(StatementAdapter.java:36)
	at org.apache.lucene.util.TestRuleAssertionsRequired$1.evaluate(TestRuleAssertionsRequired.java:53)
	at org.apache.lucene.util.TestRuleMarkFailure$1.evaluate(TestRuleMarkFailure.java:47)
	at org.apache.lucene.util.TestRuleIgnoreAfterMaxFailures$1.evaluate(TestRuleIgnoreAfterMaxFailures.java:64)
	at org.apache.lucene.util.TestRuleIgnoreTestSuites$1.evaluate(TestRuleIgnoreTestSuites.java:54)
	at com.carrotsearch.randomizedtesting.rules.StatementAdapter.evaluate(StatementAdapter.java:36)
	at com.carrotsearch.randomizedtesting.ThreadLeakControl$StatementRunner.run(ThreadLeakControl.java:368)
	at java.base/java.lang.Thread.run(Thread.java:844)




Build Log:
[...truncated 2085 lines...]
   [junit4] JVM J0: stderr was not empty, see: /Users/jenkins/workspace/Lucene-Solr-8.x-MacOSX/lucene/build/core/test/temp/junit4-J0-20190508_203301_3468493664691508657717.syserr
   [junit4] >>> JVM J0 emitted unexpected output (verbatim) ----
   [junit4] Java HotSpot(TM) 64-Bit Server VM warning: Option UseConcMarkSweepGC was deprecated in version 9.0 and will likely be removed in a future release.
   [junit4] <<< JVM J0: EOF ----

[...truncated 5 lines...]
   [junit4] JVM J1: stderr was not empty, see: /Users/jenkins/workspace/Lucene-Solr-8.x-MacOSX/lucene/build/core/test/temp/junit4-J1-20190508_203301_34616612054599737298679.syserr
   [junit4] >>> JVM J1 emitted unexpected output (verbatim) ----
   [junit4] Java HotSpot(TM) 64-Bit Server VM warning: Option UseConcMarkSweepGC was deprecated in version 9.0 and will likely be removed in a future release.
   [junit4] <<< JVM J1: EOF ----

[...truncated 296 lines...]
   [junit4] JVM J1: stderr was not empty, see: /Users/jenkins/workspace/Lucene-Solr-8.x-MacOSX/lucene/build/test-framework/test/temp/junit4-J1-20190508_204640_66110241650416059299418.syserr
   [junit4] >>> JVM J1 emitted unexpected output (verbatim) ----
   [junit4] Java HotSpot(TM) 64-Bit Server VM warning: Option UseConcMarkSweepGC was deprecated in version 9.0 and will likely be removed in a future release.
   [junit4] <<< JVM J1: EOF ----

[...truncated 3 lines...]
   [junit4] JVM J0: stderr was not empty, see: /Users/jenkins/workspace/Lucene-Solr-8.x-MacOSX/lucene/build/test-framework/test/temp/junit4-J0-20190508_204640_6617948193514325711724.syserr
   [junit4] >>> JVM J0 emitted unexpected output (verbatim) ----
   [junit4] Java HotSpot(TM) 64-Bit Server VM warning: Option UseConcMarkSweepGC was deprecated in version 9.0 and will likely be removed in a future release.
   [junit4] <<< JVM J0: EOF ----

[...truncated 1083 lines...]
   [junit4] JVM J1: stderr was not empty, see: /Users/jenkins/workspace/Lucene-Solr-8.x-MacOSX/lucene/build/analysis/common/test/temp/junit4-J1-20190508_204856_55914853912580460809409.syserr
   [junit4] >>> JVM J1 emitted unexpected output (verbatim) ----
   [junit4] Java HotSpot(TM) 64-Bit Server VM warning: Option UseConcMarkSweepGC was deprecated in version 9.0 and will likely be removed in a future release.
   [junit4] <<< JVM J1: EOF ----

   [junit4] JVM J0: stderr was not empty, see: /Users/jenkins/workspace/Lucene-Solr-8.x-MacOSX/lucene/build/analysis/common/test/temp/junit4-J0-20190508_204856_55916809859658555690038.syserr
   [junit4] >>> JVM J0 emitted unexpected output (verbatim) ----
   [junit4] Java HotSpot(TM) 64-Bit Server VM warning: Option UseConcMarkSweepGC was deprecated in version 9.0 and will likely be removed in a future release.
   [junit4] <<< JVM J0: EOF ----

[...truncated 259 lines...]
   [junit4] JVM J0: stderr was not empty, see: /Users/jenkins/workspace/Lucene-Solr-8.x-MacOSX/lucene/build/analysis/icu/test/temp/junit4-J0-20190508_205156_02318254765670274354954.syserr
   [junit4] >>> JVM J0 emitted unexpected output (verbatim) ----
   [junit4] Java HotSpot(TM) 64-Bit Server VM warning: Option UseConcMarkSweepGC was deprecated in version 9.0 and will likely be removed in a future release.
   [junit4] <<< JVM J0: EOF ----

   [junit4] JVM J1: stderr was not empty, see: /Users/jenkins/workspace/Lucene-Solr-8.x-MacOSX/lucene/build/analysis/icu/test/temp/junit4-J1-20190508_205156_02316797598234665516815.syserr
   [junit4] >>> JVM J1 emitted unexpected output (verbatim) ----
   [junit4] Java HotSpot(TM) 64-Bit Server VM warning: Option UseConcMarkSweepGC was deprecated in version 9.0 and will likely be removed in a future release.
   [junit4] <<< JVM J1: EOF ----

[...truncated 253 lines...]
   [junit4] JVM J1: stderr was not empty, see: /Users/jenkins/workspace/Lucene-Solr-8.x-MacOSX/lucene/build/analysis/kuromoji/test/temp/junit4-J1-20190508_205211_1652004295481606840519.syserr
   [junit4] >>> JVM J1 emitted unexpected output (verbatim) ----
   [junit4] Java HotSpot(TM) 64-Bit Server VM warning: Option UseConcMarkSweepGC was deprecated in version 9.0 and will likely be removed in a future release.
   [junit4] <<< JVM J1: EOF ----

[...truncated 3 lines...]
   [junit4] JVM J0: stderr was not empty, see: /Users/jenkins/workspace/Lucene-Solr-8.x-MacOSX/lucene/build/analysis/kuromoji/test/temp/junit4-J0-20190508_205211_16512614939926836569593.syserr
   [junit4] >>> JVM J0 emitted unexpected output (verbatim) ----
   [junit4] Java HotSpot(TM) 64-Bit Server VM warning: Option UseConcMarkSweepGC was deprecated in version 9.0 and will likely be removed in a future release.
   [junit4] <<< JVM J0: EOF ----

[...truncated 162 lines...]
   [junit4] JVM J0: stderr was not empty, see: /Users/jenkins/workspace/Lucene-Solr-8.x-MacOSX/lucene/build/analysis/morfologik/test/temp/junit4-J0-20190508_205249_11711145147505743500253.syserr
   [junit4] >>> JVM J0 emitted unexpected output (verbatim) ----
   [junit4] Java HotSpot(TM) 64-Bit Server VM warning: Option UseConcMarkSweepGC was deprecated in version 9.0 and will likely be removed in a future release.
   [junit4] <<< JVM J0: EOF ----

[...truncated 3 lines...]
   [junit4] JVM J1: stderr was not empty, see: /Users/jenkins/workspace/Lucene-Solr-8.x-MacOSX/lucene/build/analysis/morfologik/test/temp/junit4-J1-20190508_205249_1171436003242986221506.syserr
   [junit4] >>> JVM J1 emitted unexpected output (verbatim) ----
   [junit4] Java HotSpot(TM) 64-Bit Server VM warning: Option UseConcMarkSweepGC was deprecated in version 9.0 and will likely be removed in a future release.
   [junit4] <<< JVM J1: EOF ----

[...truncated 207 lines...]
   [junit4] JVM J1: stderr was not empty, see: /Users/jenkins/workspace/Lucene-Solr-8.x-MacOSX/lucene/build/analysis/nori/test/temp/junit4-J1-20190508_205255_6769607527700784336411.syserr
   [junit4] >>> JVM J1 emitted unexpected output (verbatim) ----
   [junit4] Java HotSpot(TM) 64-Bit Server VM warning: Option UseConcMarkSweepGC was deprecated in version 9.0 and will likely be removed in a future release.
   [junit4] <<< JVM J1: EOF ----

[...truncated 3 lines...]
   [junit4] JVM J0: stderr was not empty, see: /Users/jenkins/workspace/Lucene-Solr-8.x-MacOSX/lucene/build/analysis/nori/test/temp/junit4-J0-20190508_205255_6767290211292998026635.syserr
   [junit4] >>> JVM J0 emitted unexpected output (verbatim) ----
   [junit4] Java HotSpot(TM) 64-Bit Server VM warning: Option UseConcMarkSweepGC was deprecated in version 9.0 and will likely be removed in a future release.
   [junit4] <<< JVM J0: EOF ----

[...truncated 171 lines...]
   [junit4] JVM J1: stderr was not empty, see: /Users/jenkins/workspace/Lucene-Solr-8.x-MacOSX/lucene/build/analysis/opennlp/test/temp/junit4-J1-20190508_205305_7514008300147917054039.syserr
   [junit4] >>> JVM J1 emitted unexpected output (verbatim) ----
   [junit4] Java HotSpot(TM) 64-Bit Server VM warning: Option UseConcMarkSweepGC was deprecated in version 9.0 and will likely be removed in a future release.
   [junit4] <<< JVM J1: EOF ----

   [junit4] JVM J0: stderr was not empty, see: /Users/jenkins/workspace/Lucene-Solr-8.x-MacOSX/lucene/build/analysis/opennlp/test/temp/junit4-J0-20190508_205305_7516840756923260327493.syserr
   [junit4] >>> JVM J0 emitted unexpected output (verbatim) ----
   [junit4] Java HotSpot(TM) 64-Bit Server VM warning: Option UseConcMarkSweepGC was deprecated in version 9.0 and will likely be removed in a future release.
   [junit4] <<< JVM J0: EOF ----

[...truncated 179 lines...]
   [junit4] JVM J1: stderr was not empty, see: /Users/jenkins/workspace/Lucene-Solr-8.x-MacOSX/lucene/build/analysis/phonetic/test/temp/junit4-J1-20190508_205310_95515047276358162766602.syserr
   [junit4] >>> JVM J1 emitted unexpected output (verbatim) ----
   [junit4] Java HotSpot(TM) 64-Bit Server VM warning: Option UseConcMarkSweepGC was deprecated in version 9.0 and will likely be removed in a future release.
   [junit4] <<< JVM J1: EOF ----

   [junit4] JVM J0: stderr was not empty, see: /Users/jenkins/workspace/Lucene-Solr-8.x-MacOSX/lucene/build/analysis/phonetic/test/temp/junit4-J0-20190508_205310_9559393696194148055747.syserr
   [junit4] >>> JVM J0 emitted unexpected output (verbatim) ----
   [junit4] Java HotSpot(TM) 64-Bit Server VM warning: Option UseConcMarkSweepGC was deprecated in version 9.0 and will likely be removed in a future release.
   [junit4] <<< JVM J0: EOF ----

[...truncated 159 lines...]
   [junit4] JVM J0: stderr was not empty, see: /Users/jenkins/workspace/Lucene-Solr-8.x-MacOSX/lucene/build/analysis/smartcn/test/temp/junit4-J0-20190508_205320_87312606571814218505738.syserr
   [junit4] >>> JVM J0 emitted unexpected output (verbatim) ----
   [junit4] Java HotSpot(TM) 64-Bit Server VM warning: Option UseConcMarkSweepGC was deprecated in version 9.0 and will likely be removed in a future release.
   [junit4] <<< JVM J0: EOF ----

[...truncated 3 lines...]
   [junit4] JVM J1: stderr was not empty, see: /Users/jenkins/workspace/Lucene-Solr-8.x-MacOSX/lucene/build/analysis/smartcn/test/temp/junit4-J1-20190508_205320_8736800369596368937391.syserr
   [junit4] >>> JVM J1 emitted unexpected output (verbatim) ----
   [junit4] Java HotSpot(TM) 64-Bit Server VM warning: Option UseConcMarkSweepGC was deprecated in version 9.0 and will likely be removed in a future release.
   [junit4] <<< JVM J1: EOF ----

[...truncated 164 lines...]
   [junit4] JVM J0: stderr was not empty, see: /Users/jenkins/workspace/Lucene-Solr-8.x-MacOSX/lucene/build/analysis/stempel/test/temp/junit4-J0-20190508_205330_63816464694076714622677.syserr
   [junit4] >>> JVM J0 emitted unexpected output (verbatim) ----
   [junit4] Java HotSpot(TM) 64-Bit Server VM warning: Option UseConcMarkSweepGC was deprecated in version 9.0 and will likely be removed in a future release.
   [junit4] <<< JVM J0: EOF ----

[...truncated 3 lines...]
   [junit4] JVM J1: stderr was not empty, see: /Users/jenkins/workspace/Lucene-Solr-8.x-MacOSX/lucene/build/analysis/stempel/test/temp/junit4-J1-20190508_205330_63913038660389162423172.syserr
   [junit4] >>> JVM J1 emitted unexpected output (verbatim) ----
   [junit4] Java HotSpot(TM) 64-Bit Server VM warning: Option UseConcMarkSweepGC was deprecated in version 9.0 and will likely be removed in a future release.
   [junit4] <<< JVM J1: EOF ----

[...truncated 174 lines...]
   [junit4] JVM J0: stderr was not empty, see: /Users/jenkins/workspace/Lucene-Solr-8.x-MacOSX/lucene/build/backward-codecs/test/temp/junit4-J0-20190508_205337_4521180228708062386915.syserr
   [junit4] >>> JVM J0 emitted unexpected output (verbatim) ----
   [junit4] Java HotSpot(TM) 64-Bit Server VM warning: Option UseConcMarkSweepGC was deprecated in version 9.0 and will likely be removed in a future release.
   [junit4] <<< JVM J0: EOF ----

[...truncated 28 lines...]
   [junit4] JVM J1: stderr was not empty, see: /Users/jenkins/workspace/Lucene-Solr-8.x-MacOSX/lucene/build/backward-codecs/test/temp/junit4-J1-20190508_205337_452246499572819877711.syserr
   [junit4] >>> JVM J1 emitted unexpected output (verbatim) ----
   [junit4] Java HotSpot(TM) 64-Bit Server VM warning: Option UseConcMarkSweepGC was deprecated in version 9.0 and will likely be removed in a future release.
   [junit4] <<< JVM J1: EOF ----

[...truncated 1556 lines...]
   [junit4] JVM J1: stderr was not empty, see: /Users/jenkins/workspace/Lucene-Solr-8.x-MacOSX/lucene/build/benchmark/test/temp/junit4-J1-20190508_205704_66113154210790203350075.syserr
   [junit4] >>> JVM J1 emitted unexpected output (verbatim) ----
   [junit4] Java HotSpot(TM) 64-Bit Server VM warning: Option UseConcMarkSweepGC was deprecated in version 9.0 and will likely be removed in a future release.
   [junit4] <<< JVM J1: EOF ----

[...truncated 3 lines...]
   [junit4] JVM J0: stderr was not empty, see: /Users/jenkins/workspace/Lucene-Solr-8.x-MacOSX/lucene/build/benchmark/test/temp/junit4-J0-20190508_205704_6616783391836788306896.syserr
   [junit4] >>> JVM J0 emitted unexpected output (verbatim) ----
   [junit4] Java HotSpot(TM) 64-Bit Server VM warning: Option UseConcMarkSweepGC was deprecated in version 9.0 and will likely be removed in a future release.
   [junit4] <<< JVM J0: EOF ----

[...truncated 251 lines...]
   [junit4] JVM J0: stderr was not empty, see: /Users/jenkins/workspace/Lucene-Solr-8.x-MacOSX/lucene/build/classification/test/temp/junit4-J0-20190508_205719_9397462018420768505303.syserr
   [junit4] >>> JVM J0 emitted unexpected output (verbatim) ----
   [junit4] Java HotSpot(TM) 64-Bit Server VM warning: Option UseConcMarkSweepGC was deprecated in version 9.0 and will likely be removed in a future release.
   [junit4] <<< JVM J0: EOF ----

[...truncated 3 lines...]
   [junit4] JVM J1: stderr was not empty, see: /Users/jenkins/workspace/Lucene-Solr-8.x-MacOSX/lucene/build/classification/test/temp/junit4-J1-20190508_205719_939403503013189282044.syserr
   [junit4] >>> JVM J1 emitted unexpected output (verbatim) ----
   [junit4] Java HotSpot(TM) 64-Bit Server VM warning: Option UseConcMarkSweepGC was deprecated in version 9.0 and will likely be removed in a future release.
   [junit4] <<< JVM J1: EOF ----

[...truncated 261 lines...]
   [junit4] JVM J0: stderr was not empty, see: /Users/jenkins/workspace/Lucene-Solr-8.x-MacOSX/lucene/build/codecs/test/temp/junit4-J0-20190508_205740_38313072858923857321238.syserr
   [junit4] >>> JVM J0 emitted unexpected output (verbatim) ----
   [junit4] Java HotSpot(TM) 64-Bit Server VM warning: Option UseConcMarkSweepGC was deprecated in version 9.0 and will likely be removed in a future release.
   [junit4] <<< JVM J0: EOF ----

[...truncated 3 lines...]
   [junit4] JVM J1: stderr was not empty, see: /Users/jenkins/workspace/Lucene-Solr-8.x-MacOSX/lucene/build/codecs/test/temp/junit4-J1-20190508_205740_3849657021634015323157.syserr
   [junit4] >>> JVM J1 emitted unexpected output (verbatim) ----
   [junit4] Java HotSpot(TM) 64-Bit Server VM warning: Option UseConcMarkSweepGC was deprecated in version 9.0 and will likely be removed in a future release.
   [junit4] <<< JVM J1: EOF ----

[...truncated 231 lines...]
   [junit4] JVM J0: stderr was not empty, see: /Users/jenkins/workspace/Lucene-Solr-8.x-MacOSX/lucene/build/demo/test/temp/junit4-J0-20190508_210010_52117075723798714377079.syserr
   [junit4] >>> JVM J0 emitted unexpected output (verbatim) ----
   [junit4] Java HotSpot(TM) 64-Bit Server VM warning: Option UseConcMarkSweepGC was deprecated in version 9.0 and will likely be removed in a future release.
   [junit4] <<< JVM J0: EOF ----

[...truncated 3 lines...]
   [junit4] JVM J1: stderr was not empty, see: /Users/jenkins/workspace/Lucene-Solr-8.x-MacOSX/lucene/build/demo/test/temp/junit4-J1-20190508_210010_5215107861662993038248.syserr
   [junit4] >>> JVM J1 emitted unexpected output (verbatim) ----
   [junit4] Java HotSpot(TM) 64-Bit Server VM warning: Option UseConcMarkSweepGC was deprecated in version 9.0 and will likely be removed in a future release.
   [junit4] <<< JVM J1: EOF ----

[...truncated 173 lines...]
   [junit4] JVM J1: stderr was not empty, see: /Users/jenkins/workspace/Lucene-Solr-8.x-MacOSX/lucene/build/expressions/test/temp/junit4-J1-20190508_210017_238687817209069124954.syserr
   [junit4] >>> JVM J1 emitted unexpected output (verbatim) ----
   [junit4] Java HotSpot(TM) 64-Bit Server VM warning: Option UseConcMarkSweepGC was deprecated in version 9.0 and will likely be removed in a future release.
   [junit4] <<< JVM J1: EOF ----

[...truncated 3 lines...]
   [junit4] JVM J0: stderr was not empty, see: /Users/jenkins/workspace/Lucene-Solr-8.x-MacOSX/lucene/build/expressions/test/temp/junit4-J0-20190508_210017_23415942794939729195620.syserr
   [junit4] >>> JVM J0 emitted unexpected output (verbatim) ----
   [junit4] Java HotSpot(TM) 64-Bit Server VM warning: Option UseConcMarkSweepGC was deprecated in version 9.0 and will likely be removed in a future release.
   [junit4] <<< JVM J0: EOF ----

[...truncated 234 lines...]
   [junit4] JVM J1: stderr was not empty, see: /Users/jenkins/workspace/Lucene-Solr-8.x-MacOSX/lucene/build/facet/test/temp/junit4-J1-20190508_210027_38517331523567317735001.syserr
   [junit4] >>> JVM J1 emitted unexpected output (verbatim) ----
   [junit4] Java HotSpot(TM) 64-Bit Server VM warning: Option UseConcMarkSweepGC was deprecated in version 9.0 and will likely be removed in a future release.
   [junit4] <<< JVM J1: EOF ----

[...truncated 3 lines...]
   [junit4] JVM J0: stderr was not empty, see: /Users/jenkins/workspace/Lucene-Solr-8.x-MacOSX/lucene/build/facet/test/temp/junit4-J0-20190508_210027_38412206205589283111264.syserr
   [junit4] >>> JVM J0 emitted unexpected output (verbatim) ----
   [junit4] Java HotSpot(TM) 64-Bit Server VM warning: Option UseConcMarkSweepGC was deprecated in version 9.0 and will likely be removed in a future release.
   [junit4] <<< JVM J0: EOF ----

[...truncated 182 lines...]
   [junit4] JVM J0: stderr was not empty, see: /Users/jenkins/workspace/Lucene-Solr-8.x-MacOSX/lucene/build/grouping/test/temp/junit4-J0-20190508_210103_4336472844146015257051.syserr
   [junit4] >>> JVM J0 emitted unexpected output (verbatim) ----
   [junit4] Java HotSpot(TM) 64-Bit Server VM warning: Option UseConcMarkSweepGC was deprecated in version 9.0 and will likely be removed in a future release.
   [junit4] <<< JVM J0: EOF ----

[...truncated 3 lines...]
   [junit4] JVM J1: stderr was not empty, see: /Users/jenkins/workspace/Lucene-Solr-8.x-MacOSX/lucene/build/grouping/test/temp/junit4-J1-20190508_210103_43314894008456100434499.syserr
   [junit4] >>> JVM J1 emitted unexpected output (verbatim) ----
   [junit4] Java HotSpot(TM) 64-Bit Server VM warning: Option UseConcMarkSweepGC was deprecated in version 9.0 and will likely be removed in a future release.
   [junit4] <<< JVM J1: EOF ----

[...truncated 255 lines...]
   [junit4] JVM J0: stderr was not empty, see: /Users/jenkins/workspace/Lucene-Solr-8.x-MacOSX/lucene/build/highlighter/test/temp/junit4-J0-20190508_210113_2898871828173001098351.syserr
   [junit4] >>> JVM J0 emitted unexpected output (verbatim) ----
   [junit4] Java HotSpot(TM) 64-Bit Server VM warning: Option UseConcMarkSweepGC was deprecated in version 9.0 and will likely be removed in a future release.
   [junit4] <<< JVM J0: EOF ----

[...truncated 3 lines...]
   [junit4] JVM J1: stderr was not empty, see: /Users/jenkins/workspace/Lucene-Solr-8.x-MacOSX/lucene/build/highlighter/test/temp/junit4-J1-20190508_210113_28910701947403107047399.syserr
   [junit4] >>> JVM J1 emitted unexpected output (verbatim) ----
   [junit4] Java HotSpot(TM) 64-Bit Server VM warning: Option UseConcMarkSweepGC was deprecated in version 9.0 and will likely be removed in a future release.
   [junit4] <<< JVM J1: EOF ----

[...truncated 169 lines...]
   [junit4] JVM J0: stderr was not empty, see: /Users/jenkins/workspace/Lucene-Solr-8.x-MacOSX/lucene/build/join/test/temp/junit4-J0-20190508_210139_9269938541021134262463.syserr
   [junit4] >>> JVM J0 emitted unexpected output (verbatim) ----
   [junit4] Java HotSpot(TM) 64-Bit Server VM warning: Option UseConcMarkSweepGC was deprecated in version 9.0 and will likely be removed in a future release.
   [junit4] <<< JVM J0: EOF ----

[...truncated 3 lines...]
   [junit4] JVM J1: stderr was not empty, see: /Users/jenkins/workspace/Lucene-Solr-8.x-MacOSX/lucene/build/join/test/temp/junit4-J1-20190508_210139_9268383639215517417998.syserr
   [junit4] >>> JVM J1 emitted unexpected output (verbatim) ----
   [junit4] Java HotSpot(TM) 64-Bit Server VM warning: Option UseConcMarkSweepGC was deprecated in version 9.0 and will likely be removed in a future release.
   [junit4] <<< JVM J1: EOF ----

[...truncated 302 lines...]
   [junit4] JVM J1: stderr was not empty, see: /Users/jenkins/workspace/Lucene-Solr-8.x-MacOSX/lucene/build/luke/test/temp/junit4-J1-20190508_210202_8781364024666608287533.syserr
   [junit4] >>> JVM J1 emitted unexpected output (verbatim) ----
   [junit4] Java HotSpot(TM) 64-Bit Server VM warning: Option UseConcMarkSweepGC was deprecated in version 9.0 and will likely be removed in a future release.
   [junit4] <<< JVM J1: EOF ----

[...truncated 3 lines...]
   [junit4] JVM J0: stderr was not empty, see: /Users/jenkins/workspace/Lucene-Solr-8.x-MacOSX/lucene/build/luke/test/temp/junit4-J0-20190508_210202_8789631674423169853158.syserr
   [junit4] >>> JVM J0 emitted unexpected output (verbatim) ----
   [junit4] Java HotSpot(TM) 64-Bit Server VM warning: Option UseConcMarkSweepGC was deprecated in version 9.0 and will likely be removed in a future release.
   [junit4] <<< JVM J0: EOF ----

[...truncated 155 lines...]
   [junit4] JVM J0: stderr was not empty, see: /Users/jenkins/workspace/Lucene-Solr-8.x-MacOSX/lucene/build/memory/test/temp/junit4-J0-20190508_210220_3852132196526853845577.syserr
   [junit4] >>> JVM J0 emitted unexpected output (verbatim) ----
   [junit4] Java HotSpot(TM) 64-Bit Server VM warning: Option UseConcMarkSweepGC was deprecated in version 9.0 and will likely be removed in a future release.
   [junit4] <<< JVM J0: EOF ----

[...truncated 3 lines...]
   [junit4] JVM J1: stderr was not empty, see: /Users/jenkins/workspace/Lucene-Solr-8.x-MacOSX/lucene/build/memory/test/temp/junit4-J1-20190508_210220_3858621604768389973304.syserr
   [junit4] >>> JVM J1 emitted unexpected output (verbatim) ----
   [junit4] Java HotSpot(TM) 64-Bit Server VM warning: Option UseConcMarkSweepGC was deprecated in version 9.0 and will likely be removed in a future release.
   [junit4] <<< JVM J1: EOF ----

[...truncated 187 lines...]
   [junit4] JVM J1: stderr was not empty, see: /Users/jenkins/workspace/Lucene-Solr-8.x-MacOSX/lucene/build/misc/test/temp/junit4-J1-20190508_210231_28110891799763981063789.syserr
   [junit4] >>> JVM J1 emitted unexpected output (verbatim) ----
   [junit4] Java HotSpot(TM) 64-Bit Server VM warning: Option UseConcMarkSweepGC was deprecated in version 9.0 and will likely be removed in a future release.
   [junit4] <<< JVM J1: EOF ----

[...truncated 3 lines...]
   [junit4] JVM J0: stderr was not empty, see: /Users/jenkins/workspace/Lucene-Solr-8.x-MacOSX/lucene/build/misc/test/temp/junit4-J0-20190508_210231_2785451177338886303913.syserr
   [junit4] >>> JVM J0 emitted unexpected output (verbatim) ----
   [junit4] Java HotSpot(TM) 64-Bit Server VM warning: Option UseConcMarkSweepGC was deprecated in version 9.0 and will likely be removed in a future release.
   [junit4] <<< JVM J0: EOF ----

[...truncated 306 lines...]
   [junit4] JVM J0: stderr was not empty, see: /Users/jenkins/workspace/Lucene-Solr-8.x-MacOSX/lucene/build/queries/test/temp/junit4-J0-20190508_210259_4663477889584754714319.syserr
   [junit4] >>> JVM J0 emitted unexpected output (verbatim) ----
   [junit4] Java HotSpot(TM) 64-Bit Server VM warning: Option UseConcMarkSweepGC was deprecated in version 9.0 and will likely be removed in a future release.
   [junit4] <<< JVM J0: EOF ----

[...truncated 3 lines...]
   [junit4] JVM J1: stderr was not empty, see: /Users/jenkins/workspace/Lucene-Solr-8.x-MacOSX/lucene/build/queries/test/temp/junit4-J1-20190508_210259_4667175015026095723096.syserr
   [junit4] >>> JVM J1 emitted unexpected output (verbatim) ----
   [junit4] Java HotSpot(TM) 64-Bit Server VM warning: Option UseConcMarkSweepGC was deprecated in version 9.0 and will likely be removed in a future release.
   [junit4] <<< JVM J1: EOF ----

[...truncated 231 lines...]
   [junit4] JVM J0: stderr was not empty, see: /Users/jenkins/workspace/Lucene-Solr-8.x-MacOSX/lucene/build/queryparser/test/temp/junit4-J0-20190508_210315_2048585837302823755769.syserr
   [junit4] >>> JVM J0 emitted unexpected output (verbatim) ----
   [junit4] Java HotSpot(TM) 64-Bit Server VM warning: Option UseConcMarkSweepGC was deprecated in version 9.0 and will likely be removed in a future release.
   [junit4] <<< JVM J0: EOF ----

[...truncated 3 lines...]
   [junit4] JVM J1: stderr was not empty, see: /Users/jenkins/workspace/Lucene-Solr-8.x-MacOSX/lucene/build/queryparser/test/temp/junit4-J1-20190508_210315_20415783719552997569495.syserr
   [junit4] >>> JVM J1 emitted unexpected output (verbatim) ----
   [junit4] Java HotSpot(TM) 64-Bit Server VM warning: Option UseConcMarkSweepGC was deprecated in version 9.0 and will likely be removed in a future release.
   [junit4] <<< JVM J1: EOF ----

[...truncated 216 lines...]
   [junit4] JVM J1: stderr was not empty, see: /Users/jenkins/workspace/Lucene-Solr-8.x-MacOSX/lucene/build/replicator/test/temp/junit4-J1-20190508_210331_78711716004100481324063.syserr
   [junit4] >>> JVM J1 emitted unexpected output (verbatim) ----
   [junit4] Java HotSpot(TM) 64-Bit Server VM warning: Option UseConcMarkSweepGC was deprecated in version 9.0 and will likely be removed in a future release.
   [junit4] <<< JVM J1: EOF ----

[...truncated 3 lines...]
   [junit4] JVM J0: stderr was not empty, see: /Users/jenkins/workspace/Lucene-Solr-8.x-MacOSX/lucene/build/replicator/test/temp/junit4-J0-20190508_210331_78715514286273875225214.syserr
   [junit4] >>> JVM J0 emitted unexpected output (verbatim) ----
   [junit4] Java HotSpot(TM) 64-Bit Server VM warning: Option UseConcMarkSweepGC was deprecated in version 9.0 and will likely be removed in a future release.
   [junit4] <<< JVM J0: EOF ----

[...truncated 250 lines...]
   [junit4] JVM J0: stderr was not empty, see: /Users/jenkins/workspace/Lucene-Solr-8.x-MacOSX/lucene/build/sandbox/test/temp/junit4-J0-20190508_210351_6542395268150500864290.syserr
   [junit4] >>> JVM J0 emitted unexpected output (verbatim) ----
   [junit4] Java HotSpot(TM) 64-Bit Server VM warning: Option UseConcMarkSweepGC was deprecated in version 9.0 and will likely be removed in a future release.
   [junit4] <<< JVM J0: EOF ----

[...truncated 3 lines...]
   [junit4] JVM J1: stderr was not empty, see: /Users/jenkins/workspace/Lucene-Solr-8.x-MacOSX/lucene/build/sandbox/test/temp/junit4-J1-20190508_210351_65417734874825160994927.syserr
   [junit4] >>> JVM J1 emitted unexpected output (verbatim) ----
   [junit4] Java HotSpot(TM) 64-Bit Server VM warning: Option UseConcMarkSweepGC was deprecated in version 9.0 and will likely be removed in a future release.
   [junit4] <<< JVM J1: EOF ----

[...truncated 299 lines...]
   [junit4] JVM J1: stderr was not empty, see: /Users/jenkins/workspace/Lucene-Solr-8.x-MacOSX/lucene/build/spatial-extras/test/temp/junit4-J1-20190508_210437_88018280366291479330846.syserr
   [junit4] >>> JVM J1 emitted unexpected output (verbatim) ----
   [junit4] Java HotSpot(TM) 64-Bit Server VM warning: Option UseConcMarkSweepGC was deprecated in version 9.0 and will likely be removed in a future release.
   [junit4] <<< JVM J1: EOF ----

[...truncated 3 lines...]
   [junit4] JVM J0: stderr was not empty, see: /Users/jenkins/workspace/Lucene-Solr-8.x-MacOSX/lucene/build/spatial-extras/test/temp/junit4-J0-20190508_210437_8806203730963339717878.syserr
   [junit4] >>> JVM J0 emitted unexpected output (verbatim) ----
   [junit4] Java HotSpot(TM) 64-Bit Server VM warning: Option UseConcMarkSweepGC was deprecated in version 9.0 and will likely be removed in a future release.
   [junit4] <<< JVM J0: EOF ----

[...truncated 151 lines...]
   [junit4] JVM J0: stderr was not empty, see: /Users/jenkins/workspace/Lucene-Solr-8.x-MacOSX/lucene/build/spatial/test/temp/junit4-J0-20190508_210538_9534902353133569388540.syserr
   [junit4] >>> JVM J0 emitted unexpected output (verbatim) ----
   [junit4] Java HotSpot(TM) 64-Bit Server VM warning: Option UseConcMarkSweepGC was deprecated in version 9.0 and will likely be removed in a future release.
   [junit4] <<< JVM J0: EOF ----

[...truncated 186 lines...]
   [junit4] JVM J1: stderr was not empty, see: /Users/jenkins/workspace/Lucene-Solr-8.x-MacOSX/lucene/build/spatial3d/test/temp/junit4-J1-20190508_210541_9589230959784869761676.syserr
   [junit4] >>> JVM J1 emitted unexpected output (verbatim) ----
   [junit4] Java HotSpot(TM) 64-Bit Server VM warning: Option UseConcMarkSweepGC was deprecated in version 9.0 and will likely be removed in a future release.
   [junit4] <<< JVM J1: EOF ----

[...truncated 5 lines...]
   [junit4] JVM J0: stderr was not empty, see: /Users/jenkins/workspace/Lucene-Solr-8.x-MacOSX/lucene/build/spatial3d/test/temp/junit4-J0-20190508_210541_95410555882147949872535.syserr
   [junit4] >>> JVM J0 emitted unexpected output (verbatim) ----
   [junit4] Java HotSpot(TM) 64-Bit Server VM warning: Option UseConcMarkSweepGC was deprecated in version 9.0 and will likely be removed in a future release.
   [junit4] <<< JVM J0: EOF ----

[...truncated 243 lines...]
   [junit4] JVM J0: stderr was not empty, see: /Users/jenkins/workspace/Lucene-Solr-8.x-MacOSX/lucene/build/suggest/test/temp/junit4-J0-20190508_210606_2867197466782537793832.syserr
   [junit4] >>> JVM J0 emitted unexpected output (verbatim) ----
   [junit4] Java HotSpot(TM) 64-Bit Server VM warning: Option UseConcMarkSweepGC was deprecated in version 9.0 and will likely be removed in a future release.
   [junit4] <<< JVM J0: EOF ----

[...truncated 21 lines...]
   [junit4] JVM J1: stderr was not empty, see: /Users/jenkins/workspace/Lucene-Solr-8.x-MacOSX/lucene/build/suggest/test/temp/junit4-J1-20190508_210606_2869996077903782461244.syserr
   [junit4] >>> JVM J1 emitted unexpected output (verbatim) ----
   [junit4] Java HotSpot(TM) 64-Bit Server VM warning: Option UseConcMarkSweepGC was deprecated in version 9.0 and will likely be removed in a future release.
   [junit4] <<< JVM J1: EOF ----

[...truncated 4645 lines...]
   [junit4] JVM J1: stderr was not empty, see: /Users/jenkins/workspace/Lucene-Solr-8.x-MacOSX/solr/build/solr-core/test/temp/junit4-J1-20190508_210755_70117475358700129727544.syserr
   [junit4] >>> JVM J1 emitted unexpected output (verbatim) ----
   [junit4] Java HotSpot(TM) 64-Bit Server VM warning: Option UseConcMarkSweepGC was deprecated in version 9.0 and will likely be removed in a future release.
   [junit4] <<< JVM J1: EOF ----

   [junit4] JVM J0: stderr was not empty, see: /Users/jenkins/workspace/Lucene-Solr-8.x-MacOSX/solr/build/solr-core/test/temp/junit4-J0-20190508_210755_70116096753309012574282.syserr
   [junit4] >>> JVM J0 emitted unexpected output (verbatim) ----
   [junit4] Java HotSpot(TM) 64-Bit Server VM warning: Option UseConcMarkSweepGC was deprecated in version 9.0 and will likely be removed in a future release.
   [junit4] <<< JVM J0: EOF ----

[...truncated 1054 lines...]
   [junit4] JVM J1: stderr was not empty, see: /Users/jenkins/workspace/Lucene-Solr-8.x-MacOSX/solr/build/solr-solrj/test/temp/junit4-J1-20190508_220444_94613413624380119831180.syserr
   [junit4] >>> JVM J1 emitted unexpected output (verbatim) ----
   [junit4] Java HotSpot(TM) 64-Bit Server VM warning: Option UseConcMarkSweepGC was deprecated in version 9.0 and will likely be removed in a future release.
   [junit4] <<< JVM J1: EOF ----

[...truncated 3 lines...]
   [junit4] JVM J0: stderr was not empty, see: /Users/jenkins/workspace/Lucene-Solr-8.x-MacOSX/solr/build/solr-solrj/test/temp/junit4-J0-20190508_220444_94614991121283147475613.syserr
   [junit4] >>> JVM J0 emitted unexpected output (verbatim) ----
   [junit4] Java HotSpot(TM) 64-Bit Server VM warning: Option UseConcMarkSweepGC was deprecated in version 9.0 and will likely be removed in a future release.
   [junit4] <<< JVM J0: EOF ----

[...truncated 1512 lines...]
   [junit4] JVM J1: stderr was not empty, see: /Users/jenkins/workspace/Lucene-Solr-8.x-MacOSX/solr/build/contrib/solr-analysis-extras/test/temp/junit4-J1-20190508_221119_8232591842526253864544.syserr
   [junit4] >>> JVM J1 emitted unexpected output (verbatim) ----
   [junit4] Java HotSpot(TM) 64-Bit Server VM warning: Option UseConcMarkSweepGC was deprecated in version 9.0 and will likely be removed in a future release.
   [junit4] <<< JVM J1: EOF ----

[...truncated 3 lines...]
   [junit4] JVM J0: stderr was not empty, see: /Users/jenkins/workspace/Lucene-Solr-8.x-MacOSX/solr/build/contrib/solr-analysis-extras/test/temp/junit4-J0-20190508_221119_8234258289100595506864.syserr
   [junit4] >>> JVM J0 emitted unexpected output (verbatim) ----
   [junit4] Java HotSpot(TM) 64-Bit Server VM warning: Option UseConcMarkSweepGC was deprecated in version 9.0 and will likely be removed in a future release.
   [junit4] <<< JVM J0: EOF ----

[...truncated 800 lines...]
   [junit4] JVM J1: stderr was not empty, see: /Users/jenkins/workspace/Lucene-Solr-8.x-MacOSX/solr/build/contrib/solr-analytics/test/temp/junit4-J1-20190508_221138_59812375483777362895065.syserr
   [junit4] >>> JVM J1 emitted unexpected output (verbatim) ----
   [junit4] Java HotSpot(TM) 64-Bit Server VM warning: Option UseConcMarkSweepGC was deprecated in version 9.0 and will likely be removed in a future release.
   [junit4] <<< JVM J1: EOF ----

[...truncated 3 lines...]
   [junit4] JVM J0: stderr was not empty, see: /Users/jenkins/workspace/Lucene-Solr-8.x-MacOSX/solr/build/contrib/solr-analytics/test/temp/junit4-J0-20190508_221138_5987171375964395859993.syserr
   [junit4] >>> JVM J0 emitted unexpected output (verbatim) ----
   [junit4] Java HotSpot(TM) 64-Bit Server VM warning: Option UseConcMarkSweepGC was deprecated in version 9.0 and will likely be removed in a future release.
   [junit4] <<< JVM J0: EOF ----

[...truncated 571 lines...]
   [junit4] JVM J0: stderr was not empty, see: /Users/jenkins/workspace/Lucene-Solr-8.x-MacOSX/solr/build/contrib/solr-clustering/test/temp/junit4-J0-20190508_221343_0352603055254501279248.syserr
   [junit4] >>> JVM J0 emitted unexpected output (verbatim) ----
   [junit4] Java HotSpot(TM) 64-Bit Server VM warning: Option UseConcMarkSweepGC was deprecated in version 9.0 and will likely be removed in a future release.
   [junit4] <<< JVM J0: EOF ----

[...truncated 3 lines...]
   [junit4] JVM J1: stderr was not empty, see: /Users/jenkins/workspace/Lucene-Solr-8.x-MacOSX/solr/build/contrib/solr-clustering/test/temp/junit4-J1-20190508_221343_0352571360918128616470.syserr
   [junit4] >>> JVM J1 emitted unexpected output (verbatim) ----
   [junit4] Java HotSpot(TM) 64-Bit Server VM warning: Option UseConcMarkSweepGC was deprecated in version 9.0 and will likely be removed in a future release.
   [junit4] <<< JVM J1: EOF ----

[...truncated 1300 lines...]
   [junit4] JVM J0: stderr was not empty, see: /Users/jenkins/workspace/Lucene-Solr-8.x-MacOSX/solr/build/contrib/solr-dataimporthandler-extras/test/temp/junit4-J0-20190508_221411_8441244690637948589343.syserr
   [junit4] >>> JVM J0 emitted unexpected output (verbatim) ----
   [junit4] Java HotSpot(TM) 64-Bit Server VM warning: Option UseConcMarkSweepGC was deprecated in version 9.0 and will likely be removed in a future release.
   [junit4] <<< JVM J0: EOF ----

[...truncated 3 lines...]
   [junit4] JVM J1: stderr was not empty, see: /Users/jenkins/workspace/Lucene-Solr-8.x-MacOSX/solr/build/contrib/solr-dataimporthandler-extras/test/temp/junit4-J1-20190508_221411_84415726328810245283742.syserr
   [junit4] >>> JVM J1 emitted unexpected output (verbatim) ----
   [junit4] Java HotSpot(TM) 64-Bit Server VM warning: Option UseConcMarkSweepGC was deprecated in version 9.0 and will likely be removed in a future release.
   [junit4] <<< JVM J1: EOF ----

[...truncated 666 lines...]
   [junit4] JVM J1: stderr was not empty, see: /Users/jenkins/workspace/Lucene-Solr-8.x-MacOSX/solr/build/contrib/solr-dataimporthandler/test/temp/junit4-J1-20190508_221426_39113984154991229039011.syserr
   [junit4] >>> JVM J1 emitted unexpected output (verbatim) ----
   [junit4] Java HotSpot(TM) 64-Bit Server VM warning: Option UseConcMarkSweepGC was deprecated in version 9.0 and will likely be removed in a future release.
   [junit4] <<< JVM J1: EOF ----

[...truncated 3 lines...]
   [junit4] JVM J0: stderr was not empty, see: /Users/jenkins/workspace/Lucene-Solr-8.x-MacOSX/solr/build/contrib/solr-dataimporthandler/test/temp/junit4-J0-20190508_221426_3913169834653350615135.syserr
   [junit4] >>> JVM J0 emitted unexpected output (verbatim) ----
   [junit4] Java HotSpot(TM) 64-Bit Server VM warning: Option UseConcMarkSweepGC was deprecated in version 9.0 and will likely be removed in a future release.
   [junit4] <<< JVM J0: EOF ----

[...truncated 573 lines...]
   [junit4] JVM J1: stderr was not empty, see: /Users/jenkins/workspace/Lucene-Solr-8.x-MacOSX/solr/build/contrib/solr-cell/test/temp/junit4-J1-20190508_221502_7614508017288790224511.syserr
   [junit4] >>> JVM J1 emitted unexpected output (verbatim) ----
   [junit4] Java HotSpot(TM) 64-Bit Server VM warning: Option UseConcMarkSweepGC was deprecated in version 9.0 and will likely be removed in a future release.
   [junit4] <<< JVM J1: EOF ----

[...truncated 3 lines...]
   [junit4] JVM J0: stderr was not empty, see: /Users/jenkins/workspace/Lucene-Solr-8.x-MacOSX/solr/build/contrib/solr-cell/test/temp/junit4-J0-20190508_221502_7613827193148437750848.syserr
   [junit4] >>> JVM J0 emitted unexpected output (verbatim) ----
   [junit4] Java HotSpot(TM) 64-Bit Server VM warning: Option UseConcMarkSweepGC was deprecated in version 9.0 and will likely be removed in a future release.
   [junit4] <<< JVM J0: EOF ----

[...truncated 581 lines...]
   [junit4] JVM J0: stderr was not empty, see: /Users/jenkins/workspace/Lucene-Solr-8.x-MacOSX/solr/build/contrib/solr-langid/test/temp/junit4-J0-20190508_221523_2885760160031532537009.syserr
   [junit4] >>> JVM J0 emitted unexpected output (verbatim) ----
   [junit4] Java HotSpot(TM) 64-Bit Server VM warning: Option UseConcMarkSweepGC was deprecated in version 9.0 and will likely be removed in a future release.
   [junit4] <<< JVM J0: EOF ----

[...truncated 3 lines...]
   [junit4] JVM J1: stderr was not empty, see: /Users/jenkins/workspace/Lucene-Solr-8.x-MacOSX/solr/build/contrib/solr-langid/test/temp/junit4-J1-20190508_221523_2899623780910863210227.syserr
   [junit4] >>> JVM J1 emitted unexpected output (verbatim) ----
   [junit4] Java HotSpot(TM) 64-Bit Server VM warning: Option UseConcMarkSweepGC was deprecated in version 9.0 and will likely be removed in a future release.
   [junit4] <<< JVM J1: EOF ----

[...truncated 682 lines...]
   [junit4] JVM J0: stderr was not empty, see: /Users/jenkins/workspace/Lucene-Solr-8.x-MacOSX/solr/build/contrib/solr-ltr/test/temp/junit4-J0-20190508_221538_10914454253019745188143.syserr
   [junit4] >>> JVM J0 emitted unexpected output (verbatim) ----
   [junit4] Java HotSpot(TM) 64-Bit Server VM warning: Option UseConcMarkSweepGC was deprecated in version 9.0 and will likely be removed in a future release.
   [junit4] <<< JVM J0: EOF ----

[...truncated 3 lines...]
   [junit4] JVM J1: stderr was not empty, see: /Users/jenkins/workspace/Lucene-Solr-8.x-MacOSX/solr/build/contrib/solr-ltr/test/temp/junit4-J1-20190508_221538_1097478849352715701953.syserr
   [junit4] >>> JVM J1 emitted unexpected output (verbatim) ----
   [junit4] Java HotSpot(TM) 64-Bit Server VM warning: Option UseConcMarkSweepGC was deprecated in version 9.0 and will likely be removed in a future release.
   [junit4] <<< JVM J1: EOF ----

[...truncated 581 lines...]
   [junit4] JVM J1: stderr was not empty, see: /Users/jenkins/workspace/Lucene-Solr-8.x-MacOSX/solr/build/contrib/solr-prometheus-exporter/test/temp/junit4-J1-20190508_221619_51517475451027308318473.syserr
   [junit4] >>> JVM J1 emitted unexpected output (verbatim) ----
   [junit4] Java HotSpot(TM) 64-Bit Server VM warning: Option UseConcMarkSweepGC was deprecated in version 9.0 and will likely be removed in a future release.
   [junit4] <<< JVM J1: EOF ----

   [junit4] Suite: org.apache.solr.prometheus.exporter.SolrExporterIntegrationTest
   [junit4]   2> Creating dataDir: /Users/jenkins/workspace/Lucene-Solr-8.x-MacOSX/solr/build/contrib/solr-prometheus-exporter/test/J0/temp/solr.prometheus.exporter.SolrExporterIntegrationTest_3FEAC88952914342-001/init-core-data-001
   [junit4]   1> 22:16:32.237 [jetty-launcher-24-thread-1] ERROR org.apache.solr.util.StartupLoggingUtils - Missing Java Option solr.log.dir. Logging may be missing or incomplete.
   [junit4]   1> 22:16:32.237 [jetty-launcher-24-thread-2] ERROR org.apache.solr.util.StartupLoggingUtils - Missing Java Option solr.log.dir. Logging may be missing or incomplete.
   [junit4]   1> 22:16:32.243 [jetty-launcher-24-thread-3] ERROR org.apache.solr.util.StartupLoggingUtils - Missing Java Option solr.log.dir. Logging may be missing or incomplete.
   [junit4]   1> 22:16:32.244 [jetty-launcher-24-thread-4] ERROR org.apache.solr.util.StartupLoggingUtils - Missing Java Option solr.log.dir. Logging may be missing or incomplete.
   [junit4]   1> replica:core_node3 rstate:active live:true
   [junit4]   1> replica:core_node5 rstate:active live:true
   [junit4]   1> replica:core_node7 rstate:active live:true
   [junit4]   1> replica:core_node8 rstate:active live:true
   [junit4]   1> no one is recoverying
   [junit4]   1> 22:16:38.182 [qtp70193762-88] ERROR org.apache.solr.schema.ManagedIndexSchema - Bad version when trying to persist schema using 1 due to: org.apache.zookeeper.KeeperException$BadVersionException: KeeperErrorCode = BadVersion for /configs/collection1_config/managed-schema
   [junit4]   1> 22:16:38.370 [qtp2011016991-100] ERROR org.apache.solr.schema.ManagedIndexSchema - Bad version when trying to persist schema using 2 due to: org.apache.zookeeper.KeeperException$BadVersionException: KeeperErrorCode = BadVersion for /configs/collection1_config/managed-schema
   [junit4]   1> 22:16:38.372 [qtp70193762-90] ERROR org.apache.solr.schema.ManagedIndexSchema - Bad version when trying to persist schema using 2 due to: org.apache.zookeeper.KeeperException$BadVersionException: KeeperErrorCode = BadVersion for /configs/collection1_config/managed-schema
   [junit4]   1> 22:16:38.560 [qtp1747880147-80] ERROR org.apache.solr.schema.ManagedIndexSchema - Bad version when trying to persist schema using 3 due to: org.apache.zookeeper.KeeperException$BadVersionException: KeeperErrorCode = BadVersion for /configs/collection1_config/managed-schema
   [junit4]   1> 22:16:38.635 [qtp1747880147-85] ERROR org.apache.solr.schema.ManagedIndexSchema - Bad version when trying to persist schema using 4 due to: org.apache.zookeeper.KeeperException$BadVersionException: KeeperErrorCode = BadVersion for /configs/collection1_config/managed-schema
   [junit4]   1> 22:16:38.686 [qtp1747880147-85] ERROR org.apache.solr.schema.ManagedIndexSchema - Bad version when trying to persist schema using 4 due to: org.apache.zookeeper.KeeperException$BadVersionException: KeeperErrorCode = BadVersion for /configs/collection1_config/managed-schema
   [junit4]   1> 22:16:38.702 [qtp1747880147-85] ERROR org.apache.solr.schema.ManagedIndexSchema - Bad version when trying to persist schema using 4 due to: org.apache.zookeeper.KeeperException$BadVersionException: KeeperErrorCode = BadVersion for /configs/collection1_config/managed-schema
   [junit4]   1> 22:16:38.762 [qtp1747880147-85] ERROR org.apache.solr.schema.ManagedIndexSchema - Bad version when trying to persist schema using 4 due to: org.apache.zookeeper.KeeperException$BadVersionException: KeeperErrorCode = BadVersion for /configs/collection1_config/managed-schema
   [junit4]   1> 22:16:38.922 [qtp70193762-93] ERROR org.apache.solr.schema.ManagedIndexSchema - Bad version when trying to persist schema using 5 due to: org.apache.zookeeper.KeeperException$BadVersionException: KeeperErrorCode = BadVersion for /configs/collection1_config/managed-schema
   [junit4]   1> 22:16:38.922 [qtp2011016991-104] ERROR org.apache.solr.schema.ManagedIndexSchema - Bad version when trying to persist schema using 5 due to: org.apache.zookeeper.KeeperException$BadVersionException: KeeperErrorCode = BadVersion for /configs/collection1_config/managed-schema
   [junit4]   1> Waiting for Prometheus exporter
   [junit4]   1> Prometheus exporter running
   [junit4]   1> Waiting for Prometheus exporter
   [junit4]   1> Prometheus exporter running
   [junit4]   1> Waiting for Prometheus exporter
   [junit4]   1> Prometheus exporter running
   [junit4]   1> Waiting for Prometheus exporter
   [junit4]   1> Prometheus exporter running
   [junit4]   1> Waiting for Prometheus exporter
   [junit4]   1> Prometheus exporter running
   [junit4]   2> NOTE: reproduce with: ant test  -Dtestcase=SolrExporterIntegrationTest -Dtests.method=jvmMetrics -Dtests.seed=3FEAC88952914342 -Dtests.slow=true -Dtests.locale=nl-CW -Dtests.timezone=America/Curacao -Dtests.asserts=true -Dtests.file.encoding=UTF-8
   [junit4] FAILURE 0.54s J0 | SolrExporterIntegrationTest.jvmMetrics <<<
   [junit4]    > Throwable #1: java.lang.AssertionError: expected:<36> but was:<48>
   [junit4]    > 	at __randomizedtesting.SeedInfo.seed([3FEAC88952914342:EC5EF566477F8FD6]:0)
   [junit4]    > 	at org.apache.solr.prometheus.exporter.SolrExporterIntegrationTest.jvmMetrics(SolrExporterIntegrationTest.java:71)
   [junit4]    > 	at java.base/jdk.internal.reflect.NativeMethodAccessorImpl.invoke0(Native Method)
   [junit4]    > 	at java.base/jdk.internal.reflect.NativeMethodAccessorImpl.invoke(NativeMethodAccessorImpl.java:62)
   [junit4]    > 	at java.base/jdk.internal.reflect.DelegatingMethodAccessorImpl.invoke(DelegatingMethodAccessorImpl.java:43)
   [junit4]    > 	at java.base/java.lang.reflect.Method.invoke(Method.java:564)
   [junit4]    > 	at java.base/java.lang.Thread.run(Thread.java:844)
   [junit4]   2> NOTE: leaving temporary files on disk at: /Users/jenkins/workspace/Lucene-Solr-8.x-MacOSX/solr/build/contrib/solr-prometheus-exporter/test/J0/temp/solr.prometheus.exporter.SolrExporterIntegrationTest_3FEAC88952914342-001
   [junit4]   2> NOTE: test params are: codec=Lucene80, sim=Asserting(org.apache.lucene.search.similarities.AssertingSimilarity@7e97ab9f), locale=nl-CW, timezone=America/Curacao
   [junit4]   2> NOTE: Mac OS X 10.11.6 x86_64/Oracle Corporation 9 (64-bit)/cpus=3,threads=2,free=52625568,total=138461184
   [junit4]   2> NOTE: All tests run in this JVM: [SolrStandaloneScraperTest, SolrExporterIntegrationTest]
   [junit4] Completed [5/5 (1!)] on J0 in 11.25s, 5 tests, 1 failure <<< FAILURES!

[...truncated 1 lines...]
   [junit4] JVM J0: stderr was not empty, see: /Users/jenkins/workspace/Lucene-Solr-8.x-MacOSX/solr/build/contrib/solr-prometheus-exporter/test/temp/junit4-J0-20190508_221619_51514813354014350169476.syserr
   [junit4] >>> JVM J0 emitted unexpected output (verbatim) ----
   [junit4] Java HotSpot(TM) 64-Bit Server VM warning: Option UseConcMarkSweepGC was deprecated in version 9.0 and will likely be removed in a future release.
   [junit4] <<< JVM J0: EOF ----

[...truncated 572 lines...]
   [junit4] JVM J0: stderr was not empty, see: /Users/jenkins/workspace/Lucene-Solr-8.x-MacOSX/solr/build/contrib/solr-velocity/test/temp/junit4-J0-20190508_221648_3763043245931102755682.syserr
   [junit4] >>> JVM J0 emitted unexpected output (verbatim) ----
   [junit4] Java HotSpot(TM) 64-Bit Server VM warning: Option UseConcMarkSweepGC was deprecated in version 9.0 and will likely be removed in a future release.
   [junit4] <<< JVM J0: EOF ----

[...truncated 34168 lines...]
[repro] Jenkins log URL: https://jenkins.thetaphi.de/job/Lucene-Solr-8.x-MacOSX/121/consoleText

[repro] Revision: eed96570aa19c20304daafba403980b62445b964

[repro] Ant options: "-Dargs=-XX:-UseCompressedOops -XX:+UseConcMarkSweepGC"
[repro] Repro line:  ant test  -Dtestcase=SolrExporterIntegrationTest -Dtests.method=jvmMetrics -Dtests.seed=3FEAC88952914342 -Dtests.slow=true -Dtests.locale=nl-CW -Dtests.timezone=America/Curacao -Dtests.asserts=true -Dtests.file.encoding=UTF-8

[repro] ant clean

[...truncated 6 lines...]
[repro] Test suites by module:
[repro]    solr/contrib/prometheus-exporter
[repro]       SolrExporterIntegrationTest
[repro] ant compile-test

[...truncated 2854 lines...]
[repro] ant test-nocompile -Dtests.dups=5 -Dtests.maxfailures=5 -Dtests.class="*.SolrExporterIntegrationTest" -Dtests.showOutput=onerror "-Dargs=-XX:-UseCompressedOops -XX:+UseConcMarkSweepGC" -Dtests.seed=3FEAC88952914342 -Dtests.slow=true -Dtests.locale=nl-CW -Dtests.timezone=America/Curacao -Dtests.asserts=true -Dtests.file.encoding=UTF-8

[...truncated 63 lines...]
   [junit4] JVM J0: stderr was not empty, see: /Users/jenkins/workspace/Lucene-Solr-8.x-MacOSX/solr/build/contrib/solr-prometheus-exporter/test/temp/junit4-J0-20190508_222122_7526440469705607003178.syserr
   [junit4] >>> JVM J0 emitted unexpected output (verbatim) ----
   [junit4] Java HotSpot(TM) 64-Bit Server VM warning: Option UseConcMarkSweepGC was deprecated in version 9.0 and will likely be removed in a future release.
   [junit4] <<< JVM J0: EOF ----

[...truncated 8 lines...]
   [junit4] JVM J1: stderr was not empty, see: /Users/jenkins/workspace/Lucene-Solr-8.x-MacOSX/solr/build/contrib/solr-prometheus-exporter/test/temp/junit4-J1-20190508_222122_7524477614310178354036.syserr
   [junit4] >>> JVM J1 emitted unexpected output (verbatim) ----
   [junit4] Java HotSpot(TM) 64-Bit Server VM warning: Option UseConcMarkSweepGC was deprecated in version 9.0 and will likely be removed in a future release.
   [junit4] <<< JVM J1: EOF ----

[...truncated 21 lines...]
[repro] Failures:
[repro]   0/5 failed: org.apache.solr.prometheus.exporter.SolrExporterIntegrationTest
[repro] Exiting with code 0

[...truncated 73 lines...]

Mime
View raw message