lucene-dev mailing list archives

Site index · List index
Message view « Date » · « Thread »
Top « Date » · « Thread »
From Policeman Jenkins Server <jenk...@thetaphi.de>
Subject [JENKINS] Lucene-Solr-8.x-Solaris (64bit/jdk1.8.0) - Build # 110 - Unstable!
Date Fri, 03 May 2019 22:44:36 GMT
Build: https://jenkins.thetaphi.de/job/Lucene-Solr-8.x-Solaris/110/
Java: 64bit/jdk1.8.0 -XX:+UseCompressedOops -XX:+UseSerialGC

2 tests failed.
FAILED:  org.apache.solr.cloud.AliasIntegrationTest.testClusterStateProviderAPI

Error Message:
should be a routed alias

Stack Trace:
java.lang.AssertionError: should be a routed alias
	at __randomizedtesting.SeedInfo.seed([DD516B63CE623CD2:C286F74FBD69C599]:0)
	at org.junit.Assert.fail(Assert.java:88)
	at org.junit.Assert.assertTrue(Assert.java:41)
	at org.apache.solr.cloud.AliasIntegrationTest.testClusterStateProviderAPI(AliasIntegrationTest.java:302)
	at sun.reflect.NativeMethodAccessorImpl.invoke0(Native Method)
	at sun.reflect.NativeMethodAccessorImpl.invoke(NativeMethodAccessorImpl.java:62)
	at sun.reflect.DelegatingMethodAccessorImpl.invoke(DelegatingMethodAccessorImpl.java:43)
	at java.lang.reflect.Method.invoke(Method.java:498)
	at com.carrotsearch.randomizedtesting.RandomizedRunner.invoke(RandomizedRunner.java:1750)
	at com.carrotsearch.randomizedtesting.RandomizedRunner$8.evaluate(RandomizedRunner.java:938)
	at com.carrotsearch.randomizedtesting.RandomizedRunner$9.evaluate(RandomizedRunner.java:974)
	at com.carrotsearch.randomizedtesting.RandomizedRunner$10.evaluate(RandomizedRunner.java:988)
	at com.carrotsearch.randomizedtesting.rules.SystemPropertiesRestoreRule$1.evaluate(SystemPropertiesRestoreRule.java:57)
	at org.apache.lucene.util.TestRuleSetupTeardownChained$1.evaluate(TestRuleSetupTeardownChained.java:49)
	at org.apache.lucene.util.AbstractBeforeAfterRule$1.evaluate(AbstractBeforeAfterRule.java:45)
	at org.apache.lucene.util.TestRuleThreadAndTestName$1.evaluate(TestRuleThreadAndTestName.java:48)
	at org.apache.lucene.util.TestRuleIgnoreAfterMaxFailures$1.evaluate(TestRuleIgnoreAfterMaxFailures.java:64)
	at org.apache.lucene.util.TestRuleMarkFailure$1.evaluate(TestRuleMarkFailure.java:47)
	at com.carrotsearch.randomizedtesting.rules.StatementAdapter.evaluate(StatementAdapter.java:36)
	at com.carrotsearch.randomizedtesting.ThreadLeakControl$StatementRunner.run(ThreadLeakControl.java:368)
	at com.carrotsearch.randomizedtesting.ThreadLeakControl.forkTimeoutingTask(ThreadLeakControl.java:817)
	at com.carrotsearch.randomizedtesting.ThreadLeakControl$3.evaluate(ThreadLeakControl.java:468)
	at com.carrotsearch.randomizedtesting.RandomizedRunner.runSingleTest(RandomizedRunner.java:947)
	at com.carrotsearch.randomizedtesting.RandomizedRunner$5.evaluate(RandomizedRunner.java:832)
	at com.carrotsearch.randomizedtesting.RandomizedRunner$6.evaluate(RandomizedRunner.java:883)
	at com.carrotsearch.randomizedtesting.RandomizedRunner$7.evaluate(RandomizedRunner.java:894)
	at com.carrotsearch.randomizedtesting.rules.StatementAdapter.evaluate(StatementAdapter.java:36)
	at com.carrotsearch.randomizedtesting.rules.SystemPropertiesRestoreRule$1.evaluate(SystemPropertiesRestoreRule.java:57)
	at org.apache.lucene.util.AbstractBeforeAfterRule$1.evaluate(AbstractBeforeAfterRule.java:45)
	at com.carrotsearch.randomizedtesting.rules.StatementAdapter.evaluate(StatementAdapter.java:36)
	at org.apache.lucene.util.TestRuleStoreClassName$1.evaluate(TestRuleStoreClassName.java:41)
	at com.carrotsearch.randomizedtesting.rules.NoShadowingOrOverridesOnMethodsRule$1.evaluate(NoShadowingOrOverridesOnMethodsRule.java:40)
	at com.carrotsearch.randomizedtesting.rules.NoShadowingOrOverridesOnMethodsRule$1.evaluate(NoShadowingOrOverridesOnMethodsRule.java:40)
	at com.carrotsearch.randomizedtesting.rules.StatementAdapter.evaluate(StatementAdapter.java:36)
	at com.carrotsearch.randomizedtesting.rules.StatementAdapter.evaluate(StatementAdapter.java:36)
	at com.carrotsearch.randomizedtesting.rules.StatementAdapter.evaluate(StatementAdapter.java:36)
	at org.apache.lucene.util.TestRuleAssertionsRequired$1.evaluate(TestRuleAssertionsRequired.java:53)
	at org.apache.lucene.util.TestRuleMarkFailure$1.evaluate(TestRuleMarkFailure.java:47)
	at org.apache.lucene.util.TestRuleIgnoreAfterMaxFailures$1.evaluate(TestRuleIgnoreAfterMaxFailures.java:64)
	at org.apache.lucene.util.TestRuleIgnoreTestSuites$1.evaluate(TestRuleIgnoreTestSuites.java:54)
	at com.carrotsearch.randomizedtesting.rules.StatementAdapter.evaluate(StatementAdapter.java:36)
	at com.carrotsearch.randomizedtesting.ThreadLeakControl$StatementRunner.run(ThreadLeakControl.java:368)
	at java.lang.Thread.run(Thread.java:748)


FAILED:  org.apache.solr.cloud.TestCryptoKeys.test

Error Message:
Jetty/Solr unresponsive

Stack Trace:
java.lang.RuntimeException: Jetty/Solr unresponsive
	at __randomizedtesting.SeedInfo.seed([DD516B63CE623CD2:550554B9609E512A]:0)
	at org.apache.solr.client.solrj.embedded.JettySolrRunner.start(JettySolrRunner.java:507)
	at org.apache.solr.client.solrj.embedded.JettySolrRunner.start(JettySolrRunner.java:465)
	at org.apache.solr.cloud.AbstractFullDistribZkTestBase.createServers(AbstractFullDistribZkTestBase.java:333)
	at org.apache.solr.BaseDistributedSearchTestCase$ShardsRepeatRule$ShardsFixedStatement.callStatement(BaseDistributedSearchTestCase.java:1080)
	at org.apache.solr.BaseDistributedSearchTestCase$ShardsRepeatRule$ShardsStatement.evaluate(BaseDistributedSearchTestCase.java:1054)
	at com.carrotsearch.randomizedtesting.rules.SystemPropertiesRestoreRule$1.evaluate(SystemPropertiesRestoreRule.java:57)
	at org.apache.lucene.util.TestRuleSetupTeardownChained$1.evaluate(TestRuleSetupTeardownChained.java:49)
	at org.apache.lucene.util.AbstractBeforeAfterRule$1.evaluate(AbstractBeforeAfterRule.java:45)
	at org.apache.lucene.util.TestRuleThreadAndTestName$1.evaluate(TestRuleThreadAndTestName.java:48)
	at org.apache.lucene.util.TestRuleIgnoreAfterMaxFailures$1.evaluate(TestRuleIgnoreAfterMaxFailures.java:64)
	at org.apache.lucene.util.TestRuleMarkFailure$1.evaluate(TestRuleMarkFailure.java:47)
	at com.carrotsearch.randomizedtesting.rules.StatementAdapter.evaluate(StatementAdapter.java:36)
	at com.carrotsearch.randomizedtesting.ThreadLeakControl$StatementRunner.run(ThreadLeakControl.java:368)
	at com.carrotsearch.randomizedtesting.ThreadLeakControl.forkTimeoutingTask(ThreadLeakControl.java:817)
	at com.carrotsearch.randomizedtesting.ThreadLeakControl$3.evaluate(ThreadLeakControl.java:468)
	at com.carrotsearch.randomizedtesting.RandomizedRunner.runSingleTest(RandomizedRunner.java:947)
	at com.carrotsearch.randomizedtesting.RandomizedRunner$5.evaluate(RandomizedRunner.java:832)
	at com.carrotsearch.randomizedtesting.RandomizedRunner$6.evaluate(RandomizedRunner.java:883)
	at com.carrotsearch.randomizedtesting.RandomizedRunner$7.evaluate(RandomizedRunner.java:894)
	at com.carrotsearch.randomizedtesting.rules.StatementAdapter.evaluate(StatementAdapter.java:36)
	at com.carrotsearch.randomizedtesting.rules.SystemPropertiesRestoreRule$1.evaluate(SystemPropertiesRestoreRule.java:57)
	at org.apache.lucene.util.AbstractBeforeAfterRule$1.evaluate(AbstractBeforeAfterRule.java:45)
	at com.carrotsearch.randomizedtesting.rules.StatementAdapter.evaluate(StatementAdapter.java:36)
	at org.apache.lucene.util.TestRuleStoreClassName$1.evaluate(TestRuleStoreClassName.java:41)
	at com.carrotsearch.randomizedtesting.rules.NoShadowingOrOverridesOnMethodsRule$1.evaluate(NoShadowingOrOverridesOnMethodsRule.java:40)
	at com.carrotsearch.randomizedtesting.rules.NoShadowingOrOverridesOnMethodsRule$1.evaluate(NoShadowingOrOverridesOnMethodsRule.java:40)
	at com.carrotsearch.randomizedtesting.rules.StatementAdapter.evaluate(StatementAdapter.java:36)
	at com.carrotsearch.randomizedtesting.rules.StatementAdapter.evaluate(StatementAdapter.java:36)
	at com.carrotsearch.randomizedtesting.rules.StatementAdapter.evaluate(StatementAdapter.java:36)
	at org.apache.lucene.util.TestRuleAssertionsRequired$1.evaluate(TestRuleAssertionsRequired.java:53)
	at org.apache.lucene.util.TestRuleMarkFailure$1.evaluate(TestRuleMarkFailure.java:47)
	at org.apache.lucene.util.TestRuleIgnoreAfterMaxFailures$1.evaluate(TestRuleIgnoreAfterMaxFailures.java:64)
	at org.apache.lucene.util.TestRuleIgnoreTestSuites$1.evaluate(TestRuleIgnoreTestSuites.java:54)
	at com.carrotsearch.randomizedtesting.rules.StatementAdapter.evaluate(StatementAdapter.java:36)
	at com.carrotsearch.randomizedtesting.ThreadLeakControl$StatementRunner.run(ThreadLeakControl.java:368)
	at java.lang.Thread.run(Thread.java:748)




Build Log:
[...truncated 13996 lines...]
   [junit4] Suite: org.apache.solr.cloud.TestCryptoKeys
   [junit4]   2> Creating dataDir: /export/home/jenkins/workspace/Lucene-Solr-8.x-Solaris/solr/build/solr-core/test/J1/temp/solr.cloud.TestCryptoKeys_DD516B63CE623CD2-001/init-core-data-001
   [junit4]   2> 1435855 WARN  (SUITE-TestCryptoKeys-seed#[DD516B63CE623CD2]-worker) [    ] o.a.s.SolrTestCaseJ4 startTrackingSearchers: numOpens=7 numCloses=7
   [junit4]   2> 1435856 INFO  (SUITE-TestCryptoKeys-seed#[DD516B63CE623CD2]-worker) [    ] o.a.s.SolrTestCaseJ4 Using PointFields (NUMERIC_POINTS_SYSPROP=true) w/NUMERIC_DOCVALUES_SYSPROP=true
   [junit4]   2> 1435869 INFO  (SUITE-TestCryptoKeys-seed#[DD516B63CE623CD2]-worker) [    ] o.a.s.SolrTestCaseJ4 Randomized ssl (true) and clientAuth (false) via: @org.apache.solr.util.RandomizeSSL(reason=, value=NaN, ssl=NaN, clientAuth=NaN)
   [junit4]   2> 1435869 INFO  (SUITE-TestCryptoKeys-seed#[DD516B63CE623CD2]-worker) [    ] o.a.s.SolrTestCaseJ4 SecureRandom sanity checks: test.solr.allowed.securerandom=null & java.security.egd=file:/dev/./urandom
   [junit4]   2> 1435870 INFO  (SUITE-TestCryptoKeys-seed#[DD516B63CE623CD2]-worker) [    ] o.a.s.BaseDistributedSearchTestCase Setting hostContext system property: /qkla/t
   [junit4]   2> 1435880 INFO  (TEST-TestCryptoKeys.test-seed#[DD516B63CE623CD2]) [    ] o.a.s.c.ZkTestServer STARTING ZK TEST SERVER
   [junit4]   2> 1435881 INFO  (ZkTestServer Run Thread) [    ] o.a.s.c.ZkTestServer client port:0.0.0.0/0.0.0.0:0
   [junit4]   2> 1435881 INFO  (ZkTestServer Run Thread) [    ] o.a.s.c.ZkTestServer Starting server
   [junit4]   2> 1435981 INFO  (TEST-TestCryptoKeys.test-seed#[DD516B63CE623CD2]) [    ] o.a.s.c.ZkTestServer start zk server on port:36808
   [junit4]   2> 1435981 INFO  (TEST-TestCryptoKeys.test-seed#[DD516B63CE623CD2]) [    ] o.a.s.c.ZkTestServer parse host and port list: 127.0.0.1:36808
   [junit4]   2> 1435981 INFO  (TEST-TestCryptoKeys.test-seed#[DD516B63CE623CD2]) [    ] o.a.s.c.ZkTestServer connecting to 127.0.0.1 36808
   [junit4]   2> 1435988 INFO  (zkConnectionManagerCallback-10056-thread-1) [    ] o.a.s.c.c.ConnectionManager zkClient has connected
   [junit4]   2> 1435992 INFO  (zkConnectionManagerCallback-10058-thread-1) [    ] o.a.s.c.c.ConnectionManager zkClient has connected
   [junit4]   2> 1435993 INFO  (TEST-TestCryptoKeys.test-seed#[DD516B63CE623CD2]) [    ] o.a.s.c.ZkTestServer put /export/home/jenkins/workspace/Lucene-Solr-8.x-Solaris/solr/core/src/test-files/solr/collection1/conf/solrconfig-tlog.xml to /configs/conf1/solrconfig.xml
   [junit4]   2> 1435995 INFO  (TEST-TestCryptoKeys.test-seed#[DD516B63CE623CD2]) [    ] o.a.s.c.ZkTestServer put /export/home/jenkins/workspace/Lucene-Solr-8.x-Solaris/solr/core/src/test-files/solr/collection1/conf/schema.xml to /configs/conf1/schema.xml
   [junit4]   2> 1435997 INFO  (TEST-TestCryptoKeys.test-seed#[DD516B63CE623CD2]) [    ] o.a.s.c.ZkTestServer put /export/home/jenkins/workspace/Lucene-Solr-8.x-Solaris/solr/core/src/test-files/solr/collection1/conf/solrconfig.snippet.randomindexconfig.xml to /configs/conf1/solrconfig.snippet.randomindexconfig.xml
   [junit4]   2> 1435999 INFO  (TEST-TestCryptoKeys.test-seed#[DD516B63CE623CD2]) [    ] o.a.s.c.ZkTestServer put /export/home/jenkins/workspace/Lucene-Solr-8.x-Solaris/solr/core/src/test-files/solr/collection1/conf/stopwords.txt to /configs/conf1/stopwords.txt
   [junit4]   2> 1436001 INFO  (TEST-TestCryptoKeys.test-seed#[DD516B63CE623CD2]) [    ] o.a.s.c.ZkTestServer put /export/home/jenkins/workspace/Lucene-Solr-8.x-Solaris/solr/core/src/test-files/solr/collection1/conf/protwords.txt to /configs/conf1/protwords.txt
   [junit4]   2> 1436003 INFO  (TEST-TestCryptoKeys.test-seed#[DD516B63CE623CD2]) [    ] o.a.s.c.ZkTestServer put /export/home/jenkins/workspace/Lucene-Solr-8.x-Solaris/solr/core/src/test-files/solr/collection1/conf/currency.xml to /configs/conf1/currency.xml
   [junit4]   2> 1436004 INFO  (TEST-TestCryptoKeys.test-seed#[DD516B63CE623CD2]) [    ] o.a.s.c.ZkTestServer put /export/home/jenkins/workspace/Lucene-Solr-8.x-Solaris/solr/core/src/test-files/solr/collection1/conf/enumsConfig.xml to /configs/conf1/enumsConfig.xml
   [junit4]   2> 1436006 INFO  (TEST-TestCryptoKeys.test-seed#[DD516B63CE623CD2]) [    ] o.a.s.c.ZkTestServer put /export/home/jenkins/workspace/Lucene-Solr-8.x-Solaris/solr/core/src/test-files/solr/collection1/conf/open-exchange-rates.json to /configs/conf1/open-exchange-rates.json
   [junit4]   2> 1436007 INFO  (TEST-TestCryptoKeys.test-seed#[DD516B63CE623CD2]) [    ] o.a.s.c.ZkTestServer put /export/home/jenkins/workspace/Lucene-Solr-8.x-Solaris/solr/core/src/test-files/solr/collection1/conf/mapping-ISOLatin1Accent.txt to /configs/conf1/mapping-ISOLatin1Accent.txt
   [junit4]   2> 1436008 INFO  (TEST-TestCryptoKeys.test-seed#[DD516B63CE623CD2]) [    ] o.a.s.c.ZkTestServer put /export/home/jenkins/workspace/Lucene-Solr-8.x-Solaris/solr/core/src/test-files/solr/collection1/conf/old_synonyms.txt to /configs/conf1/old_synonyms.txt
   [junit4]   2> 1436009 INFO  (TEST-TestCryptoKeys.test-seed#[DD516B63CE623CD2]) [    ] o.a.s.c.ZkTestServer put /export/home/jenkins/workspace/Lucene-Solr-8.x-Solaris/solr/core/src/test-files/solr/collection1/conf/synonyms.txt to /configs/conf1/synonyms.txt
   [junit4]   2> 1436012 INFO  (zkConnectionManagerCallback-10062-thread-1) [    ] o.a.s.c.c.ConnectionManager zkClient has connected
   [junit4]   2> 1436015 INFO  (TEST-TestCryptoKeys.test-seed#[DD516B63CE623CD2]) [    ] o.a.s.c.AbstractFullDistribZkTestBase Will use NRT replicas unless explicitly asked otherwise
   [junit4]   2> 1436355 WARN  (TEST-TestCryptoKeys.test-seed#[DD516B63CE623CD2]) [    ] o.e.j.s.AbstractConnector Ignoring deprecated socket close linger time
   [junit4]   2> 1436355 INFO  (TEST-TestCryptoKeys.test-seed#[DD516B63CE623CD2]) [    ] o.a.s.c.s.e.JettySolrRunner Start Jetty (original configured port=0)
   [junit4]   2> 1436355 INFO  (TEST-TestCryptoKeys.test-seed#[DD516B63CE623CD2]) [    ] o.a.s.c.s.e.JettySolrRunner Trying to start Jetty on port 0 try number 1 ...
   [junit4]   2> 1436355 INFO  (TEST-TestCryptoKeys.test-seed#[DD516B63CE623CD2]) [    ] o.e.j.s.Server jetty-9.4.14.v20181114; built: 2018-11-14T21:20:31.478Z; git: c4550056e785fb5665914545889f21dc136ad9e6; jvm 1.8.0_201-b09
   [junit4]   2> 1436357 INFO  (TEST-TestCryptoKeys.test-seed#[DD516B63CE623CD2]) [    ] o.e.j.s.session DefaultSessionIdManager workerName=node0
   [junit4]   2> 1436357 INFO  (TEST-TestCryptoKeys.test-seed#[DD516B63CE623CD2]) [    ] o.e.j.s.session No SessionScavenger set, using defaults
   [junit4]   2> 1436357 INFO  (TEST-TestCryptoKeys.test-seed#[DD516B63CE623CD2]) [    ] o.e.j.s.session node0 Scavenging every 600000ms
   [junit4]   2> 1436360 INFO  (TEST-TestCryptoKeys.test-seed#[DD516B63CE623CD2]) [    ] o.e.j.s.h.ContextHandler Started o.e.j.s.ServletContextHandler@25c62fef{/qkla/t,null,AVAILABLE}
   [junit4]   2> 1436361 WARN  (TEST-TestCryptoKeys.test-seed#[DD516B63CE623CD2]) [    ] o.e.j.u.s.S.config No Client EndPointIdentificationAlgorithm configured for SslContextFactory@64c61db6[provider=null,keyStore=null,trustStore=null]
   [junit4]   2> 1436362 INFO  (TEST-TestCryptoKeys.test-seed#[DD516B63CE623CD2]) [    ] o.e.j.s.AbstractConnector Started ServerConnector@3e461cee{SSL,[ssl, http/1.1]}{127.0.0.1:36808}
   [junit4]   2> 1436362 INFO  (TEST-TestCryptoKeys.test-seed#[DD516B63CE623CD2]) [    ] o.e.j.s.Server Started @1437396ms
   [junit4]   2> 1436362 INFO  (TEST-TestCryptoKeys.test-seed#[DD516B63CE623CD2]) [    ] o.a.s.c.s.e.JettySolrRunner Jetty properties: {solr.data.dir=/export/home/jenkins/workspace/Lucene-Solr-8.x-Solaris/solr/build/solr-core/test/J1/temp/solr.cloud.TestCryptoKeys_DD516B63CE623CD2-001/tempDir-001/control/data, hostContext=/qkla/t, hostPort=36808, coreRootDirectory=/export/home/jenkins/workspace/Lucene-Solr-8.x-Solaris/solr/build/solr-core/test/J1/temp/solr.cloud.TestCryptoKeys_DD516B63CE623CD2-001/control-001/cores}
   [junit4]   2> 1436362 ERROR (TEST-TestCryptoKeys.test-seed#[DD516B63CE623CD2]) [    ] o.a.s.u.StartupLoggingUtils Missing Java Option solr.log.dir. Logging may be missing or incomplete.
   [junit4]   2> 1436362 INFO  (TEST-TestCryptoKeys.test-seed#[DD516B63CE623CD2]) [    ] o.a.s.s.SolrDispatchFilter Using logger factory org.apache.logging.slf4j.Log4jLoggerFactory
   [junit4]   2> 1436362 INFO  (TEST-TestCryptoKeys.test-seed#[DD516B63CE623CD2]) [    ] o.a.s.s.SolrDispatchFilter  ___      _       Welcome to Apache Solr™ version 8.2.0
   [junit4]   2> 1436362 INFO  (TEST-TestCryptoKeys.test-seed#[DD516B63CE623CD2]) [    ] o.a.s.s.SolrDispatchFilter / __| ___| |_ _   Starting in cloud mode on port null
   [junit4]   2> 1436362 INFO  (TEST-TestCryptoKeys.test-seed#[DD516B63CE623CD2]) [    ] o.a.s.s.SolrDispatchFilter \__ \/ _ \ | '_|  Install dir: null
   [junit4]   2> 1436362 INFO  (TEST-TestCryptoKeys.test-seed#[DD516B63CE623CD2]) [    ] o.a.s.s.SolrDispatchFilter |___/\___/_|_|    Start time: 2019-05-03T21:32:24.118Z
   [junit4]   2> 1436410 WARN  (TEST-TestCryptoKeys.test-seed#[DD516B63CE623CD2]-SendThread(serv1-vm3:36808)) [    ] o.a.z.ClientCnxn Session 0x0 for server serv1-vm3/127.0.0.1:36808, unexpected error, closing socket connection and attempting reconnect
   [junit4]   2>           => java.io.IOException: Packet len352518912 is out of range!
   [junit4]   2> 	at org.apache.zookeeper.ClientCnxnSocket.readLength(ClientCnxnSocket.java:113)
   [junit4]   2> java.io.IOException: Packet len352518912 is out of range!
   [junit4]   2> 	at org.apache.zookeeper.ClientCnxnSocket.readLength(ClientCnxnSocket.java:113) ~[zookeeper-3.4.14.jar:3.4.14-4c25d480e66aadd371de8bd2fd8da255ac140bcf]
   [junit4]   2> 	at org.apache.zookeeper.ClientCnxnSocketNIO.doIO(ClientCnxnSocketNIO.java:79) ~[zookeeper-3.4.14.jar:3.4.14-4c25d480e66aadd371de8bd2fd8da255ac140bcf]
   [junit4]   2> 	at org.apache.zookeeper.ClientCnxnSocketNIO.doTransport(ClientCnxnSocketNIO.java:366) ~[zookeeper-3.4.14.jar:3.4.14-4c25d480e66aadd371de8bd2fd8da255ac140bcf]
   [junit4]   2> 	at org.apache.zookeeper.ClientCnxn$SendThread.run(ClientCnxn.java:1141) ~[zookeeper-3.4.14.jar:3.4.14-4c25d480e66aadd371de8bd2fd8da255ac140bcf]
   [junit4]   2> 1438135 WARN  (TEST-TestCryptoKeys.test-seed#[DD516B63CE623CD2]-SendThread(serv1-vm3:36808)) [    ] o.a.z.ClientCnxn Session 0x0 for server serv1-vm3/127.0.0.1:36808, unexpected error, closing socket connection and attempting reconnect
   [junit4]   2>           => java.io.IOException: Packet len352518912 is out of range!
   [junit4]   2> 	at org.apache.zookeeper.ClientCnxnSocket.readLength(ClientCnxnSocket.java:113)
   [junit4]   2> java.io.IOException: Packet len352518912 is out of range!
   [junit4]   2> 	at org.apache.zookeeper.ClientCnxnSocket.readLength(ClientCnxnSocket.java:113) ~[zookeeper-3.4.14.jar:3.4.14-4c25d480e66aadd371de8bd2fd8da255ac140bcf]
   [junit4]   2> 	at org.apache.zookeeper.ClientCnxnSocketNIO.doIO(ClientCnxnSocketNIO.java:79) ~[zookeeper-3.4.14.jar:3.4.14-4c25d480e66aadd371de8bd2fd8da255ac140bcf]
   [junit4]   2> 	at org.apache.zookeeper.ClientCnxnSocketNIO.doTransport(ClientCnxnSocketNIO.java:366) ~[zookeeper-3.4.14.jar:3.4.14-4c25d480e66aadd371de8bd2fd8da255ac140bcf]
   [junit4]   2> 	at org.apache.zookeeper.ClientCnxn$SendThread.run(ClientCnxn.java:1141) ~[zookeeper-3.4.14.jar:3.4.14-4c25d480e66aadd371de8bd2fd8da255ac140bcf]
   [junit4]   2> 1439943 WARN  (TEST-TestCryptoKeys.test-seed#[DD516B63CE623CD2]-SendThread(serv1-vm3:36808)) [    ] o.a.z.ClientCnxn Session 0x0 for server serv1-vm3/127.0.0.1:36808, unexpected error, closing socket connection and attempting reconnect
   [junit4]   2>           => java.io.IOException: Packet len352518912 is out of range!
   [junit4]   2> 	at org.apache.zookeeper.ClientCnxnSocket.readLength(ClientCnxnSocket.java:113)
   [junit4]   2> java.io.IOException: Packet len352518912 is out of range!
   [junit4]   2> 	at org.apache.zookeeper.ClientCnxnSocket.readLength(ClientCnxnSocket.java:113) ~[zookeeper-3.4.14.jar:3.4.14-4c25d480e66aadd371de8bd2fd8da255ac140bcf]
   [junit4]   2> 	at org.apache.zookeeper.ClientCnxnSocketNIO.doIO(ClientCnxnSocketNIO.java:79) ~[zookeeper-3.4.14.jar:3.4.14-4c25d480e66aadd371de8bd2fd8da255ac140bcf]
   [junit4]   2> 	at org.apache.zookeeper.ClientCnxnSocketNIO.doTransport(ClientCnxnSocketNIO.java:366) ~[zookeeper-3.4.14.jar:3.4.14-4c25d480e66aadd371de8bd2fd8da255ac140bcf]
   [junit4]   2> 	at org.apache.zookeeper.ClientCnxn$SendThread.run(ClientCnxn.java:1141) ~[zookeeper-3.4.14.jar:3.4.14-4c25d480e66aadd371de8bd2fd8da255ac140bcf]
   [junit4]   2> 1441497 WARN  (TEST-TestCryptoKeys.test-seed#[DD516B63CE623CD2]-SendThread(serv1-vm3:36808)) [    ] o.a.z.ClientCnxn Session 0x0 for server serv1-vm3/127.0.0.1:36808, unexpected error, closing socket connection and attempting reconnect
   [junit4]   2>           => java.io.IOException: Packet len352518912 is out of range!
   [junit4]   2> 	at org.apache.zookeeper.ClientCnxnSocket.readLength(ClientCnxnSocket.java:113)
   [junit4]   2> java.io.IOException: Packet len352518912 is out of range!
   [junit4]   2> 	at org.apache.zookeeper.ClientCnxnSocket.readLength(ClientCnxnSocket.java:113) ~[zookeeper-3.4.14.jar:3.4.14-4c25d480e66aadd371de8bd2fd8da255ac140bcf]
   [junit4]   2> 	at org.apache.zookeeper.ClientCnxnSocketNIO.doIO(ClientCnxnSocketNIO.java:79) ~[zookeeper-3.4.14.jar:3.4.14-4c25d480e66aadd371de8bd2fd8da255ac140bcf]
   [junit4]   2> 	at org.apache.zookeeper.ClientCnxnSocketNIO.doTransport(ClientCnxnSocketNIO.java:366) ~[zookeeper-3.4.14.jar:3.4.14-4c25d480e66aadd371de8bd2fd8da255ac140bcf]
   [junit4]   2> 	at org.apache.zookeeper.ClientCnxn$SendThread.run(ClientCnxn.java:1141) ~[zookeeper-3.4.14.jar:3.4.14-4c25d480e66aadd371de8bd2fd8da255ac140bcf]
   [junit4]   2> 1443234 WARN  (TEST-TestCryptoKeys.test-seed#[DD516B63CE623CD2]-SendThread(serv1-vm3:36808)) [    ] o.a.z.ClientCnxn Session 0x0 for server serv1-vm3/127.0.0.1:36808, unexpected error, closing socket connection and attempting reconnect
   [junit4]   2>           => java.io.IOException: Packet len352518912 is out of range!
   [junit4]   2> 	at org.apache.zookeeper.ClientCnxnSocket.readLength(ClientCnxnSocket.java:113)
   [junit4]   2> java.io.IOException: Packet len352518912 is out of range!
   [junit4]   2> 	at org.apache.zookeeper.ClientCnxnSocket.readLength(ClientCnxnSocket.java:113) ~[zookeeper-3.4.14.jar:3.4.14-4c25d480e66aadd371de8bd2fd8da255ac140bcf]
   [junit4]   2> 	at org.apache.zookeeper.ClientCnxnSocketNIO.doIO(ClientCnxnSocketNIO.java:79) ~[zookeeper-3.4.14.jar:3.4.14-4c25d480e66aadd371de8bd2fd8da255ac140bcf]
   [junit4]   2> 	at org.apache.zookeeper.ClientCnxnSocketNIO.doTransport(ClientCnxnSocketNIO.java:366) ~[zookeeper-3.4.14.jar:3.4.14-4c25d480e66aadd371de8bd2fd8da255ac140bcf]
   [junit4]   2> 	at org.apache.zookeeper.ClientCnxn$SendThread.run(ClientCnxn.java:1141) ~[zookeeper-3.4.14.jar:3.4.14-4c25d480e66aadd371de8bd2fd8da255ac140bcf]
   [junit4]   2> 1445080 WARN  (TEST-TestCryptoKeys.test-seed#[DD516B63CE623CD2]-SendThread(serv1-vm3:36808)) [    ] o.a.z.ClientCnxn Session 0x0 for server serv1-vm3/127.0.0.1:36808, unexpected error, closing socket connection and attempting reconnect
   [junit4]   2>           => java.io.IOException: Packet len352518912 is out of range!
   [junit4]   2> 	at org.apache.zookeeper.ClientCnxnSocket.readLength(ClientCnxnSocket.java:113)
   [junit4]   2> java.io.IOException: Packet len352518912 is out of range!
   [junit4]   2> 	at org.apache.zookeeper.ClientCnxnSocket.readLength(ClientCnxnSocket.java:113) ~[zookeeper-3.4.14.jar:3.4.14-4c25d480e66aadd371de8bd2fd8da255ac140bcf]
   [junit4]   2> 	at org.apache.zookeeper.ClientCnxnSocketNIO.doIO(ClientCnxnSocketNIO.java:79) ~[zookeeper-3.4.14.jar:3.4.14-4c25d480e66aadd371de8bd2fd8da255ac140bcf]
   [junit4]   2> 	at org.apache.zookeeper.ClientCnxnSocketNIO.doTransport(ClientCnxnSocketNIO.java:366) ~[zookeeper-3.4.14.jar:3.4.14-4c25d480e66aadd371de8bd2fd8da255ac140bcf]
   [junit4]   2> 	at org.apache.zookeeper.ClientCnxn$SendThread.run(ClientCnxn.java:1141) ~[zookeeper-3.4.14.jar:3.4.14-4c25d480e66aadd371de8bd2fd8da255ac140bcf]
   [junit4]   2> 1446234 WARN  (TEST-TestCryptoKeys.test-seed#[DD516B63CE623CD2]-SendThread(serv1-vm3:36808)) [    ] o.a.z.ClientCnxn Session 0x0 for server serv1-vm3/127.0.0.1:36808, unexpected error, closing socket connection and attempting reconnect
   [junit4]   2>           => java.io.IOException: Packet len352518912 is out of range!
   [junit4]   2> 	at org.apache.zookeeper.ClientCnxnSocket.readLength(ClientCnxnSocket.java:113)
   [junit4]   2> java.io.IOException: Packet len352518912 is out of range!
   [junit4]   2> 	at org.apache.zookeeper.ClientCnxnSocket.readLength(ClientCnxnSocket.java:113) ~[zookeeper-3.4.14.jar:3.4.14-4c25d480e66aadd371de8bd2fd8da255ac140bcf]
   [junit4]   2> 	at org.apache.zookeeper.ClientCnxnSocketNIO.doIO(ClientCnxnSocketNIO.java:79) ~[zookeeper-3.4.14.jar:3.4.14-4c25d480e66aadd371de8bd2fd8da255ac140bcf]
   [junit4]   2> 	at org.apache.zookeeper.ClientCnxnSocketNIO.doTransport(ClientCnxnSocketNIO.java:366) ~[zookeeper-3.4.14.jar:3.4.14-4c25d480e66aadd371de8bd2fd8da255ac140bcf]
   [junit4]   2> 	at org.apache.zookeeper.ClientCnxn$SendThread.run(ClientCnxn.java:1141) ~[zookeeper-3.4.14.jar:3.4.14-4c25d480e66aadd371de8bd2fd8da255ac140bcf]
   [junit4]   2> 1447795 WARN  (TEST-TestCryptoKeys.test-seed#[DD516B63CE623CD2]-SendThread(serv1-vm3:36808)) [    ] o.a.z.ClientCnxn Session 0x0 for server serv1-vm3/127.0.0.1:36808, unexpected error, closing socket connection and attempting reconnect
   [junit4]   2>           => java.io.IOException: Packet len352518912 is out of range!
   [junit4]   2> 	at org.apache.zookeeper.ClientCnxnSocket.readLength(ClientCnxnSocket.java:113)
   [junit4]   2> java.io.IOException: Packet len352518912 is out of range!
   [junit4]   2> 	at org.apache.zookeeper.ClientCnxnSocket.readLength(ClientCnxnSocket.java:113) ~[zookeeper-3.4.14.jar:3.4.14-4c25d480e66aadd371de8bd2fd8da255ac140bcf]
   [junit4]   2> 	at org.apache.zookeeper.ClientCnxnSocketNIO.doIO(ClientCnxnSocketNIO.java:79) ~[zookeeper-3.4.14.jar:3.4.14-4c25d480e66aadd371de8bd2fd8da255ac140bcf]
   [junit4]   2> 	at org.apache.zookeeper.ClientCnxnSocketNIO.doTransport(ClientCnxnSocketNIO.java:366) ~[zookeeper-3.4.14.jar:3.4.14-4c25d480e66aadd371de8bd2fd8da255ac140bcf]
   [junit4]   2> 	at org.apache.zookeeper.ClientCnxn$SendThread.run(ClientCnxn.java:1141) ~[zookeeper-3.4.14.jar:3.4.14-4c25d480e66aadd371de8bd2fd8da255ac140bcf]
   [junit4]   2> 1449713 WARN  (TEST-TestCryptoKeys.test-seed#[DD516B63CE623CD2]-SendThread(serv1-vm3:36808)) [    ] o.a.z.ClientCnxn Session 0x0 for server serv1-vm3/127.0.0.1:36808, unexpected error, closing socket connection and attempting reconnect
   [junit4]   2>           => java.io.IOException: Packet len352518912 is out of range!
   [junit4]   2> 	at org.apache.zookeeper.ClientCnxnSocket.readLength(ClientCnxnSocket.java:113)
   [junit4]   2> java.io.IOException: Packet len352518912 is out of range!
   [junit4]   2> 	at org.apache.zookeeper.ClientCnxnSocket.readLength(ClientCnxnSocket.java:113) ~[zookeeper-3.4.14.jar:3.4.14-4c25d480e66aadd371de8bd2fd8da255ac140bcf]
   [junit4]   2> 	at org.apache.zookeeper.ClientCnxnSocketNIO.doIO(ClientCnxnSocketNIO.java:79) ~[zookeeper-3.4.14.jar:3.4.14-4c25d480e66aadd371de8bd2fd8da255ac140bcf]
   [junit4]   2> 	at org.apache.zookeeper.ClientCnxnSocketNIO.doTransport(ClientCnxnSocketNIO.java:366) ~[zookeeper-3.4.14.jar:3.4.14-4c25d480e66aadd371de8bd2fd8da255ac140bcf]
   [junit4]   2> 	at org.apache.zookeeper.ClientCnxn$SendThread.run(ClientCnxn.java:1141) ~[zookeeper-3.4.14.jar:3.4.14-4c25d480e66aadd371de8bd2fd8da255ac140bcf]
   [junit4]   2> 1451734 WARN  (TEST-TestCryptoKeys.test-seed#[DD516B63CE623CD2]-SendThread(serv1-vm3:36808)) [    ] o.a.z.ClientCnxn Session 0x0 for server serv1-vm3/127.0.0.1:36808, unexpected error, closing socket connection and attempting reconnect
   [junit4]   2>           => java.io.IOException: Packet len352518912 is out of range!
   [junit4]   2> 	at org.apache.zookeeper.ClientCnxnSocket.readLength(ClientCnxnSocket.java:113)
   [junit4]   2> java.io.IOException: Packet len352518912 is out of range!
   [junit4]   2> 	at org.apache.zookeeper.ClientCnxnSocket.readLength(ClientCnxnSocket.java:113) ~[zookeeper-3.4.14.jar:3.4.14-4c25d480e66aadd371de8bd2fd8da255ac140bcf]
   [junit4]   2> 	at org.apache.zookeeper.ClientCnxnSocketNIO.doIO(ClientCnxnSocketNIO.java:79) ~[zookeeper-3.4.14.jar:3.4.14-4c25d480e66aadd371de8bd2fd8da255ac140bcf]
   [junit4]   2> 	at org.apache.zookeeper.ClientCnxnSocketNIO.doTransport(ClientCnxnSocketNIO.java:366) ~[zookeeper-3.4.14.jar:3.4.14-4c25d480e66aadd371de8bd2fd8da255ac140bcf]
   [junit4]   2> 	at org.apache.zookeeper.ClientCnxn$SendThread.run(ClientCnxn.java:1141) ~[zookeeper-3.4.14.jar:3.4.14-4c25d480e66aadd371de8bd2fd8da255ac140bcf]
   [junit4]   2> 1453041 WARN  (TEST-TestCryptoKeys.test-seed#[DD516B63CE623CD2]-SendThread(serv1-vm3:36808)) [    ] o.a.z.ClientCnxn Session 0x0 for server serv1-vm3/127.0.0.1:36808, unexpected error, closing socket connection and attempting reconnect
   [junit4]   2>           => java.io.IOException: Packet len352518912 is out of range!
   [junit4]   2> 	at org.apache.zookeeper.ClientCnxnSocket.readLength(ClientCnxnSocket.java:113)
   [junit4]   2> java.io.IOException: Packet len352518912 is out of range!
   [junit4]   2> 	at org.apache.zookeeper.ClientCnxnSocket.readLength(ClientCnxnSocket.java:113) ~[zookeeper-3.4.14.jar:3.4.14-4c25d480e66aadd371de8bd2fd8da255ac140bcf]
   [junit4]   2> 	at org.apache.zookeeper.ClientCnxnSocketNIO.doIO(ClientCnxnSocketNIO.java:79) ~[zookeeper-3.4.14.jar:3.4.14-4c25d480e66aadd371de8bd2fd8da255ac140bcf]
   [junit4]   2> 	at org.apache.zookeeper.ClientCnxnSocketNIO.doTransport(ClientCnxnSocketNIO.java:366) ~[zookeeper-3.4.14.jar:3.4.14-4c25d480e66aadd371de8bd2fd8da255ac140bcf]
   [junit4]   2> 	at org.apache.zookeeper.ClientCnxn$SendThread.run(ClientCnxn.java:1141) ~[zookeeper-3.4.14.jar:3.4.14-4c25d480e66aadd371de8bd2fd8da255ac140bcf]
   [junit4]   2> 1455069 WARN  (TEST-TestCryptoKeys.test-seed#[DD516B63CE623CD2]-SendThread(serv1-vm3:36808)) [    ] o.a.z.ClientCnxn Session 0x0 for server serv1-vm3/127.0.0.1:36808, unexpected error, closing socket connection and attempting reconnect
   [junit4]   2>           => java.io.IOException: Packet len352518912 is out of range!
   [junit4]   2> 	at org.apache.zookeeper.ClientCnxnSocket.readLength(ClientCnxnSocket.java:113)
   [junit4]   2> java.io.IOException: Packet len352518912 is out of range!
   [junit4]   2> 	at org.apache.zookeeper.ClientCnxnSocket.readLength(ClientCnxnSocket.java:113) ~[zookeeper-3.4.14.jar:3.4.14-4c25d480e66aadd371de8bd2fd8da255ac140bcf]
   [junit4]   2> 	at org.apache.zookeeper.ClientCnxnSocketNIO.doIO(ClientCnxnSocketNIO.java:79) ~[zookeeper-3.4.14.jar:3.4.14-4c25d480e66aadd371de8bd2fd8da255ac140bcf]
   [junit4]   2> 	at org.apache.zookeeper.ClientCnxnSocketNIO.doTransport(ClientCnxnSocketNIO.java:366) ~[zookeeper-3.4.14.jar:3.4.14-4c25d480e66aadd371de8bd2fd8da255ac140bcf]
   [junit4]   2> 	at org.apache.zookeeper.ClientCnxn$SendThread.run(ClientCnxn.java:1141) ~[zookeeper-3.4.14.jar:3.4.14-4c25d480e66aadd371de8bd2fd8da255ac140bcf]
   [junit4]   2> 1456319 WARN  (TEST-TestCryptoKeys.test-seed#[DD516B63CE623CD2]-SendThread(serv1-vm3:36808)) [    ] o.a.z.ClientCnxn Session 0x0 for server serv1-vm3/127.0.0.1:36808, unexpected error, closing socket connection and attempting reconnect
   [junit4]   2>           => java.io.IOException: Packet len352518912 is out of range!
   [junit4]   2> 	at org.apache.zookeeper.ClientCnxnSocket.readLength(ClientCnxnSocket.java:113)
   [junit4]   2> java.io.IOException: Packet len352518912 is out of range!
   [junit4]   2> 	at org.apache.zookeeper.ClientCnxnSocket.readLength(ClientCnxnSocket.java:113) ~[zookeeper-3.4.14.jar:3.4.14-4c25d480e66aadd371de8bd2fd8da255ac140bcf]
   [junit4]   2> 	at org.apache.zookeeper.ClientCnxnSocketNIO.doIO(ClientCnxnSocketNIO.java:79) ~[zookeeper-3.4.14.jar:3.4.14-4c25d480e66aadd371de8bd2fd8da255ac140bcf]
   [junit4]   2> 	at org.apache.zookeeper.ClientCnxnSocketNIO.doTransport(ClientCnxnSocketNIO.java:366) ~[zookeeper-3.4.14.jar:3.4.14-4c25d480e66aadd371de8bd2fd8da255ac140bcf]
   [junit4]   2> 	at org.apache.zookeeper.ClientCnxn$SendThread.run(ClientCnxn.java:1141) ~[zookeeper-3.4.14.jar:3.4.14-4c25d480e66aadd371de8bd2fd8da255ac140bcf]
   [junit4]   2> 1458333 WARN  (TEST-TestCryptoKeys.test-seed#[DD516B63CE623CD2]-SendThread(serv1-vm3:36808)) [    ] o.a.z.ClientCnxn Session 0x0 for server serv1-vm3/127.0.0.1:36808, unexpected error, closing socket connection and attempting reconnect
   [junit4]   2>           => java.io.IOException: Packet len352518912 is out of range!
   [junit4]   2> 	at org.apache.zookeeper.ClientCnxnSocket.readLength(ClientCnxnSocket.java:113)
   [junit4]   2> java.io.IOException: Packet len352518912 is out of range!
   [junit4]   2> 	at org.apache.zookeeper.ClientCnxnSocket.readLength(ClientCnxnSocket.java:113) ~[zookeeper-3.4.14.jar:3.4.14-4c25d480e66aadd371de8bd2fd8da255ac140bcf]
   [junit4]   2> 	at org.apache.zookeeper.ClientCnxnSocketNIO.doIO(ClientCnxnSocketNIO.java:79) ~[zookeeper-3.4.14.jar:3.4.14-4c25d480e66aadd371de8bd2fd8da255ac140bcf]
   [junit4]   2> 	at org.apache.zookeeper.ClientCnxnSocketNIO.doTransport(ClientCnxnSocketNIO.java:366) ~[zookeeper-3.4.14.jar:3.4.14-4c25d480e66aadd371de8bd2fd8da255ac140bcf]
   [junit4]   2> 	at org.apache.zookeeper.ClientCnxn$SendThread.run(ClientCnxn.java:1141) ~[zookeeper-3.4.14.jar:3.4.14-4c25d480e66aadd371de8bd2fd8da255ac140bcf]
   [junit4]   2> 1459464 WARN  (TEST-TestCryptoKeys.test-seed#[DD516B63CE623CD2]-SendThread(serv1-vm3:36808)) [    ] o.a.z.ClientCnxn Session 0x0 for server serv1-vm3/127.0.0.1:36808, unexpected error, closing socket connection and attempting reconnect
   [junit4]   2>           => java.io.IOException: Packet len352518912 is out of range!
   [junit4]   2> 	at org.apache.zookeeper.ClientCnxnSocket.readLength(ClientCnxnSocket.java:113)
   [junit4]   2> java.io.IOException: Packet len352518912 is out of range!
   [junit4]   2> 	at org.apache.zookeeper.ClientCnxnSocket.readLength(ClientCnxnSocket.java:113) ~[zookeeper-3.4.14.jar:3.4.14-4c25d480e66aadd371de8bd2fd8da255ac140bcf]
   [junit4]   2> 	at org.apache.zookeeper.ClientCnxnSocketNIO.doIO(ClientCnxnSocketNIO.java:79) ~[zookeeper-3.4.14.jar:3.4.14-4c25d480e66aadd371de8bd2fd8da255ac140bcf]
   [junit4]   2> 	at org.apache.zookeeper.ClientCnxnSocketNIO.doTransport(ClientCnxnSocketNIO.java:366) ~[zookeeper-3.4.14.jar:3.4.14-4c25d480e66aadd371de8bd2fd8da255ac140bcf]
   [junit4]   2> 	at org.apache.zookeeper.ClientCnxn$SendThread.run(ClientCnxn.java:1141) ~[zookeeper-3.4.14.jar:3.4.14-4c25d480e66aadd371de8bd2fd8da255ac140bcf]
   [junit4]   2> 1461532 WARN  (TEST-TestCryptoKeys.test-seed#[DD516B63CE623CD2]-SendThread(serv1-vm3:36808)) [    ] o.a.z.ClientCnxn Session 0x0 for server serv1-vm3/127.0.0.1:36808, unexpected error, closing socket connection and attempting reconnect
   [junit4]   2>           => java.io.IOException: Packet len352518912 is out of range!
   [junit4]   2> 	at org.apache.zookeeper.ClientCnxnSocket.readLength(ClientCnxnSocket.java:113)
   [junit4]   2> java.io.IOException: Packet len352518912 is out of range!
   [junit4]   2> 	at org.apache.zookeeper.ClientCnxnSocket.readLength(ClientCnxnSocket.java:113) ~[zookeeper-3.4.14.jar:3.4.14-4c25d480e66aadd371de8bd2fd8da255ac140bcf]
   [junit4]   2> 	at org.apache.zookeeper.ClientCnxnSocketNIO.doIO(ClientCnxnSocketNIO.java:79) ~[zookeeper-3.4.14.jar:3.4.14-4c25d480e66aadd371de8bd2fd8da255ac140bcf]
   [junit4]   2> 	at org.apache.zookeeper.ClientCnxnSocketNIO.doTransport(ClientCnxnSocketNIO.java:366) ~[zookeeper-3.4.14.jar:3.4.14-4c25d480e66aadd371de8bd2fd8da255ac140bcf]
   [junit4]   2> 	at org.apache.zookeeper.ClientCnxn$SendThread.run(ClientCnxn.java:1141) ~[zookeeper-3.4.14.jar:3.4.14-4c25d480e66aadd371de8bd2fd8da255ac140bcf]
   [junit4]   2> 1462923 WARN  (TEST-TestCryptoKeys.test-seed#[DD516B63CE623CD2]-SendThread(serv1-vm3:36808)) [    ] o.a.z.ClientCnxn Session 0x0 for server serv1-vm3/127.0.0.1:36808, unexpected error, closing socket connection and attempting reconnect
   [junit4]   2>           => java.io.IOException: Packet len352518912 is out of range!
   [junit4]   2> 	at org.apache.zookeeper.ClientCnxnSocket.readLength(ClientCnxnSocket.java:113)
   [junit4]   2> java.io.IOException: Packet len352518912 is out of range!
   [junit4]   2> 	at org.apache.zookeeper.ClientCnxnSocket.readLength(ClientCnxnSocket.java:113) ~[zookeeper-3.4.14.jar:3.4.14-4c25d480e66aadd371de8bd2fd8da255ac140bcf]
   [junit4]   2> 	at org.apache.zookeeper.ClientCnxnSocketNIO.doIO(ClientCnxnSocketNIO.java:79) ~[zookeeper-3.4.14.jar:3.4.14-4c25d480e66aadd371de8bd2fd8da255ac140bcf]
   [junit4]   2> 	at org.apache.zookeeper.ClientCnxnSocketNIO.doTransport(ClientCnxnSocketNIO.java:366) ~[zookeeper-3.4.14.jar:3.4.14-4c25d480e66aadd371de8bd2fd8da255ac140bcf]
   [junit4]   2> 	at org.apache.zookeeper.ClientCnxn$SendThread.run(ClientCnxn.java:1141) ~[zookeeper-3.4.14.jar:3.4.14-4c25d480e66aadd371de8bd2fd8da255ac140bcf]
   [junit4]   2> 1464045 WARN  (TEST-TestCryptoKeys.test-seed#[DD516B63CE623CD2]-SendThread(serv1-vm3:36808)) [    ] o.a.z.ClientCnxn Session 0x0 for server serv1-vm3/127.0.0.1:36808, unexpected error, closing socket connection and attempting reconnect
   [junit4]   2>           => java.io.IOException: Packet len352518912 is out of range!
   [junit4]   2> 	at org.apache.zookeeper.ClientCnxnSocket.readLength(ClientCnxnSocket.java:113)
   [junit4]   2> java.io.IOException: Packet len352518912 is out of range!
   [junit4]   2> 	at org.apache.zookeeper.ClientCnxnSocket.readLength(ClientCnxnSocket.java:113) ~[zookeeper-3.4.14.jar:3.4.14-4c25d480e66aadd371de8bd2fd8da255ac140bcf]
   [junit4]   2> 	at org.apache.zookeeper.ClientCnxnSocketNIO.doIO(ClientCnxnSocketNIO.java:79) ~[zookeeper-3.4.14.jar:3.4.14-4c25d480e66aadd371de8bd2fd8da255ac140bcf]
   [junit4]   2> 	at org.apache.zookeeper.ClientCnxnSocketNIO.doTransport(ClientCnxnSocketNIO.java:366) ~[zookeeper-3.4.14.jar:3.4.14-4c25d480e66aadd371de8bd2fd8da255ac140bcf]
   [junit4]   2> 	at org.apache.zookeeper.ClientCnxn$SendThread.run(ClientCnxn.java:1141) ~[zookeeper-3.4.14.jar:3.4.14-4c25d480e66aadd371de8bd2fd8da255ac140bcf]
   [junit4]   2> 1465618 WARN  (TEST-TestCryptoKeys.test-seed#[DD516B63CE623CD2]-SendThread(serv1-vm3:36808)) [    ] o.a.z.ClientCnxn Session 0x0 for server serv1-vm3/127.0.0.1:36808, unexpected error, closing socket connection and attempting reconnect
   [junit4]   2>           => java.io.IOException: Packet len352518912 is out of range!
   [junit4]   2> 	at org.apache.zookeeper.ClientCnxnSocket.readLength(ClientCnxnSocket.java:113)
   [junit4]   2> java.io.IOException: Packet len352518912 is out of range!
   [junit4]   2> 	at org.apache.zookeeper.ClientCnxnSocket.readLength(ClientCnxnSocket.java:113) ~[zookeeper-3.4.14.jar:3.4.14-4c25d480e66aadd371de8bd2fd8da255ac140bcf]
   [junit4]   2> 	at org.apache.zookeeper.ClientCnxnSocketNIO.doIO(ClientCnxnSocketNIO.java:79) ~[zookeeper-3.4.14.jar:3.4.14-4c25d480e66aadd371de8bd2fd8da255ac140bcf]
   [junit4]   2> 	at org.apache.zookeeper.ClientCnxnSocketNIO.doTransport(ClientCnxnSocketNIO.java:366) ~[zookeeper-3.4.14.jar:3.4.14-4c25d480e66aadd371de8bd2fd8da255ac140bcf]
   [junit4]   2> 	at org.apache.zookeeper.ClientCnxn$SendThread.run(ClientCnxn.java:1141) ~[zookeeper-3.4.14.jar:3.4.14-4c25d480e66aadd371de8bd2fd8da255ac140bcf]
   [junit4]   2> 1466696 ERROR (TEST-TestCryptoKeys.test-seed#[DD516B63CE623CD2]) [    ] o.a.s.s.SolrDispatchFilter Could not start Solr. Check solr/home property and the logs
   [junit4]   2> 1466697 ERROR (TEST-TestCryptoKeys.test-seed#[DD516B63CE623CD2]) [    ] o.a.s.c.SolrCore null:org.apache.solr.common.SolrException: Error occurred while loading solr.xml from zookeeper
   [junit4]   2> 	at org.apache.solr.servlet.SolrDispatchFilter.loadNodeConfig(SolrDispatchFilter.java:283)
   [junit4]   2> 	at org.apache.solr.servlet.SolrDispatchFilter.createCoreContainer(SolrDispatchFilter.java:253)
   [junit4]   2> 	at org.apache.solr.servlet.SolrDispatchFilter.init(SolrDispatchFilter.java:175)
   [junit4]   2> 	at org.eclipse.jetty.servlet.FilterHolder.initialize(FilterHolder.java:136)
   [junit4]   2> 	at org.eclipse.jetty.servlet.ServletHandler.lambda$initialize$0(ServletHandler.java:750)
   [junit4]   2> 	at java.util.Spliterators$ArraySpliterator.forEachRemaining(Spliterators.java:948)
   [junit4]   2> 	at java.util.stream.Streams$ConcatSpliterator.forEachRemaining(Streams.java:742)
   [junit4]   2> 	at java.util.stream.Streams$ConcatSpliterator.forEachRemaining(Streams.java:742)
   [junit4]   2> 	at java.util.stream.ReferencePipeline$Head.forEach(ReferencePipeline.java:580)
   [junit4]   2> 	at org.eclipse.jetty.servlet.ServletHandler.initialize(ServletHandler.java:744)
   [junit4]   2> 	at org.eclipse.jetty.servlet.ServletHandler.updateMappings(ServletHandler.java:1449)
   [junit4]   2> 	at org.eclipse.jetty.servlet.ServletHandler.setFilterMappings(ServletHandler.java:1513)
   [junit4]   2> 	at org.eclipse.jetty.servlet.ServletHandler.addFilterMapping(ServletHandler.java:1158)
   [junit4]   2> 	at org.eclipse.jetty.servlet.ServletHandler.addFilterWithMapping(ServletHandler.java:995)
   [junit4]   2> 	at org.eclipse.jetty.servlet.ServletContextHandler.addFilter(ServletContextHandler.java:467)
   [junit4]   2> 	at org.apache.solr.client.solrj.embedded.JettySolrRunner$1.lifeCycleStarted(JettySolrRunner.java:384)
   [junit4]   2> 	at org.eclipse.jetty.util.component.AbstractLifeCycle.setStarted(AbstractLifeCycle.java:179)
   [junit4]   2> 	at org.eclipse.jetty.util.component.AbstractLifeCycle.start(AbstractLifeCycle.java:69)
   [junit4]   2> 	at org.apache.solr.client.solrj.embedded.JettySolrRunner.retryOnPortBindFailure(JettySolrRunner.java:558)
   [junit4]   2> 	at org.apache.solr.client.solrj.embedded.JettySolrRunner.start(JettySolrRunner.java:497)
   [junit4]   2> 	at org.apache.solr.client.solrj.embedded.JettySolrRunner.start(JettySolrRunner.java:465)
   [junit4]   2> 	at org.apache.solr.cloud.AbstractFullDistribZkTestBase.createServers(AbstractFullDistribZkTestBase.java:333)
   [junit4]   2> 	at org.apache.solr.BaseDistributedSearchTestCase$ShardsRepeatRule$ShardsFixedStatement.callStatement(BaseDistributedSearchTestCase.java:1080)
   [junit4]   2> 	at org.apache.solr.BaseDistributedSearchTestCase$ShardsRepeatRule$ShardsStatement.evaluate(BaseDistributedSearchTestCase.java:1054)
   [junit4]   2> 	at com.carrotsearch.randomizedtesting.rules.SystemPropertiesRestoreRule$1.evaluate(SystemPropertiesRestoreRule.java:57)
   [junit4]   2> 	at org.apache.lucene.util.TestRuleSetupTeardownChained$1.evaluate(TestRuleSetupTeardownChained.java:49)
   [junit4]   2> 	at org.apache.lucene.util.AbstractBeforeAfterRule$1.evaluate(AbstractBeforeAfterRule.java:45)
   [junit4]   2> 	at org.apache.lucene.util.TestRuleThreadAndTestName$1.evaluate(TestRuleThreadAndTestName.java:48)
   [junit4]   2> 	at org.apache.lucene.util.TestRuleIgnoreAfterMaxFailures$1.evaluate(TestRuleIgnoreAfterMaxFailures.java:64)
   [junit4]   2> 	at org.apache.lucene.util.TestRuleMarkFailure$1.evaluate(TestRuleMarkFailure.java:47)
   [junit4]   2> 	at com.carrotsearch.randomizedtesting.rules.StatementAdapter.evaluate(StatementAdapter.java:36)
   [junit4]   2> 	at com.carrotsearch.randomizedtesting.ThreadLeakControl$StatementRunner.run(ThreadLeakControl.java:368)
   [junit4]   2> 	at com.carrotsearch.randomizedtesting.ThreadLeakControl.forkTimeoutingTask(ThreadLeakControl.java:817)
   [junit4]   2> 	at com.carrotsearch.randomizedtesting.ThreadLeakControl$3.evaluate(ThreadLeakControl.java:468)
   [junit4]   2> 	at com.carrotsearch.randomizedtesting.RandomizedRunner.runSingleTest(RandomizedRunner.java:947)
   [junit4]   2> 	at com.carrotsearch.randomizedtesting.RandomizedRunner$5.evaluate(RandomizedRunner.java:832)
   [junit4]   2> 	at com.carrotsearch.randomizedtesting.RandomizedRunner$6.evaluate(RandomizedRunner.java:883)
   [junit4]   2> 	at com.carrotsearch.randomizedtesting.RandomizedRunner$7.evaluate(RandomizedRunner.java:894)
   [junit4]   2> 	at com.carrotsearch.randomizedtesting.rules.StatementAdapter.evaluate(StatementAdapter.java:36)
   [junit4]   2> 	at com.carrotsearch.randomizedtesting.rules.SystemPropertiesRestoreRule$1.evaluate(SystemPropertiesRestoreRule.java:57)
   [junit4]   2> 	at org.apache.lucene.util.AbstractBeforeAfterRule$1.evaluate(AbstractBeforeAfterRule.java:45)
   [junit4]   2> 	at com.carrotsearch.randomizedtesting.rules.StatementAdapter.evaluate(StatementAdapter.java:36)
   [junit4]   2> 	at org.apache.lucene.util.TestRuleStoreClassName$1.evaluate(TestRuleStoreClassName.java:41)
   [junit4]   2> 	at com.carrotsearch.randomizedtesting.rules.NoShadowingOrOverridesOnMethodsRule$1.evaluate(NoShadowingOrOverridesOnMethodsRule.java:40)
   [junit4]   2> 	at com.carrotsearch.randomizedtesting.rules.NoShadowingOrOverridesOnMethodsRule$1.evaluate(NoShadowingOrOverridesOnMethodsRule.java:40)
   [junit4]   2> 	at com.carrotsearch.randomizedtesting.rules.StatementAdapter.evaluate(StatementAdapter.java:36)
   [junit4]   2> 	at com.carrotsearch.randomizedtesting.rules.StatementAdapter.evaluate(StatementAdapter.java:36)
   [junit4]   2> 	at com.carrotsearch.randomizedtesting.rules.StatementAdapter.evaluate(StatementAdapter.java:36)
   [junit4]   2> 	at org.apache.lucene.util.TestRuleAssertionsRequired$1.evaluate(TestRuleAssertionsRequired.java:53)
   [junit4]   2> 	at org.apache.lucene.util.TestRuleMarkFailure$1.evaluate(TestRuleMarkFailure.java:47)
   [junit4]   2> 	at org.apache.lucene.util.TestRuleIgnoreAfterMaxFailures$1.evaluate(TestRuleIgnoreAfterMaxFailures.java:64)
   [junit4]   2> 	at org.apache.lucene.util.TestRuleIgnoreTestSuites$1.evaluate(TestRuleIgnoreTestSuites.java:54)
   [junit4]   2> 	at com.carrotsearch.randomizedtesting.rules.StatementAdapter.evaluate(StatementAdapter.java:36)
   [junit4]   2> 	at com.carrotsearch.randomizedtesting.ThreadLeakControl$StatementRunner.run(ThreadLeakControl.java:368)
   [junit4]   2> 	at java.lang.Thread.run(Thread.java:748)
   [junit4]   2> Caused by: org.apache.solr.common.SolrException: java.util.concurrent.TimeoutException: Could not connect to ZooKeeper 127.0.0.1:36808/solr within 30000 ms
   [junit4]   2> 	at org.apache.solr.common.cloud.SolrZkClient.<init>(SolrZkClient.java:201)
   [junit4]   2> 	at org.apache.solr.common.cloud.SolrZkClient.<init>(SolrZkClient.java:126)
   [junit4]   2> 	at org.apache.solr.common.cloud.SolrZkClient.<init>(SolrZkClient.java:121)
   [junit4]   2> 	at org.apache.solr.common.cloud.SolrZkClient.<init>(SolrZkClient.java:108)
   [junit4]   2> 	at org.apache.solr.servlet.SolrDispatchFilter.loadNodeConfig(SolrDispatchFilter.java:276)
   [junit4]   2> 	... 54 more
   [junit4]   2> Caused by: java.util.concurrent.TimeoutException: Could not connect to ZooKeeper 127.0.0.1:36808/solr within 30000 ms
   [junit4]   2> 	at org.apache.solr.common.cloud.ConnectionManager.waitForConnected(ConnectionManager.java:250)
   [junit4]   2> 	at org.apache.solr.common.cloud.SolrZkClient.<init>(SolrZkClient.java:193)
   [junit4]   2> 	... 58 more
   [junit4]   2> 
   [junit4]   2> 1468317 INFO  (closeThreadPool-10066-thread-2) [    ] o.e.j.s.AbstractConnector Stopped ServerConnector@3e461cee{SSL,[ssl, http/1.1]}{127.0.0.1:0}
   [junit4]   2> 1468323 INFO  (closeThreadPool-10066-thread-2) [    ] o.e.j.s.h.ContextHandler Stopped o.e.j.s.ServletContextHandler@25c62fef{/qkla/t,null,UNAVAILABLE}
   [junit4]   2> 1468324 INFO  (closeThreadPool-10066-thread-2) [    ] o.e.j.s.session node0 Stopped scavenging
   [junit4]   2> 1468325 INFO  (TEST-TestCryptoKeys.test-seed#[DD516B63CE623CD2]) [    ] o.a.s.c.ZkTestServer Shutting down ZkTestServer.
   [junit4]   2> 1468331 INFO  (TEST-TestCryptoKeys.test-seed#[DD516B63CE623CD2]) [    ] o.a.s.c.ZkTestServer parse host and port list: 127.0.0.1:36808
   [junit4]   2> 1468331 INFO  (TEST-TestCryptoKeys.test-seed#[DD516B63CE623CD2]) [    ] o.a.s.c.ZkTestServer connecting to 127.0.0.1 36808
   [junit4]   2> NOTE: reproduce with: ant test  -Dtestcase=TestCryptoKeys -Dtests.method=test -Dtests.seed=DD516B63CE623CD2 -Dtests.slow=true -Dtests.locale=et-EE -Dtests.timezone=Europe/Guernsey -Dtests.asserts=true -Dtests.file.encoding=UTF-8
   [junit4] ERROR   32.5s J1 | TestCryptoKeys.test <<<
   [junit4]    > Throwable #1: java.lang.RuntimeException: Jetty/Solr unresponsive
   [junit4]    > 	at __randomizedtesting.SeedInfo.seed([DD516B63CE623CD2:550554B9609E512A]:0)
   [junit4]    > 	at org.apache.solr.client.solrj.embedded.JettySolrRunner.start(JettySolrRunner.java:507)
   [junit4]    > 	at org.apache.solr.client.solrj.embedded.JettySolrRunner.start(JettySolrRunner.java:465)
   [junit4]    > 	at org.apache.solr.cloud.AbstractFullDistribZkTestBase.createServers(AbstractFullDistribZkTestBase.java:333)
   [junit4]    > 	at org.apache.solr.BaseDistributedSearchTestCase$ShardsRepeatRule$ShardsFixedStatement.callStatement(BaseDistributedSearchTestCase.java:1080)
   [junit4]    > 	at org.apache.solr.BaseDistributedSearchTestCase$ShardsRepeatRule$ShardsStatement.evaluate(BaseDistributedSearchTestCase.java:1054)
   [junit4]    > 	at java.lang.Thread.run(Thread.java:748)
   [junit4]   2> NOTE: leaving temporary files on disk at: /export/home/jenkins/workspace/Lucene-Solr-8.x-Solaris/solr/build/solr-core/test/J1/temp/solr.cloud.TestCryptoKeys_DD516B63CE623CD2-001
   [junit4]   2> May 03, 2019 9:32:56 PM com.carrotsearch.randomizedtesting.ThreadLeakControl checkThreadLeaks
   [junit4]   2> WARNING: Will linger awaiting termination of 3 leaked thread(s).
   [junit4]   2> NOTE: test params are: codec=Asserting(Lucene80): {}, docValues:{}, maxPointsInLeafNode=1441, maxMBSortInHeap=6.903676021412609, sim=Asserting(org.apache.lucene.search.similarities.AssertingSimilarity@5bd2d323), locale=et-EE, timezone=Europe/Guernsey
   [junit4]   2> NOTE: SunOS 5.11 amd64/Oracle Corporation 1.8.0_201 (64-bit)/cpus=3,threads=1,free=123897632,total=433864704
   [junit4]   2> NOTE: All tests run in this JVM: [IndexSchemaTest, SearchHandlerTest, LeaderElectionIntegrationTest, TestLFUCache, TestQuerySenderNoQuery, ZkStateReaderTest, ConcurrentDeleteAndCreateCollectionTest, TimeRoutedAliasUpdateProcessorTest, ExternalFileFieldSortTest, ClusterStateTest, TestSolrDeletionPolicy2, HdfsDirectoryTest, TestNamedUpdateProcessors, TestMacros, TestSmileRequest, IndexBasedSpellCheckerTest, BasicZkTest, NodeLostTriggerTest, ReturnFieldsTest, HdfsRecoverLeaseTest, TestSolr4Spatial2, TestCloudDeleteByQuery, BasicDistributedZk2Test, TestManagedSchemaThreadSafety, UUIDFieldTest, TestWithCollection, TestSchemaResource, DistributedSuggestComponentTest, TestWordDelimiterFilterFactory, TestPushWriter, CoreMergeIndexesAdminHandlerTest, TestSubQueryTransformerCrossCore, ConfigureRecoveryStrategyTest, TestIndexSearcher, StatsReloadRaceTest, OverseerRolesTest, TestNestedDocsSort, OutOfBoxZkACLAndCredentialsProvidersTest, SolrRequestParserTest, AddBlockUpdateTest, TestConfigsApi, TestSolrXml, HttpPartitionWithTlogReplicasTest, TestSolrConfigHandlerConcurrent, TestImpersonationWithHadoopAuth, HLLSerializationTest, UninvertDocValuesMergePolicyTest, TestExtendedDismaxParser, SolrPluginUtilsTest, CustomHighlightComponentTest, SharedFSAutoReplicaFailoverTest, HdfsBasicDistributedZkTest, TestNestedUpdateProcessor, MultiDestinationAuditLoggerTest, TestPrepRecovery, HttpPartitionOnCommitTest, SolrTestCaseJ4Test, CloneFieldUpdateProcessorFactoryTest, TestLegacyNumericRangeQueryBuilder, TestSolrCLIRunExample, TestGeoJSONResponseWriter, SpellCheckCollatorWithCollapseTest, TestInPlaceUpdatesDistrib, TestDistributedStatsComponentCardinality, CursorPagingTest, PreAnalyzedFieldManagedSchemaCloudTest, TestLazyCores, BlockJoinFacetRandomTest, TestSolrQueryResponse, DeleteShardTest, TestFieldSortValues, TestRestManager, MinimalSchemaTest, TestMultiWordSynonyms, XmlUpdateRequestHandlerTest, TestRecoveryHdfs, OverseerCollectionConfigSetProcessorTest, TestQueryTypes, ShardRoutingCustomTest, QueryResultKeyTest, TestXmlQParserPlugin, DistributedExpandComponentTest, TestUseDocValuesAsStored, TestTrackingShardHandlerFactory, TestSimpleTrackingShardHandler, TestWriterPerf, TestFileDictionaryLookup, SolrIndexMetricsTest, TestCoreDiscovery, TestDocSet, TestManagedSynonymFilterFactory, TaggerTest, TestCharFilters, TestNumericTokenStream, CollectionsAPIAsyncDistributedZkTest, SearchRateTriggerIntegrationTest, CopyFieldTest, TestManagedSchema, JWTAuthPluginIntegrationTest, DistribJoinFromCollectionTest, TestTolerantUpdateProcessorRandomCloud, TestDistributedMissingSort, TestExactStatsCache, TestValueSourceCache, TestJsonFacetRefinement, TestCollectionsAPIViaSolrCloudCluster, TestSimPolicyCloud, TestPullReplicaErrorHandling, LukeRequestHandlerTest, TestRestoreCore, TestRawTransformer, UpdateParamsTest, TestFacetMethods, TlogReplayBufferedWhileIndexingTest, TestDocumentBuilder, TestFieldResource, SortByFunctionTest, CollectionsAPISolrJTest, TestHdfsUpdateLog, TestSegmentSorting, TestStressUserVersions, TestCoreBackup, HighlighterConfigTest, RecoveryZkTest, TestLegacyTerms, TestConfig, LeaderFailoverAfterPartitionTest, CheckHdfsIndexTest, TestMinMaxOnMultiValuedField, TestConfigSets, TestCSVResponseWriter, TestSimNodeAddedTrigger, BlockDirectoryTest, TermVectorComponentTest, InfoHandlerTest, AuthToolTest, TestClusterProperties, CursorMarkTest, TestSearcherReuse, TestConfigSetsAPIExclusivity, MaxSizeAutoCommitTest, TestSizeLimitedDistributedMap, SuggesterTSTTest, TestCryptoKeys]
   [junit4] Completed [337/855 (1!)] on J1 in 32.83s, 1 test, 1 error <<< FAILURES!

[...truncated 328 lines...]
   [junit4] Suite: org.apache.solr.cloud.AliasIntegrationTest
   [junit4]   2> Creating dataDir: /export/home/jenkins/workspace/Lucene-Solr-8.x-Solaris/solr/build/solr-core/test/J0/temp/solr.cloud.AliasIntegrationTest_DD516B63CE623CD2-001/init-core-data-001
   [junit4]   2> 1842117 INFO  (SUITE-AliasIntegrationTest-seed#[DD516B63CE623CD2]-worker) [    ] o.a.s.c.MiniSolrCloudCluster Starting cluster of 2 servers in /export/home/jenkins/workspace/Lucene-Solr-8.x-Solaris/solr/build/solr-core/test/J0/temp/solr.cloud.AliasIntegrationTest_DD516B63CE623CD2-001/tempDir-001
   [junit4]   2> 1842117 INFO  (SUITE-AliasIntegrationTest-seed#[DD516B63CE623CD2]-worker) [    ] o.a.s.c.ZkTestServer STARTING ZK TEST SERVER
   [junit4]   2> 1842118 INFO  (ZkTestServer Run Thread) [    ] o.a.s.c.ZkTestServer client port:0.0.0.0/0.0.0.0:0
   [junit4]   2> 1842118 INFO  (ZkTestServer Run Thread) [    ] o.a.s.c.ZkTestServer Starting server
   [junit4]   2> 1842219 INFO  (SUITE-AliasIntegrationTest-seed#[DD516B63CE623CD2]-worker) [    ] o.a.s.c.ZkTestServer start zk server on port:38644
   [junit4]   2> 1842219 INFO  (SUITE-AliasIntegrationTest-seed#[DD516B63CE623CD2]-worker) [    ] o.a.s.c.ZkTestServer parse host and port list: 127.0.0.1:38644
   [junit4]   2> 1842219 INFO  (SUITE-AliasIntegrationTest-seed#[DD516B63CE623CD2]-worker) [    ] o.a.s.c.ZkTestServer connecting to 127.0.0.1 38644
   [junit4]   2> 1842230 INFO  (zkConnectionManagerCallback-13236-thread-1) [    ] o.a.s.c.c.ConnectionManager zkClient has connected
   [junit4]   2> 1842233 INFO  (zkConnectionManagerCallback-13238-thread-1) [    ] o.a.s.c.c.ConnectionManager zkClient has connected
   [junit4]   2> 1842235 INFO  (zkConnectionManagerCallback-13240-thread-1) [    ] o.a.s.c.c.ConnectionManager zkClient has connected
   [junit4]   2> 1842237 WARN  (jetty-launcher-13241-thread-1) [    ] o.e.j.s.AbstractConnector Ignoring deprecated socket close linger time
   [junit4]   2> 1842237 WARN  (jetty-launcher-13241-thread-2) [    ] o.e.j.s.AbstractConnector Ignoring deprecated socket close linger time
   [junit4]   2> 1842237 INFO  (jetty-launcher-13241-thread-1) [    ] o.a.s.c.s.e.JettySolrRunner Start Jetty (original configured port=0)
   [junit4]   2> 1842237 INFO  (jetty-launcher-13241-thread-1) [    ] o.a.s.c.s.e.JettySolrRunner Trying to start Jetty on port 0 try number 1 ...
   [junit4]   2> 1842237 INFO  (jetty-launcher-13241-thread-1) [    ] o.e.j.s.Server jetty-9.4.14.v20181114; built: 2018-11-14T21:20:31.478Z; git: c4550056e785fb5665914545889f21dc136ad9e6; jvm 1.8.0_201-b09
   [junit4]   2> 1842237 INFO  (jetty-launcher-13241-thread-2) [    ] o.a.s.c.s.e.JettySolrRunner Start Jetty (original configured port=0)
   [junit4]   2> 1842237 INFO  (jetty-launcher-13241-thread-2) [    ] o.a.s.c.s.e.JettySolrRunner Trying to start Jetty on port 0 try number 1 ...
   [junit4]   2> 1842237 INFO  (jetty-launcher-13241-thread-2) [    ] o.e.j.s.Server jetty-9.4.14.v20181114; built: 2018-11-14T21:20:31.478Z; git: c4550056e785fb5665914545889f21dc136ad9e6; jvm 1.8.0_201-b09
   [junit4]   2> 1842238 INFO  (jetty-launcher-13241-thread-1) [    ] o.e.j.s.session DefaultSessionIdManager workerName=node0
   [junit4]   2> 1842238 INFO  (jetty-launcher-13241-thread-1) [    ] o.e.j.s.session No SessionScavenger set, using defaults
   [junit4]   2> 1842238 INFO  (jetty-launcher-13241-thread-1) [    ] o.e.j.s.session node0 Scavenging every 600000ms
   [junit4]   2> 1842239 INFO  (jetty-launcher-13241-thread-1) [    ] o.e.j.s.h.ContextHandler Started o.e.j.s.ServletContextHandler@358efa31{/solr,null,AVAILABLE}
   [junit4]   2> 1842239 INFO  (jetty-launcher-13241-thread-2) [    ] o.e.j.s.session DefaultSessionIdManager workerName=node0
   [junit4]   2> 1842239 INFO  (jetty-launcher-13241-thread-2) [    ] o.e.j.s.session No SessionScavenger set, using defaults
   [junit4]   2> 1842239 INFO  (jetty-launcher-13241-thread-2) [    ] o.e.j.s.session node0 Scavenging every 660000ms
   [junit4]   2> 1842239 INFO  (jetty-launcher-13241-thread-2) [    ] o.e.j.s.h.ContextHandler Started o.e.j.s.ServletContextHandler@4d1f4883{/solr,null,AVAILABLE}
   [junit4]   2> 1842239 INFO  (jetty-launcher-13241-thread-1) [    ] o.e.j.s.AbstractConnector Started ServerConnector@7f0a0782{HTTP/1.1,[http/1.1, h2c]}{127.0.0.1:49249}
   [junit4]   2> 1842239 INFO  (jetty-launcher-13241-thread-1) [    ] o.e.j.s.Server Started @1843818ms
   [junit4]   2> 1842239 INFO  (jetty-launcher-13241-thread-1) [    ] o.a.s.c.s.e.JettySolrRunner Jetty properties: {hostContext=/solr, hostPort=49249}
   [junit4]   2> 1842240 INFO  (jetty-launcher-13241-thread-2) [    ] o.e.j.s.AbstractConnector Started ServerConnector@769f2d3{HTTP/1.1,[http/1.1, h2c]}{127.0.0.1:47789}
   [junit4]   2> 1842240 ERROR (jetty-launcher-13241-thread-1) [    ] o.a.s.u.StartupLoggingUtils Missing Java Option solr.log.dir. Logging may be missing or incomplete.
   [junit4]   2> 1842240 INFO  (jetty-launcher-13241-thread-1) [    ] o.a.s.s.SolrDispatchFilter Using logger factory org.apache.logging.slf4j.Log4jLoggerFactory
   [junit4]   2> 1842240 INFO  (jetty-launcher-13241-thread-2) [    ] o.e.j.s.Server Started @1843818ms
   [junit4]   2> 1842240 INFO  (jetty-launcher-13241-thread-2) [    ] o.a.s.c.s.e.JettySolrRunner Jetty properties: {hostContext=/solr, hostPort=47789}
   [junit4]   2> 1842240 INFO  (jetty-launcher-13241-thread-1) [    ] o.a.s.s.SolrDispatchFilter  ___      _       Welcome to Apache Solr™ version 8.2.0
   [junit4]   2> 1842240 ERROR (jetty-launcher-13241-thread-2) [    ] o.a.s.u.StartupLoggingUtils Missing Java Option solr.log.dir. Logging may be missing or incomplete.
   [junit4]   2> 1842240 INFO  (jetty-launcher-13241-thread-2) [    ] o.a.s.s.SolrDispatchFilter Using logger factory org.apache.logging.slf4j.Log4jLoggerFactory
   [junit4]   2> 1842240 INFO  (jetty-launcher-13241-thread-1) [    ] o.a.s.s.SolrDispatchFilter / __| ___| |_ _   Starting in cloud mode on port null
   [junit4]   2> 1842240 INFO  (jetty-launcher-13241-thread-1) [    ] o.a.s.s.SolrDispatchFilter \__ \/ _ \ | '_|  Install dir: null
   [junit4]   2> 1842240 INFO  (jetty-launcher-13241-thread-1) [    ] o.a.s.s.SolrDispatchFilter |___/\___/_|_|    Start time: 2019-05-03T21:39:10.051Z
   [junit4]   2> 1842240 INFO  (jetty-launcher-13241-thread-2) [    ] o.a.s.s.SolrDispatchFilter  ___      _       Welcome to Apache Solr™ version 8.2.0
   [junit4]   2> 1842240 INFO  (jetty-launcher-13241-thread-2) [    ] o.a.s.s.SolrDispatchFilter / __| ___| |_ _   Starting in cloud mode on port null
   [junit4]   2> 1842240 INFO  (jetty-launcher-13241-thread-2) [    ] o.a.s.s.SolrDispatchFilter \__ \/ _ \ | '_|  Install dir: null
   [junit4]   2> 1842240 INFO  (jetty-launcher-13241-thread-2) [    ] o.a.s.s.SolrDispatchFilter |___/\___/_|_|    Start time: 2019-05-03T21:39:10.051Z
   [junit4]   2> 1842242 INFO  (zkConnectionManagerCallback-13245-thread-1) [    ] o.a.s.c.c.ConnectionManager zkClient has connected
   [junit4]   2> 1842242 INFO  (zkConnectionManagerCallback-13244-thread-1) [    ] o.a.s.c.c.ConnectionManager zkClient has connected
   [junit4]   2> 1842242 INFO  (jetty-launcher-13241-thread-1) [    ] o.a.s.s.SolrDispatchFilter solr.xml found in ZooKeeper. Loading...
   [junit4]   2> 1842242 INFO  (jetty-launcher-13241-thread-2) [    ] o.a.s.s.SolrDispatchFilter solr.xml found in ZooKeeper. Loading...
   [junit4]   2> 1843253 INFO  (jetty-launcher-13241-thread-1) [    ] o.a.s.h.c.HttpShardHandlerFactory Host whitelist initialized: WhitelistHostChecker [whitelistHosts=null, whitelistHostCheckingEnabled=true]
   [junit4]   2> 1843254 WARN  (jetty-launcher-13241-thread-1) [    ] o.e.j.u.s.S.config No Client EndPointIdentificationAlgorithm configured for SslContextFactory@14484b5a[provider=null,keyStore=null,trustStore=null]
   [junit4]   2> 1843256 WARN  (jetty-launcher-13241-thread-1) [    ] o.e.j.u.s.S.config No Client EndPointIdentificationAlgorithm configured for SslContextFactory@28aa816d[provider=null,keyStore=null,trustStore=null]
   [junit4]   2> 1843257 INFO  (jetty-launcher-13241-thread-1) [    ] o.a.s.c.ZkContainer Zookeeper client=127.0.0.1:38644/solr
   [junit4]   2> 1843259 INFO  (zkConnectionManagerCallback-13253-thread-1) [    ] o.a.s.c.c.ConnectionManager zkClient has connected
   [junit4]   2> 1843261 INFO  (zkConnectionManagerCallback-13255-thread-1) [    ] o.a.s.c.c.ConnectionManager zkClient has connected
   [junit4]   2> 1843551 INFO  (jetty-launcher-13241-thread-2) [    ] o.a.s.h.c.HttpShardHandlerFactory Host whitelist initialized: WhitelistHostChecker [whitelistHosts=null, whitelistHostCheckingEnabled=true]
   [junit4]   2> 1843553 WARN  (jetty-launcher-13241-thread-2) [    ] o.e.j.u.s.S.config No Client EndPointIdentificationAlgorithm configured for SslContextFactory@6408f1b5[provider=null,keyStore=null,trustStore=null]
   [junit4]   2> 1843556 WARN  (jetty-launcher-13241-thread-2) [    ] o.e.j.u.s.S.config No Client EndPointIdentificationAlgorithm configured for SslContextFactory@5d69c534[provider=null,keyStore=null,trustStore=null]
   [junit4]   2> 1843557 INFO  (jetty-launcher-13241-thread-2) [    ] o.a.s.c.ZkContainer Zookeeper client=127.0.0.1:38644/solr
   [junit4]   2> 1843560 INFO  (zkConnectionManagerCallback-13263-thread-1) [    ] o.a.s.c.c.ConnectionManager zkClient has connected
   [junit4]   2> 1843652 INFO  (zkConnectionManagerCallback-13265-thread-1) [    ] o.a.s.c.c.ConnectionManager zkClient has connected
   [junit4]   2> 1843660 INFO  (jetty-launcher-13241-thread-1) [n:127.0.0.1:49249_solr    ] o.a.s.c.OverseerElectionContext I am going to be the leader 127.0.0.1:49249_solr
   [junit4]   2> 1843661 INFO  (jetty-launcher-13241-thread-1) [n:127.0.0.1:49249_solr    ] o.a.s.c.Overseer Overseer (id=72077601923268614-127.0.0.1:49249_solr-n_0000000000) starting
   [junit4]   2> 1843667 INFO  (zkConnectionManagerCallback-13270-thread-1) [    ] o.a.s.c.c.ConnectionManager zkClient has connected
   [junit4]   2> 1843670 INFO  (jetty-launcher-13241-thread-1) [n:127.0.0.1:49249_solr    ] o.a.s.c.s.i.ZkClientClusterStateProvider Cluster at 127.0.0.1:38644/solr ready
   [junit4]   2> 1843671 INFO  (jetty-launcher-13241-thread-1) [n:127.0.0.1:49249_solr    ] o.a.s.c.ZkController Register node as live in ZooKeeper:/live_nodes/127.0.0.1:49249_solr
   [junit4]   2> 1843672 INFO  (OverseerStateUpdate-72077601923268614-127.0.0.1:49249_solr-n_0000000000) [n:127.0.0.1:49249_solr    ] o.a.s.c.Overseer Starting to work on the main queue : 127.0.0.1:49249_solr
   [junit4]   2> 1843673 INFO  (zkCallback-13269-thread-1) [    ] o.a.s.c.c.ZkStateReader Updated live nodes from ZooKeeper... (0) -> (1)
   [junit4]   2> 1843673 INFO  (jetty-launcher-13241-thread-2) [n:127.0.0.1:47789_solr    ] o.a.s.c.c.ZkStateReader Updated live nodes from ZooKeeper... (0) -> (1)
   [junit4]   2> 1843678 INFO  (jetty-launcher-13241-thread-2) [n:127.0.0.1:47789_solr    ] o.a.s.c.ZkController Publish node=127.0.0.1:47789_solr as DOWN
   [junit4]   2> 1843678 INFO  (jetty-launcher-13241-thread-2) [n:127.0.0.1:47789_solr    ] o.a.s.c.TransientSolrCoreCacheDefault Allocating transient cache for 2147483647 transient cores
   [junit4]   2> 1843678 INFO  (jetty-launcher-13241-thread-2) [n:127.0.0.1:47789_solr    ] o.a.s.c.ZkController Register node as live in ZooKeeper:/live_nodes/127.0.0.1:47789_solr
   [junit4]   2> 1843679 INFO  (zkCallback-13269-thread-1) [    ] o.a.s.c.c.ZkStateReader Updated live nodes from ZooKeeper... (1) -> (2)
   [junit4]   2> 1843681 INFO  (zkCallback-13264-thread-1) [    ] o.a.s.c.c.ZkStateReader Updated live nodes from ZooKeeper... (1) -> (2)
   [junit4]   2> 1843700 INFO  (OverseerStateUpdate-72077601923268614-127.0.0.1:49249_solr-n_0000000000) [n:127.0.0.1:49249_solr    ] o.a.s.c.c.ZkStateReader Updated live nodes from ZooKeeper... (0) -> (1)
   [junit4]   2> 1843701 INFO  (zkCallback-13254-thread-2) [    ] o.a.s.c.c.ZkStateReader Updated live nodes from ZooKeeper... (1) -> (2)
   [junit4]   2> 1843712 INFO  (jetty-launcher-13241-thread-1) [n:127.0.0.1:49249_solr    ] o.a.s.h.a.MetricsHistoryHandler No .system collection, keeping metrics history in memory.
   [junit4]   2> 1843714 INFO  (zkConnectionManagerCallback-13278-thread-1) [    ] o.a.s.c.c.ConnectionManager zkClient has connected
   [junit4]   2> 1843716 INFO  (jetty-launcher-13241-thread-2) [n:127.0.0.1:47789_solr    ] o.a.s.c.c.ZkStateReader Updated live nodes from ZooKeeper... (0) -> (2)
   [junit4]   2> 1843717 INFO  (jetty-launcher-13241-thread-2) [n:127.0.0.1:47789_solr    ] o.a.s.c.s.i.ZkClientClusterStateProvider Cluster at 127.0.0.1:38644/solr ready
   [junit4]   2> 1843717 INFO  (jetty-launcher-13241-thread-2) [n:127.0.0.1:47789_solr    ] o.a.s.h.a.MetricsHistoryHandler No .system collection, keeping metrics history in memory.
   [junit4]   2> 1843738 INFO  (jetty-launcher-13241-thread-1) [n:127.0.0.1:49249_solr    ] o.a.s.m.r.SolrJmxReporter JMX monitoring for 'solr_49249.solr.node' (registry 'solr.node') enabled at server: com.sun.jmx.mbeanserver.JmxMBeanServer@344a1cb0
   [junit4]   2> 1843743 INFO  (jetty-launcher-13241-thread-2) [n:127.0.0.1:47789_solr    ] o.a.s.m.r.SolrJmxReporter JMX monitoring for 'solr_47789.solr.node' (registry 'solr.node') enabled at server: com.sun.jmx.mbeanserver.JmxMBeanServer@344a1cb0
   [junit4]   2> 1843750 INFO  (jetty-launcher-13241-thread-1) [n:127.0.0.1:49249_solr    ] o.a.s.m.r.SolrJmxReporter JMX monitoring for 'solr_49249.solr.jvm' (registry 'solr.jvm') enabled at server: com.sun.jmx.mbeanserver.JmxMBeanServer@344a1cb0
   [junit4]   2> 1843751 INFO  (jetty-launcher-13241-thread-1) [n:127.0.0.1:49249_solr    ] o.a.s.m.r.SolrJmxReporter JMX monitoring for 'solr_49249.solr.jetty' (registry 'solr.jetty') enabled at server: com.sun.jmx.mbeanserver.JmxMBeanServer@344a1cb0
   [junit4]   2> 1843751 INFO  (jetty-launcher-13241-thread-2) [n:127.0.0.1:47789_solr    ] o.a.s.m.r.SolrJmxReporter JMX monitoring for 'solr_47789.solr.jvm' (registry 'solr.jvm') enabled at server: com.sun.jmx.mbeanserver.JmxMBeanServer@344a1cb0
   [junit4]   2> 1843751 INFO  (jetty-launcher-13241-thread-2) [n:127.0.0.1:47789_solr    ] o.a.s.m.r.SolrJmxReporter JMX monitoring for 'solr_47789.solr.jetty' (registry 'solr.jetty') enabled at server: com.sun.jmx.mbeanserver.JmxMBeanServer@344a1cb0
   [junit4]   2> 1843752 INFO  (jetty-launcher-13241-thread-1) [n:127.0.0.1:49249_solr    ] o.a.s.c.CorePropertiesLocator Found 0 core definitions underneath /export/home/jenkins/workspace/Lucene-Solr-8.x-Solaris/solr/build/solr-core/test/J0/temp/solr.cloud.AliasIntegrationTest_DD516B63CE623CD2-001/tempDir-001/node1/.
   [junit4]   2> 1843752 INFO  (jetty-launcher-13241-thread-2) [n:127.0.0.1:47789_solr    ] o.a.s.c.CorePropertiesLocator Found 0 core definitions underneath /export/home/jenkins/workspace/Lucene-Solr-8.x-Solaris/solr/build/solr-core/test/J0/temp/solr.cloud.AliasIntegrationTest_DD516B63CE623CD2-001/tempDir-001/node2/.
   [junit4]   2> 1843786 INFO  (zkConnectionManagerCallback-13284-thread-1) [    ] o.a.s.c.c.ConnectionManager zkClient has connected
   [junit4]   2> 1843788 INFO  (SUITE-AliasIntegrationTest-seed#[DD516B63CE623CD2]-worker) [    ] o.a.s.c.c.ZkStateReader Updated live nodes from ZooKeeper... (0) -> (2)
   [junit4]   2> 1843789 INFO  (SUITE-AliasIntegrationTest-seed#[DD516B63CE623CD2]-worker) [    ] o.a.s.c.s.i.ZkClientClusterStateProvider Cluster at 127.0.0.1:38644/solr ready
   [junit4]   2> 1843814 INFO  (qtp1331768823-34635) [n:127.0.0.1:47789_solr    ] o.a.s.h.a.CollectionsHandler Invoked Collection Action :create with params collection.configName=conf&name=collection1&nrtReplicas=1&action=CREATE&numShards=2&wt=javabin&version=2 and sendToOCPQueue=true
   [junit4]   2> 1843818 INFO  (OverseerThreadFactory-10372-thread-1-processing-n:127.0.0.1:49249_solr) [n:127.0.0.1:49249_solr    ] o.a.s.c.a.c.CreateCollectionCmd Create collection collection1
   [junit4]   2> 1843927 INFO  (OverseerStateUpdate-72077601923268614-127.0.0.1:49249_solr-n_0000000000) [n:127.0.0.1:49249_solr    ] o.a.s.c.o.SliceMutator createReplica() {
   [junit4]   2>   "operation":"ADDREPLICA",
   [junit4]   2>   "collection":"collection1",
   [junit4]   2>   "shard":"shard1",
   [junit4]   2>   "core":"collection1_shard1_replica_n1",
   [junit4]   2>   "state":"down",
   [junit4]   2>   "base_url":"http://127.0.0.1:47789/solr",
   [junit4]   2>   "type":"NRT",
   [junit4]   2>   "waitForFinalState":"false"} 
   [junit4]   2> 1843931 INFO  (OverseerStateUpdate-72077601923268614-127.0.0.1:49249_solr-n_0000000000) [n:127.0.0.1:49249_solr    ] o.a.s.c.o.SliceMutator createReplica() {
   [junit4]   2>   "operation":"ADDREPLICA",
   [junit4]   2>   "collection":"collection1",
   [junit4]   2>   "shard":"shard2",
   [junit4]   2>   "core":"collection1_shard2_replica_n2",
   [junit4]   2>   "state":"down",
   [junit4]   2>   "base_url":"http://127.0.0.1:49249/solr",
   [junit4]   2>   "type":"NRT",
   [junit4]   2>   "waitForFinalState":"false"} 
   [junit4]   2> 1844134 INFO  (qtp1331768823-34639) [n:127.0.0.1:47789_solr    x:collection1_shard1_replica_n1] o.a.s.h.a.CoreAdminOperation core create command qt=/admin/cores&coreNodeName=core_node3&collection.configName=conf&newCollection=true&name=collection1_shard1_replica_n1&action=CREATE&numShards=2&collection=collection1&shard=shard1&wt=javabin&version=2&replicaType=NRT
   [junit4]   2> 1844134 INFO  (qtp2109641278-34628) [n:127.0.0.1:49249_solr    x:collection1_shard2_replica_n2] o.a.s.h.a.CoreAdminOperation core create command qt=/admin/cores&coreNodeName=core_node4&collection.configName=conf&newCollection=true&name=collection1_shard2_replica_n2&action=CREATE&numShards=2&collection=collection1&shard=shard2&wt=javabin&version=2&replicaType=NRT
   [junit4]   2> 1844134 INFO  (qtp2109641278-34628) [n:127.0.0.1:49249_solr    x:collection1_shard2_replica_n2] o.a.s.c.TransientSolrCoreCacheDefault Allocating transient cache for 2147483647 transient cores
   [junit4]   2> 1845154 INFO  (qtp2109641278-34628) [n:127.0.0.1:49249_solr c:collection1 s:shard2 r:core_node4 x:collection1_shard2_replica_n2] o.a.s.c.SolrConfig Using Lucene MatchVersion: 8.2.0
   [junit4]   2> 1845154 INFO  (qtp1331768823-34639) [n:127.0.0.1:47789_solr c:collection1 s:shard1 r:core_node3 x:collection1_shard1_replica_n1] o.a.s.c.SolrConfig Using Lucene MatchVersion: 8.2.0
   [junit4]   2> 1845162 INFO  (qtp1331768823-34639) [n:127.0.0.1:47789_solr c:collection1 s:shard1 r:core_node3 x:collection1_shard1_replica_n1] o.a.s.s.IndexSchema [collection1_shard1_replica_n1] Schema name=minimal
   [junit4]   2> 1845162 INFO  (qtp2109641278-34628) [n:127.0.0.1:49249_solr c:collection1 s:shard2 r:core_node4 x:collection1_shard2_replica_n2] o.a.s.s.IndexSchema [collection1_shard2_replica_n2] Schema name=minimal
   [junit4]   2> 1845180 INFO  (qtp1331768823-34639) [n:127.0.0.1:47789_solr c:collection1 s:shard1 r:core_node3 x:collection1_shard1_replica_n1] o.a.s.s.IndexSchema Loaded schema minimal/1.1 with uniqueid field id
   [junit4]   2> 1845180 INFO  (qtp1331768823-34639) [n:127.0.0.1:47789_solr c:collection1 s:shard1 r:core_node3 x:collection1_shard1_replica_n1] o.a.s.c.CoreContainer Creating SolrCore 'collection1_shard1_replica_n1' using configuration from collection collection1, trusted=true
   [junit4]   2> 1845181 INFO  (qtp1331768823-34639) [n:127.0.0.1:47789_solr c:collection1 s:shard1 r:core_node3 x:collection1_shard1_replica_n1] o.a.s.m.r.SolrJmxReporter JMX monitoring for 'solr_47789.solr.core.collection1.shard1.replica_n1' (registry 'solr.core.collection1.shard1.replica_n1') enabled at server: com.sun.jmx.mbeanserver.JmxMBeanServer@344a1cb0
   [junit4]   2> 1845181 INFO  (qtp2109641278-34628) [n:127.0.0.1:49249_solr c:collection1 s:shard2 r:core_node4 x:collection1_shard2_replica_n2] o.a.s.s.IndexSchema Loaded schema minimal/1.1 with uniqueid field id
   [junit4]   2> 1845181 INFO  (qtp2109641278-34628) [n:127.0.0.1:49249_solr c:collection1 s:shard2 r:core_node4 x:collection1_shard2_replica_n2] o.a.s.c.CoreContainer Creating SolrCore 'collection1_shard2_replica_n2' using configuration from collection collection1, trusted=true
   [junit4]   2> 1845181 INFO  (qtp1331768823-34639) [n:127.0.0.1:47789_solr c:collection1 s:shard1 r:core_node3 x:collection1_shard1_replica_n1] o.a.s.c.SolrCore [[collection1_shard1_replica_n1] ] Opening new SolrCore at [/export/home/jenkins/workspace/Lucene-Solr-8.x-Solaris/solr/build/solr-core/test/J0/temp/solr.cloud.AliasIntegrationTest_DD516B63CE623CD2-001/tempDir-001/node2/collection1_shard1_replica_n1], dataDir=[/export/home/jenkins/workspace/Lucene-Solr-8.x-Solaris/solr/build/solr-core/test/J0/temp/solr.cloud.AliasIntegrationTest_DD516B63CE623CD2-001/tempDir-001/node2/./collection1_shard1_replica_n1/data/]
   [junit4]   2> 1845181 INFO  (qtp2109641278-34628) [n:127.0.0.1:49249_solr c:collection1 s:shard2 r:core_node4 x:collection1_shard2_replica_n2] o.a.s.m.r.SolrJmxReporter JMX monitoring for 'solr_49249.solr.core.collection1.shard2.replica_n2' (registry 'solr.core.collection1.shard2.replica_n2') enabled at server: com.sun.jmx.mbeanserver.JmxMBeanServer@344a1cb0
   [junit4]   2> 1845181 INFO  (qtp2109641278-34628) [n:127.0.0.1:49249_solr c:collection1 s:shard2 r:core_node4 x:collection1_shard2_replica_n2] o.a.s.c.SolrCore [[collection1_shard2_replica_n2] ] Opening new SolrCore at [/export/home/jenkins/workspace/Lucene-Solr-8.x-Solaris/solr/build/solr-core/test/J0/temp/solr.cloud.AliasIntegrationTest_DD516B63CE623CD2-001/tempDir-001/node1/collection1_shard2_replica_n2], dataDir=[/export/home/jenkins/workspace/Lucene-Solr-8.x-Solaris/solr/build/solr-core/test/J0/temp/solr.cloud.AliasIntegrationTest_DD516B63CE623CD2-001/tempDir-001/node1/./collection1_shard2_replica_n2/data/]
   [junit4]   2> 1845235 INFO  (qtp1331768823-34639) [n:127.0.0.1:47789_solr c:collection1 s:shard1 r:core_node3 x:collection1_shard1_replica_n1] o.a.s.u.UpdateHandler Using UpdateLog implementation: org.apache.solr.update.UpdateLog
   [junit4]   2> 1845235 INFO  (qtp1331768823-34639) [n:127.0.0.1:47789_solr c:collection1 s:shard1 r:core_node3 x:collection1_shard1_replica_n1] o.a.s.u.UpdateLog Initializing UpdateLog: dataDir=null defaultSyncLevel=FLUSH numRecordsToKeep=100 maxNumLogsToKeep=10 numVersionBuckets=65536
   [junit4]   2> 1845235 INFO  (qtp2109641278-34628) [n:127.0.0.1:49249_solr c:collection1 s:shard2 r:core_node4 x:collection1_shard2_replica_n2] o.a.s.u.UpdateHandler Using UpdateLog implementation: org.apache.solr.update.UpdateLog
   [junit4]   2> 1845235 INFO  (qtp2109641278-34628) [n:127.0.0.1:49249_solr c:collection1 s:shard2 r:core_node4 x:collection1_shard2_replica_n2] o.a.s.u.UpdateLog Initializing UpdateLog: dataDir=null defaultSyncLevel=FLUSH numRecordsToKeep=100 maxNumLogsToKeep=10 numVersionBuckets=65536
   [junit4]   2> 1845236 INFO  (qtp1331768823-34639) [n:127.0.0.1:47789_solr c:collection1 s:shard1 r:core_node3 x:collection1_shard1_replica_n1] o.a.s.u.CommitTracker Hard AutoCommit: disabled
   [junit4]   2> 1845236 INFO  (qtp1331768823-34639) [n:127.0.0.1:47789_solr c:collection1 s:shard1 r:core_node3 x:collection1_shard1_replica_n1] o.a.s.u.CommitTracker Soft AutoCommit: disabled
   [junit4]   2> 1845236 INFO  (qtp2109641278-34628) [n:127.0.0.1:49249_solr c:collection1 s:shard2 r:core_node4 x:collection1_shard2_replica_n2] o.a.s.u.CommitTracker Hard AutoCommit: disabled
   [junit4]   2> 1845236 INFO  (qtp2109641278-34628) [n:127.0.0.1:49249_solr c:collection1 s:shard2 r:core_node4 x:collection1_shard2_replica_n2] o.a.s.u.CommitTracker Soft AutoCommit: disabled
   [junit4]   2> 1845237 INFO  (qtp1331768823-34639) [n:127.0.0.1:47789_solr c:collection1 s:shard1 r:core_node3 x:collection1_shard1_replica_n1] o.a.s.s.SolrIndexSearcher Opening [Searcher@1de40d3e[collection1_shard1_replica_n1] main]
   [junit4]   2> 1845237 INFO  (qtp2109641278-34628) [n:127.0.0.1:49249_solr c:collection1 s:shard2 r:core_node4 x:collection1_shard2_replica_n2] o.a.s.s.SolrIndexSearcher Opening [Searcher@543918c7[collection1_shard2_replica_n2] main]
   [junit4]   2> 1845238 INFO  (qtp1331768823-34639) [n:127.0.0.1:47789_solr c:collection1 s:shard1 r:core_node3 x:collection1_shard1_replica_n1] o.a.s.r.ManagedResourceStorage Configured ZooKeeperStorageIO with znodeBase: /configs/conf
   [junit4]   2> 1845238 INFO  (qtp2109641278-34628) [n:127.0.0.1:49249_solr c:collection1 s:shard2 r:core_node4 x:collection1_shard2_replica_n2] o.a.s.r.ManagedResourceStorage Configured ZooKeeperStorageIO with znodeBase: /configs/conf
   [junit4]   2> 1845239 INFO  (qtp1331768823-34639) [n:127.0.0.1:47789_solr c:collection1 s:shard1 r:core_node3 x:collection1_shard1_replica_n1] o.a.s.r.ManagedResourceStorage Loaded null at path _rest_managed.json using ZooKeeperStorageIO:path=/configs/conf
   [junit4]   2> 1845239 INFO  (qtp2109641278-34628) [n:127.0.0.1:49249_solr c:collection1 s:shard2 r:core_node4 x:collection1_shard2_replica_n2] o.a.s.r.ManagedResourceStorage Loaded null at path _rest_managed.json using ZooKeeperStorageIO:path=/configs/conf
   [junit4]   2> 1845239 INFO  (qtp1331768823-34639) [n:127.0.0.1:47789_solr c:collection1 s:shard1 r:core_node3 x:collection1_shard1_replica_n1] o.a.s.h.ReplicationHandler Commits will be reserved for 10000ms.
   [junit4]   2> 1845239 INFO  (qtp2109641278-34628) [n:127.0.0.1:49249_solr c:collection1 s:shard2 r:core_node4 x:collection1_shard2_replica_n2] o.a.s.h.ReplicationHandler Commits will be reserved for 10000ms.
   [junit4]   2> 1845239 INFO  (qtp1331768823-34639) [n:127.0.0.1:47789_solr c:collection1 s:shard1 r:core_node3 x:collection1_shard1_replica_n1] o.a.s.u.UpdateLog Could not find max version in index or recent updates, using new clock 1632548477258956800
   [junit4]   2> 1845239 INFO  (qtp2109641278-34628) [n:127.0.0.1:49249_solr c:collection1 s:shard2 r:core_node4 x:collection1_shard2_replica_n2] o.a.s.u.UpdateLog Could not find max version in index or recent updates, using new clock 1632548477258956800
   [junit4]   2> 1845242 INFO  (searcherExecutor-10381-thread-1-processing-n:127.0.0.1:47789_solr x:collection1_shard1_replica_n1 c:collection1 s:shard1 r:core_node3) [n:127.0.0.1:47789_solr c:collection1 s:shard1 r:core_node3 x:collection1_shard1_replica_n1] o.a.s.c.SolrCore [collection1_shard1_replica_n1] Registered new searcher Searcher@1de40d3e[collection1_shard1_replica_n1] main{ExitableDirectoryReader(UninvertingDirectoryReader())}
   [junit4]   2> 1845242 INFO  (searcherExecutor-10382-thread-1-processing-n:127.0.0.1:49249_solr x:collection1_shard2_replica_n2 c:collection1 s:shard2 r:core_node4) [n:127.0.0.1:49249_solr c:collection1 s:shard2 r:core_node4 x:collection1_shard2_replica_n2] o.a.s.c.SolrCore [collection1_shard2_replica_n2] Registered new searcher Searcher@543918c7[collection1_shard2_replica_n2] main{ExitableDirectoryReader(UninvertingDirectoryReader())}
   [junit4]   2> 1845247 INFO  (qtp2109641278-34628) [n:127.0.0.1:49249_solr c:collection1 s:shard2 r:core_node4 x:collection1_shard2_replica_n2] o.a.s.c.ZkShardTerms Successful update of terms at /collections/collection1/terms/shard2 to Terms{values={core_node4=0}, version=0}
   [junit4]   2> 1845247 INFO  (qtp2109641278-34628) [n:127.0.0.1:49249_solr c:collection1 s:shard2 r:core_node4 x:collection1_shard2_replica_n2] o.a.s.c.ShardLeaderElectionContextBase make sure parent is created /collections/collection1/leaders/shard2
   [junit4]   2> 1845247 INFO  (qtp1331768823-34639) [n:127.0.0.1:47789_solr c:collection1 s:shard1 r:core_node3 x:collection1_shard1_replica_n1] o.a.s.c.ZkShardTerms Successful update of terms at /collections/collection1/terms/shard1 to Terms{values={core_node3=0}, version=0}
   [junit4]   2> 1845248 INFO  (qtp1331768823-34639) [n:127.0.0.1:47789_solr c:collection1 s:shard1 r:core_node3 x:collection1_shard1_replica_n1] o.a.s.c.ShardLeaderElectionContextBase make sure parent is created /collections/collection1/leaders/shard1
   [junit4]   2> 1845252 INFO  (qtp2109641278-34628) [n:127.0.0.1:49249_solr c:collection1 s:shard2 r:core_node4 x:collection1_shard2_replica_n2] o.a.s.c.ShardLeaderElectionContext Enough replicas found to continue.
   [junit4]   2> 1845252 INFO  (qtp2109641278-34628) [n:127.0.0.1:49249_solr c:collection1 s:shard2 r:core_node4 x:collection1_shard2_replica_n2] o.a.s.c.ShardLeaderElectionContext I may be the new leader - try and sync
   [junit4]   2> 1845252 INFO  (qtp2109641278-34628) [n:127.0.0.1:49249_solr c:collection1 s:shard2 r:core_node4 x:collection1_shard2_replica_n2] o.a.s.c.SyncStrategy Sync replicas to http://127.0.0.1:49249/solr/collection1_shard2_replica_n2/
   [junit4]   2> 1845253 INFO  (qtp2109641278-34628) [n:127.0.0.1:49249_solr c:collection1 s:shard2 r:core_node4 x:collection1_shard2_replica_n2] o.a.s.c.SyncStrategy Sync Success - now sync replicas to me
   [junit4]   2> 1845254 INFO  (qtp2109641278-34628) [n:127.0.0.1:49249_solr c:collection1 s:shard2 r:core_node4 x:collection1_shard2_replica_n2] o.a.s.c.SyncStrategy http://127.0.0.1:49249/solr/collection1_shard2_replica_n2/ has no replicas
   [junit4]   2> 1845254 INFO  (qtp2109641278-34628) [n:127.0.0.1:49249_solr c:collection1 s:shard2 r:core_node4 x:collection1_shard2_replica_n2] o.a.s.c.ShardLeaderElectionContextBase Creating leader registration node /collections/collection1/leaders/shard2/leader after winning as /collections/collection1/leader_elect/shard2/election/72077601923268614-core_node4-n_0000000000
   [junit4]   2> 1845254 INFO  (qtp1331768823-34639) [n:127.0.0.1:47789_solr c:collection1 s:shard1 r:core_node3 x:collection1_shard1_replica_n1] o.a.s.c.ShardLeaderElectionContext Enough replicas found to continue.
   [junit4]   2> 1845254 INFO  (qtp1331768823-34639) [n:127.0.0.1:47789_solr c:collection1 s:shard1 r:core_node3 x:collection1_shard1_replica_n1] o.a.s.c.ShardLeaderElectionContext I may be the new leader - try and sync
   [junit4]   2> 1845254 INFO  (qtp1331768823-34639) [n:127.0.0.1:47789_solr c:collection1 s:shard1 r:core_node3 x:collection1_shard1_replica_n1] o.a.s.c.SyncStrategy Sync replicas to http://127.0.0.1:47789/solr/collection1_shard1_replica_n1/
   [junit4]   2> 1845255 INFO  (qtp1331768823-34639) [n:127.0.0.1:47789_solr c:collection1 s:shard1 r:core_node3 x:collection1_shard1_replica_n1] o.a.s.c.SyncStrategy Sync Success - now sync replicas to me
   [junit4]   2> 1845255 INFO  (qtp1331768823-34639) [n:127.0.0.1:47789_solr c:collection1 s:shard1 r:core_node3 x:collection1_shard1_replica_n1] o.a.s.c.SyncStrategy http://127.0.0.1:47789/solr/collection1_shard1_replica_n1/ has no replicas
   [junit4]   2> 1845255 INFO  (qtp1331768823-34639) [n:127.0.0.1:47789_solr c:collection1 s:shard1 r:core_node3 x:collection1_shard1_replica_n1] o.a.s.c.ShardLeaderElectionContextBase Creating leader registration node /collections/collection1/leaders/shard1/leader after winning as /collections/collection1/leader_elect/shard1/election/72077601923268616-core_node3-n_0000000000
   [junit4]   2> 1845257 INFO  (qtp2109641278-34628) [n:127.0.0.1:49249_solr c:collection1 s:shard2 r:core_node4 x:collection1_shard2_replica_n2] o.a.s.c.ShardLeaderElectionContext I am the new leader: http://127.0.0.1:49249/solr/collection1_shard2_replica_n2/ shard2
   [junit4]   2> 1845258 INFO  (qtp1331768823-34639) [n:127.0.0.1:47789_solr c:collection1 s:shard1 r:core_node3 x:collection1_shard1_replica_n1] o.a.s.c.ShardLeaderElectionContext I am the new leader: http://127.0.0.1:47789/solr/collection1_shard1_replica_n1/ shard1
   [junit4]   2> 1845360 INFO  (zkCallback-13254-thread-1) [    ] o.a.s.c.c.ZkStateReader A cluster state change: [WatchedEvent state:SyncConnected type:NodeDataChanged path:/collections/collection1/state.json] for collection [collection1] has occurred - updating... (live nodes size: [2])
   [junit4]   2> 1845360 INFO  (zkCallback-13254-thread-2) [    ] o.a.s.c.c.ZkStateReader A cluster state change: [WatchedEvent state:SyncConnected type:NodeDataChanged path:/collections/collection1/state.json] for collection [collection1] has occurred - updating... (live nodes size: [2])
   [junit4]   2> 1845364 INFO  (zkCallback-13264-thread-1) [    ] o.a.s.c.c.ZkStateReader A cluster state change: [WatchedEvent state:SyncConnected type:NodeDataChanged path:/collections/collection1/state.json] for collection [collection1] has occurred - updating... (live nodes size: [2])
   [junit4]   2> 1845365 INFO  (zkCallback-13264-thread-2) [    ] o.a.s.c.c.ZkStateReader A cluster state change: [WatchedEvent state:SyncConnected type:NodeDataChanged path:/collections/collection1/state.json] for collection [collection1] has occurred - updating... (live nodes size: [2])
   [junit4]   2> 1845366 INFO  (qtp1331768823-34639) [n:127.0.0.1:47789_solr c:collection1 s:shard1 r:core_node3 x:collection1_shard1_replica_n1] o.a.s.c.ZkController I am the leader, no recovery necessary
   [junit4]   2> 1845366 INFO  (qtp2109641278-34628) [n:127.0.0.1:49249_solr c:collection1 s:shard2 r:core_node4 x:collection1_shard2_replica_n2] o.a.s.c.ZkController I am the leader, no recovery necessary
   [junit4]   2> 1845368 INFO  (qtp1331768823-34639) [n:127.0.0.1:47789_solr c:collection1 s:shard1 r:core_node3 x:collection1_shard1_replica_n1] o.a.s.s.HttpSolrCall [admin] webapp=null path=/admin/cores params={qt=/admin/cores&coreNodeName=core_node3&collection.configName=conf&newCollection=true&name=collection1_shard1_replica_n1&action=CREATE&numShards=2&collection=collection1&shard=shard1&wt=javabin&version=2&replicaType=NRT} status=0 QTime=1234
   [junit4]   2> 1845368 INFO  (qtp2109641278-34628) [n:127.0.0.1:49249_solr c:collection1 s:shard2 r:core_node4 x:collection1_shard2_replica_n2] o.a.s.s.HttpSolrCall [admin] webapp=null path=/admin/cores params={qt=/admin/cores&coreNodeName=core_node4&collection.configName=conf&newCollection=true&name=collection1_shard2_replica_n2&action=CREATE&numShards=2&collection=collection1&shard=shard2&wt=javabin&version=2&replicaType=NRT} status=0 QTime=1234
   [junit4]   2> 1845372 INFO  (qtp1331768823-34635) [n:127.0.0.1:47789_solr    ] o.a.s.h.a.CollectionsHandler Wait for new collection to be active for at most 45 seconds. Check all shard replicas
   [junit4]   2> 1845469 INFO  (zkCallback-13254-thread-2) [    ] o.a.s.c.c.ZkStateReader A cluster state change: [WatchedEvent state:SyncConnected type:NodeDataChanged path:/collections/collection1/state.json] for collection [collection1] has occurred - updating... (live nodes size: [2])
   [junit4]   2> 1845469 INFO  (zkCallback-13264-thread-1) [    ] o.a.s.c.c.ZkStateReader A cluster state change: [WatchedEvent state:SyncConnected type:NodeDataChanged path:/collections/collection1/state.json] for collection [collection1] has occurred - updating... (live nodes size: [2])
   [junit4]   2> 1845469 INFO  (zkCallback-13254-thread-3) [    ] o.a.s.c.c.ZkStateReader A cluster state change: [WatchedEvent state:SyncConnected type:NodeDataChanged path:/collections/collection1/state.json] for collection [collection1] has occurred - updating... (live nodes size: [2])
   [junit4]   2> 1845469 INFO  (zkCallback-13254-thread-1) [    ] o.a.s.c.c.ZkStateReader A cluster state change: [WatchedEvent state:SyncConnected type:NodeDataChanged path:/collections/collection1/state.json] for collection [collection1] has occurred - updating... (live nodes size: [2])
   [junit4]   2> 1845469 INFO  (zkCallback-13264-thread-3) [    ] o.a.s.c.c.ZkStateReader A cluster state change: [WatchedEvent state:SyncConnected type:NodeDataChanged path:/collections/collection1/state.json] for collection [collection1] has occurred - updating... (live nodes size: [2])
   [junit4]   2> 1845469 INFO  (zkCallback-13264-thread-2) [    ] o.a.s.c.c.ZkStateReader A cluster state change: [WatchedEvent state:SyncConnected type:NodeDataChanged path:/collections/collection1/state.json] for collection [collection1] has occurred - updating... (live nodes siz

[...truncated too long message...]

yPropertiesV1
   [junit4] OK      2.46s J1 | AliasIntegrationTest.testErrorChecks
   [junit4] OK      10.1s J1 | AliasIntegrationTest.testDeleteAliasWithExistingCollectionName
   [junit4] Completed [2/10] on J1 in 65.80s, 9 tests
   [junit4] 
   [junit4] Suite: org.apache.solr.cloud.AliasIntegrationTest
   [junit4] OK      5.79s J0 | AliasIntegrationTest.test
   [junit4] OK      3.92s J0 | AliasIntegrationTest.testClusterStateProviderAPI
   [junit4] OK      3.98s J0 | AliasIntegrationTest.testModifyPropertiesCAR
   [junit4] OK      3.93s J0 | AliasIntegrationTest.testModifyPropertiesV2
   [junit4] OK      3.92s J0 | AliasIntegrationTest.testProperties
   [junit4] OK      10.1s J0 | AliasIntegrationTest.testDeleteOneOfTwoCollectionsAliased
   [junit4] OK      3.94s J0 | AliasIntegrationTest.testModifyPropertiesV1
   [junit4] OK      2.24s J0 | AliasIntegrationTest.testErrorChecks
   [junit4] OK      11.2s J0 | AliasIntegrationTest.testDeleteAliasWithExistingCollectionName
   [junit4] Completed [3/10] on J0 in 51.91s, 9 tests
   [junit4] 
   [junit4] Suite: org.apache.solr.cloud.AliasIntegrationTest
   [junit4] OK      5.73s J1 | AliasIntegrationTest.test
   [junit4] OK      3.91s J1 | AliasIntegrationTest.testClusterStateProviderAPI
   [junit4] OK      3.94s J1 | AliasIntegrationTest.testModifyPropertiesCAR
   [junit4] OK      4.03s J1 | AliasIntegrationTest.testModifyPropertiesV2
   [junit4] OK      4.09s J1 | AliasIntegrationTest.testProperties
   [junit4] OK      9.96s J1 | AliasIntegrationTest.testDeleteOneOfTwoCollectionsAliased
   [junit4] OK      3.99s J1 | AliasIntegrationTest.testModifyPropertiesV1
   [junit4] OK      2.31s J1 | AliasIntegrationTest.testErrorChecks
   [junit4] OK      11.1s J1 | AliasIntegrationTest.testDeleteAliasWithExistingCollectionName
   [junit4] Completed [4/10] on J1 in 51.75s, 9 tests
   [junit4] 
   [junit4] Suite: org.apache.solr.cloud.TestCryptoKeys
   [junit4] OK      26.9s J0 | TestCryptoKeys.test
   [junit4] Completed [5/10] on J0 in 27.98s, 1 test
   [junit4] 
   [junit4] Suite: org.apache.solr.cloud.TestCryptoKeys
   [junit4] OK      27.3s J1 | TestCryptoKeys.test
   [junit4] Completed [6/10] on J1 in 27.97s, 1 test
   [junit4] 
   [junit4] Suite: org.apache.solr.cloud.TestCryptoKeys
   [junit4] OK      22.2s J1 | TestCryptoKeys.test
   [junit4] Completed [7/10] on J1 in 22.72s, 1 test
   [junit4] 
   [junit4] Suite: org.apache.solr.cloud.TestCryptoKeys
   [junit4] OK      21.5s J1 | TestCryptoKeys.test
   [junit4] Completed [8/10] on J1 in 21.77s, 1 test
   [junit4] 
   [junit4] Suite: org.apache.solr.cloud.AliasIntegrationTest
   [junit4] OK      5.50s J0 | AliasIntegrationTest.test
   [junit4] OK      3.91s J0 | AliasIntegrationTest.testClusterStateProviderAPI
   [junit4] OK      3.91s J0 | AliasIntegrationTest.testModifyPropertiesCAR
   [junit4] OK      4.02s J0 | AliasIntegrationTest.testModifyPropertiesV2
   [junit4] OK      4.02s J0 | AliasIntegrationTest.testProperties
   [junit4] OK      10.0s J0 | AliasIntegrationTest.testDeleteOneOfTwoCollectionsAliased
   [junit4] OK      3.81s J0 | AliasIntegrationTest.testModifyPropertiesV1
   [junit4] OK      2.25s J0 | AliasIntegrationTest.testErrorChecks
   [junit4] OK      11.3s J0 | AliasIntegrationTest.testDeleteAliasWithExistingCollectionName
   [junit4] Completed [9/10] on J0 in 50.70s, 9 tests
   [junit4] 
   [junit4] Suite: org.apache.solr.cloud.TestCryptoKeys
   [junit4] OK      22.0s J1 | TestCryptoKeys.test
   [junit4] Completed [10/10] on J1 in 22.98s, 1 test
   [junit4] 
   [junit4] JVM J0:     0.73 ..   197.20 =   196.46s
   [junit4] JVM J1:     0.70 ..   215.41 =   214.71s
   [junit4] Execution time total: 3 minutes 35 seconds
   [junit4] Tests summary: 10 suites, 50 tests
   [junit4] Could not remove temporary path: /export/home/jenkins/workspace/Lucene-Solr-8.x-Solaris/solr/build/solr-core/test/J1 (java.nio.file.DirectoryNotEmptyException: Remaining files: [/export/home/jenkins/workspace/Lucene-Solr-8.x-Solaris/solr/build/solr-core/test/J1/temp])
   [junit4] Could not remove temporary path: /export/home/jenkins/workspace/Lucene-Solr-8.x-Solaris/solr/build/solr-core/test/J0 (java.nio.file.DirectoryNotEmptyException: Remaining files: [/export/home/jenkins/workspace/Lucene-Solr-8.x-Solaris/solr/build/solr-core/test/J0/temp])
     [echo] 5 slowest tests:
[junit4:tophints] 199.65s | org.apache.solr.cloud.api.collections.ShardSplitTest
[junit4:tophints] 145.99s | org.apache.solr.search.facet.TestJsonFacets
[junit4:tophints] 118.47s | org.apache.solr.handler.TestReplicationHandler
[junit4:tophints] 117.87s | org.apache.solr.update.SoftAutoCommitTest
[junit4:tophints] 113.89s | org.apache.solr.cloud.CollectionsAPISolrJTest

-check-totals:

test-nocompile:

BUILD SUCCESSFUL
Total time: 3 minutes 38 seconds
[repro] Failures:
[repro]   0/5 failed: org.apache.solr.cloud.AliasIntegrationTest
[repro]   0/5 failed: org.apache.solr.cloud.TestCryptoKeys
[repro] Exiting with code 0
+ mv lucene/build lucene/build.repro
+ mv solr/build solr/build.repro
+ mv lucene/build.orig lucene/build
+ mv solr/build.orig solr/build
Archiving artifacts
Setting ANT_1_8_2_HOME=/export/home/jenkins/tools/hudson.tasks.Ant_AntInstallation/ANT_1.8.2
java.lang.InterruptedException: no matches found within 10000
	at hudson.FilePath$ValidateAntFileMask.hasMatch(FilePath.java:2802)
	at hudson.FilePath$ValidateAntFileMask.invoke(FilePath.java:2681)
	at hudson.FilePath$ValidateAntFileMask.invoke(FilePath.java:2662)
	at hudson.FilePath$FileCallableWrapper.call(FilePath.java:3040)
Also:   hudson.remoting.Channel$CallSiteStackTrace: Remote call to Solaris VBOX
		at hudson.remoting.Channel.attachCallSiteStackTrace(Channel.java:1743)
		at hudson.remoting.UserRequest$ExceptionResponse.retrieve(UserRequest.java:357)
		at hudson.remoting.Channel.call(Channel.java:957)
		at hudson.FilePath.act(FilePath.java:1069)
		at hudson.FilePath.act(FilePath.java:1058)
		at hudson.FilePath.validateAntFileMask(FilePath.java:2660)
		at hudson.tasks.ArtifactArchiver.perform(ArtifactArchiver.java:243)
		at hudson.tasks.BuildStepCompatibilityLayer.perform(BuildStepCompatibilityLayer.java:79)
		at hudson.tasks.BuildStepMonitor$1.perform(BuildStepMonitor.java:20)
		at hudson.model.AbstractBuild$AbstractBuildExecution.perform(AbstractBuild.java:741)
		at hudson.model.AbstractBuild$AbstractBuildExecution.performAllBuildSteps(AbstractBuild.java:690)
		at hudson.model.Build$BuildExecution.post2(Build.java:186)
		at hudson.model.AbstractBuild$AbstractBuildExecution.post(AbstractBuild.java:635)
		at hudson.model.Run.execute(Run.java:1843)
		at hudson.model.FreeStyleBuild.run(FreeStyleBuild.java:43)
		at hudson.model.ResourceController.execute(ResourceController.java:97)
		at hudson.model.Executor.run(Executor.java:429)
Caused: hudson.FilePath$TunneledInterruptedException
	at hudson.FilePath$FileCallableWrapper.call(FilePath.java:3042)
	at hudson.remoting.UserRequest.perform(UserRequest.java:212)
	at hudson.remoting.UserRequest.perform(UserRequest.java:54)
	at hudson.remoting.Request$2.run(Request.java:369)
	at hudson.remoting.InterceptingExecutorService$1.call(InterceptingExecutorService.java:72)
	at java.util.concurrent.FutureTask.run(FutureTask.java:266)
	at java.util.concurrent.ThreadPoolExecutor.runWorker(ThreadPoolExecutor.java:1149)
	at java.util.concurrent.ThreadPoolExecutor$Worker.run(ThreadPoolExecutor.java:624)
	at java.lang.Thread.run(Thread.java:748)
Caused: java.lang.InterruptedException: java.lang.InterruptedException: no matches found within 10000
	at hudson.FilePath.act(FilePath.java:1071)
	at hudson.FilePath.act(FilePath.java:1058)
	at hudson.FilePath.validateAntFileMask(FilePath.java:2660)
	at hudson.tasks.ArtifactArchiver.perform(ArtifactArchiver.java:243)
	at hudson.tasks.BuildStepCompatibilityLayer.perform(BuildStepCompatibilityLayer.java:79)
	at hudson.tasks.BuildStepMonitor$1.perform(BuildStepMonitor.java:20)
	at hudson.model.AbstractBuild$AbstractBuildExecution.perform(AbstractBuild.java:741)
	at hudson.model.AbstractBuild$AbstractBuildExecution.performAllBuildSteps(AbstractBuild.java:690)
	at hudson.model.Build$BuildExecution.post2(Build.java:186)
	at hudson.model.AbstractBuild$AbstractBuildExecution.post(AbstractBuild.java:635)
	at hudson.model.Run.execute(Run.java:1843)
	at hudson.model.FreeStyleBuild.run(FreeStyleBuild.java:43)
	at hudson.model.ResourceController.execute(ResourceController.java:97)
	at hudson.model.Executor.run(Executor.java:429)
No artifacts found that match the file pattern "**/*.events,heapdumps/**,**/*_pid*.log". Configuration error?
[WARNINGS] Parsing warnings in console log with parser Java Compiler (javac)
Setting ANT_1_8_2_HOME=/export/home/jenkins/tools/hudson.tasks.Ant_AntInstallation/ANT_1.8.2
No credentials specified
Setting ANT_1_8_2_HOME=/export/home/jenkins/tools/hudson.tasks.Ant_AntInstallation/ANT_1.8.2
<Git Blamer> Using GitBlamer to create author and commit information for all warnings.
<Git Blamer> GIT_COMMIT=400a918071b2d1c9eaa9732f5ac942c046b18dbc, workspace=/export/home/jenkins/workspace/Lucene-Solr-8.x-Solaris
[WARNINGS] Computing warning deltas based on reference build #103
Recording test results
Setting ANT_1_8_2_HOME=/export/home/jenkins/tools/hudson.tasks.Ant_AntInstallation/ANT_1.8.2
Build step 'Publish JUnit test result report' changed build result to UNSTABLE
Email was triggered for: Unstable (Test Failures)
Sending email for trigger: Unstable (Test Failures)
Setting ANT_1_8_2_HOME=/export/home/jenkins/tools/hudson.tasks.Ant_AntInstallation/ANT_1.8.2
Setting ANT_1_8_2_HOME=/export/home/jenkins/tools/hudson.tasks.Ant_AntInstallation/ANT_1.8.2
Setting ANT_1_8_2_HOME=/export/home/jenkins/tools/hudson.tasks.Ant_AntInstallation/ANT_1.8.2
Setting ANT_1_8_2_HOME=/export/home/jenkins/tools/hudson.tasks.Ant_AntInstallation/ANT_1.8.2
Setting ANT_1_8_2_HOME=/export/home/jenkins/tools/hudson.tasks.Ant_AntInstallation/ANT_1.8.2
Setting ANT_1_8_2_HOME=/export/home/jenkins/tools/hudson.tasks.Ant_AntInstallation/ANT_1.8.2

Mime
View raw message