lucene-dev mailing list archives

Site index · List index
Message view « Date » · « Thread »
Top « Date » · « Thread »
From Policeman Jenkins Server <jenk...@thetaphi.de>
Subject [JENKINS-EA] Lucene-Solr-8.1-Windows (64bit/jdk-13-ea+18) - Build # 92 - Still Unstable!
Date Tue, 07 May 2019 01:06:46 GMT
Build: https://jenkins.thetaphi.de/job/Lucene-Solr-8.1-Windows/92/
Java: 64bit/jdk-13-ea+18 -XX:+UseCompressedOops -XX:+UseG1GC

12 tests failed.
FAILED:  org.apache.solr.prometheus.exporter.SolrExporterIntegrationTest.jvmMetrics

Error Message:
expected:<36> but was:<48>

Stack Trace:
java.lang.AssertionError: expected:<36> but was:<48>
	at __randomizedtesting.SeedInfo.seed([31FA467CC1B24098:E24E7B93D45C8C0C]:0)
	at org.junit.Assert.fail(Assert.java:88)
	at org.junit.Assert.failNotEquals(Assert.java:834)
	at org.junit.Assert.assertEquals(Assert.java:645)
	at org.junit.Assert.assertEquals(Assert.java:631)
	at org.apache.solr.prometheus.exporter.SolrExporterIntegrationTest.jvmMetrics(SolrExporterIntegrationTest.java:71)
	at java.base/jdk.internal.reflect.NativeMethodAccessorImpl.invoke0(Native Method)
	at java.base/jdk.internal.reflect.NativeMethodAccessorImpl.invoke(NativeMethodAccessorImpl.java:62)
	at java.base/jdk.internal.reflect.DelegatingMethodAccessorImpl.invoke(DelegatingMethodAccessorImpl.java:43)
	at java.base/java.lang.reflect.Method.invoke(Method.java:567)
	at com.carrotsearch.randomizedtesting.RandomizedRunner.invoke(RandomizedRunner.java:1750)
	at com.carrotsearch.randomizedtesting.RandomizedRunner$8.evaluate(RandomizedRunner.java:938)
	at com.carrotsearch.randomizedtesting.RandomizedRunner$9.evaluate(RandomizedRunner.java:974)
	at com.carrotsearch.randomizedtesting.RandomizedRunner$10.evaluate(RandomizedRunner.java:988)
	at com.carrotsearch.randomizedtesting.rules.SystemPropertiesRestoreRule$1.evaluate(SystemPropertiesRestoreRule.java:57)
	at org.apache.lucene.util.TestRuleSetupTeardownChained$1.evaluate(TestRuleSetupTeardownChained.java:49)
	at org.apache.lucene.util.AbstractBeforeAfterRule$1.evaluate(AbstractBeforeAfterRule.java:45)
	at org.apache.lucene.util.TestRuleThreadAndTestName$1.evaluate(TestRuleThreadAndTestName.java:48)
	at org.apache.lucene.util.TestRuleIgnoreAfterMaxFailures$1.evaluate(TestRuleIgnoreAfterMaxFailures.java:64)
	at org.apache.lucene.util.TestRuleMarkFailure$1.evaluate(TestRuleMarkFailure.java:47)
	at com.carrotsearch.randomizedtesting.rules.StatementAdapter.evaluate(StatementAdapter.java:36)
	at com.carrotsearch.randomizedtesting.ThreadLeakControl$StatementRunner.run(ThreadLeakControl.java:368)
	at com.carrotsearch.randomizedtesting.ThreadLeakControl.forkTimeoutingTask(ThreadLeakControl.java:817)
	at com.carrotsearch.randomizedtesting.ThreadLeakControl$3.evaluate(ThreadLeakControl.java:468)
	at com.carrotsearch.randomizedtesting.RandomizedRunner.runSingleTest(RandomizedRunner.java:947)
	at com.carrotsearch.randomizedtesting.RandomizedRunner$5.evaluate(RandomizedRunner.java:832)
	at com.carrotsearch.randomizedtesting.RandomizedRunner$6.evaluate(RandomizedRunner.java:883)
	at com.carrotsearch.randomizedtesting.RandomizedRunner$7.evaluate(RandomizedRunner.java:894)
	at com.carrotsearch.randomizedtesting.rules.StatementAdapter.evaluate(StatementAdapter.java:36)
	at com.carrotsearch.randomizedtesting.rules.SystemPropertiesRestoreRule$1.evaluate(SystemPropertiesRestoreRule.java:57)
	at org.apache.lucene.util.AbstractBeforeAfterRule$1.evaluate(AbstractBeforeAfterRule.java:45)
	at com.carrotsearch.randomizedtesting.rules.StatementAdapter.evaluate(StatementAdapter.java:36)
	at org.apache.lucene.util.TestRuleStoreClassName$1.evaluate(TestRuleStoreClassName.java:41)
	at com.carrotsearch.randomizedtesting.rules.NoShadowingOrOverridesOnMethodsRule$1.evaluate(NoShadowingOrOverridesOnMethodsRule.java:40)
	at com.carrotsearch.randomizedtesting.rules.NoShadowingOrOverridesOnMethodsRule$1.evaluate(NoShadowingOrOverridesOnMethodsRule.java:40)
	at com.carrotsearch.randomizedtesting.rules.StatementAdapter.evaluate(StatementAdapter.java:36)
	at com.carrotsearch.randomizedtesting.rules.StatementAdapter.evaluate(StatementAdapter.java:36)
	at org.apache.lucene.util.TestRuleAssertionsRequired$1.evaluate(TestRuleAssertionsRequired.java:53)
	at org.apache.lucene.util.TestRuleMarkFailure$1.evaluate(TestRuleMarkFailure.java:47)
	at org.apache.lucene.util.TestRuleIgnoreAfterMaxFailures$1.evaluate(TestRuleIgnoreAfterMaxFailures.java:64)
	at org.apache.lucene.util.TestRuleIgnoreTestSuites$1.evaluate(TestRuleIgnoreTestSuites.java:54)
	at com.carrotsearch.randomizedtesting.rules.StatementAdapter.evaluate(StatementAdapter.java:36)
	at com.carrotsearch.randomizedtesting.ThreadLeakControl$StatementRunner.run(ThreadLeakControl.java:368)
	at java.base/java.lang.Thread.run(Thread.java:835)


FAILED:  junit.framework.TestSuite.org.apache.solr.update.processor.DistributedUpdateProcessorTest

Error Message:
SOLR-11606: ByteBuddy used by Mockito is not working with this JVM version.

Stack Trace:
org.junit.AssumptionViolatedException: SOLR-11606: ByteBuddy used by Mockito is not working with this JVM version.
	at __randomizedtesting.SeedInfo.seed([D7260DD705D22AC5]:0)
	at com.carrotsearch.randomizedtesting.RandomizedTest.assumeNoException(RandomizedTest.java:742)
	at org.apache.solr.SolrTestCaseJ4.assumeWorkingMockito(SolrTestCaseJ4.java:374)
	at org.apache.solr.update.processor.DistributedUpdateProcessorTest.beforeClass(DistributedUpdateProcessorTest.java:60)
	at java.base/jdk.internal.reflect.NativeMethodAccessorImpl.invoke0(Native Method)
	at java.base/jdk.internal.reflect.NativeMethodAccessorImpl.invoke(NativeMethodAccessorImpl.java:62)
	at java.base/jdk.internal.reflect.DelegatingMethodAccessorImpl.invoke(DelegatingMethodAccessorImpl.java:43)
	at java.base/java.lang.reflect.Method.invoke(Method.java:567)
	at com.carrotsearch.randomizedtesting.RandomizedRunner.invoke(RandomizedRunner.java:1750)
	at com.carrotsearch.randomizedtesting.RandomizedRunner$6.evaluate(RandomizedRunner.java:878)
	at com.carrotsearch.randomizedtesting.RandomizedRunner$7.evaluate(RandomizedRunner.java:894)
	at com.carrotsearch.randomizedtesting.rules.StatementAdapter.evaluate(StatementAdapter.java:36)
	at com.carrotsearch.randomizedtesting.rules.SystemPropertiesRestoreRule$1.evaluate(SystemPropertiesRestoreRule.java:57)
	at org.apache.lucene.util.AbstractBeforeAfterRule$1.evaluate(AbstractBeforeAfterRule.java:45)
	at com.carrotsearch.randomizedtesting.rules.StatementAdapter.evaluate(StatementAdapter.java:36)
	at org.apache.lucene.util.TestRuleStoreClassName$1.evaluate(TestRuleStoreClassName.java:41)
	at com.carrotsearch.randomizedtesting.rules.NoShadowingOrOverridesOnMethodsRule$1.evaluate(NoShadowingOrOverridesOnMethodsRule.java:40)
	at com.carrotsearch.randomizedtesting.rules.NoShadowingOrOverridesOnMethodsRule$1.evaluate(NoShadowingOrOverridesOnMethodsRule.java:40)
	at com.carrotsearch.randomizedtesting.rules.StatementAdapter.evaluate(StatementAdapter.java:36)
	at com.carrotsearch.randomizedtesting.rules.StatementAdapter.evaluate(StatementAdapter.java:36)
	at org.apache.lucene.util.TestRuleAssertionsRequired$1.evaluate(TestRuleAssertionsRequired.java:53)
	at org.apache.lucene.util.TestRuleMarkFailure$1.evaluate(TestRuleMarkFailure.java:47)
	at org.apache.lucene.util.TestRuleIgnoreAfterMaxFailures$1.evaluate(TestRuleIgnoreAfterMaxFailures.java:64)
	at org.apache.lucene.util.TestRuleIgnoreTestSuites$1.evaluate(TestRuleIgnoreTestSuites.java:54)
	at com.carrotsearch.randomizedtesting.rules.StatementAdapter.evaluate(StatementAdapter.java:36)
	at com.carrotsearch.randomizedtesting.ThreadLeakControl$StatementRunner.run(ThreadLeakControl.java:368)
	at java.base/java.lang.Thread.run(Thread.java:835)
Caused by: java.lang.IllegalArgumentException: Unknown Java version: 13
	at net.bytebuddy.ClassFileVersion.ofJavaVersion(ClassFileVersion.java:210)
	at net.bytebuddy.ClassFileVersion$VersionLocator$ForJava9CapableVm.locate(ClassFileVersion.java:462)
	at net.bytebuddy.ClassFileVersion.ofThisVm(ClassFileVersion.java:223)
	at java.base/jdk.internal.reflect.NativeMethodAccessorImpl.invoke0(Native Method)
	at java.base/jdk.internal.reflect.NativeMethodAccessorImpl.invoke(NativeMethodAccessorImpl.java:62)
	at java.base/jdk.internal.reflect.DelegatingMethodAccessorImpl.invoke(DelegatingMethodAccessorImpl.java:43)
	at java.base/java.lang.reflect.Method.invoke(Method.java:567)
	at org.apache.solr.SolrTestCaseJ4.assumeWorkingMockito(SolrTestCaseJ4.java:372)
	... 24 more


FAILED:  junit.framework.TestSuite.org.apache.solr.update.processor.DistributedUpdateProcessorTest

Error Message:


Stack Trace:
java.lang.NullPointerException
	at __randomizedtesting.SeedInfo.seed([D7260DD705D22AC5]:0)
	at org.apache.solr.update.processor.DistributedUpdateProcessorTest.AfterClass(DistributedUpdateProcessorTest.java:68)
	at java.base/jdk.internal.reflect.NativeMethodAccessorImpl.invoke0(Native Method)
	at java.base/jdk.internal.reflect.NativeMethodAccessorImpl.invoke(NativeMethodAccessorImpl.java:62)
	at java.base/jdk.internal.reflect.DelegatingMethodAccessorImpl.invoke(DelegatingMethodAccessorImpl.java:43)
	at java.base/java.lang.reflect.Method.invoke(Method.java:567)
	at com.carrotsearch.randomizedtesting.RandomizedRunner.invoke(RandomizedRunner.java:1750)
	at com.carrotsearch.randomizedtesting.RandomizedRunner$7.evaluate(RandomizedRunner.java:901)
	at com.carrotsearch.randomizedtesting.rules.StatementAdapter.evaluate(StatementAdapter.java:36)
	at com.carrotsearch.randomizedtesting.rules.SystemPropertiesRestoreRule$1.evaluate(SystemPropertiesRestoreRule.java:57)
	at org.apache.lucene.util.AbstractBeforeAfterRule$1.evaluate(AbstractBeforeAfterRule.java:45)
	at com.carrotsearch.randomizedtesting.rules.StatementAdapter.evaluate(StatementAdapter.java:36)
	at org.apache.lucene.util.TestRuleStoreClassName$1.evaluate(TestRuleStoreClassName.java:41)
	at com.carrotsearch.randomizedtesting.rules.NoShadowingOrOverridesOnMethodsRule$1.evaluate(NoShadowingOrOverridesOnMethodsRule.java:40)
	at com.carrotsearch.randomizedtesting.rules.NoShadowingOrOverridesOnMethodsRule$1.evaluate(NoShadowingOrOverridesOnMethodsRule.java:40)
	at com.carrotsearch.randomizedtesting.rules.StatementAdapter.evaluate(StatementAdapter.java:36)
	at com.carrotsearch.randomizedtesting.rules.StatementAdapter.evaluate(StatementAdapter.java:36)
	at org.apache.lucene.util.TestRuleAssertionsRequired$1.evaluate(TestRuleAssertionsRequired.java:53)
	at org.apache.lucene.util.TestRuleMarkFailure$1.evaluate(TestRuleMarkFailure.java:47)
	at org.apache.lucene.util.TestRuleIgnoreAfterMaxFailures$1.evaluate(TestRuleIgnoreAfterMaxFailures.java:64)
	at org.apache.lucene.util.TestRuleIgnoreTestSuites$1.evaluate(TestRuleIgnoreTestSuites.java:54)
	at com.carrotsearch.randomizedtesting.rules.StatementAdapter.evaluate(StatementAdapter.java:36)
	at com.carrotsearch.randomizedtesting.ThreadLeakControl$StatementRunner.run(ThreadLeakControl.java:368)
	at java.base/java.lang.Thread.run(Thread.java:835)


FAILED:  junit.framework.TestSuite.org.apache.solr.update.processor.DistributedUpdateProcessorTest

Error Message:
SOLR-11606: ByteBuddy used by Mockito is not working with this JVM version.

Stack Trace:
org.junit.AssumptionViolatedException: SOLR-11606: ByteBuddy used by Mockito is not working with this JVM version.
	at __randomizedtesting.SeedInfo.seed([D7260DD705D22AC5]:0)
	at com.carrotsearch.randomizedtesting.RandomizedTest.assumeNoException(RandomizedTest.java:742)
	at org.apache.solr.SolrTestCaseJ4.assumeWorkingMockito(SolrTestCaseJ4.java:374)
	at org.apache.solr.update.processor.DistributedUpdateProcessorTest.beforeClass(DistributedUpdateProcessorTest.java:60)
	at java.base/jdk.internal.reflect.NativeMethodAccessorImpl.invoke0(Native Method)
	at java.base/jdk.internal.reflect.NativeMethodAccessorImpl.invoke(NativeMethodAccessorImpl.java:62)
	at java.base/jdk.internal.reflect.DelegatingMethodAccessorImpl.invoke(DelegatingMethodAccessorImpl.java:43)
	at java.base/java.lang.reflect.Method.invoke(Method.java:567)
	at com.carrotsearch.randomizedtesting.RandomizedRunner.invoke(RandomizedRunner.java:1750)
	at com.carrotsearch.randomizedtesting.RandomizedRunner$6.evaluate(RandomizedRunner.java:878)
	at com.carrotsearch.randomizedtesting.RandomizedRunner$7.evaluate(RandomizedRunner.java:894)
	at com.carrotsearch.randomizedtesting.rules.StatementAdapter.evaluate(StatementAdapter.java:36)
	at com.carrotsearch.randomizedtesting.rules.SystemPropertiesRestoreRule$1.evaluate(SystemPropertiesRestoreRule.java:57)
	at org.apache.lucene.util.AbstractBeforeAfterRule$1.evaluate(AbstractBeforeAfterRule.java:45)
	at com.carrotsearch.randomizedtesting.rules.StatementAdapter.evaluate(StatementAdapter.java:36)
	at org.apache.lucene.util.TestRuleStoreClassName$1.evaluate(TestRuleStoreClassName.java:41)
	at com.carrotsearch.randomizedtesting.rules.NoShadowingOrOverridesOnMethodsRule$1.evaluate(NoShadowingOrOverridesOnMethodsRule.java:40)
	at com.carrotsearch.randomizedtesting.rules.NoShadowingOrOverridesOnMethodsRule$1.evaluate(NoShadowingOrOverridesOnMethodsRule.java:40)
	at com.carrotsearch.randomizedtesting.rules.StatementAdapter.evaluate(StatementAdapter.java:36)
	at com.carrotsearch.randomizedtesting.rules.StatementAdapter.evaluate(StatementAdapter.java:36)
	at org.apache.lucene.util.TestRuleAssertionsRequired$1.evaluate(TestRuleAssertionsRequired.java:53)
	at org.apache.lucene.util.TestRuleMarkFailure$1.evaluate(TestRuleMarkFailure.java:47)
	at org.apache.lucene.util.TestRuleIgnoreAfterMaxFailures$1.evaluate(TestRuleIgnoreAfterMaxFailures.java:64)
	at org.apache.lucene.util.TestRuleIgnoreTestSuites$1.evaluate(TestRuleIgnoreTestSuites.java:54)
	at com.carrotsearch.randomizedtesting.rules.StatementAdapter.evaluate(StatementAdapter.java:36)
	at com.carrotsearch.randomizedtesting.ThreadLeakControl$StatementRunner.run(ThreadLeakControl.java:368)
	at java.base/java.lang.Thread.run(Thread.java:835)
Caused by: java.lang.IllegalArgumentException: Unknown Java version: 13
	at net.bytebuddy.ClassFileVersion.ofJavaVersion(ClassFileVersion.java:210)
	at net.bytebuddy.ClassFileVersion$VersionLocator$ForJava9CapableVm.locate(ClassFileVersion.java:462)
	at net.bytebuddy.ClassFileVersion.ofThisVm(ClassFileVersion.java:223)
	at java.base/jdk.internal.reflect.NativeMethodAccessorImpl.invoke0(Native Method)
	at java.base/jdk.internal.reflect.NativeMethodAccessorImpl.invoke(NativeMethodAccessorImpl.java:62)
	at java.base/jdk.internal.reflect.DelegatingMethodAccessorImpl.invoke(DelegatingMethodAccessorImpl.java:43)
	at java.base/java.lang.reflect.Method.invoke(Method.java:567)
	at org.apache.solr.SolrTestCaseJ4.assumeWorkingMockito(SolrTestCaseJ4.java:372)
	... 24 more


FAILED:  junit.framework.TestSuite.org.apache.solr.update.processor.DistributedUpdateProcessorTest

Error Message:


Stack Trace:
java.lang.NullPointerException
	at __randomizedtesting.SeedInfo.seed([D7260DD705D22AC5]:0)
	at org.apache.solr.update.processor.DistributedUpdateProcessorTest.AfterClass(DistributedUpdateProcessorTest.java:68)
	at java.base/jdk.internal.reflect.NativeMethodAccessorImpl.invoke0(Native Method)
	at java.base/jdk.internal.reflect.NativeMethodAccessorImpl.invoke(NativeMethodAccessorImpl.java:62)
	at java.base/jdk.internal.reflect.DelegatingMethodAccessorImpl.invoke(DelegatingMethodAccessorImpl.java:43)
	at java.base/java.lang.reflect.Method.invoke(Method.java:567)
	at com.carrotsearch.randomizedtesting.RandomizedRunner.invoke(RandomizedRunner.java:1750)
	at com.carrotsearch.randomizedtesting.RandomizedRunner$7.evaluate(RandomizedRunner.java:901)
	at com.carrotsearch.randomizedtesting.rules.StatementAdapter.evaluate(StatementAdapter.java:36)
	at com.carrotsearch.randomizedtesting.rules.SystemPropertiesRestoreRule$1.evaluate(SystemPropertiesRestoreRule.java:57)
	at org.apache.lucene.util.AbstractBeforeAfterRule$1.evaluate(AbstractBeforeAfterRule.java:45)
	at com.carrotsearch.randomizedtesting.rules.StatementAdapter.evaluate(StatementAdapter.java:36)
	at org.apache.lucene.util.TestRuleStoreClassName$1.evaluate(TestRuleStoreClassName.java:41)
	at com.carrotsearch.randomizedtesting.rules.NoShadowingOrOverridesOnMethodsRule$1.evaluate(NoShadowingOrOverridesOnMethodsRule.java:40)
	at com.carrotsearch.randomizedtesting.rules.NoShadowingOrOverridesOnMethodsRule$1.evaluate(NoShadowingOrOverridesOnMethodsRule.java:40)
	at com.carrotsearch.randomizedtesting.rules.StatementAdapter.evaluate(StatementAdapter.java:36)
	at com.carrotsearch.randomizedtesting.rules.StatementAdapter.evaluate(StatementAdapter.java:36)
	at org.apache.lucene.util.TestRuleAssertionsRequired$1.evaluate(TestRuleAssertionsRequired.java:53)
	at org.apache.lucene.util.TestRuleMarkFailure$1.evaluate(TestRuleMarkFailure.java:47)
	at org.apache.lucene.util.TestRuleIgnoreAfterMaxFailures$1.evaluate(TestRuleIgnoreAfterMaxFailures.java:64)
	at org.apache.lucene.util.TestRuleIgnoreTestSuites$1.evaluate(TestRuleIgnoreTestSuites.java:54)
	at com.carrotsearch.randomizedtesting.rules.StatementAdapter.evaluate(StatementAdapter.java:36)
	at com.carrotsearch.randomizedtesting.ThreadLeakControl$StatementRunner.run(ThreadLeakControl.java:368)
	at java.base/java.lang.Thread.run(Thread.java:835)


FAILED:  junit.framework.TestSuite.org.apache.solr.update.processor.DistributedUpdateProcessorTest

Error Message:
SOLR-11606: ByteBuddy used by Mockito is not working with this JVM version.

Stack Trace:
org.junit.AssumptionViolatedException: SOLR-11606: ByteBuddy used by Mockito is not working with this JVM version.
	at __randomizedtesting.SeedInfo.seed([D7260DD705D22AC5]:0)
	at com.carrotsearch.randomizedtesting.RandomizedTest.assumeNoException(RandomizedTest.java:742)
	at org.apache.solr.SolrTestCaseJ4.assumeWorkingMockito(SolrTestCaseJ4.java:374)
	at org.apache.solr.update.processor.DistributedUpdateProcessorTest.beforeClass(DistributedUpdateProcessorTest.java:60)
	at java.base/jdk.internal.reflect.NativeMethodAccessorImpl.invoke0(Native Method)
	at java.base/jdk.internal.reflect.NativeMethodAccessorImpl.invoke(NativeMethodAccessorImpl.java:62)
	at java.base/jdk.internal.reflect.DelegatingMethodAccessorImpl.invoke(DelegatingMethodAccessorImpl.java:43)
	at java.base/java.lang.reflect.Method.invoke(Method.java:567)
	at com.carrotsearch.randomizedtesting.RandomizedRunner.invoke(RandomizedRunner.java:1750)
	at com.carrotsearch.randomizedtesting.RandomizedRunner$6.evaluate(RandomizedRunner.java:878)
	at com.carrotsearch.randomizedtesting.RandomizedRunner$7.evaluate(RandomizedRunner.java:894)
	at com.carrotsearch.randomizedtesting.rules.StatementAdapter.evaluate(StatementAdapter.java:36)
	at com.carrotsearch.randomizedtesting.rules.SystemPropertiesRestoreRule$1.evaluate(SystemPropertiesRestoreRule.java:57)
	at org.apache.lucene.util.AbstractBeforeAfterRule$1.evaluate(AbstractBeforeAfterRule.java:45)
	at com.carrotsearch.randomizedtesting.rules.StatementAdapter.evaluate(StatementAdapter.java:36)
	at org.apache.lucene.util.TestRuleStoreClassName$1.evaluate(TestRuleStoreClassName.java:41)
	at com.carrotsearch.randomizedtesting.rules.NoShadowingOrOverridesOnMethodsRule$1.evaluate(NoShadowingOrOverridesOnMethodsRule.java:40)
	at com.carrotsearch.randomizedtesting.rules.NoShadowingOrOverridesOnMethodsRule$1.evaluate(NoShadowingOrOverridesOnMethodsRule.java:40)
	at com.carrotsearch.randomizedtesting.rules.StatementAdapter.evaluate(StatementAdapter.java:36)
	at com.carrotsearch.randomizedtesting.rules.StatementAdapter.evaluate(StatementAdapter.java:36)
	at org.apache.lucene.util.TestRuleAssertionsRequired$1.evaluate(TestRuleAssertionsRequired.java:53)
	at org.apache.lucene.util.TestRuleMarkFailure$1.evaluate(TestRuleMarkFailure.java:47)
	at org.apache.lucene.util.TestRuleIgnoreAfterMaxFailures$1.evaluate(TestRuleIgnoreAfterMaxFailures.java:64)
	at org.apache.lucene.util.TestRuleIgnoreTestSuites$1.evaluate(TestRuleIgnoreTestSuites.java:54)
	at com.carrotsearch.randomizedtesting.rules.StatementAdapter.evaluate(StatementAdapter.java:36)
	at com.carrotsearch.randomizedtesting.ThreadLeakControl$StatementRunner.run(ThreadLeakControl.java:368)
	at java.base/java.lang.Thread.run(Thread.java:835)
Caused by: java.lang.IllegalArgumentException: Unknown Java version: 13
	at net.bytebuddy.ClassFileVersion.ofJavaVersion(ClassFileVersion.java:210)
	at net.bytebuddy.ClassFileVersion$VersionLocator$ForJava9CapableVm.locate(ClassFileVersion.java:462)
	at net.bytebuddy.ClassFileVersion.ofThisVm(ClassFileVersion.java:223)
	at java.base/jdk.internal.reflect.NativeMethodAccessorImpl.invoke0(Native Method)
	at java.base/jdk.internal.reflect.NativeMethodAccessorImpl.invoke(NativeMethodAccessorImpl.java:62)
	at java.base/jdk.internal.reflect.DelegatingMethodAccessorImpl.invoke(DelegatingMethodAccessorImpl.java:43)
	at java.base/java.lang.reflect.Method.invoke(Method.java:567)
	at org.apache.solr.SolrTestCaseJ4.assumeWorkingMockito(SolrTestCaseJ4.java:372)
	... 24 more


FAILED:  junit.framework.TestSuite.org.apache.solr.update.processor.DistributedUpdateProcessorTest

Error Message:


Stack Trace:
java.lang.NullPointerException
	at __randomizedtesting.SeedInfo.seed([D7260DD705D22AC5]:0)
	at org.apache.solr.update.processor.DistributedUpdateProcessorTest.AfterClass(DistributedUpdateProcessorTest.java:68)
	at java.base/jdk.internal.reflect.NativeMethodAccessorImpl.invoke0(Native Method)
	at java.base/jdk.internal.reflect.NativeMethodAccessorImpl.invoke(NativeMethodAccessorImpl.java:62)
	at java.base/jdk.internal.reflect.DelegatingMethodAccessorImpl.invoke(DelegatingMethodAccessorImpl.java:43)
	at java.base/java.lang.reflect.Method.invoke(Method.java:567)
	at com.carrotsearch.randomizedtesting.RandomizedRunner.invoke(RandomizedRunner.java:1750)
	at com.carrotsearch.randomizedtesting.RandomizedRunner$7.evaluate(RandomizedRunner.java:901)
	at com.carrotsearch.randomizedtesting.rules.StatementAdapter.evaluate(StatementAdapter.java:36)
	at com.carrotsearch.randomizedtesting.rules.SystemPropertiesRestoreRule$1.evaluate(SystemPropertiesRestoreRule.java:57)
	at org.apache.lucene.util.AbstractBeforeAfterRule$1.evaluate(AbstractBeforeAfterRule.java:45)
	at com.carrotsearch.randomizedtesting.rules.StatementAdapter.evaluate(StatementAdapter.java:36)
	at org.apache.lucene.util.TestRuleStoreClassName$1.evaluate(TestRuleStoreClassName.java:41)
	at com.carrotsearch.randomizedtesting.rules.NoShadowingOrOverridesOnMethodsRule$1.evaluate(NoShadowingOrOverridesOnMethodsRule.java:40)
	at com.carrotsearch.randomizedtesting.rules.NoShadowingOrOverridesOnMethodsRule$1.evaluate(NoShadowingOrOverridesOnMethodsRule.java:40)
	at com.carrotsearch.randomizedtesting.rules.StatementAdapter.evaluate(StatementAdapter.java:36)
	at com.carrotsearch.randomizedtesting.rules.StatementAdapter.evaluate(StatementAdapter.java:36)
	at org.apache.lucene.util.TestRuleAssertionsRequired$1.evaluate(TestRuleAssertionsRequired.java:53)
	at org.apache.lucene.util.TestRuleMarkFailure$1.evaluate(TestRuleMarkFailure.java:47)
	at org.apache.lucene.util.TestRuleIgnoreAfterMaxFailures$1.evaluate(TestRuleIgnoreAfterMaxFailures.java:64)
	at org.apache.lucene.util.TestRuleIgnoreTestSuites$1.evaluate(TestRuleIgnoreTestSuites.java:54)
	at com.carrotsearch.randomizedtesting.rules.StatementAdapter.evaluate(StatementAdapter.java:36)
	at com.carrotsearch.randomizedtesting.ThreadLeakControl$StatementRunner.run(ThreadLeakControl.java:368)
	at java.base/java.lang.Thread.run(Thread.java:835)


FAILED:  junit.framework.TestSuite.org.apache.solr.update.processor.DistributedUpdateProcessorTest

Error Message:
SOLR-11606: ByteBuddy used by Mockito is not working with this JVM version.

Stack Trace:
org.junit.AssumptionViolatedException: SOLR-11606: ByteBuddy used by Mockito is not working with this JVM version.
	at __randomizedtesting.SeedInfo.seed([D7260DD705D22AC5]:0)
	at com.carrotsearch.randomizedtesting.RandomizedTest.assumeNoException(RandomizedTest.java:742)
	at org.apache.solr.SolrTestCaseJ4.assumeWorkingMockito(SolrTestCaseJ4.java:374)
	at org.apache.solr.update.processor.DistributedUpdateProcessorTest.beforeClass(DistributedUpdateProcessorTest.java:60)
	at java.base/jdk.internal.reflect.NativeMethodAccessorImpl.invoke0(Native Method)
	at java.base/jdk.internal.reflect.NativeMethodAccessorImpl.invoke(NativeMethodAccessorImpl.java:62)
	at java.base/jdk.internal.reflect.DelegatingMethodAccessorImpl.invoke(DelegatingMethodAccessorImpl.java:43)
	at java.base/java.lang.reflect.Method.invoke(Method.java:567)
	at com.carrotsearch.randomizedtesting.RandomizedRunner.invoke(RandomizedRunner.java:1750)
	at com.carrotsearch.randomizedtesting.RandomizedRunner$6.evaluate(RandomizedRunner.java:878)
	at com.carrotsearch.randomizedtesting.RandomizedRunner$7.evaluate(RandomizedRunner.java:894)
	at com.carrotsearch.randomizedtesting.rules.StatementAdapter.evaluate(StatementAdapter.java:36)
	at com.carrotsearch.randomizedtesting.rules.SystemPropertiesRestoreRule$1.evaluate(SystemPropertiesRestoreRule.java:57)
	at org.apache.lucene.util.AbstractBeforeAfterRule$1.evaluate(AbstractBeforeAfterRule.java:45)
	at com.carrotsearch.randomizedtesting.rules.StatementAdapter.evaluate(StatementAdapter.java:36)
	at org.apache.lucene.util.TestRuleStoreClassName$1.evaluate(TestRuleStoreClassName.java:41)
	at com.carrotsearch.randomizedtesting.rules.NoShadowingOrOverridesOnMethodsRule$1.evaluate(NoShadowingOrOverridesOnMethodsRule.java:40)
	at com.carrotsearch.randomizedtesting.rules.NoShadowingOrOverridesOnMethodsRule$1.evaluate(NoShadowingOrOverridesOnMethodsRule.java:40)
	at com.carrotsearch.randomizedtesting.rules.StatementAdapter.evaluate(StatementAdapter.java:36)
	at com.carrotsearch.randomizedtesting.rules.StatementAdapter.evaluate(StatementAdapter.java:36)
	at org.apache.lucene.util.TestRuleAssertionsRequired$1.evaluate(TestRuleAssertionsRequired.java:53)
	at org.apache.lucene.util.TestRuleMarkFailure$1.evaluate(TestRuleMarkFailure.java:47)
	at org.apache.lucene.util.TestRuleIgnoreAfterMaxFailures$1.evaluate(TestRuleIgnoreAfterMaxFailures.java:64)
	at org.apache.lucene.util.TestRuleIgnoreTestSuites$1.evaluate(TestRuleIgnoreTestSuites.java:54)
	at com.carrotsearch.randomizedtesting.rules.StatementAdapter.evaluate(StatementAdapter.java:36)
	at com.carrotsearch.randomizedtesting.ThreadLeakControl$StatementRunner.run(ThreadLeakControl.java:368)
	at java.base/java.lang.Thread.run(Thread.java:835)
Caused by: java.lang.IllegalArgumentException: Unknown Java version: 13
	at net.bytebuddy.ClassFileVersion.ofJavaVersion(ClassFileVersion.java:210)
	at net.bytebuddy.ClassFileVersion$VersionLocator$ForJava9CapableVm.locate(ClassFileVersion.java:462)
	at net.bytebuddy.ClassFileVersion.ofThisVm(ClassFileVersion.java:223)
	at java.base/jdk.internal.reflect.NativeMethodAccessorImpl.invoke0(Native Method)
	at java.base/jdk.internal.reflect.NativeMethodAccessorImpl.invoke(NativeMethodAccessorImpl.java:62)
	at java.base/jdk.internal.reflect.DelegatingMethodAccessorImpl.invoke(DelegatingMethodAccessorImpl.java:43)
	at java.base/java.lang.reflect.Method.invoke(Method.java:567)
	at org.apache.solr.SolrTestCaseJ4.assumeWorkingMockito(SolrTestCaseJ4.java:372)
	... 24 more


FAILED:  junit.framework.TestSuite.org.apache.solr.update.processor.DistributedUpdateProcessorTest

Error Message:


Stack Trace:
java.lang.NullPointerException
	at __randomizedtesting.SeedInfo.seed([D7260DD705D22AC5]:0)
	at org.apache.solr.update.processor.DistributedUpdateProcessorTest.AfterClass(DistributedUpdateProcessorTest.java:68)
	at java.base/jdk.internal.reflect.NativeMethodAccessorImpl.invoke0(Native Method)
	at java.base/jdk.internal.reflect.NativeMethodAccessorImpl.invoke(NativeMethodAccessorImpl.java:62)
	at java.base/jdk.internal.reflect.DelegatingMethodAccessorImpl.invoke(DelegatingMethodAccessorImpl.java:43)
	at java.base/java.lang.reflect.Method.invoke(Method.java:567)
	at com.carrotsearch.randomizedtesting.RandomizedRunner.invoke(RandomizedRunner.java:1750)
	at com.carrotsearch.randomizedtesting.RandomizedRunner$7.evaluate(RandomizedRunner.java:901)
	at com.carrotsearch.randomizedtesting.rules.StatementAdapter.evaluate(StatementAdapter.java:36)
	at com.carrotsearch.randomizedtesting.rules.SystemPropertiesRestoreRule$1.evaluate(SystemPropertiesRestoreRule.java:57)
	at org.apache.lucene.util.AbstractBeforeAfterRule$1.evaluate(AbstractBeforeAfterRule.java:45)
	at com.carrotsearch.randomizedtesting.rules.StatementAdapter.evaluate(StatementAdapter.java:36)
	at org.apache.lucene.util.TestRuleStoreClassName$1.evaluate(TestRuleStoreClassName.java:41)
	at com.carrotsearch.randomizedtesting.rules.NoShadowingOrOverridesOnMethodsRule$1.evaluate(NoShadowingOrOverridesOnMethodsRule.java:40)
	at com.carrotsearch.randomizedtesting.rules.NoShadowingOrOverridesOnMethodsRule$1.evaluate(NoShadowingOrOverridesOnMethodsRule.java:40)
	at com.carrotsearch.randomizedtesting.rules.StatementAdapter.evaluate(StatementAdapter.java:36)
	at com.carrotsearch.randomizedtesting.rules.StatementAdapter.evaluate(StatementAdapter.java:36)
	at org.apache.lucene.util.TestRuleAssertionsRequired$1.evaluate(TestRuleAssertionsRequired.java:53)
	at org.apache.lucene.util.TestRuleMarkFailure$1.evaluate(TestRuleMarkFailure.java:47)
	at org.apache.lucene.util.TestRuleIgnoreAfterMaxFailures$1.evaluate(TestRuleIgnoreAfterMaxFailures.java:64)
	at org.apache.lucene.util.TestRuleIgnoreTestSuites$1.evaluate(TestRuleIgnoreTestSuites.java:54)
	at com.carrotsearch.randomizedtesting.rules.StatementAdapter.evaluate(StatementAdapter.java:36)
	at com.carrotsearch.randomizedtesting.ThreadLeakControl$StatementRunner.run(ThreadLeakControl.java:368)
	at java.base/java.lang.Thread.run(Thread.java:835)


FAILED:  junit.framework.TestSuite.org.apache.solr.update.processor.DistributedUpdateProcessorTest

Error Message:
SOLR-11606: ByteBuddy used by Mockito is not working with this JVM version.

Stack Trace:
org.junit.AssumptionViolatedException: SOLR-11606: ByteBuddy used by Mockito is not working with this JVM version.
	at __randomizedtesting.SeedInfo.seed([D7260DD705D22AC5]:0)
	at com.carrotsearch.randomizedtesting.RandomizedTest.assumeNoException(RandomizedTest.java:742)
	at org.apache.solr.SolrTestCaseJ4.assumeWorkingMockito(SolrTestCaseJ4.java:374)
	at org.apache.solr.update.processor.DistributedUpdateProcessorTest.beforeClass(DistributedUpdateProcessorTest.java:60)
	at java.base/jdk.internal.reflect.NativeMethodAccessorImpl.invoke0(Native Method)
	at java.base/jdk.internal.reflect.NativeMethodAccessorImpl.invoke(NativeMethodAccessorImpl.java:62)
	at java.base/jdk.internal.reflect.DelegatingMethodAccessorImpl.invoke(DelegatingMethodAccessorImpl.java:43)
	at java.base/java.lang.reflect.Method.invoke(Method.java:567)
	at com.carrotsearch.randomizedtesting.RandomizedRunner.invoke(RandomizedRunner.java:1750)
	at com.carrotsearch.randomizedtesting.RandomizedRunner$6.evaluate(RandomizedRunner.java:878)
	at com.carrotsearch.randomizedtesting.RandomizedRunner$7.evaluate(RandomizedRunner.java:894)
	at com.carrotsearch.randomizedtesting.rules.StatementAdapter.evaluate(StatementAdapter.java:36)
	at com.carrotsearch.randomizedtesting.rules.SystemPropertiesRestoreRule$1.evaluate(SystemPropertiesRestoreRule.java:57)
	at org.apache.lucene.util.AbstractBeforeAfterRule$1.evaluate(AbstractBeforeAfterRule.java:45)
	at com.carrotsearch.randomizedtesting.rules.StatementAdapter.evaluate(StatementAdapter.java:36)
	at org.apache.lucene.util.TestRuleStoreClassName$1.evaluate(TestRuleStoreClassName.java:41)
	at com.carrotsearch.randomizedtesting.rules.NoShadowingOrOverridesOnMethodsRule$1.evaluate(NoShadowingOrOverridesOnMethodsRule.java:40)
	at com.carrotsearch.randomizedtesting.rules.NoShadowingOrOverridesOnMethodsRule$1.evaluate(NoShadowingOrOverridesOnMethodsRule.java:40)
	at com.carrotsearch.randomizedtesting.rules.StatementAdapter.evaluate(StatementAdapter.java:36)
	at com.carrotsearch.randomizedtesting.rules.StatementAdapter.evaluate(StatementAdapter.java:36)
	at org.apache.lucene.util.TestRuleAssertionsRequired$1.evaluate(TestRuleAssertionsRequired.java:53)
	at org.apache.lucene.util.TestRuleMarkFailure$1.evaluate(TestRuleMarkFailure.java:47)
	at org.apache.lucene.util.TestRuleIgnoreAfterMaxFailures$1.evaluate(TestRuleIgnoreAfterMaxFailures.java:64)
	at org.apache.lucene.util.TestRuleIgnoreTestSuites$1.evaluate(TestRuleIgnoreTestSuites.java:54)
	at com.carrotsearch.randomizedtesting.rules.StatementAdapter.evaluate(StatementAdapter.java:36)
	at com.carrotsearch.randomizedtesting.ThreadLeakControl$StatementRunner.run(ThreadLeakControl.java:368)
	at java.base/java.lang.Thread.run(Thread.java:835)
Caused by: java.lang.IllegalArgumentException: Unknown Java version: 13
	at net.bytebuddy.ClassFileVersion.ofJavaVersion(ClassFileVersion.java:210)
	at net.bytebuddy.ClassFileVersion$VersionLocator$ForJava9CapableVm.locate(ClassFileVersion.java:462)
	at net.bytebuddy.ClassFileVersion.ofThisVm(ClassFileVersion.java:223)
	at java.base/jdk.internal.reflect.NativeMethodAccessorImpl.invoke0(Native Method)
	at java.base/jdk.internal.reflect.NativeMethodAccessorImpl.invoke(NativeMethodAccessorImpl.java:62)
	at java.base/jdk.internal.reflect.DelegatingMethodAccessorImpl.invoke(DelegatingMethodAccessorImpl.java:43)
	at java.base/java.lang.reflect.Method.invoke(Method.java:567)
	at org.apache.solr.SolrTestCaseJ4.assumeWorkingMockito(SolrTestCaseJ4.java:372)
	... 24 more


FAILED:  junit.framework.TestSuite.org.apache.solr.update.processor.DistributedUpdateProcessorTest

Error Message:


Stack Trace:
java.lang.NullPointerException
	at __randomizedtesting.SeedInfo.seed([D7260DD705D22AC5]:0)
	at org.apache.solr.update.processor.DistributedUpdateProcessorTest.AfterClass(DistributedUpdateProcessorTest.java:68)
	at java.base/jdk.internal.reflect.NativeMethodAccessorImpl.invoke0(Native Method)
	at java.base/jdk.internal.reflect.NativeMethodAccessorImpl.invoke(NativeMethodAccessorImpl.java:62)
	at java.base/jdk.internal.reflect.DelegatingMethodAccessorImpl.invoke(DelegatingMethodAccessorImpl.java:43)
	at java.base/java.lang.reflect.Method.invoke(Method.java:567)
	at com.carrotsearch.randomizedtesting.RandomizedRunner.invoke(RandomizedRunner.java:1750)
	at com.carrotsearch.randomizedtesting.RandomizedRunner$7.evaluate(RandomizedRunner.java:901)
	at com.carrotsearch.randomizedtesting.rules.StatementAdapter.evaluate(StatementAdapter.java:36)
	at com.carrotsearch.randomizedtesting.rules.SystemPropertiesRestoreRule$1.evaluate(SystemPropertiesRestoreRule.java:57)
	at org.apache.lucene.util.AbstractBeforeAfterRule$1.evaluate(AbstractBeforeAfterRule.java:45)
	at com.carrotsearch.randomizedtesting.rules.StatementAdapter.evaluate(StatementAdapter.java:36)
	at org.apache.lucene.util.TestRuleStoreClassName$1.evaluate(TestRuleStoreClassName.java:41)
	at com.carrotsearch.randomizedtesting.rules.NoShadowingOrOverridesOnMethodsRule$1.evaluate(NoShadowingOrOverridesOnMethodsRule.java:40)
	at com.carrotsearch.randomizedtesting.rules.NoShadowingOrOverridesOnMethodsRule$1.evaluate(NoShadowingOrOverridesOnMethodsRule.java:40)
	at com.carrotsearch.randomizedtesting.rules.StatementAdapter.evaluate(StatementAdapter.java:36)
	at com.carrotsearch.randomizedtesting.rules.StatementAdapter.evaluate(StatementAdapter.java:36)
	at org.apache.lucene.util.TestRuleAssertionsRequired$1.evaluate(TestRuleAssertionsRequired.java:53)
	at org.apache.lucene.util.TestRuleMarkFailure$1.evaluate(TestRuleMarkFailure.java:47)
	at org.apache.lucene.util.TestRuleIgnoreAfterMaxFailures$1.evaluate(TestRuleIgnoreAfterMaxFailures.java:64)
	at org.apache.lucene.util.TestRuleIgnoreTestSuites$1.evaluate(TestRuleIgnoreTestSuites.java:54)
	at com.carrotsearch.randomizedtesting.rules.StatementAdapter.evaluate(StatementAdapter.java:36)
	at com.carrotsearch.randomizedtesting.ThreadLeakControl$StatementRunner.run(ThreadLeakControl.java:368)
	at java.base/java.lang.Thread.run(Thread.java:835)


FAILED:  junit.framework.TestSuite.org.apache.solr.client.solrj.impl.CloudHttp2SolrClientTest

Error Message:
ObjectTracker found 5 object(s) that were not released!!! [MockDirectoryWrapper, SolrCore, InternalHttpClient, MockDirectoryWrapper, MockDirectoryWrapper] org.apache.solr.common.util.ObjectReleaseTracker$ObjectTrackerException: org.apache.lucene.store.MockDirectoryWrapper  at org.apache.solr.common.util.ObjectReleaseTracker.track(ObjectReleaseTracker.java:42)  at org.apache.solr.core.CachingDirectoryFactory.get(CachingDirectoryFactory.java:348)  at org.apache.solr.update.SolrIndexWriter.create(SolrIndexWriter.java:99)  at org.apache.solr.core.SolrCore.initIndex(SolrCore.java:779)  at org.apache.solr.core.SolrCore.<init>(SolrCore.java:976)  at org.apache.solr.core.SolrCore.<init>(SolrCore.java:883)  at org.apache.solr.core.CoreContainer.createFromDescriptor(CoreContainer.java:1238)  at org.apache.solr.core.CoreContainer.create(CoreContainer.java:1148)  at org.apache.solr.handler.admin.CoreAdminOperation.lambda$static$0(CoreAdminOperation.java:92)  at org.apache.solr.handler.admin.CoreAdminOperation.execute(CoreAdminOperation.java:360)  at org.apache.solr.handler.admin.CoreAdminHandler$CallInfo.call(CoreAdminHandler.java:396)  at org.apache.solr.handler.admin.CoreAdminHandler.lambda$handleRequestBody$0(CoreAdminHandler.java:188)  at com.codahale.metrics.InstrumentedExecutorService$InstrumentedRunnable.run(InstrumentedExecutorService.java:181)  at org.apache.solr.common.util.ExecutorUtil$MDCAwareThreadPoolExecutor.lambda$execute$0(ExecutorUtil.java:209)  at java.base/java.util.concurrent.ThreadPoolExecutor.runWorker(ThreadPoolExecutor.java:1128)  at java.base/java.util.concurrent.ThreadPoolExecutor$Worker.run(ThreadPoolExecutor.java:628)  at java.base/java.lang.Thread.run(Thread.java:835)  org.apache.solr.common.util.ObjectReleaseTracker$ObjectTrackerException: org.apache.solr.core.SolrCore  at org.apache.solr.common.util.ObjectReleaseTracker.track(ObjectReleaseTracker.java:42)  at org.apache.solr.core.SolrCore.<init>(SolrCore.java:1063)  at org.apache.solr.core.SolrCore.<init>(SolrCore.java:883)  at org.apache.solr.core.CoreContainer.createFromDescriptor(CoreContainer.java:1238)  at org.apache.solr.core.CoreContainer.create(CoreContainer.java:1148)  at org.apache.solr.handler.admin.CoreAdminOperation.lambda$static$0(CoreAdminOperation.java:92)  at org.apache.solr.handler.admin.CoreAdminOperation.execute(CoreAdminOperation.java:360)  at org.apache.solr.handler.admin.CoreAdminHandler$CallInfo.call(CoreAdminHandler.java:396)  at org.apache.solr.handler.admin.CoreAdminHandler.lambda$handleRequestBody$0(CoreAdminHandler.java:188)  at com.codahale.metrics.InstrumentedExecutorService$InstrumentedRunnable.run(InstrumentedExecutorService.java:181)  at org.apache.solr.common.util.ExecutorUtil$MDCAwareThreadPoolExecutor.lambda$execute$0(ExecutorUtil.java:209)  at java.base/java.util.concurrent.ThreadPoolExecutor.runWorker(ThreadPoolExecutor.java:1128)  at java.base/java.util.concurrent.ThreadPoolExecutor$Worker.run(ThreadPoolExecutor.java:628)  at java.base/java.lang.Thread.run(Thread.java:835)  org.apache.solr.common.util.ObjectReleaseTracker$ObjectTrackerException: org.apache.http.impl.client.InternalHttpClient  at org.apache.solr.common.util.ObjectReleaseTracker.track(ObjectReleaseTracker.java:42)  at org.apache.solr.client.solrj.impl.HttpClientUtil.createClient(HttpClientUtil.java:321)  at org.apache.solr.client.solrj.impl.HttpClientUtil.createClient(HttpClientUtil.java:330)  at org.apache.solr.handler.IndexFetcher.createHttpClient(IndexFetcher.java:230)  at org.apache.solr.handler.IndexFetcher.<init>(IndexFetcher.java:272)  at org.apache.solr.handler.ReplicationHandler.inform(ReplicationHandler.java:1224)  at org.apache.solr.cloud.ReplicateFromLeader.startReplication(ReplicateFromLeader.java:109)  at org.apache.solr.cloud.ZkController.startReplicationFromLeader(ZkController.java:1307)  at org.apache.solr.cloud.ZkController.register(ZkController.java:1202)  at org.apache.solr.cloud.ZkController.register(ZkController.java:1148)  at org.apache.solr.core.ZkContainer.lambda$registerInZk$0(ZkContainer.java:190)  at org.apache.solr.core.ZkContainer.registerInZk(ZkContainer.java:222)  at org.apache.solr.core.CoreContainer.registerCore(CoreContainer.java:1086)  at org.apache.solr.core.CoreContainer.createFromDescriptor(CoreContainer.java:1248)  at org.apache.solr.core.CoreContainer.create(CoreContainer.java:1148)  at org.apache.solr.handler.admin.CoreAdminOperation.lambda$static$0(CoreAdminOperation.java:92)  at org.apache.solr.handler.admin.CoreAdminOperation.execute(CoreAdminOperation.java:360)  at org.apache.solr.handler.admin.CoreAdminHandler$CallInfo.call(CoreAdminHandler.java:396)  at org.apache.solr.handler.admin.CoreAdminHandler.lambda$handleRequestBody$0(CoreAdminHandler.java:188)  at com.codahale.metrics.InstrumentedExecutorService$InstrumentedRunnable.run(InstrumentedExecutorService.java:181)  at org.apache.solr.common.util.ExecutorUtil$MDCAwareThreadPoolExecutor.lambda$execute$0(ExecutorUtil.java:209)  at java.base/java.util.concurrent.ThreadPoolExecutor.runWorker(ThreadPoolExecutor.java:1128)  at java.base/java.util.concurrent.ThreadPoolExecutor$Worker.run(ThreadPoolExecutor.java:628)  at java.base/java.lang.Thread.run(Thread.java:835)  org.apache.solr.common.util.ObjectReleaseTracker$ObjectTrackerException: org.apache.lucene.store.MockDirectoryWrapper  at org.apache.solr.common.util.ObjectReleaseTracker.track(ObjectReleaseTracker.java:42)  at org.apache.solr.core.CachingDirectoryFactory.get(CachingDirectoryFactory.java:348)  at org.apache.solr.core.SolrCore.initSnapshotMetaDataManager(SolrCore.java:517)  at org.apache.solr.core.SolrCore.<init>(SolrCore.java:968)  at org.apache.solr.core.SolrCore.<init>(SolrCore.java:883)  at org.apache.solr.core.CoreContainer.createFromDescriptor(CoreContainer.java:1238)  at org.apache.solr.core.CoreContainer.create(CoreContainer.java:1148)  at org.apache.solr.handler.admin.CoreAdminOperation.lambda$static$0(CoreAdminOperation.java:92)  at org.apache.solr.handler.admin.CoreAdminOperation.execute(CoreAdminOperation.java:360)  at org.apache.solr.handler.admin.CoreAdminHandler$CallInfo.call(CoreAdminHandler.java:396)  at org.apache.solr.handler.admin.CoreAdminHandler.lambda$handleRequestBody$0(CoreAdminHandler.java:188)  at com.codahale.metrics.InstrumentedExecutorService$InstrumentedRunnable.run(InstrumentedExecutorService.java:181)  at org.apache.solr.common.util.ExecutorUtil$MDCAwareThreadPoolExecutor.lambda$execute$0(ExecutorUtil.java:209)  at java.base/java.util.concurrent.ThreadPoolExecutor.runWorker(ThreadPoolExecutor.java:1128)  at java.base/java.util.concurrent.ThreadPoolExecutor$Worker.run(ThreadPoolExecutor.java:628)  at java.base/java.lang.Thread.run(Thread.java:835)  org.apache.solr.common.util.ObjectReleaseTracker$ObjectTrackerException: org.apache.lucene.store.MockDirectoryWrapper  at org.apache.solr.common.util.ObjectReleaseTracker.track(ObjectReleaseTracker.java:42)  at org.apache.solr.core.CachingDirectoryFactory.get(CachingDirectoryFactory.java:348)  at org.apache.solr.handler.IndexFetcher.fetchLatestIndex(IndexFetcher.java:509)  at org.apache.solr.handler.IndexFetcher.fetchLatestIndex(IndexFetcher.java:351)  at org.apache.solr.handler.ReplicationHandler.doFetch(ReplicationHandler.java:424)  at org.apache.solr.handler.ReplicationHandler.lambda$setupPolling$13(ReplicationHandler.java:1193)  at java.base/java.util.concurrent.Executors$RunnableAdapter.call(Executors.java:515)  at java.base/java.util.concurrent.FutureTask.runAndReset(FutureTask.java:305)  at java.base/java.util.concurrent.ScheduledThreadPoolExecutor$ScheduledFutureTask.run(ScheduledThreadPoolExecutor.java:305)  at java.base/java.util.concurrent.ThreadPoolExecutor.runWorker(ThreadPoolExecutor.java:1128)  at java.base/java.util.concurrent.ThreadPoolExecutor$Worker.run(ThreadPoolExecutor.java:628)  at java.base/java.lang.Thread.run(Thread.java:835)   expected null, but was:<ObjectTracker found 5 object(s) that were not released!!! [MockDirectoryWrapper, SolrCore, InternalHttpClient, MockDirectoryWrapper, MockDirectoryWrapper] org.apache.solr.common.util.ObjectReleaseTracker$ObjectTrackerException: org.apache.lucene.store.MockDirectoryWrapper  at org.apache.solr.common.util.ObjectReleaseTracker.track(ObjectReleaseTracker.java:42)  at org.apache.solr.core.CachingDirectoryFactory.get(CachingDirectoryFactory.java:348)  at org.apache.solr.update.SolrIndexWriter.create(SolrIndexWriter.java:99)  at org.apache.solr.core.SolrCore.initIndex(SolrCore.java:779)  at org.apache.solr.core.SolrCore.<init>(SolrCore.java:976)  at org.apache.solr.core.SolrCore.<init>(SolrCore.java:883)  at org.apache.solr.core.CoreContainer.createFromDescriptor(CoreContainer.java:1238)  at org.apache.solr.core.CoreContainer.create(CoreContainer.java:1148)  at org.apache.solr.handler.admin.CoreAdminOperation.lambda$static$0(CoreAdminOperation.java:92)  at org.apache.solr.handler.admin.CoreAdminOperation.execute(CoreAdminOperation.java:360)  at org.apache.solr.handler.admin.CoreAdminHandler$CallInfo.call(CoreAdminHandler.java:396)  at org.apache.solr.handler.admin.CoreAdminHandler.lambda$handleRequestBody$0(CoreAdminHandler.java:188)  at com.codahale.metrics.InstrumentedExecutorService$InstrumentedRunnable.run(InstrumentedExecutorService.java:181)  at org.apache.solr.common.util.ExecutorUtil$MDCAwareThreadPoolExecutor.lambda$execute$0(ExecutorUtil.java:209)  at java.base/java.util.concurrent.ThreadPoolExecutor.runWorker(ThreadPoolExecutor.java:1128)  at java.base/java.util.concurrent.ThreadPoolExecutor$Worker.run(ThreadPoolExecutor.java:628)  at java.base/java.lang.Thread.run(Thread.java:835)  org.apache.solr.common.util.ObjectReleaseTracker$ObjectTrackerException: org.apache.solr.core.SolrCore  at org.apache.solr.common.util.ObjectReleaseTracker.track(ObjectReleaseTracker.java:42)  at org.apache.solr.core.SolrCore.<init>(SolrCore.java:1063)  at org.apache.solr.core.SolrCore.<init>(SolrCore.java:883)  at org.apache.solr.core.CoreContainer.createFromDescriptor(CoreContainer.java:1238)  at org.apache.solr.core.CoreContainer.create(CoreContainer.java:1148)  at org.apache.solr.handler.admin.CoreAdminOperation.lambda$static$0(CoreAdminOperation.java:92)  at org.apache.solr.handler.admin.CoreAdminOperation.execute(CoreAdminOperation.java:360)  at org.apache.solr.handler.admin.CoreAdminHandler$CallInfo.call(CoreAdminHandler.java:396)  at org.apache.solr.handler.admin.CoreAdminHandler.lambda$handleRequestBody$0(CoreAdminHandler.java:188)  at com.codahale.metrics.InstrumentedExecutorService$InstrumentedRunnable.run(InstrumentedExecutorService.java:181)  at org.apache.solr.common.util.ExecutorUtil$MDCAwareThreadPoolExecutor.lambda$execute$0(ExecutorUtil.java:209)  at java.base/java.util.concurrent.ThreadPoolExecutor.runWorker(ThreadPoolExecutor.java:1128)  at java.base/java.util.concurrent.ThreadPoolExecutor$Worker.run(ThreadPoolExecutor.java:628)  at java.base/java.lang.Thread.run(Thread.java:835)  org.apache.solr.common.util.ObjectReleaseTracker$ObjectTrackerException: org.apache.http.impl.client.InternalHttpClient  at org.apache.solr.common.util.ObjectReleaseTracker.track(ObjectReleaseTracker.java:42)  at org.apache.solr.client.solrj.impl.HttpClientUtil.createClient(HttpClientUtil.java:321)  at org.apache.solr.client.solrj.impl.HttpClientUtil.createClient(HttpClientUtil.java:330)  at org.apache.solr.handler.IndexFetcher.createHttpClient(IndexFetcher.java:230)  at org.apache.solr.handler.IndexFetcher.<init>(IndexFetcher.java:272)  at org.apache.solr.handler.ReplicationHandler.inform(ReplicationHandler.java:1224)  at org.apache.solr.cloud.ReplicateFromLeader.startReplication(ReplicateFromLeader.java:109)  at org.apache.solr.cloud.ZkController.startReplicationFromLeader(ZkController.java:1307)  at org.apache.solr.cloud.ZkController.register(ZkController.java:1202)  at org.apache.solr.cloud.ZkController.register(ZkController.java:1148)  at org.apache.solr.core.ZkContainer.lambda$registerInZk$0(ZkContainer.java:190)  at org.apache.solr.core.ZkContainer.registerInZk(ZkContainer.java:222)  at org.apache.solr.core.CoreContainer.registerCore(CoreContainer.java:1086)  at org.apache.solr.core.CoreContainer.createFromDescriptor(CoreContainer.java:1248)  at org.apache.solr.core.CoreContainer.create(CoreContainer.java:1148)  at org.apache.solr.handler.admin.CoreAdminOperation.lambda$static$0(CoreAdminOperation.java:92)  at org.apache.solr.handler.admin.CoreAdminOperation.execute(CoreAdminOperation.java:360)  at org.apache.solr.handler.admin.CoreAdminHandler$CallInfo.call(CoreAdminHandler.java:396)  at org.apache.solr.handler.admin.CoreAdminHandler.lambda$handleRequestBody$0(CoreAdminHandler.java:188)  at com.codahale.metrics.InstrumentedExecutorService$InstrumentedRunnable.run(InstrumentedExecutorService.java:181)  at org.apache.solr.common.util.ExecutorUtil$MDCAwareThreadPoolExecutor.lambda$execute$0(ExecutorUtil.java:209)  at java.base/java.util.concurrent.ThreadPoolExecutor.runWorker(ThreadPoolExecutor.java:1128)  at java.base/java.util.concurrent.ThreadPoolExecutor$Worker.run(ThreadPoolExecutor.java:628)  at java.base/java.lang.Thread.run(Thread.java:835)  org.apache.solr.common.util.ObjectReleaseTracker$ObjectTrackerException: org.apache.lucene.store.MockDirectoryWrapper  at org.apache.solr.common.util.ObjectReleaseTracker.track(ObjectReleaseTracker.java:42)  at org.apache.solr.core.CachingDirectoryFactory.get(CachingDirectoryFactory.java:348)  at org.apache.solr.core.SolrCore.initSnapshotMetaDataManager(SolrCore.java:517)  at org.apache.solr.core.SolrCore.<init>(SolrCore.java:968)  at org.apache.solr.core.SolrCore.<init>(SolrCore.java:883)  at org.apache.solr.core.CoreContainer.createFromDescriptor(CoreContainer.java:1238)  at org.apache.solr.core.CoreContainer.create(CoreContainer.java:1148)  at org.apache.solr.handler.admin.CoreAdminOperation.lambda$static$0(CoreAdminOperation.java:92)  at org.apache.solr.handler.admin.CoreAdminOperation.execute(CoreAdminOperation.java:360)  at org.apache.solr.handler.admin.CoreAdminHandler$CallInfo.call(CoreAdminHandler.java:396)  at org.apache.solr.handler.admin.CoreAdminHandler.lambda$handleRequestBody$0(CoreAdminHandler.java:188)  at com.codahale.metrics.InstrumentedExecutorService$InstrumentedRunnable.run(InstrumentedExecutorService.java:181)  at org.apache.solr.common.util.ExecutorUtil$MDCAwareThreadPoolExecutor.lambda$execute$0(ExecutorUtil.java:209)  at java.base/java.util.concurrent.ThreadPoolExecutor.runWorker(ThreadPoolExecutor.java:1128)  at java.base/java.util.concurrent.ThreadPoolExecutor$Worker.run(ThreadPoolExecutor.java:628)  at java.base/java.lang.Thread.run(Thread.java:835)  org.apache.solr.common.util.ObjectReleaseTracker$ObjectTrackerException: org.apache.lucene.store.MockDirectoryWrapper  at org.apache.solr.common.util.ObjectReleaseTracker.track(ObjectReleaseTracker.java:42)  at org.apache.solr.core.CachingDirectoryFactory.get(CachingDirectoryFactory.java:348)  at org.apache.solr.handler.IndexFetcher.fetchLatestIndex(IndexFetcher.java:509)  at org.apache.solr.handler.IndexFetcher.fetchLatestIndex(IndexFetcher.java:351)  at org.apache.solr.handler.ReplicationHandler.doFetch(ReplicationHandler.java:424)  at org.apache.solr.handler.ReplicationHandler.lambda$setupPolling$13(ReplicationHandler.java:1193)  at java.base/java.util.concurrent.Executors$RunnableAdapter.call(Executors.java:515)  at java.base/java.util.concurrent.FutureTask.runAndReset(FutureTask.java:305)  at java.base/java.util.concurrent.ScheduledThreadPoolExecutor$ScheduledFutureTask.run(ScheduledThreadPoolExecutor.java:305)  at java.base/java.util.concurrent.ThreadPoolExecutor.runWorker(ThreadPoolExecutor.java:1128)  at java.base/java.util.concurrent.ThreadPoolExecutor$Worker.run(ThreadPoolExecutor.java:628)  at java.base/java.lang.Thread.run(Thread.java:835)  >

Stack Trace:
java.lang.AssertionError: ObjectTracker found 5 object(s) that were not released!!! [MockDirectoryWrapper, SolrCore, InternalHttpClient, MockDirectoryWrapper, MockDirectoryWrapper]
org.apache.solr.common.util.ObjectReleaseTracker$ObjectTrackerException: org.apache.lucene.store.MockDirectoryWrapper
	at org.apache.solr.common.util.ObjectReleaseTracker.track(ObjectReleaseTracker.java:42)
	at org.apache.solr.core.CachingDirectoryFactory.get(CachingDirectoryFactory.java:348)
	at org.apache.solr.update.SolrIndexWriter.create(SolrIndexWriter.java:99)
	at org.apache.solr.core.SolrCore.initIndex(SolrCore.java:779)
	at org.apache.solr.core.SolrCore.<init>(SolrCore.java:976)
	at org.apache.solr.core.SolrCore.<init>(SolrCore.java:883)
	at org.apache.solr.core.CoreContainer.createFromDescriptor(CoreContainer.java:1238)
	at org.apache.solr.core.CoreContainer.create(CoreContainer.java:1148)
	at org.apache.solr.handler.admin.CoreAdminOperation.lambda$static$0(CoreAdminOperation.java:92)
	at org.apache.solr.handler.admin.CoreAdminOperation.execute(CoreAdminOperation.java:360)
	at org.apache.solr.handler.admin.CoreAdminHandler$CallInfo.call(CoreAdminHandler.java:396)
	at org.apache.solr.handler.admin.CoreAdminHandler.lambda$handleRequestBody$0(CoreAdminHandler.java:188)
	at com.codahale.metrics.InstrumentedExecutorService$InstrumentedRunnable.run(InstrumentedExecutorService.java:181)
	at org.apache.solr.common.util.ExecutorUtil$MDCAwareThreadPoolExecutor.lambda$execute$0(ExecutorUtil.java:209)
	at java.base/java.util.concurrent.ThreadPoolExecutor.runWorker(ThreadPoolExecutor.java:1128)
	at java.base/java.util.concurrent.ThreadPoolExecutor$Worker.run(ThreadPoolExecutor.java:628)
	at java.base/java.lang.Thread.run(Thread.java:835)

org.apache.solr.common.util.ObjectReleaseTracker$ObjectTrackerException: org.apache.solr.core.SolrCore
	at org.apache.solr.common.util.ObjectReleaseTracker.track(ObjectReleaseTracker.java:42)
	at org.apache.solr.core.SolrCore.<init>(SolrCore.java:1063)
	at org.apache.solr.core.SolrCore.<init>(SolrCore.java:883)
	at org.apache.solr.core.CoreContainer.createFromDescriptor(CoreContainer.java:1238)
	at org.apache.solr.core.CoreContainer.create(CoreContainer.java:1148)
	at org.apache.solr.handler.admin.CoreAdminOperation.lambda$static$0(CoreAdminOperation.java:92)
	at org.apache.solr.handler.admin.CoreAdminOperation.execute(CoreAdminOperation.java:360)
	at org.apache.solr.handler.admin.CoreAdminHandler$CallInfo.call(CoreAdminHandler.java:396)
	at org.apache.solr.handler.admin.CoreAdminHandler.lambda$handleRequestBody$0(CoreAdminHandler.java:188)
	at com.codahale.metrics.InstrumentedExecutorService$InstrumentedRunnable.run(InstrumentedExecutorService.java:181)
	at org.apache.solr.common.util.ExecutorUtil$MDCAwareThreadPoolExecutor.lambda$execute$0(ExecutorUtil.java:209)
	at java.base/java.util.concurrent.ThreadPoolExecutor.runWorker(ThreadPoolExecutor.java:1128)
	at java.base/java.util.concurrent.ThreadPoolExecutor$Worker.run(ThreadPoolExecutor.java:628)
	at java.base/java.lang.Thread.run(Thread.java:835)

org.apache.solr.common.util.ObjectReleaseTracker$ObjectTrackerException: org.apache.http.impl.client.InternalHttpClient
	at org.apache.solr.common.util.ObjectReleaseTracker.track(ObjectReleaseTracker.java:42)
	at org.apache.solr.client.solrj.impl.HttpClientUtil.createClient(HttpClientUtil.java:321)
	at org.apache.solr.client.solrj.impl.HttpClientUtil.createClient(HttpClientUtil.java:330)
	at org.apache.solr.handler.IndexFetcher.createHttpClient(IndexFetcher.java:230)
	at org.apache.solr.handler.IndexFetcher.<init>(IndexFetcher.java:272)
	at org.apache.solr.handler.ReplicationHandler.inform(ReplicationHandler.java:1224)
	at org.apache.solr.cloud.ReplicateFromLeader.startReplication(ReplicateFromLeader.java:109)
	at org.apache.solr.cloud.ZkController.startReplicationFromLeader(ZkController.java:1307)
	at org.apache.solr.cloud.ZkController.register(ZkController.java:1202)
	at org.apache.solr.cloud.ZkController.register(ZkController.java:1148)
	at org.apache.solr.core.ZkContainer.lambda$registerInZk$0(ZkContainer.java:190)
	at org.apache.solr.core.ZkContainer.registerInZk(ZkContainer.java:222)
	at org.apache.solr.core.CoreContainer.registerCore(CoreContainer.java:1086)
	at org.apache.solr.core.CoreContainer.createFromDescriptor(CoreContainer.java:1248)
	at org.apache.solr.core.CoreContainer.create(CoreContainer.java:1148)
	at org.apache.solr.handler.admin.CoreAdminOperation.lambda$static$0(CoreAdminOperation.java:92)
	at org.apache.solr.handler.admin.CoreAdminOperation.execute(CoreAdminOperation.java:360)
	at org.apache.solr.handler.admin.CoreAdminHandler$CallInfo.call(CoreAdminHandler.java:396)
	at org.apache.solr.handler.admin.CoreAdminHandler.lambda$handleRequestBody$0(CoreAdminHandler.java:188)
	at com.codahale.metrics.InstrumentedExecutorService$InstrumentedRunnable.run(InstrumentedExecutorService.java:181)
	at org.apache.solr.common.util.ExecutorUtil$MDCAwareThreadPoolExecutor.lambda$execute$0(ExecutorUtil.java:209)
	at java.base/java.util.concurrent.ThreadPoolExecutor.runWorker(ThreadPoolExecutor.java:1128)
	at java.base/java.util.concurrent.ThreadPoolExecutor$Worker.run(ThreadPoolExecutor.java:628)
	at java.base/java.lang.Thread.run(Thread.java:835)

org.apache.solr.common.util.ObjectReleaseTracker$ObjectTrackerException: org.apache.lucene.store.MockDirectoryWrapper
	at org.apache.solr.common.util.ObjectReleaseTracker.track(ObjectReleaseTracker.java:42)
	at org.apache.solr.core.CachingDirectoryFactory.get(CachingDirectoryFactory.java:348)
	at org.apache.solr.core.SolrCore.initSnapshotMetaDataManager(SolrCore.java:517)
	at org.apache.solr.core.SolrCore.<init>(SolrCore.java:968)
	at org.apache.solr.core.SolrCore.<init>(SolrCore.java:883)
	at org.apache.solr.core.CoreContainer.createFromDescriptor(CoreContainer.java:1238)
	at org.apache.solr.core.CoreContainer.create(CoreContainer.java:1148)
	at org.apache.solr.handler.admin.CoreAdminOperation.lambda$static$0(CoreAdminOperation.java:92)
	at org.apache.solr.handler.admin.CoreAdminOperation.execute(CoreAdminOperation.java:360)
	at org.apache.solr.handler.admin.CoreAdminHandler$CallInfo.call(CoreAdminHandler.java:396)
	at org.apache.solr.handler.admin.CoreAdminHandler.lambda$handleRequestBody$0(CoreAdminHandler.java:188)
	at com.codahale.metrics.InstrumentedExecutorService$InstrumentedRunnable.run(InstrumentedExecutorService.java:181)
	at org.apache.solr.common.util.ExecutorUtil$MDCAwareThreadPoolExecutor.lambda$execute$0(ExecutorUtil.java:209)
	at java.base/java.util.concurrent.ThreadPoolExecutor.runWorker(ThreadPoolExecutor.java:1128)
	at java.base/java.util.concurrent.ThreadPoolExecutor$Worker.run(ThreadPoolExecutor.java:628)
	at java.base/java.lang.Thread.run(Thread.java:835)

org.apache.solr.common.util.ObjectReleaseTracker$ObjectTrackerException: org.apache.lucene.store.MockDirectoryWrapper
	at org.apache.solr.common.util.ObjectReleaseTracker.track(ObjectReleaseTracker.java:42)
	at org.apache.solr.core.CachingDirectoryFactory.get(CachingDirectoryFactory.java:348)
	at org.apache.solr.handler.IndexFetcher.fetchLatestIndex(IndexFetcher.java:509)
	at org.apache.solr.handler.IndexFetcher.fetchLatestIndex(IndexFetcher.java:351)
	at org.apache.solr.handler.ReplicationHandler.doFetch(ReplicationHandler.java:424)
	at org.apache.solr.handler.ReplicationHandler.lambda$setupPolling$13(ReplicationHandler.java:1193)
	at java.base/java.util.concurrent.Executors$RunnableAdapter.call(Executors.java:515)
	at java.base/java.util.concurrent.FutureTask.runAndReset(FutureTask.java:305)
	at java.base/java.util.concurrent.ScheduledThreadPoolExecutor$ScheduledFutureTask.run(ScheduledThreadPoolExecutor.java:305)
	at java.base/java.util.concurrent.ThreadPoolExecutor.runWorker(ThreadPoolExecutor.java:1128)
	at java.base/java.util.concurrent.ThreadPoolExecutor$Worker.run(ThreadPoolExecutor.java:628)
	at java.base/java.lang.Thread.run(Thread.java:835)

 expected null, but was:<ObjectTracker found 5 object(s) that were not released!!! [MockDirectoryWrapper, SolrCore, InternalHttpClient, MockDirectoryWrapper, MockDirectoryWrapper]
org.apache.solr.common.util.ObjectReleaseTracker$ObjectTrackerException: org.apache.lucene.store.MockDirectoryWrapper
	at org.apache.solr.common.util.ObjectReleaseTracker.track(ObjectReleaseTracker.java:42)
	at org.apache.solr.core.CachingDirectoryFactory.get(CachingDirectoryFactory.java:348)
	at org.apache.solr.update.SolrIndexWriter.create(SolrIndexWriter.java:99)
	at org.apache.solr.core.SolrCore.initIndex(SolrCore.java:779)
	at org.apache.solr.core.SolrCore.<init>(SolrCore.java:976)
	at org.apache.solr.core.SolrCore.<init>(SolrCore.java:883)
	at org.apache.solr.core.CoreContainer.createFromDescriptor(CoreContainer.java:1238)
	at org.apache.solr.core.CoreContainer.create(CoreContainer.java:1148)
	at org.apache.solr.handler.admin.CoreAdminOperation.lambda$static$0(CoreAdminOperation.java:92)
	at org.apache.solr.handler.admin.CoreAdminOperation.execute(CoreAdminOperation.java:360)
	at org.apache.solr.handler.admin.CoreAdminHandler$CallInfo.call(CoreAdminHandler.java:396)
	at org.apache.solr.handler.admin.CoreAdminHandler.lambda$handleRequestBody$0(CoreAdminHandler.java:188)
	at com.codahale.metrics.InstrumentedExecutorService$InstrumentedRunnable.run(InstrumentedExecutorService.java:181)
	at org.apache.solr.common.util.ExecutorUtil$MDCAwareThreadPoolExecutor.lambda$execute$0(ExecutorUtil.java:209)
	at java.base/java.util.concurrent.ThreadPoolExecutor.runWorker(ThreadPoolExecutor.java:1128)
	at java.base/java.util.concurrent.ThreadPoolExecutor$Worker.run(ThreadPoolExecutor.java:628)
	at java.base/java.lang.Thread.run(Thread.java:835)

org.apache.solr.common.util.ObjectReleaseTracker$ObjectTrackerException: org.apache.solr.core.SolrCore
	at org.apache.solr.common.util.ObjectReleaseTracker.track(ObjectReleaseTracker.java:42)
	at org.apache.solr.core.SolrCore.<init>(SolrCore.java:1063)
	at org.apache.solr.core.SolrCore.<init>(SolrCore.java:883)
	at org.apache.solr.core.CoreContainer.createFromDescriptor(CoreContainer.java:1238)
	at org.apache.solr.core.CoreContainer.create(CoreContainer.java:1148)
	at org.apache.solr.handler.admin.CoreAdminOperation.lambda$static$0(CoreAdminOperation.java:92)
	at org.apache.solr.handler.admin.CoreAdminOperation.execute(CoreAdminOperation.java:360)
	at org.apache.solr.handler.admin.CoreAdminHandler$CallInfo.call(CoreAdminHandler.java:396)
	at org.apache.solr.handler.admin.CoreAdminHandler.lambda$handleRequestBody$0(CoreAdminHandler.java:188)
	at com.codahale.metrics.InstrumentedExecutorService$InstrumentedRunnable.run(InstrumentedExecutorService.java:181)
	at org.apache.solr.common.util.ExecutorUtil$MDCAwareThreadPoolExecutor.lambda$execute$0(ExecutorUtil.java:209)
	at java.base/java.util.concurrent.ThreadPoolExecutor.runWorker(ThreadPoolExecutor.java:1128)
	at java.base/java.util.concurrent.ThreadPoolExecutor$Worker.run(ThreadPoolExecutor.java:628)
	at java.base/java.lang.Thread.run(Thread.java:835)

org.apache.solr.common.util.ObjectReleaseTracker$ObjectTrackerException: org.apache.http.impl.client.InternalHttpClient
	at org.apache.solr.common.util.ObjectReleaseTracker.track(ObjectReleaseTracker.java:42)
	at org.apache.solr.client.solrj.impl.HttpClientUtil.createClient(HttpClientUtil.java:321)
	at org.apache.solr.client.solrj.impl.HttpClientUtil.createClient(HttpClientUtil.java:330)
	at org.apache.solr.handler.IndexFetcher.createHttpClient(IndexFetcher.java:230)
	at org.apache.solr.handler.IndexFetcher.<init>(IndexFetcher.java:272)
	at org.apache.solr.handler.ReplicationHandler.inform(ReplicationHandler.java:1224)
	at org.apache.solr.cloud.ReplicateFromLeader.startReplication(ReplicateFromLeader.java:109)
	at org.apache.solr.cloud.ZkController.startReplicationFromLeader(ZkController.java:1307)
	at org.apache.solr.cloud.ZkController.register(ZkController.java:1202)
	at org.apache.solr.cloud.ZkController.register(ZkController.java:1148)
	at org.apache.solr.core.ZkContainer.lambda$registerInZk$0(ZkContainer.java:190)
	at org.apache.solr.core.ZkContainer.registerInZk(ZkContainer.java:222)
	at org.apache.solr.core.CoreContainer.registerCore(CoreContainer.java:1086)
	at org.apache.solr.core.CoreContainer.createFromDescriptor(CoreContainer.java:1248)
	at org.apache.solr.core.CoreContainer.create(CoreContainer.java:1148)
	at org.apache.solr.handler.admin.CoreAdminOperation.lambda$static$0(CoreAdminOperation.java:92)
	at org.apache.solr.handler.admin.CoreAdminOperation.execute(CoreAdminOperation.java:360)
	at org.apache.solr.handler.admin.CoreAdminHandler$CallInfo.call(CoreAdminHandler.java:396)
	at org.apache.solr.handler.admin.CoreAdminHandler.lambda$handleRequestBody$0(CoreAdminHandler.java:188)
	at com.codahale.metrics.InstrumentedExecutorService$InstrumentedRunnable.run(InstrumentedExecutorService.java:181)
	at org.apache.solr.common.util.ExecutorUtil$MDCAwareThreadPoolExecutor.lambda$execute$0(ExecutorUtil.java:209)
	at java.base/java.util.concurrent.ThreadPoolExecutor.runWorker(ThreadPoolExecutor.java:1128)
	at java.base/java.util.concurrent.ThreadPoolExecutor$Worker.run(ThreadPoolExecutor.java:628)
	at java.base/java.lang.Thread.run(Thread.java:835)

org.apache.solr.common.util.ObjectReleaseTracker$ObjectTrackerException: org.apache.lucene.store.MockDirectoryWrapper
	at org.apache.solr.common.util.ObjectReleaseTracker.track(ObjectReleaseTracker.java:42)
	at org.apache.solr.core.CachingDirectoryFactory.get(CachingDirectoryFactory.java:348)
	at org.apache.solr.core.SolrCore.initSnapshotMetaDataManager(SolrCore.java:517)
	at org.apache.solr.core.SolrCore.<init>(SolrCore.java:968)
	at org.apache.solr.core.SolrCore.<init>(SolrCore.java:883)
	at org.apache.solr.core.CoreContainer.createFromDescriptor(CoreContainer.java:1238)
	at org.apache.solr.core.CoreContainer.create(CoreContainer.java:1148)
	at org.apache.solr.handler.admin.CoreAdminOperation.lambda$static$0(CoreAdminOperation.java:92)
	at org.apache.solr.handler.admin.CoreAdminOperation.execute(CoreAdminOperation.java:360)
	at org.apache.solr.handler.admin.CoreAdminHandler$CallInfo.call(CoreAdminHandler.java:396)
	at org.apache.solr.handler.admin.CoreAdminHandler.lambda$handleRequestBody$0(CoreAdminHandler.java:188)
	at com.codahale.metrics.InstrumentedExecutorService$InstrumentedRunnable.run(InstrumentedExecutorService.java:181)
	at org.apache.solr.common.util.ExecutorUtil$MDCAwareThreadPoolExecutor.lambda$execute$0(ExecutorUtil.java:209)
	at java.base/java.util.concurrent.ThreadPoolExecutor.runWorker(ThreadPoolExecutor.java:1128)
	at java.base/java.util.concurrent.ThreadPoolExecutor$Worker.run(ThreadPoolExecutor.java:628)
	at java.base/java.lang.Thread.run(Thread.java:835)

org.apache.solr.common.util.ObjectReleaseTracker$ObjectTrackerException: org.apache.lucene.store.MockDirectoryWrapper
	at org.apache.solr.common.util.ObjectReleaseTracker.track(ObjectReleaseTracker.java:42)
	at org.apache.solr.core.CachingDirectoryFactory.get(CachingDirectoryFactory.java:348)
	at org.apache.solr.handler.IndexFetcher.fetchLatestIndex(IndexFetcher.java:509)
	at org.apache.solr.handler.IndexFetcher.fetchLatestIndex(IndexFetcher.java:351)
	at org.apache.solr.handler.ReplicationHandler.doFetch(ReplicationHandler.java:424)
	at org.apache.solr.handler.ReplicationHandler.lambda$setupPolling$13(ReplicationHandler.java:1193)
	at java.base/java.util.concurrent.Executors$RunnableAdapter.call(Executors.java:515)
	at java.base/java.util.concurrent.FutureTask.runAndReset(FutureTask.java:305)
	at java.base/java.util.concurrent.ScheduledThreadPoolExecutor$ScheduledFutureTask.run(ScheduledThreadPoolExecutor.java:305)
	at java.base/java.util.concurrent.ThreadPoolExecutor.runWorker(ThreadPoolExecutor.java:1128)
	at java.base/java.util.concurrent.ThreadPoolExecutor$Worker.run(ThreadPoolExecutor.java:628)
	at java.base/java.lang.Thread.run(Thread.java:835)

>
	at __randomizedtesting.SeedInfo.seed([5A4C003840BE4ADC]:0)
	at org.junit.Assert.fail(Assert.java:88)
	at org.junit.Assert.failNotNull(Assert.java:755)
	at org.junit.Assert.assertNull(Assert.java:737)
	at org.apache.solr.SolrTestCaseJ4.teardownTestCases(SolrTestCaseJ4.java:331)
	at jdk.internal.reflect.GeneratedMethodAccessor39.invoke(Unknown Source)
	at java.base/jdk.internal.reflect.DelegatingMethodAccessorImpl.invoke(DelegatingMethodAccessorImpl.java:43)
	at java.base/java.lang.reflect.Method.invoke(Method.java:567)
	at com.carrotsearch.randomizedtesting.RandomizedRunner.invoke(RandomizedRunner.java:1750)
	at com.carrotsearch.randomizedtesting.RandomizedRunner$7.evaluate(RandomizedRunner.java:901)
	at com.carrotsearch.randomizedtesting.rules.StatementAdapter.evaluate(StatementAdapter.java:36)
	at com.carrotsearch.randomizedtesting.rules.SystemPropertiesRestoreRule$1.evaluate(SystemPropertiesRestoreRule.java:57)
	at org.apache.lucene.util.AbstractBeforeAfterRule$1.evaluate(AbstractBeforeAfterRule.java:45)
	at com.carrotsearch.randomizedtesting.rules.StatementAdapter.evaluate(StatementAdapter.java:36)
	at org.apache.lucene.util.TestRuleStoreClassName$1.evaluate(TestRuleStoreClassName.java:41)
	at com.carrotsearch.randomizedtesting.rules.NoShadowingOrOverridesOnMethodsRule$1.evaluate(NoShadowingOrOverridesOnMethodsRule.java:40)
	at com.carrotsearch.randomizedtesting.rules.NoShadowingOrOverridesOnMethodsRule$1.evaluate(NoShadowingOrOverridesOnMethodsRule.java:40)
	at com.carrotsearch.randomizedtesting.rules.StatementAdapter.evaluate(StatementAdapter.java:36)
	at com.carrotsearch.randomizedtesting.rules.StatementAdapter.evaluate(StatementAdapter.java:36)
	at org.apache.lucene.util.TestRuleAssertionsRequired$1.evaluate(TestRuleAssertionsRequired.java:53)
	at org.apache.lucene.util.TestRuleMarkFailure$1.evaluate(TestRuleMarkFailure.java:47)
	at org.apache.lucene.util.TestRuleIgnoreAfterMaxFailures$1.evaluate(TestRuleIgnoreAfterMaxFailures.java:64)
	at org.apache.lucene.util.TestRuleIgnoreTestSuites$1.evaluate(TestRuleIgnoreTestSuites.java:54)
	at com.carrotsearch.randomizedtesting.rules.StatementAdapter.evaluate(StatementAdapter.java:36)
	at com.carrotsearch.randomizedtesting.ThreadLeakControl$StatementRunner.run(ThreadLeakControl.java:368)
	at java.base/java.lang.Thread.run(Thread.java:835)




Build Log:
[...truncated 14405 lines...]
   [junit4] Suite: org.apache.solr.update.processor.DistributedUpdateProcessorTest
   [junit4]   2> Creating dataDir: C:\Users\jenkins\workspace\Lucene-Solr-8.1-Windows\solr\build\solr-core\test\J1\temp\solr.update.processor.DistributedUpdateProcessorTest_D7260DD705D22AC5-001\init-core-data-001
   [junit4]   2> 1861813 WARN  (SUITE-DistributedUpdateProcessorTest-seed#[D7260DD705D22AC5]-worker) [    ] o.a.s.SolrTestCaseJ4 startTrackingSearchers: numOpens=36 numCloses=36
   [junit4]   2> 1861813 INFO  (SUITE-DistributedUpdateProcessorTest-seed#[D7260DD705D22AC5]-worker) [    ] o.a.s.SolrTestCaseJ4 Using PointFields (NUMERIC_POINTS_SYSPROP=true) w/NUMERIC_DOCVALUES_SYSPROP=false
   [junit4]   2> 1861814 INFO  (SUITE-DistributedUpdateProcessorTest-seed#[D7260DD705D22AC5]-worker) [    ] o.a.s.SolrTestCaseJ4 Randomized ssl (false) and clientAuth (false) via: @org.apache.solr.util.RandomizeSSL(reason="", value=0.0/0.0, ssl=0.0/0.0, clientAuth=0.0/0.0)
   [junit4]   2> 1861814 INFO  (SUITE-DistributedUpdateProcessorTest-seed#[D7260DD705D22AC5]-worker) [    ] o.a.s.SolrTestCaseJ4 SecureRandom sanity checks: test.solr.allowed.securerandom=null & java.security.egd=file:/dev/./urandom
   [junit4]   2> 1861815 INFO  (SUITE-DistributedUpdateProcessorTest-seed#[D7260DD705D22AC5]-worker) [    ] o.a.s.SolrTestCaseJ4 ------------------------------------------------------- Done waiting for tracked resources to be released
   [junit4]   2> NOTE: test params are: codec=Asserting(Lucene80): {}, docValues:{}, maxPointsInLeafNode=1032, maxMBSortInHeap=6.627336432035751, sim=Asserting(org.apache.lucene.search.similarities.AssertingSimilarity@869f49e), locale=tk-TM, timezone=America/Sitka
   [junit4]   2> NOTE: Windows 10 10.0 amd64/Oracle Corporation 13-ea (64-bit)/cpus=3,threads=1,free=96605784,total=481296384
   [junit4]   2> NOTE: All tests run in this JVM: [TestManagedSchema, TestLegacyNumericRangeQueryBuilder, TestSolrFieldCacheBean, NodeLostTriggerTest, SolrRequestParserTest, CollectionsAPISolrJTest, TestSmileRequest, TestCopyFieldCollectionResource, CoreAdminOperationTest, SolrRrdBackendFactoryTest, JvmMetricsTest, CursorMarkTest, PhrasesIdentificationComponentTest, DistributedIntervalFacetingTest, GraphQueryTest, SearchRateTriggerIntegrationTest, RequestHandlersTest, TestSimNodeAddedTrigger, TriggerIntegrationTest, TimeRoutedAliasUpdateProcessorTest, TestDocSet, IgnoreLargeDocumentProcessorFactoryTest, MergeStrategyTest, JWTAuthPluginIntegrationTest, HighlighterTest, SampleTest, IndexSchemaTest, TestCryptoKeys, AddSchemaFieldsUpdateProcessorFactoryTest, LegacyCloudClusterPropTest, TestManagedResource, AuthToolTest, TestCharFilters, SuggestComponentTest, TestDynamicLoading, TestSha256AuthenticationProvider, SolrIndexMetricsTest, TestMacros, SearchHandlerTest, SystemLogListenerTest, ReplicaListTransformerTest, TestSegmentSorting, TestFileDictionaryLookup, RegexBoostProcessorTest, SynonymTokenizerTest, SortSpecParsingTest, StatsReloadRaceTest, UninvertDocValuesMergePolicyTest, OverseerCollectionConfigSetProcessorTest, TestQueryTypes, TestIntervalFaceting, TestSimpleTrackingShardHandler, QueryParsingTest, ShardRoutingCustomTest, TestLegacyTerms, ScheduledTriggerIntegrationTest, BlockDirectoryTest, TestExactStatsCache, TestReloadDeadlock, RangeFacetCloudTest, HdfsUnloadDistributedZkTest, TestSolrDeletionPolicy2, BlobRepositoryCloudTest, TestImpersonationWithHadoopAuth, SolrMetricReporterTest, ZkCLITest, TestUnifiedSolrHighlighter, TestStressUserVersions, TestSizeLimitedDistributedMap, DirectoryFactoryTest, CollectionPropsTest, XmlUpdateRequestHandlerTest, TestBM25SimilarityFactory, DeleteShardTest, MoreLikeThisHandlerTest, ZkShardTermsTest, TestCoreDiscovery, NoCacheHeaderTest, SolrLogAuditLoggerPluginTest, TestLuceneMatchVersion, TestCloudJSONFacetJoinDomain, TestSimClusterStateProvider, TestAuthenticationFramework, PeerSyncWithBufferUpdatesTest, DistributedFacetPivotWhiteBoxTest, CSVRequestHandlerTest, ImplicitSnitchTest, TestDistributedMissingSort, TestSolrConfigHandler, TestShardHandlerFactory, MetricsHandlerTest, TestPayloadScoreQParserPlugin, TestCloudPhrasesIdentificationComponent, LeaderFailoverAfterPartitionTest, TestTestInjection, HdfsRecoverLeaseTest, TestStandardQParsers, TestSolrCLIRunExample, TestFieldCache, NumberUtilsTest, NotRequiredUniqueKeyTest, CreateCollectionCleanupTest, BJQParserTest, TestStressRecovery, SolrGraphiteReporterTest, RandomizedTaggerTest, TestPointFields, TemplateUpdateProcessorTest, CdcrBootstrapTest, TestRequestStatusCollectionAPI, TestTolerantUpdateProcessorRandomCloud, StatsComponentTest, TestRestManager, TestIndexSearcher, TestLeaderElectionZkExpiry, DistributedExpandComponentTest, TestSolrQueryResponse, ClusterStateTest, TestNonDefinedSimilarityFactory, TestCoreBackup, FieldAnalysisRequestHandlerTest, TestHdfsUpdateLog, SOLR749Test, HttpPartitionWithTlogReplicasTest, TestWithCollection, MoveReplicaHDFSTest, TlogReplayBufferedWhileIndexingTest, TestBadConfig, ChaosMonkeyNothingIsSafeWithPullReplicasTest, DistributedQueryComponentCustomSortTest, TestDocTermOrds, TestPKIAuthenticationPlugin, DistribJoinFromCollectionTest, TestLocalFSCloudBackupRestore, SolrXmlInZkTest, AutoAddReplicasPlanActionTest, TestLegacyFieldCache, SharedFSAutoReplicaFailoverTest, CdcrReplicationHandlerTest, V2ApiIntegrationTest, OpenExchangeRatesOrgProviderTest, TestGeoJSONResponseWriter, CoreAdminCreateDiscoverTest, TestSimExecutePlanAction, ActionThrottleTest, ExternalFileFieldSortTest, TestDistribDocBasedVersion, HdfsThreadLeakTest, HdfsRestartWhileUpdatingTest, TestConfigSets, TestEmbeddedSolrServerConstructors, PrimitiveFieldTypeTest, TestSchemaResource, ZkFailoverTest, CategoryRoutedAliasUpdateProcessorTest, RestartWhileUpdatingTest, TestJavabinTupleStreamParser, TestPhraseSuggestions, HdfsDirectoryTest, JavabinLoaderTest, TestInPlaceUpdatesDistrib, TestComponentsName, TestManagedSynonymFilterFactory, TestRequestForwarding, TestJsonFacetRefinement, SolrTestCaseJ4Test, TestTolerantSearch, SchemaApiFailureTest, OverseerTaskQueueTest, SSLMigrationTest, TestSolrCoreSnapshots, BasicAuthIntegrationTest, TestApiFramework, TestCloudPseudoReturnFields, TestHighlightDedupGrouping, TestAtomicUpdateErrorCases, RulesTest, TestWriterPerf, TestFacetMethods, NestedShardedAtomicUpdateTest, MultiDestinationAuditLoggerTest, TestNestedUpdateProcessor, LukeRequestHandlerTest, OutOfBoxZkACLAndCredentialsProvidersTest, TestGraphTermsQParserPlugin, SolrPluginUtilsTest, TestCollectionsAPIViaSolrCloudCluster, TestPrepRecovery, BigEndianAscendingWordSerializerTest, BasicZkTest, HLLSerializationTest, DistanceUnitsTest, FullSolrCloudDistribCmdsTest, CollectionsAPIAsyncDistributedZkTest, TestStreamBody, CdcrVersionReplicationTest, RestoreTriggerStateTest, NodeAddedTriggerTest, ClassificationUpdateProcessorIntegrationTest, TestOverriddenPrefixQueryForCustomFieldType, UpdateParamsTest, TestSolr4Spatial2, DirectUpdateHandlerTest, DocValuesMissingTest, HdfsAutoAddReplicasIntegrationTest, MetricTriggerTest, CloudMLTQParserTest, DistributedUpdateProcessorTest]
   [junit4]   2> NOTE: reproduce with: ant test  -Dtestcase=DistributedUpdateProcessorTest -Dtests.seed=D7260DD705D22AC5 -Dtests.slow=true -Dtests.locale=tk-TM -Dtests.timezone=America/Sitka -Dtests.asserts=true -Dtests.file.encoding=Cp1252
   [junit4] ERROR   0.00s J1 | DistributedUpdateProcessorTest (suite) <<<
   [junit4]    > Assumption #1: SOLR-11606: ByteBuddy used by Mockito is not working with this JVM version.Throwable #2: java.lang.NullPointerException
   [junit4]    > 	at __randomizedtesting.SeedInfo.seed([D7260DD705D22AC5]:0)
   [junit4]    > 	at org.apache.solr.update.processor.DistributedUpdateProcessorTest.AfterClass(DistributedUpdateProcessorTest.java:68)
   [junit4]    > 	at java.base/jdk.internal.reflect.NativeMethodAccessorImpl.invoke0(Native Method)
   [junit4]    > 	at java.base/jdk.internal.reflect.NativeMethodAccessorImpl.invoke(NativeMethodAccessorImpl.java:62)
   [junit4]    > 	at java.base/jdk.internal.reflect.DelegatingMethodAccessorImpl.invoke(DelegatingMethodAccessorImpl.java:43)
   [junit4]    > 	at java.base/java.lang.reflect.Method.invoke(Method.java:567)
   [junit4]    > 	at java.base/java.lang.Thread.run(Thread.java:835)
   [junit4] Completed [449/855 (1!)] on J1 in 0.25s, 0 tests, 1 error <<< FAILURES!

[...truncated 2557 lines...]
   [junit4] Suite: org.apache.solr.client.solrj.impl.CloudHttp2SolrClientTest
   [junit4]   2> Creating dataDir: C:\Users\jenkins\workspace\Lucene-Solr-8.1-Windows\solr\build\solr-solrj\test\J0\temp\solr.client.solrj.impl.CloudHttp2SolrClientTest_5A4C003840BE4ADC-001\init-core-data-001
   [junit4]   2> 349665 INFO  (SUITE-CloudHttp2SolrClientTest-seed#[5A4C003840BE4ADC]-worker) [    ] o.a.s.SolrTestCaseJ4 SecureRandom sanity checks: test.solr.allowed.securerandom=null & java.security.egd=file:/dev/./urandom
   [junit4]   2> 349667 WARN  (SUITE-CloudHttp2SolrClientTest-seed#[5A4C003840BE4ADC]-worker) [    ] o.a.s.SolrTestCaseJ4 startTrackingSearchers: numOpens=128 numCloses=128
   [junit4]   2> 349667 INFO  (SUITE-CloudHttp2SolrClientTest-seed#[5A4C003840BE4ADC]-worker) [    ] o.a.s.SolrTestCaseJ4 Using TrieFields (NUMERIC_POINTS_SYSPROP=false) w/NUMERIC_DOCVALUES_SYSPROP=true
   [junit4]   2> 349670 INFO  (SUITE-CloudHttp2SolrClientTest-seed#[5A4C003840BE4ADC]-worker) [    ] o.a.s.SolrTestCaseJ4 Randomized ssl (false) and clientAuth (true) via: @org.apache.solr.util.RandomizeSSL(reason="", value=0.0/0.0, ssl=0.0/0.0, clientAuth=0.0/0.0)
   [junit4]   2> 349675 INFO  (TEST-CloudHttp2SolrClientTest.testWrongZkChrootTest-seed#[5A4C003840BE4ADC]) [    ] o.a.s.SolrTestCaseJ4 ###Starting testWrongZkChrootTest
   [junit4]   2> 349675 INFO  (TEST-CloudHttp2SolrClientTest.testWrongZkChrootTest-seed#[5A4C003840BE4ADC]) [    ] o.a.s.c.MiniSolrCloudCluster Starting cluster of 3 servers in C:\Users\jenkins\workspace\Lucene-Solr-8.1-Windows\solr\build\solr-solrj\test\J0\temp\solr.client.solrj.impl.CloudHttp2SolrClientTest_5A4C003840BE4ADC-001\tempDir-001
   [junit4]   2> 349685 INFO  (TEST-CloudHttp2SolrClientTest.testWrongZkChrootTest-seed#[5A4C003840BE4ADC]) [    ] o.a.s.c.ZkTestServer STARTING ZK TEST SERVER
   [junit4]   2> 349687 INFO  (ZkTestServer Run Thread) [    ] o.a.s.c.ZkTestServer client port:0.0.0.0/0.0.0.0:0
   [junit4]   2> 349687 INFO  (ZkTestServer Run Thread) [    ] o.a.s.c.ZkTestServer Starting server
   [junit4]   2> 349786 INFO  (TEST-CloudHttp2SolrClientTest.testWrongZkChrootTest-seed#[5A4C003840BE4ADC]) [    ] o.a.s.c.ZkTestServer start zk server on port:51515
   [junit4]   2> 349787 INFO  (TEST-CloudHttp2SolrClientTest.testWrongZkChrootTest-seed#[5A4C003840BE4ADC]) [    ] o.a.s.c.ZkTestServer parse host and port list: 127.0.0.1:51515
   [junit4]   2> 349787 INFO  (TEST-CloudHttp2SolrClientTest.testWrongZkChrootTest-seed#[5A4C003840BE4ADC]) [    ] o.a.s.c.ZkTestServer connecting to 127.0.0.1 51515
   [junit4]   2> 349827 INFO  (zkConnectionManagerCallback-5108-thread-1) [    ] o.a.s.c.c.ConnectionManager zkClient has connected
   [junit4]   2> 349877 INFO  (zkConnectionManagerCallback-5110-thread-1) [    ] o.a.s.c.c.ConnectionManager zkClient has connected
   [junit4]   2> 349885 INFO  (zkConnectionManagerCallback-5112-thread-1) [    ] o.a.s.c.c.ConnectionManager zkClient has connected
   [junit4]   2> 349893 WARN  (NIOServerCxn.Factory:0.0.0.0/0.0.0.0:0) [    ] o.a.z.s.NIOServerCnxn Unable to read additional data from client sessionid 0x1000f9b31f20002, likely client has closed socket
   [junit4]   2> 349897 WARN  (jetty-launcher-5113-thread-1) [    ] o.e.j.s.AbstractConnector Ignoring deprecated socket close linger time
   [junit4]   2> 349897 WARN  (jetty-launcher-5113-thread-2) [    ] o.e.j.s.AbstractConnector Ignoring deprecated socket close linger time
   [junit4]   2> 349897 INFO  (jetty-launcher-5113-thread-1) [    ] o.a.s.c.s.e.JettySolrRunner Start Jetty (original configured port=0)
   [junit4]   2> 349897 INFO  (jetty-launcher-5113-thread-1) [    ] o.a.s.c.s.e.JettySolrRunner Trying to start Jetty on port 0 try number 1 ...
   [junit4]   2> 349898 INFO  (jetty-launcher-5113-thread-2) [    ] o.a.s.c.s.e.JettySolrRunner Start Jetty (original configured port=0)
   [junit4]   2> 349898 INFO  (jetty-launcher-5113-thread-2) [    ] o.a.s.c.s.e.JettySolrRunner Trying to start Jetty on port 0 try number 1 ...
   [junit4]   2> 349898 INFO  (jetty-launcher-5113-thread-1) [    ] o.e.j.s.Server jetty-9.4.14.v20181114; built: 2018-11-14T21:20:31.478Z; git: c4550056e785fb5665914545889f21dc136ad9e6; jvm 13-ea+18
   [junit4]   2> 349898 INFO  (jetty-launcher-5113-thread-2) [    ] o.e.j.s.Server jetty-9.4.14.v20181114; built: 2018-11-14T21:20:31.478Z; git: c4550056e785fb5665914545889f21dc136ad9e6; jvm 13-ea+18
   [junit4]   2> 349898 WARN  (jetty-launcher-5113-thread-3) [    ] o.e.j.s.AbstractConnector Ignoring deprecated socket close linger time
   [junit4]   2> 349898 INFO  (jetty-launcher-5113-thread-2) [    ] o.e.j.s.session DefaultSessionIdManager workerName=node0
   [junit4]   2> 349898 INFO  (jetty-launcher-5113-thread-2) [    ] o.e.j.s.session No SessionScavenger set, using defaults
   [junit4]   2> 349898 INFO  (jetty-launcher-5113-thread-2) [    ] o.e.j.s.session node0 Scavenging every 600000ms
   [junit4]   2> 349898 INFO  (jetty-launcher-5113-thread-3) [    ] o.a.s.c.s.e.JettySolrRunner Start Jetty (original configured port=0)
   [junit4]   2> 349898 INFO  (jetty-launcher-5113-thread-3) [    ] o.a.s.c.s.e.JettySolrRunner Trying to start Jetty on port 0 try number 1 ...
   [junit4]   2> 349898 INFO  (jetty-launcher-5113-thread-3) [    ] o.e.j.s.Server jetty-9.4.14.v20181114; built: 2018-11-14T21:20:31.478Z; git: c4550056e785fb5665914545889f21dc136ad9e6; jvm 13-ea+18
   [junit4]   2> 349898 INFO  (jetty-launcher-5113-thread-2) [    ] o.e.j.s.h.ContextHandler Started o.e.j.s.ServletContextHandler@36e73109{/solr,null,AVAILABLE}
   [junit4]   2> 349899 INFO  (jetty-launcher-5113-thread-3) [    ] o.e.j.s.session DefaultSessionIdManager workerName=node0
   [junit4]   2> 349899 INFO  (jetty-launcher-5113-thread-3) [    ] o.e.j.s.session No SessionScavenger set, using defaults
   [junit4]   2> 349899 INFO  (jetty-launcher-5113-thread-3) [    ] o.e.j.s.session node0 Scavenging every 660000ms
   [junit4]   2> 349899 INFO  (jetty-launcher-5113-thread-3) [    ] o.e.j.s.h.ContextHandler Started o.e.j.s.ServletContextHandler@5c5536cb{/solr,null,AVAILABLE}
   [junit4]   2> 349901 INFO  (jetty-launcher-5113-thread-1) [    ] o.e.j.s.session DefaultSessionIdManager workerName=node0
   [junit4]   2> 349901 INFO  (jetty-launcher-5113-thread-1) [    ] o.e.j.s.session No SessionScavenger set, using defaults
   [junit4]   2> 349901 INFO  (jetty-launcher-5113-thread-1) [    ] o.e.j.s.session node0 Scavenging every 660000ms
   [junit4]   2> 349901 INFO  (jetty-launcher-5113-thread-1) [    ] o.e.j.s.h.ContextHandler Started o.e.j.s.ServletContextHandler@182faeb1{/solr,null,AVAILABLE}
   [junit4]   2> 349902 INFO  (jetty-launcher-5113-thread-2) [    ] o.e.j.s.AbstractConnector Started ServerConnector@6060d513{HTTP/1.1,[http/1.1, h2c]}{127.0.0.1:51526}
   [junit4]   2> 349902 INFO  (jetty-launcher-5113-thread-2) [    ] o.e.j.s.Server Started @349923ms
   [junit4]   2> 349902 INFO  (jetty-launcher-5113-thread-2) [    ] o.a.s.c.s.e.JettySolrRunner Jetty properties: {hostContext=/solr, hostPort=51526}
   [junit4]   2> 349902 ERROR (jetty-launcher-5113-thread-2) [    ] o.a.s.u.StartupLoggingUtils Missing Java Option solr.log.dir. Logging may be missing or incomplete.
   [junit4]   2> 349902 INFO  (jetty-launcher-5113-thread-2) [    ] o.a.s.s.SolrDispatchFilter Using logger factory org.apache.logging.slf4j.Log4jLoggerFactory
   [junit4]   2> 349902 INFO  (jetty-launcher-5113-thread-2) [    ] o.a.s.s.SolrDispatchFilter  ___      _       Welcome to Apache Solr™ version 8.1.0
   [junit4]   2> 349902 INFO  (jetty-launcher-5113-thread-2) [    ] o.a.s.s.SolrDispatchFilter / __| ___| |_ _   Starting in cloud mode on port null
   [junit4]   2> 349902 INFO  (jetty-launcher-5113-thread-2) [    ] o.a.s.s.SolrDispatchFilter \__ \/ _ \ | '_|  Install dir: null
   [junit4]   2> 349903 INFO  (jetty-launcher-5113-thread-2) [    ] o.a.s.s.SolrDispatchFilter |___/\___/_|_|    Start time: 2019-05-07T00:34:35.685491700Z
   [junit4]   2> 349905 INFO  (jetty-launcher-5113-thread-3) [    ] o.e.j.s.AbstractConnector Started ServerConnector@50880156{HTTP/1.1,[http/1.1, h2c]}{127.0.0.1:51529}
   [junit4]   2> 349905 INFO  (jetty-launcher-5113-thread-3) [    ] o.e.j.s.Server Started @349926ms
   [junit4]   2> 349905 INFO  (jetty-launcher-5113-thread-3) [    ] o.a.s.c.s.e.JettySolrRunner Jetty properties: {hostContext=/solr, hostPort=51529}
   [junit4]   2> 349905 ERROR (jetty-launcher-5113-thread-3) [    ] o.a.s.u.StartupLoggingUtils Missing Java Option solr.log.dir. Logging may be missing or incomplete.
   [junit4]   2> 349905 INFO  (jetty-launcher-5113-thread-3) [    ] o.a.s.s.SolrDispatchFilter Using logger factory org.apache.logging.slf4j.Log4jLoggerFactory
   [junit4]   2> 349905 INFO  (jetty-launcher-5113-thread-3) [    ] o.a.s.s.SolrDispatchFilter  ___      _       Welcome to Apache Solr™ version 8.1.0
   [junit4]   2> 349905 INFO  (jetty-launcher-5113-thread-3) [    ] o.a.s.s.SolrDispatchFilter / __| ___| |_ _   Starting in cloud mode on port null
   [junit4]   2> 349905 INFO  (jetty-launcher-5113-thread-3) [    ] o.a.s.s.SolrDispatchFilter \__ \/ _ \ | '_|  Install dir: null
   [junit4]   2> 349905 INFO  (jetty-launcher-5113-thread-3) [    ] o.a.s.s.SolrDispatchFilter |___/\___/_|_|    Start time: 2019-05-07T00:34:35.688394200Z
   [junit4]   2> 349905 INFO  (jetty-launcher-5113-thread-1) [    ] o.e.j.s.AbstractConnector Started ServerConnector@48c1a6de{HTTP/1.1,[http/1.1, h2c]}{127.0.0.1:51532}
   [junit4]   2> 349905 INFO  (jetty-launcher-5113-thread-1) [    ] o.e.j.s.Server Started @349927ms
   [junit4]   2> 349905 INFO  (jetty-launcher-5113-thread-1) [    ] o.a.s.c.s.e.JettySolrRunner Jetty properties: {hostContext=/solr, hostPort=51532}
   [junit4]   2> 349905 ERROR (jetty-launcher-5113-thread-1) [    ] o.a.s.u.StartupLoggingUtils Missing Java Option solr.log.dir. Logging may be missing or incomplete.
   [junit4]   2> 349905 INFO  (jetty-launcher-5113-thread-1) [    ] o.a.s.s.SolrDispatchFilter Using logger factory org.apache.logging.slf4j.Log4jLoggerFactory
   [junit4]   2> 349905 INFO  (jetty-launcher-5113-thread-1) [    ] o.a.s.s.SolrDispatchFilter  ___      _       Welcome to Apache Solr™ version 8.1.0
   [junit4]   2> 349905 INFO  (jetty-launcher-5113-thread-1) [    ] o.a.s.s.SolrDispatchFilter / __| ___| |_ _   Starting in cloud mode on port null
   [junit4]   2> 349905 INFO  (jetty-launcher-5113-thread-1) [    ] o.a.s.s.SolrDispatchFilter \__ \/ _ \ | '_|  Install dir: null
   [junit4]   2> 349905 INFO  (jetty-launcher-5113-thread-1) [    ] o.a.s.s.SolrDispatchFilter |___/\___/_|_|    Start time: 2019-05-07T00:34:35.688394200Z
   [junit4]   2> 349914 INFO  (zkConnectionManagerCallback-5117-thread-1) [    ] o.a.s.c.c.ConnectionManager zkClient has connected
   [junit4]   2> 349914 INFO  (zkConnectionManagerCallback-5119-thread-1) [    ] o.a.s.c.c.ConnectionManager zkClient has connected
   [junit4]   2> 349917 INFO  (zkConnectionManagerCallback-5115-thread-1) [    ] o.a.s.c.c.ConnectionManager zkClient has connected
   [junit4]   2> 349917 INFO  (jetty-launcher-5113-thread-3) [    ] o.a.s.s.SolrDispatchFilter solr.xml found in ZooKeeper. Loading...
   [junit4]   2> 349917 INFO  (jetty-launcher-5113-thread-1) [    ] o.a.s.s.SolrDispatchFilter solr.xml found in ZooKeeper. Loading...
   [junit4]   2> 349917 INFO  (jetty-launcher-5113-thread-2) [    ] o.a.s.s.SolrDispatchFilter solr.xml found in ZooKeeper. Loading...
   [junit4]   2> 350447 INFO  (jetty-launcher-5113-thread-2) [    ] o.a.s.h.c.HttpShardHandlerFactory Host whitelist initialized: WhitelistHostChecker [whitelistHosts=null, whitelistHostCheckingEnabled=true]
   [junit4]   2> 350456 WARN  (jetty-launcher-5113-thread-2) [    ] o.e.j.u.s.S.config No Client EndPointIdentificationAlgorithm configured for SslContextFactory@62d8f25d[provider=null,keyStore=null,trustStore=null]
   [junit4

[...truncated too long message...]

org.apache.solr.client.solrj.impl.CloudHttp2SolrClientTest
   [junit4] OK      16.0s J1 | CloudHttp2SolrClientTest.testWrongZkChrootTest
   [junit4] OK      10.4s J1 | CloudHttp2SolrClientTest.stateVersionParamTest
   [junit4] OK      22.5s J1 | CloudHttp2SolrClientTest.preferReplicaTypesTest
   [junit4] OK      12.3s J1 | CloudHttp2SolrClientTest.testAliasHandling
   [junit4] OK      10.5s J1 | CloudHttp2SolrClientTest.testRetryUpdatesWhenClusterStateIsStale
   [junit4] OK      5.84s J1 | CloudHttp2SolrClientTest.testShutdown
   [junit4] OK      8.91s J1 | CloudHttp2SolrClientTest.checkCollectionParameters
   [junit4] OK      5.28s J1 | CloudHttp2SolrClientTest.testVersionsAreReturned
   [junit4] OK      7.28s J1 | CloudHttp2SolrClientTest.testNonRetryableRequests
   [junit4] OK      7.30s J1 | CloudHttp2SolrClientTest.testOverwriteOption
   [junit4] OK      2.77s J1 | CloudHttp2SolrClientTest.testCollectionDoesntExist
   [junit4] OK      11.1s J1 | CloudHttp2SolrClientTest.preferLocalShardsTest
   [junit4] OK      5.16s J1 | CloudHttp2SolrClientTest.testRouting
   [junit4] OK      2.78s J1 | CloudHttp2SolrClientTest.customHttpClientTest
   [junit4] OK      5.17s J1 | CloudHttp2SolrClientTest.testParallelUpdateQTime
   [junit4] OK      5.89s J1 | CloudHttp2SolrClientTest.testInitializationWithSolrUrls
   [junit4] Completed [2/5] on J1 in 153.42s, 16 tests
   [junit4] 
   [junit4] Suite: org.apache.solr.client.solrj.impl.CloudHttp2SolrClientTest
   [junit4] OK      2.56s J0 | CloudHttp2SolrClientTest.testWrongZkChrootTest
   [junit4] OK      4.17s J0 | CloudHttp2SolrClientTest.stateVersionParamTest
   [junit4] OK      8.97s J0 | CloudHttp2SolrClientTest.preferReplicaTypesTest
   [junit4] OK      7.22s J0 | CloudHttp2SolrClientTest.testAliasHandling
   [junit4] OK      8.03s J0 | CloudHttp2SolrClientTest.testRetryUpdatesWhenClusterStateIsStale
   [junit4] OK      3.63s J0 | CloudHttp2SolrClientTest.testShutdown
   [junit4] OK      5.53s J0 | CloudHttp2SolrClientTest.checkCollectionParameters
   [junit4] OK      4.25s J0 | CloudHttp2SolrClientTest.testVersionsAreReturned
   [junit4] OK      6.41s J0 | CloudHttp2SolrClientTest.testNonRetryableRequests
   [junit4] OK      5.22s J0 | CloudHttp2SolrClientTest.testOverwriteOption
   [junit4] OK      1.86s J0 | CloudHttp2SolrClientTest.testCollectionDoesntExist
   [junit4] OK      7.50s J0 | CloudHttp2SolrClientTest.preferLocalShardsTest
   [junit4] OK      7.02s J0 | CloudHttp2SolrClientTest.testRouting
   [junit4] OK      2.58s J0 | CloudHttp2SolrClientTest.customHttpClientTest
   [junit4] OK      5.39s J0 | CloudHttp2SolrClientTest.testParallelUpdateQTime
   [junit4] OK      6.98s J0 | CloudHttp2SolrClientTest.testInitializationWithSolrUrls
   [junit4] Completed [3/5] on J0 in 87.75s, 16 tests
   [junit4] 
   [junit4] Suite: org.apache.solr.client.solrj.impl.CloudHttp2SolrClientTest
   [junit4] OK      2.36s J1 | CloudHttp2SolrClientTest.testWrongZkChrootTest
   [junit4] OK      3.94s J1 | CloudHttp2SolrClientTest.stateVersionParamTest
   [junit4] OK      8.39s J1 | CloudHttp2SolrClientTest.preferReplicaTypesTest
   [junit4] OK      7.81s J1 | CloudHttp2SolrClientTest.testAliasHandling
   [junit4] OK      7.95s J1 | CloudHttp2SolrClientTest.testRetryUpdatesWhenClusterStateIsStale
   [junit4] OK      3.81s J1 | CloudHttp2SolrClientTest.testShutdown
   [junit4] OK      5.61s J1 | CloudHttp2SolrClientTest.checkCollectionParameters
   [junit4] OK      4.14s J1 | CloudHttp2SolrClientTest.testVersionsAreReturned
   [junit4] OK      6.33s J1 | CloudHttp2SolrClientTest.testNonRetryableRequests
   [junit4] OK      5.64s J1 | CloudHttp2SolrClientTest.testOverwriteOption
   [junit4] OK      1.80s J1 | CloudHttp2SolrClientTest.testCollectionDoesntExist
   [junit4] OK      7.54s J1 | CloudHttp2SolrClientTest.preferLocalShardsTest
   [junit4] OK      7.06s J1 | CloudHttp2SolrClientTest.testRouting
   [junit4] OK      2.83s J1 | CloudHttp2SolrClientTest.customHttpClientTest
   [junit4] OK      5.31s J1 | CloudHttp2SolrClientTest.testParallelUpdateQTime
   [junit4] OK      5.84s J1 | CloudHttp2SolrClientTest.testInitializationWithSolrUrls
   [junit4] Completed [4/5] on J1 in 86.81s, 16 tests
   [junit4] 
   [junit4] Suite: org.apache.solr.client.solrj.impl.CloudHttp2SolrClientTest
   [junit4] OK      3.02s J0 | CloudHttp2SolrClientTest.testWrongZkChrootTest
   [junit4] OK      4.33s J0 | CloudHttp2SolrClientTest.stateVersionParamTest
   [junit4] OK      6.42s J0 | CloudHttp2SolrClientTest.preferReplicaTypesTest
   [junit4] OK      6.01s J0 | CloudHttp2SolrClientTest.testAliasHandling
   [junit4] OK      7.11s J0 | CloudHttp2SolrClientTest.testRetryUpdatesWhenClusterStateIsStale
   [junit4] OK      3.68s J0 | CloudHttp2SolrClientTest.testShutdown
   [junit4] OK      4.89s J0 | CloudHttp2SolrClientTest.checkCollectionParameters
   [junit4] OK      3.79s J0 | CloudHttp2SolrClientTest.testVersionsAreReturned
   [junit4] OK      6.11s J0 | CloudHttp2SolrClientTest.testNonRetryableRequests
   [junit4] OK      4.95s J0 | CloudHttp2SolrClientTest.testOverwriteOption
   [junit4] OK      1.67s J0 | CloudHttp2SolrClientTest.testCollectionDoesntExist
   [junit4] OK      6.10s J0 | CloudHttp2SolrClientTest.preferLocalShardsTest
   [junit4] OK      3.79s J0 | CloudHttp2SolrClientTest.testRouting
   [junit4] OK      1.73s J0 | CloudHttp2SolrClientTest.customHttpClientTest
   [junit4] OK      4.21s J0 | CloudHttp2SolrClientTest.testParallelUpdateQTime
   [junit4] OK      4.95s J0 | CloudHttp2SolrClientTest.testInitializationWithSolrUrls
   [junit4] Completed [5/5] on J0 in 73.06s, 16 tests
   [junit4] 
   [junit4] JVM J0:     2.72 ..   318.50 =   315.78s
   [junit4] JVM J1:     2.73 ..   245.16 =   242.43s
   [junit4] Execution time total: 5 minutes 18 seconds
   [junit4] Tests summary: 5 suites, 80 tests
   [junit4] Could not remove temporary path: C:\Users\jenkins\workspace\Lucene-Solr-8.1-Windows\solr\build\solr-solrj\test\J1 (java.nio.file.DirectoryNotEmptyException: Remaining files: [C:\Users\jenkins\workspace\Lucene-Solr-8.1-Windows\solr\build\solr-solrj\test\J1\temp])
   [junit4] Could not remove temporary path: C:\Users\jenkins\workspace\Lucene-Solr-8.1-Windows\solr\build\solr-solrj\test\J0 (java.nio.file.DirectoryNotEmptyException: Remaining files: [C:\Users\jenkins\workspace\Lucene-Solr-8.1-Windows\solr\build\solr-solrj\test\J0\temp])
     [echo] 5 slowest tests:
[junit4:tophints] 117.78s | org.apache.solr.client.solrj.impl.CloudHttp2SolrClientTest
[junit4:tophints]  86.08s | org.apache.solr.client.solrj.io.stream.StreamDecoratorTest
[junit4:tophints]  76.30s | org.apache.solr.client.solrj.impl.CloudSolrClientTest
[junit4:tophints]  60.83s | org.apache.solr.common.cloud.TestCloudCollectionsListeners
[junit4:tophints]  46.18s | org.apache.solr.common.cloud.TestCollectionStateWatchers

-check-totals:
WARNING: An illegal reflective access operation has occurred
WARNING: Illegal reflective access by org.codehaus.groovy.reflection.CachedClass (file:/C:/Users/jenkins/.ivy2/cache/org.codehaus.groovy/groovy-all/jars/groovy-all-2.4.16.jar) to method java.lang.Object.finalize()
WARNING: Please consider reporting this to the maintainers of org.codehaus.groovy.reflection.CachedClass
WARNING: Use --illegal-access=warn to enable warnings of further illegal reflective access operations
WARNING: All illegal access operations will be denied in a future release

test-nocompile:

BUILD SUCCESSFUL
Total time: 5 minutes 21 seconds
[repro] Failures:
[repro]   0/5 failed: org.apache.solr.client.solrj.impl.CloudHttp2SolrClientTest
[repro]   0/5 failed: org.apache.solr.prometheus.exporter.SolrExporterIntegrationTest
[repro]   5/5 failed: org.apache.solr.update.processor.DistributedUpdateProcessorTest
[repro] Exiting with code 1

C:\Users\jenkins\workspace\Lucene-Solr-8.1-Windows>IF EXIST lucene\build move /y lucene\build lucene\build.repro 
        1 dir(s) moved.

C:\Users\jenkins\workspace\Lucene-Solr-8.1-Windows>IF EXIST solr\build move /y solr\build solr\build.repro 
        1 dir(s) moved.

C:\Users\jenkins\workspace\Lucene-Solr-8.1-Windows>IF EXIST lucene\build.orig move /y lucene\build.orig lucene\build 
        1 dir(s) moved.

C:\Users\jenkins\workspace\Lucene-Solr-8.1-Windows>IF EXIST solr\build.orig move /y solr\build.orig solr\build 
        1 dir(s) moved.

C:\Users\jenkins\workspace\Lucene-Solr-8.1-Windows>exit 0 
Archiving artifacts
Setting ANT_1_8_2_HOME=C:\Users\jenkins\tools\hudson.tasks.Ant_AntInstallation\ANT_1.8.2
[WARNINGS] Parsing warnings in console log with parser Java Compiler (javac)
Setting ANT_1_8_2_HOME=C:\Users\jenkins\tools\hudson.tasks.Ant_AntInstallation\ANT_1.8.2
No credentials specified
Setting ANT_1_8_2_HOME=C:\Users\jenkins\tools\hudson.tasks.Ant_AntInstallation\ANT_1.8.2
<Git Blamer> Using GitBlamer to create author and commit information for all warnings.
<Git Blamer> GIT_COMMIT=47886225187c0442e3d6bb93475eafacfccab6ff, workspace=C:\Users\jenkins\workspace\Lucene-Solr-8.1-Windows
[WARNINGS] Computing warning deltas based on reference build #91
Recording test results
Setting ANT_1_8_2_HOME=C:\Users\jenkins\tools\hudson.tasks.Ant_AntInstallation\ANT_1.8.2
Build step 'Publish JUnit test result report' changed build result to UNSTABLE
Email was triggered for: Unstable (Test Failures)
Sending email for trigger: Unstable (Test Failures)
Setting ANT_1_8_2_HOME=C:\Users\jenkins\tools\hudson.tasks.Ant_AntInstallation\ANT_1.8.2
Setting ANT_1_8_2_HOME=C:\Users\jenkins\tools\hudson.tasks.Ant_AntInstallation\ANT_1.8.2
Setting ANT_1_8_2_HOME=C:\Users\jenkins\tools\hudson.tasks.Ant_AntInstallation\ANT_1.8.2
Setting ANT_1_8_2_HOME=C:\Users\jenkins\tools\hudson.tasks.Ant_AntInstallation\ANT_1.8.2
Setting ANT_1_8_2_HOME=C:\Users\jenkins\tools\hudson.tasks.Ant_AntInstallation\ANT_1.8.2
Setting ANT_1_8_2_HOME=C:\Users\jenkins\tools\hudson.tasks.Ant_AntInstallation\ANT_1.8.2

Mime
View raw message