lucene-dev mailing list archives

Site index · List index
Message view « Date » · « Thread »
Top « Date » · « Thread »
From Apache Jenkins Server <jenk...@builds.apache.org>
Subject [JENKINS] Lucene-Solr-NightlyTests-8.x - Build # 92 - Still unstable
Date Mon, 06 May 2019 16:37:54 GMT
Build: https://builds.apache.org/job/Lucene-Solr-NightlyTests-8.x/92/

1 tests failed.
FAILED:  junit.framework.TestSuite.org.apache.solr.handler.TestReplicationHandler

Error Message:
ObjectTracker found 5 object(s) that were not released!!! [MockDirectoryWrapper, SolrCore, RawDirectoryWrapper, MockDirectoryWrapper, InternalHttpClient] org.apache.solr.common.util.ObjectReleaseTracker$ObjectTrackerException: org.apache.lucene.store.MockDirectoryWrapper  at org.apache.solr.common.util.ObjectReleaseTracker.track(ObjectReleaseTracker.java:42)  at org.apache.solr.core.CachingDirectoryFactory.get(CachingDirectoryFactory.java:348)  at org.apache.solr.handler.IndexFetcher.fetchLatestIndex(IndexFetcher.java:509)  at org.apache.solr.handler.IndexFetcher.fetchLatestIndex(IndexFetcher.java:351)  at org.apache.solr.handler.ReplicationHandler.doFetch(ReplicationHandler.java:424)  at org.apache.solr.handler.ReplicationHandler.lambda$setupPolling$13(ReplicationHandler.java:1193)  at java.util.concurrent.Executors$RunnableAdapter.call(Executors.java:511)  at java.util.concurrent.FutureTask.runAndReset(FutureTask.java:308)  at java.util.concurrent.ScheduledThreadPoolExecutor$ScheduledFutureTask.access$301(ScheduledThreadPoolExecutor.java:180)  at java.util.concurrent.ScheduledThreadPoolExecutor$ScheduledFutureTask.run(ScheduledThreadPoolExecutor.java:294)  at java.util.concurrent.ThreadPoolExecutor.runWorker(ThreadPoolExecutor.java:1149)  at java.util.concurrent.ThreadPoolExecutor$Worker.run(ThreadPoolExecutor.java:624)  at java.lang.Thread.run(Thread.java:748)  org.apache.solr.common.util.ObjectReleaseTracker$ObjectTrackerException: org.apache.solr.core.SolrCore  at org.apache.solr.common.util.ObjectReleaseTracker.track(ObjectReleaseTracker.java:42)  at org.apache.solr.core.SolrCore.<init>(SolrCore.java:1063)  at org.apache.solr.core.SolrCore.reload(SolrCore.java:675)  at org.apache.solr.core.CoreContainer.reload(CoreContainer.java:1499)  at org.apache.solr.handler.IndexFetcher.lambda$reloadCore$0(IndexFetcher.java:934)  at java.lang.Thread.run(Thread.java:748)  org.apache.solr.common.util.ObjectReleaseTracker$ObjectTrackerException: org.apache.lucene.store.RawDirectoryWrapper  at org.apache.solr.common.util.ObjectReleaseTracker.track(ObjectReleaseTracker.java:42)  at org.apache.solr.core.CachingDirectoryFactory.get(CachingDirectoryFactory.java:348)  at org.apache.solr.core.SolrCore.getNewIndexDir(SolrCore.java:368)  at org.apache.solr.core.SolrCore.initIndex(SolrCore.java:747)  at org.apache.solr.core.SolrCore.<init>(SolrCore.java:976)  at org.apache.solr.core.SolrCore.<init>(SolrCore.java:883)  at org.apache.solr.core.CoreContainer.createFromDescriptor(CoreContainer.java:1238)  at org.apache.solr.core.CoreContainer.lambda$load$13(CoreContainer.java:749)  at com.codahale.metrics.InstrumentedExecutorService$InstrumentedCallable.call(InstrumentedExecutorService.java:202)  at java.util.concurrent.FutureTask.run(FutureTask.java:266)  at org.apache.solr.common.util.ExecutorUtil$MDCAwareThreadPoolExecutor.lambda$execute$0(ExecutorUtil.java:209)  at java.util.concurrent.ThreadPoolExecutor.runWorker(ThreadPoolExecutor.java:1149)  at java.util.concurrent.ThreadPoolExecutor$Worker.run(ThreadPoolExecutor.java:624)  at java.lang.Thread.run(Thread.java:748)  org.apache.solr.common.util.ObjectReleaseTracker$ObjectTrackerException: org.apache.lucene.store.MockDirectoryWrapper  at org.apache.solr.common.util.ObjectReleaseTracker.track(ObjectReleaseTracker.java:42)  at org.apache.solr.core.CachingDirectoryFactory.get(CachingDirectoryFactory.java:348)  at org.apache.solr.handler.IndexFetcher.fetchLatestIndex(IndexFetcher.java:509)  at org.apache.solr.handler.IndexFetcher.fetchLatestIndex(IndexFetcher.java:351)  at org.apache.solr.handler.ReplicationHandler.doFetch(ReplicationHandler.java:424)  at org.apache.solr.handler.ReplicationHandler.lambda$setupPolling$13(ReplicationHandler.java:1193)  at java.util.concurrent.Executors$RunnableAdapter.call(Executors.java:511)  at java.util.concurrent.FutureTask.runAndReset(FutureTask.java:308)  at java.util.concurrent.ScheduledThreadPoolExecutor$ScheduledFutureTask.access$301(ScheduledThreadPoolExecutor.java:180)  at java.util.concurrent.ScheduledThreadPoolExecutor$ScheduledFutureTask.run(ScheduledThreadPoolExecutor.java:294)  at java.util.concurrent.ThreadPoolExecutor.runWorker(ThreadPoolExecutor.java:1149)  at java.util.concurrent.ThreadPoolExecutor$Worker.run(ThreadPoolExecutor.java:624)  at java.lang.Thread.run(Thread.java:748)  org.apache.solr.common.util.ObjectReleaseTracker$ObjectTrackerException: org.apache.http.impl.client.InternalHttpClient  at org.apache.solr.common.util.ObjectReleaseTracker.track(ObjectReleaseTracker.java:42)  at org.apache.solr.client.solrj.impl.HttpClientUtil.createClient(HttpClientUtil.java:321)  at org.apache.solr.client.solrj.impl.HttpClientUtil.createClient(HttpClientUtil.java:330)  at org.apache.solr.handler.IndexFetcher.createHttpClient(IndexFetcher.java:230)  at org.apache.solr.handler.IndexFetcher.<init>(IndexFetcher.java:272)  at org.apache.solr.handler.ReplicationHandler.inform(ReplicationHandler.java:1224)  at org.apache.solr.core.SolrResourceLoader.inform(SolrResourceLoader.java:696)  at org.apache.solr.core.SolrCore.<init>(SolrCore.java:1009)  at org.apache.solr.core.SolrCore.reload(SolrCore.java:675)  at org.apache.solr.core.CoreContainer.reload(CoreContainer.java:1499)  at org.apache.solr.handler.IndexFetcher.lambda$reloadCore$0(IndexFetcher.java:934)  at java.lang.Thread.run(Thread.java:748)   expected null, but was:<ObjectTracker found 5 object(s) that were not released!!! [MockDirectoryWrapper, SolrCore, RawDirectoryWrapper, MockDirectoryWrapper, InternalHttpClient] org.apache.solr.common.util.ObjectReleaseTracker$ObjectTrackerException: org.apache.lucene.store.MockDirectoryWrapper  at org.apache.solr.common.util.ObjectReleaseTracker.track(ObjectReleaseTracker.java:42)  at org.apache.solr.core.CachingDirectoryFactory.get(CachingDirectoryFactory.java:348)  at org.apache.solr.handler.IndexFetcher.fetchLatestIndex(IndexFetcher.java:509)  at org.apache.solr.handler.IndexFetcher.fetchLatestIndex(IndexFetcher.java:351)  at org.apache.solr.handler.ReplicationHandler.doFetch(ReplicationHandler.java:424)  at org.apache.solr.handler.ReplicationHandler.lambda$setupPolling$13(ReplicationHandler.java:1193)  at java.util.concurrent.Executors$RunnableAdapter.call(Executors.java:511)  at java.util.concurrent.FutureTask.runAndReset(FutureTask.java:308)  at java.util.concurrent.ScheduledThreadPoolExecutor$ScheduledFutureTask.access$301(ScheduledThreadPoolExecutor.java:180)  at java.util.concurrent.ScheduledThreadPoolExecutor$ScheduledFutureTask.run(ScheduledThreadPoolExecutor.java:294)  at java.util.concurrent.ThreadPoolExecutor.runWorker(ThreadPoolExecutor.java:1149)  at java.util.concurrent.ThreadPoolExecutor$Worker.run(ThreadPoolExecutor.java:624)  at java.lang.Thread.run(Thread.java:748)  org.apache.solr.common.util.ObjectReleaseTracker$ObjectTrackerException: org.apache.solr.core.SolrCore  at org.apache.solr.common.util.ObjectReleaseTracker.track(ObjectReleaseTracker.java:42)  at org.apache.solr.core.SolrCore.<init>(SolrCore.java:1063)  at org.apache.solr.core.SolrCore.reload(SolrCore.java:675)  at org.apache.solr.core.CoreContainer.reload(CoreContainer.java:1499)  at org.apache.solr.handler.IndexFetcher.lambda$reloadCore$0(IndexFetcher.java:934)  at java.lang.Thread.run(Thread.java:748)  org.apache.solr.common.util.ObjectReleaseTracker$ObjectTrackerException: org.apache.lucene.store.RawDirectoryWrapper  at org.apache.solr.common.util.ObjectReleaseTracker.track(ObjectReleaseTracker.java:42)  at org.apache.solr.core.CachingDirectoryFactory.get(CachingDirectoryFactory.java:348)  at org.apache.solr.core.SolrCore.getNewIndexDir(SolrCore.java:368)  at org.apache.solr.core.SolrCore.initIndex(SolrCore.java:747)  at org.apache.solr.core.SolrCore.<init>(SolrCore.java:976)  at org.apache.solr.core.SolrCore.<init>(SolrCore.java:883)  at org.apache.solr.core.CoreContainer.createFromDescriptor(CoreContainer.java:1238)  at org.apache.solr.core.CoreContainer.lambda$load$13(CoreContainer.java:749)  at com.codahale.metrics.InstrumentedExecutorService$InstrumentedCallable.call(InstrumentedExecutorService.java:202)  at java.util.concurrent.FutureTask.run(FutureTask.java:266)  at org.apache.solr.common.util.ExecutorUtil$MDCAwareThreadPoolExecutor.lambda$execute$0(ExecutorUtil.java:209)  at java.util.concurrent.ThreadPoolExecutor.runWorker(ThreadPoolExecutor.java:1149)  at java.util.concurrent.ThreadPoolExecutor$Worker.run(ThreadPoolExecutor.java:624)  at java.lang.Thread.run(Thread.java:748)  org.apache.solr.common.util.ObjectReleaseTracker$ObjectTrackerException: org.apache.lucene.store.MockDirectoryWrapper  at org.apache.solr.common.util.ObjectReleaseTracker.track(ObjectReleaseTracker.java:42)  at org.apache.solr.core.CachingDirectoryFactory.get(CachingDirectoryFactory.java:348)  at org.apache.solr.handler.IndexFetcher.fetchLatestIndex(IndexFetcher.java:509)  at org.apache.solr.handler.IndexFetcher.fetchLatestIndex(IndexFetcher.java:351)  at org.apache.solr.handler.ReplicationHandler.doFetch(ReplicationHandler.java:424)  at org.apache.solr.handler.ReplicationHandler.lambda$setupPolling$13(ReplicationHandler.java:1193)  at java.util.concurrent.Executors$RunnableAdapter.call(Executors.java:511)  at java.util.concurrent.FutureTask.runAndReset(FutureTask.java:308)  at java.util.concurrent.ScheduledThreadPoolExecutor$ScheduledFutureTask.access$301(ScheduledThreadPoolExecutor.java:180)  at java.util.concurrent.ScheduledThreadPoolExecutor$ScheduledFutureTask.run(ScheduledThreadPoolExecutor.java:294)  at java.util.concurrent.ThreadPoolExecutor.runWorker(ThreadPoolExecutor.java:1149)  at java.util.concurrent.ThreadPoolExecutor$Worker.run(ThreadPoolExecutor.java:624)  at java.lang.Thread.run(Thread.java:748)  org.apache.solr.common.util.ObjectReleaseTracker$ObjectTrackerException: org.apache.http.impl.client.InternalHttpClient  at org.apache.solr.common.util.ObjectReleaseTracker.track(ObjectReleaseTracker.java:42)  at org.apache.solr.client.solrj.impl.HttpClientUtil.createClient(HttpClientUtil.java:321)  at org.apache.solr.client.solrj.impl.HttpClientUtil.createClient(HttpClientUtil.java:330)  at org.apache.solr.handler.IndexFetcher.createHttpClient(IndexFetcher.java:230)  at org.apache.solr.handler.IndexFetcher.<init>(IndexFetcher.java:272)  at org.apache.solr.handler.ReplicationHandler.inform(ReplicationHandler.java:1224)  at org.apache.solr.core.SolrResourceLoader.inform(SolrResourceLoader.java:696)  at org.apache.solr.core.SolrCore.<init>(SolrCore.java:1009)  at org.apache.solr.core.SolrCore.reload(SolrCore.java:675)  at org.apache.solr.core.CoreContainer.reload(CoreContainer.java:1499)  at org.apache.solr.handler.IndexFetcher.lambda$reloadCore$0(IndexFetcher.java:934)  at java.lang.Thread.run(Thread.java:748)  >

Stack Trace:
java.lang.AssertionError: ObjectTracker found 5 object(s) that were not released!!! [MockDirectoryWrapper, SolrCore, RawDirectoryWrapper, MockDirectoryWrapper, InternalHttpClient]
org.apache.solr.common.util.ObjectReleaseTracker$ObjectTrackerException: org.apache.lucene.store.MockDirectoryWrapper
	at org.apache.solr.common.util.ObjectReleaseTracker.track(ObjectReleaseTracker.java:42)
	at org.apache.solr.core.CachingDirectoryFactory.get(CachingDirectoryFactory.java:348)
	at org.apache.solr.handler.IndexFetcher.fetchLatestIndex(IndexFetcher.java:509)
	at org.apache.solr.handler.IndexFetcher.fetchLatestIndex(IndexFetcher.java:351)
	at org.apache.solr.handler.ReplicationHandler.doFetch(ReplicationHandler.java:424)
	at org.apache.solr.handler.ReplicationHandler.lambda$setupPolling$13(ReplicationHandler.java:1193)
	at java.util.concurrent.Executors$RunnableAdapter.call(Executors.java:511)
	at java.util.concurrent.FutureTask.runAndReset(FutureTask.java:308)
	at java.util.concurrent.ScheduledThreadPoolExecutor$ScheduledFutureTask.access$301(ScheduledThreadPoolExecutor.java:180)
	at java.util.concurrent.ScheduledThreadPoolExecutor$ScheduledFutureTask.run(ScheduledThreadPoolExecutor.java:294)
	at java.util.concurrent.ThreadPoolExecutor.runWorker(ThreadPoolExecutor.java:1149)
	at java.util.concurrent.ThreadPoolExecutor$Worker.run(ThreadPoolExecutor.java:624)
	at java.lang.Thread.run(Thread.java:748)

org.apache.solr.common.util.ObjectReleaseTracker$ObjectTrackerException: org.apache.solr.core.SolrCore
	at org.apache.solr.common.util.ObjectReleaseTracker.track(ObjectReleaseTracker.java:42)
	at org.apache.solr.core.SolrCore.<init>(SolrCore.java:1063)
	at org.apache.solr.core.SolrCore.reload(SolrCore.java:675)
	at org.apache.solr.core.CoreContainer.reload(CoreContainer.java:1499)
	at org.apache.solr.handler.IndexFetcher.lambda$reloadCore$0(IndexFetcher.java:934)
	at java.lang.Thread.run(Thread.java:748)

org.apache.solr.common.util.ObjectReleaseTracker$ObjectTrackerException: org.apache.lucene.store.RawDirectoryWrapper
	at org.apache.solr.common.util.ObjectReleaseTracker.track(ObjectReleaseTracker.java:42)
	at org.apache.solr.core.CachingDirectoryFactory.get(CachingDirectoryFactory.java:348)
	at org.apache.solr.core.SolrCore.getNewIndexDir(SolrCore.java:368)
	at org.apache.solr.core.SolrCore.initIndex(SolrCore.java:747)
	at org.apache.solr.core.SolrCore.<init>(SolrCore.java:976)
	at org.apache.solr.core.SolrCore.<init>(SolrCore.java:883)
	at org.apache.solr.core.CoreContainer.createFromDescriptor(CoreContainer.java:1238)
	at org.apache.solr.core.CoreContainer.lambda$load$13(CoreContainer.java:749)
	at com.codahale.metrics.InstrumentedExecutorService$InstrumentedCallable.call(InstrumentedExecutorService.java:202)
	at java.util.concurrent.FutureTask.run(FutureTask.java:266)
	at org.apache.solr.common.util.ExecutorUtil$MDCAwareThreadPoolExecutor.lambda$execute$0(ExecutorUtil.java:209)
	at java.util.concurrent.ThreadPoolExecutor.runWorker(ThreadPoolExecutor.java:1149)
	at java.util.concurrent.ThreadPoolExecutor$Worker.run(ThreadPoolExecutor.java:624)
	at java.lang.Thread.run(Thread.java:748)

org.apache.solr.common.util.ObjectReleaseTracker$ObjectTrackerException: org.apache.lucene.store.MockDirectoryWrapper
	at org.apache.solr.common.util.ObjectReleaseTracker.track(ObjectReleaseTracker.java:42)
	at org.apache.solr.core.CachingDirectoryFactory.get(CachingDirectoryFactory.java:348)
	at org.apache.solr.handler.IndexFetcher.fetchLatestIndex(IndexFetcher.java:509)
	at org.apache.solr.handler.IndexFetcher.fetchLatestIndex(IndexFetcher.java:351)
	at org.apache.solr.handler.ReplicationHandler.doFetch(ReplicationHandler.java:424)
	at org.apache.solr.handler.ReplicationHandler.lambda$setupPolling$13(ReplicationHandler.java:1193)
	at java.util.concurrent.Executors$RunnableAdapter.call(Executors.java:511)
	at java.util.concurrent.FutureTask.runAndReset(FutureTask.java:308)
	at java.util.concurrent.ScheduledThreadPoolExecutor$ScheduledFutureTask.access$301(ScheduledThreadPoolExecutor.java:180)
	at java.util.concurrent.ScheduledThreadPoolExecutor$ScheduledFutureTask.run(ScheduledThreadPoolExecutor.java:294)
	at java.util.concurrent.ThreadPoolExecutor.runWorker(ThreadPoolExecutor.java:1149)
	at java.util.concurrent.ThreadPoolExecutor$Worker.run(ThreadPoolExecutor.java:624)
	at java.lang.Thread.run(Thread.java:748)

org.apache.solr.common.util.ObjectReleaseTracker$ObjectTrackerException: org.apache.http.impl.client.InternalHttpClient
	at org.apache.solr.common.util.ObjectReleaseTracker.track(ObjectReleaseTracker.java:42)
	at org.apache.solr.client.solrj.impl.HttpClientUtil.createClient(HttpClientUtil.java:321)
	at org.apache.solr.client.solrj.impl.HttpClientUtil.createClient(HttpClientUtil.java:330)
	at org.apache.solr.handler.IndexFetcher.createHttpClient(IndexFetcher.java:230)
	at org.apache.solr.handler.IndexFetcher.<init>(IndexFetcher.java:272)
	at org.apache.solr.handler.ReplicationHandler.inform(ReplicationHandler.java:1224)
	at org.apache.solr.core.SolrResourceLoader.inform(SolrResourceLoader.java:696)
	at org.apache.solr.core.SolrCore.<init>(SolrCore.java:1009)
	at org.apache.solr.core.SolrCore.reload(SolrCore.java:675)
	at org.apache.solr.core.CoreContainer.reload(CoreContainer.java:1499)
	at org.apache.solr.handler.IndexFetcher.lambda$reloadCore$0(IndexFetcher.java:934)
	at java.lang.Thread.run(Thread.java:748)

 expected null, but was:<ObjectTracker found 5 object(s) that were not released!!! [MockDirectoryWrapper, SolrCore, RawDirectoryWrapper, MockDirectoryWrapper, InternalHttpClient]
org.apache.solr.common.util.ObjectReleaseTracker$ObjectTrackerException: org.apache.lucene.store.MockDirectoryWrapper
	at org.apache.solr.common.util.ObjectReleaseTracker.track(ObjectReleaseTracker.java:42)
	at org.apache.solr.core.CachingDirectoryFactory.get(CachingDirectoryFactory.java:348)
	at org.apache.solr.handler.IndexFetcher.fetchLatestIndex(IndexFetcher.java:509)
	at org.apache.solr.handler.IndexFetcher.fetchLatestIndex(IndexFetcher.java:351)
	at org.apache.solr.handler.ReplicationHandler.doFetch(ReplicationHandler.java:424)
	at org.apache.solr.handler.ReplicationHandler.lambda$setupPolling$13(ReplicationHandler.java:1193)
	at java.util.concurrent.Executors$RunnableAdapter.call(Executors.java:511)
	at java.util.concurrent.FutureTask.runAndReset(FutureTask.java:308)
	at java.util.concurrent.ScheduledThreadPoolExecutor$ScheduledFutureTask.access$301(ScheduledThreadPoolExecutor.java:180)
	at java.util.concurrent.ScheduledThreadPoolExecutor$ScheduledFutureTask.run(ScheduledThreadPoolExecutor.java:294)
	at java.util.concurrent.ThreadPoolExecutor.runWorker(ThreadPoolExecutor.java:1149)
	at java.util.concurrent.ThreadPoolExecutor$Worker.run(ThreadPoolExecutor.java:624)
	at java.lang.Thread.run(Thread.java:748)

org.apache.solr.common.util.ObjectReleaseTracker$ObjectTrackerException: org.apache.solr.core.SolrCore
	at org.apache.solr.common.util.ObjectReleaseTracker.track(ObjectReleaseTracker.java:42)
	at org.apache.solr.core.SolrCore.<init>(SolrCore.java:1063)
	at org.apache.solr.core.SolrCore.reload(SolrCore.java:675)
	at org.apache.solr.core.CoreContainer.reload(CoreContainer.java:1499)
	at org.apache.solr.handler.IndexFetcher.lambda$reloadCore$0(IndexFetcher.java:934)
	at java.lang.Thread.run(Thread.java:748)

org.apache.solr.common.util.ObjectReleaseTracker$ObjectTrackerException: org.apache.lucene.store.RawDirectoryWrapper
	at org.apache.solr.common.util.ObjectReleaseTracker.track(ObjectReleaseTracker.java:42)
	at org.apache.solr.core.CachingDirectoryFactory.get(CachingDirectoryFactory.java:348)
	at org.apache.solr.core.SolrCore.getNewIndexDir(SolrCore.java:368)
	at org.apache.solr.core.SolrCore.initIndex(SolrCore.java:747)
	at org.apache.solr.core.SolrCore.<init>(SolrCore.java:976)
	at org.apache.solr.core.SolrCore.<init>(SolrCore.java:883)
	at org.apache.solr.core.CoreContainer.createFromDescriptor(CoreContainer.java:1238)
	at org.apache.solr.core.CoreContainer.lambda$load$13(CoreContainer.java:749)
	at com.codahale.metrics.InstrumentedExecutorService$InstrumentedCallable.call(InstrumentedExecutorService.java:202)
	at java.util.concurrent.FutureTask.run(FutureTask.java:266)
	at org.apache.solr.common.util.ExecutorUtil$MDCAwareThreadPoolExecutor.lambda$execute$0(ExecutorUtil.java:209)
	at java.util.concurrent.ThreadPoolExecutor.runWorker(ThreadPoolExecutor.java:1149)
	at java.util.concurrent.ThreadPoolExecutor$Worker.run(ThreadPoolExecutor.java:624)
	at java.lang.Thread.run(Thread.java:748)

org.apache.solr.common.util.ObjectReleaseTracker$ObjectTrackerException: org.apache.lucene.store.MockDirectoryWrapper
	at org.apache.solr.common.util.ObjectReleaseTracker.track(ObjectReleaseTracker.java:42)
	at org.apache.solr.core.CachingDirectoryFactory.get(CachingDirectoryFactory.java:348)
	at org.apache.solr.handler.IndexFetcher.fetchLatestIndex(IndexFetcher.java:509)
	at org.apache.solr.handler.IndexFetcher.fetchLatestIndex(IndexFetcher.java:351)
	at org.apache.solr.handler.ReplicationHandler.doFetch(ReplicationHandler.java:424)
	at org.apache.solr.handler.ReplicationHandler.lambda$setupPolling$13(ReplicationHandler.java:1193)
	at java.util.concurrent.Executors$RunnableAdapter.call(Executors.java:511)
	at java.util.concurrent.FutureTask.runAndReset(FutureTask.java:308)
	at java.util.concurrent.ScheduledThreadPoolExecutor$ScheduledFutureTask.access$301(ScheduledThreadPoolExecutor.java:180)
	at java.util.concurrent.ScheduledThreadPoolExecutor$ScheduledFutureTask.run(ScheduledThreadPoolExecutor.java:294)
	at java.util.concurrent.ThreadPoolExecutor.runWorker(ThreadPoolExecutor.java:1149)
	at java.util.concurrent.ThreadPoolExecutor$Worker.run(ThreadPoolExecutor.java:624)
	at java.lang.Thread.run(Thread.java:748)

org.apache.solr.common.util.ObjectReleaseTracker$ObjectTrackerException: org.apache.http.impl.client.InternalHttpClient
	at org.apache.solr.common.util.ObjectReleaseTracker.track(ObjectReleaseTracker.java:42)
	at org.apache.solr.client.solrj.impl.HttpClientUtil.createClient(HttpClientUtil.java:321)
	at org.apache.solr.client.solrj.impl.HttpClientUtil.createClient(HttpClientUtil.java:330)
	at org.apache.solr.handler.IndexFetcher.createHttpClient(IndexFetcher.java:230)
	at org.apache.solr.handler.IndexFetcher.<init>(IndexFetcher.java:272)
	at org.apache.solr.handler.ReplicationHandler.inform(ReplicationHandler.java:1224)
	at org.apache.solr.core.SolrResourceLoader.inform(SolrResourceLoader.java:696)
	at org.apache.solr.core.SolrCore.<init>(SolrCore.java:1009)
	at org.apache.solr.core.SolrCore.reload(SolrCore.java:675)
	at org.apache.solr.core.CoreContainer.reload(CoreContainer.java:1499)
	at org.apache.solr.handler.IndexFetcher.lambda$reloadCore$0(IndexFetcher.java:934)
	at java.lang.Thread.run(Thread.java:748)

>
	at __randomizedtesting.SeedInfo.seed([B8FC675D5AB600A8]:0)
	at org.junit.Assert.fail(Assert.java:88)
	at org.junit.Assert.failNotNull(Assert.java:755)
	at org.junit.Assert.assertNull(Assert.java:737)
	at org.apache.solr.SolrTestCaseJ4.teardownTestCases(SolrTestCaseJ4.java:331)
	at sun.reflect.GeneratedMethodAccessor69.invoke(Unknown Source)
	at sun.reflect.DelegatingMethodAccessorImpl.invoke(DelegatingMethodAccessorImpl.java:43)
	at java.lang.reflect.Method.invoke(Method.java:498)
	at com.carrotsearch.randomizedtesting.RandomizedRunner.invoke(RandomizedRunner.java:1750)
	at com.carrotsearch.randomizedtesting.RandomizedRunner$7.evaluate(RandomizedRunner.java:901)
	at com.carrotsearch.randomizedtesting.rules.StatementAdapter.evaluate(StatementAdapter.java:36)
	at com.carrotsearch.randomizedtesting.rules.SystemPropertiesRestoreRule$1.evaluate(SystemPropertiesRestoreRule.java:57)
	at org.apache.lucene.util.AbstractBeforeAfterRule$1.evaluate(AbstractBeforeAfterRule.java:45)
	at com.carrotsearch.randomizedtesting.rules.StatementAdapter.evaluate(StatementAdapter.java:36)
	at org.apache.lucene.util.TestRuleStoreClassName$1.evaluate(TestRuleStoreClassName.java:41)
	at com.carrotsearch.randomizedtesting.rules.NoShadowingOrOverridesOnMethodsRule$1.evaluate(NoShadowingOrOverridesOnMethodsRule.java:40)
	at com.carrotsearch.randomizedtesting.rules.NoShadowingOrOverridesOnMethodsRule$1.evaluate(NoShadowingOrOverridesOnMethodsRule.java:40)
	at com.carrotsearch.randomizedtesting.rules.StatementAdapter.evaluate(StatementAdapter.java:36)
	at com.carrotsearch.randomizedtesting.rules.StatementAdapter.evaluate(StatementAdapter.java:36)
	at com.carrotsearch.randomizedtesting.rules.StatementAdapter.evaluate(StatementAdapter.java:36)
	at org.apache.lucene.util.TestRuleAssertionsRequired$1.evaluate(TestRuleAssertionsRequired.java:53)
	at org.apache.lucene.util.TestRuleMarkFailure$1.evaluate(TestRuleMarkFailure.java:47)
	at org.apache.lucene.util.TestRuleIgnoreAfterMaxFailures$1.evaluate(TestRuleIgnoreAfterMaxFailures.java:64)
	at org.apache.lucene.util.TestRuleIgnoreTestSuites$1.evaluate(TestRuleIgnoreTestSuites.java:54)
	at com.carrotsearch.randomizedtesting.rules.StatementAdapter.evaluate(StatementAdapter.java:36)
	at com.carrotsearch.randomizedtesting.ThreadLeakControl$StatementRunner.run(ThreadLeakControl.java:368)
	at java.lang.Thread.run(Thread.java:748)




Build Log:
[...truncated 13870 lines...]
   [junit4] Suite: org.apache.solr.handler.TestReplicationHandler
   [junit4]   2> Creating dataDir: /x1/jenkins/jenkins-slave/workspace/Lucene-Solr-NightlyTests-8.x/checkout/solr/build/solr-core/test/J2/temp/solr.handler.TestReplicationHandler_B8FC675D5AB600A8-001/init-core-data-001
   [junit4]   2> 1127394 WARN  (SUITE-TestReplicationHandler-seed#[B8FC675D5AB600A8]-worker) [    ] o.a.s.SolrTestCaseJ4 startTrackingSearchers: numOpens=7 numCloses=7
   [junit4]   2> 1127394 INFO  (SUITE-TestReplicationHandler-seed#[B8FC675D5AB600A8]-worker) [    ] o.a.s.SolrTestCaseJ4 Using PointFields (NUMERIC_POINTS_SYSPROP=true) w/NUMERIC_DOCVALUES_SYSPROP=false
   [junit4]   2> 1127397 INFO  (SUITE-TestReplicationHandler-seed#[B8FC675D5AB600A8]-worker) [    ] o.a.s.SolrTestCaseJ4 Randomized ssl (false) and clientAuth (false) via: @org.apache.solr.SolrTestCaseJ4$SuppressSSL(bugUrl=None)
   [junit4]   2> 1127397 INFO  (SUITE-TestReplicationHandler-seed#[B8FC675D5AB600A8]-worker) [    ] o.a.s.SolrTestCaseJ4 SecureRandom sanity checks: test.solr.allowed.securerandom=null & java.security.egd=file:/dev/./urandom
   [junit4]   2> 1127401 INFO  (TEST-TestReplicationHandler.doTestStressReplication-seed#[B8FC675D5AB600A8]) [    ] o.a.s.SolrTestCaseJ4 ###Starting doTestStressReplication
   [junit4]   2> 1127402 INFO  (TEST-TestReplicationHandler.doTestStressReplication-seed#[B8FC675D5AB600A8]) [    ] o.a.s.SolrTestCaseJ4 Writing core.properties file to /x1/jenkins/jenkins-slave/workspace/Lucene-Solr-NightlyTests-8.x/checkout/solr/build/solr-core/test/J2/temp/solr.handler.TestReplicationHandler_B8FC675D5AB600A8-001/solr-instance-001/collection1
   [junit4]   2> 1127408 WARN  (TEST-TestReplicationHandler.doTestStressReplication-seed#[B8FC675D5AB600A8]) [    ] o.e.j.s.AbstractConnector Ignoring deprecated socket close linger time
   [junit4]   2> 1127408 INFO  (TEST-TestReplicationHandler.doTestStressReplication-seed#[B8FC675D5AB600A8]) [    ] o.a.s.c.s.e.JettySolrRunner Start Jetty (original configured port=0)
   [junit4]   2> 1127409 INFO  (TEST-TestReplicationHandler.doTestStressReplication-seed#[B8FC675D5AB600A8]) [    ] o.a.s.c.s.e.JettySolrRunner Trying to start Jetty on port 0 try number 1 ...
   [junit4]   2> 1127410 INFO  (TEST-TestReplicationHandler.doTestStressReplication-seed#[B8FC675D5AB600A8]) [    ] o.e.j.s.Server jetty-9.4.14.v20181114; built: 2018-11-14T21:20:31.478Z; git: c4550056e785fb5665914545889f21dc136ad9e6; jvm 1.8.0_191-b12
   [junit4]   2> 1127411 INFO  (TEST-TestReplicationHandler.doTestStressReplication-seed#[B8FC675D5AB600A8]) [    ] o.e.j.s.session DefaultSessionIdManager workerName=node0
   [junit4]   2> 1127411 INFO  (TEST-TestReplicationHandler.doTestStressReplication-seed#[B8FC675D5AB600A8]) [    ] o.e.j.s.session No SessionScavenger set, using defaults
   [junit4]   2> 1127411 INFO  (TEST-TestReplicationHandler.doTestStressReplication-seed#[B8FC675D5AB600A8]) [    ] o.e.j.s.session node0 Scavenging every 660000ms
   [junit4]   2> 1127412 INFO  (TEST-TestReplicationHandler.doTestStressReplication-seed#[B8FC675D5AB600A8]) [    ] o.e.j.s.h.ContextHandler Started o.e.j.s.ServletContextHandler@41bfdc93{/solr,null,AVAILABLE}
   [junit4]   2> 1127414 INFO  (TEST-TestReplicationHandler.doTestStressReplication-seed#[B8FC675D5AB600A8]) [    ] o.e.j.s.AbstractConnector Started ServerConnector@6d38f423{HTTP/1.1,[http/1.1, h2c]}{127.0.0.1:39667}
   [junit4]   2> 1127414 INFO  (TEST-TestReplicationHandler.doTestStressReplication-seed#[B8FC675D5AB600A8]) [    ] o.e.j.s.Server Started @1127489ms
   [junit4]   2> 1127414 INFO  (TEST-TestReplicationHandler.doTestStressReplication-seed#[B8FC675D5AB600A8]) [    ] o.a.s.c.s.e.JettySolrRunner Jetty properties: {solr.data.dir=/x1/jenkins/jenkins-slave/workspace/Lucene-Solr-NightlyTests-8.x/checkout/solr/build/solr-core/test/J2/temp/solr.handler.TestReplicationHandler_B8FC675D5AB600A8-001/solr-instance-001/collection1/data, hostContext=/solr, hostPort=39667}
   [junit4]   2> 1127414 ERROR (TEST-TestReplicationHandler.doTestStressReplication-seed#[B8FC675D5AB600A8]) [    ] o.a.s.u.StartupLoggingUtils Missing Java Option solr.log.dir. Logging may be missing or incomplete.
   [junit4]   2> 1127414 INFO  (TEST-TestReplicationHandler.doTestStressReplication-seed#[B8FC675D5AB600A8]) [    ] o.a.s.s.SolrDispatchFilter Using logger factory org.apache.logging.slf4j.Log4jLoggerFactory
   [junit4]   2> 1127414 INFO  (TEST-TestReplicationHandler.doTestStressReplication-seed#[B8FC675D5AB600A8]) [    ] o.a.s.s.SolrDispatchFilter  ___      _       Welcome to Apache Solr? version 8.2.0
   [junit4]   2> 1127414 INFO  (TEST-TestReplicationHandler.doTestStressReplication-seed#[B8FC675D5AB600A8]) [    ] o.a.s.s.SolrDispatchFilter / __| ___| |_ _   Starting in standalone mode on port null
   [junit4]   2> 1127414 INFO  (TEST-TestReplicationHandler.doTestStressReplication-seed#[B8FC675D5AB600A8]) [    ] o.a.s.s.SolrDispatchFilter \__ \/ _ \ | '_|  Install dir: null
   [junit4]   2> 1127414 INFO  (TEST-TestReplicationHandler.doTestStressReplication-seed#[B8FC675D5AB600A8]) [    ] o.a.s.s.SolrDispatchFilter |___/\___/_|_|    Start time: 2019-05-06T15:00:00.405Z
   [junit4]   2> 1127415 INFO  (TEST-TestReplicationHandler.doTestStressReplication-seed#[B8FC675D5AB600A8]) [    ] o.a.s.c.SolrXmlConfig Loading container configuration from /x1/jenkins/jenkins-slave/workspace/Lucene-Solr-NightlyTests-8.x/checkout/solr/build/solr-core/test/J2/temp/solr.handler.TestReplicationHandler_B8FC675D5AB600A8-001/solr-instance-001/solr.xml
   [junit4]   2> 1127420 INFO  (TEST-TestReplicationHandler.doTestStressReplication-seed#[B8FC675D5AB600A8]) [    ] o.a.s.c.SolrXmlConfig Configuration parameter autoReplicaFailoverWorkLoopDelay is ignored
   [junit4]   2> 1127420 INFO  (TEST-TestReplicationHandler.doTestStressReplication-seed#[B8FC675D5AB600A8]) [    ] o.a.s.c.SolrXmlConfig Configuration parameter autoReplicaFailoverBadNodeExpiration is ignored
   [junit4]   2> 1127423 INFO  (TEST-TestReplicationHandler.doTestStressReplication-seed#[B8FC675D5AB600A8]) [    ] o.a.s.c.SolrXmlConfig MBean server found: com.sun.jmx.mbeanserver.JmxMBeanServer@6a912039, but no JMX reporters were configured - adding default JMX reporter.
   [junit4]   2> 1127696 INFO  (TEST-TestReplicationHandler.doTestStressReplication-seed#[B8FC675D5AB600A8]) [    ] o.a.s.h.c.HttpShardHandlerFactory Host whitelist initialized: WhitelistHostChecker [whitelistHosts=null, whitelistHostCheckingEnabled=true]
   [junit4]   2> 1127697 WARN  (TEST-TestReplicationHandler.doTestStressReplication-seed#[B8FC675D5AB600A8]) [    ] o.e.j.u.s.S.config No Client EndPointIdentificationAlgorithm configured for SslContextFactory@6f4eb5b1[provider=null,keyStore=null,trustStore=null]
   [junit4]   2> 1127702 WARN  (TEST-TestReplicationHandler.doTestStressReplication-seed#[B8FC675D5AB600A8]) [    ] o.e.j.u.s.S.config No Client EndPointIdentificationAlgorithm configured for SslContextFactory@53be11e9[provider=null,keyStore=null,trustStore=null]
   [junit4]   2> 1127732 INFO  (TEST-TestReplicationHandler.doTestStressReplication-seed#[B8FC675D5AB600A8]) [    ] o.a.s.c.TransientSolrCoreCacheDefault Allocating transient cache for 4 transient cores
   [junit4]   2> 1127732 INFO  (TEST-TestReplicationHandler.doTestStressReplication-seed#[B8FC675D5AB600A8]) [    ] o.a.s.h.a.MetricsHistoryHandler No .system collection, keeping metrics history in memory.
   [junit4]   2> 1127770 INFO  (TEST-TestReplicationHandler.doTestStressReplication-seed#[B8FC675D5AB600A8]) [    ] o.a.s.m.r.SolrJmxReporter JMX monitoring for 'solr.node' (registry 'solr.node') enabled at server: com.sun.jmx.mbeanserver.JmxMBeanServer@6a912039
   [junit4]   2> 1127789 INFO  (TEST-TestReplicationHandler.doTestStressReplication-seed#[B8FC675D5AB600A8]) [    ] o.a.s.m.r.SolrJmxReporter JMX monitoring for 'solr.jvm' (registry 'solr.jvm') enabled at server: com.sun.jmx.mbeanserver.JmxMBeanServer@6a912039
   [junit4]   2> 1127789 INFO  (TEST-TestReplicationHandler.doTestStressReplication-seed#[B8FC675D5AB600A8]) [    ] o.a.s.m.r.SolrJmxReporter JMX monitoring for 'solr.jetty' (registry 'solr.jetty') enabled at server: com.sun.jmx.mbeanserver.JmxMBeanServer@6a912039
   [junit4]   2> 1127792 INFO  (TEST-TestReplicationHandler.doTestStressReplication-seed#[B8FC675D5AB600A8]) [    ] o.a.s.c.CorePropertiesLocator Found 1 core definitions underneath /x1/jenkins/jenkins-slave/workspace/Lucene-Solr-NightlyTests-8.x/checkout/solr/build/solr-core/test/J2/temp/solr.handler.TestReplicationHandler_B8FC675D5AB600A8-001/solr-instance-001/.
   [junit4]   2> 1127792 INFO  (TEST-TestReplicationHandler.doTestStressReplication-seed#[B8FC675D5AB600A8]) [    ] o.a.s.c.CorePropertiesLocator Cores are: [collection1]
   [junit4]   2> 1127805 INFO  (coreLoadExecutor-10395-thread-1) [    x:collection1] o.a.s.c.SolrConfig Using Lucene MatchVersion: 8.2.0
   [junit4]   2> 1127824 INFO  (coreLoadExecutor-10395-thread-1) [    x:collection1] o.a.s.s.IndexSchema [collection1] Schema name=test
   [junit4]   2> 1127828 INFO  (coreLoadExecutor-10395-thread-1) [    x:collection1] o.a.s.s.IndexSchema Loaded schema test/1.2 with uniqueid field id
   [junit4]   2> 1127828 INFO  (coreLoadExecutor-10395-thread-1) [    x:collection1] o.a.s.c.CoreContainer Creating SolrCore 'collection1' using configuration from instancedir /x1/jenkins/jenkins-slave/workspace/Lucene-Solr-NightlyTests-8.x/checkout/solr/build/solr-core/test/J2/temp/solr.handler.TestReplicationHandler_B8FC675D5AB600A8-001/solr-instance-001/./collection1, trusted=true
   [junit4]   2> 1127828 INFO  (coreLoadExecutor-10395-thread-1) [    x:collection1] o.a.s.m.r.SolrJmxReporter JMX monitoring for 'solr.core.collection1' (registry 'solr.core.collection1') enabled at server: com.sun.jmx.mbeanserver.JmxMBeanServer@6a912039
   [junit4]   2> 1127828 INFO  (coreLoadExecutor-10395-thread-1) [    x:collection1] o.a.s.c.SolrCore [[collection1] ] Opening new SolrCore at [/x1/jenkins/jenkins-slave/workspace/Lucene-Solr-NightlyTests-8.x/checkout/solr/build/solr-core/test/J2/temp/solr.handler.TestReplicationHandler_B8FC675D5AB600A8-001/solr-instance-001/collection1], dataDir=[/x1/jenkins/jenkins-slave/workspace/Lucene-Solr-NightlyTests-8.x/checkout/solr/build/solr-core/test/J2/temp/solr.handler.TestReplicationHandler_B8FC675D5AB600A8-001/solr-instance-001/./collection1/data/]
   [junit4]   2> 1127830 INFO  (coreLoadExecutor-10395-thread-1) [    x:collection1] o.a.s.u.RandomMergePolicy RandomMergePolicy wrapping class org.apache.lucene.index.TieredMergePolicy: [TieredMergePolicy: maxMergeAtOnce=22, maxMergeAtOnceExplicit=16, maxMergedSegmentMB=90.5224609375, floorSegmentMB=1.072265625, forceMergeDeletesPctAllowed=12.286914741373936, segmentsPerTier=46.0, maxCFSSegmentSizeMB=8.796093022207999E12, noCFSRatio=0.31043636666225227, deletesPctAllowed=43.40622274257977
   [junit4]   2> 1127894 INFO  (coreLoadExecutor-10395-thread-1) [    x:collection1] o.a.s.u.CommitTracker Hard AutoCommit: disabled
   [junit4]   2> 1127894 INFO  (coreLoadExecutor-10395-thread-1) [    x:collection1] o.a.s.u.CommitTracker Soft AutoCommit: disabled
   [junit4]   2> 1127895 INFO  (coreLoadExecutor-10395-thread-1) [    x:collection1] o.a.s.u.RandomMergePolicy RandomMergePolicy wrapping class org.apache.lucene.index.AlcoholicMergePolicy: [AlcoholicMergePolicy: minMergeSize=0, mergeFactor=10, maxMergeSize=1292745118, maxMergeSizeForForcedMerge=9223372036854775807, calibrateSizeByDeletes=true, maxMergeDocs=2147483647, maxCFSSegmentSizeMB=8.796093022207999E12, noCFSRatio=0.1]
   [junit4]   2> 1127895 INFO  (coreLoadExecutor-10395-thread-1) [    x:collection1] o.a.s.s.SolrIndexSearcher Opening [Searcher@436afacf[collection1] main]
   [junit4]   2> 1127898 INFO  (coreLoadExecutor-10395-thread-1) [    x:collection1] o.a.s.r.ManagedResourceStorage File-based storage initialized to use dir: /x1/jenkins/jenkins-slave/workspace/Lucene-Solr-NightlyTests-8.x/checkout/solr/build/solr-core/test/J2/temp/solr.handler.TestReplicationHandler_B8FC675D5AB600A8-001/solr-instance-001/collection1/conf
   [junit4]   2> 1127899 INFO  (coreLoadExecutor-10395-thread-1) [    x:collection1] o.a.s.h.ReplicationHandler Replication enabled for following config files: schema.xml,xslt/dummy.xsl
   [junit4]   2> 1127899 INFO  (coreLoadExecutor-10395-thread-1) [    x:collection1] o.a.s.h.ReplicationHandler Commits will be reserved for 10000ms.
   [junit4]   2> 1127900 INFO  (searcherExecutor-10396-thread-1-processing-x:collection1) [    x:collection1] o.a.s.c.SolrCore [collection1] Registered new searcher Searcher@436afacf[collection1] main{ExitableDirectoryReader(UninvertingDirectoryReader())}
   [junit4]   2> 1128403 INFO  (TEST-TestReplicationHandler.doTestStressReplication-seed#[B8FC675D5AB600A8]) [    ] o.a.s.SolrTestCaseJ4 Writing core.properties file to /x1/jenkins/jenkins-slave/workspace/Lucene-Solr-NightlyTests-8.x/checkout/solr/build/solr-core/test/J2/temp/solr.handler.TestReplicationHandler_B8FC675D5AB600A8-001/solr-instance-002/collection1
   [junit4]   2> 1128406 WARN  (TEST-TestReplicationHandler.doTestStressReplication-seed#[B8FC675D5AB600A8]) [    ] o.e.j.s.AbstractConnector Ignoring deprecated socket close linger time
   [junit4]   2> 1128406 INFO  (TEST-TestReplicationHandler.doTestStressReplication-seed#[B8FC675D5AB600A8]) [    ] o.a.s.c.s.e.JettySolrRunner Start Jetty (original configured port=0)
   [junit4]   2> 1128407 INFO  (TEST-TestReplicationHandler.doTestStressReplication-seed#[B8FC675D5AB600A8]) [    ] o.a.s.c.s.e.JettySolrRunner Trying to start Jetty on port 0 try number 1 ...
   [junit4]   2> 1128407 INFO  (TEST-TestReplicationHandler.doTestStressReplication-seed#[B8FC675D5AB600A8]) [    ] o.e.j.s.Server jetty-9.4.14.v20181114; built: 2018-11-14T21:20:31.478Z; git: c4550056e785fb5665914545889f21dc136ad9e6; jvm 1.8.0_191-b12
   [junit4]   2> 1128408 INFO  (TEST-TestReplicationHandler.doTestStressReplication-seed#[B8FC675D5AB600A8]) [    ] o.e.j.s.session DefaultSessionIdManager workerName=node0
   [junit4]   2> 1128408 INFO  (TEST-TestReplicationHandler.doTestStressReplication-seed#[B8FC675D5AB600A8]) [    ] o.e.j.s.session No SessionScavenger set, using defaults
   [junit4]   2> 1128408 INFO  (TEST-TestReplicationHandler.doTestStressReplication-seed#[B8FC675D5AB600A8]) [    ] o.e.j.s.session node0 Scavenging every 600000ms
   [junit4]   2> 1128408 INFO  (TEST-TestReplicationHandler.doTestStressReplication-seed#[B8FC675D5AB600A8]) [    ] o.e.j.s.h.ContextHandler Started o.e.j.s.ServletContextHandler@4d207a{/solr,null,AVAILABLE}
   [junit4]   2> 1128409 INFO  (TEST-TestReplicationHandler.doTestStressReplication-seed#[B8FC675D5AB600A8]) [    ] o.e.j.s.AbstractConnector Started ServerConnector@22390c04{HTTP/1.1,[http/1.1, h2c]}{127.0.0.1:45743}
   [junit4]   2> 1128409 INFO  (TEST-TestReplicationHandler.doTestStressReplication-seed#[B8FC675D5AB600A8]) [    ] o.e.j.s.Server Started @1128485ms
   [junit4]   2> 1128409 INFO  (TEST-TestReplicationHandler.doTestStressReplication-seed#[B8FC675D5AB600A8]) [    ] o.a.s.c.s.e.JettySolrRunner Jetty properties: {solr.data.dir=/x1/jenkins/jenkins-slave/workspace/Lucene-Solr-NightlyTests-8.x/checkout/solr/build/solr-core/test/J2/temp/solr.handler.TestReplicationHandler_B8FC675D5AB600A8-001/solr-instance-002/collection1/data, hostContext=/solr, hostPort=45743}
   [junit4]   2> 1128409 ERROR (TEST-TestReplicationHandler.doTestStressReplication-seed#[B8FC675D5AB600A8]) [    ] o.a.s.u.StartupLoggingUtils Missing Java Option solr.log.dir. Logging may be missing or incomplete.
   [junit4]   2> 1128409 INFO  (TEST-TestReplicationHandler.doTestStressReplication-seed#[B8FC675D5AB600A8]) [    ] o.a.s.s.SolrDispatchFilter Using logger factory org.apache.logging.slf4j.Log4jLoggerFactory
   [junit4]   2> 1128409 INFO  (TEST-TestReplicationHandler.doTestStressReplication-seed#[B8FC675D5AB600A8]) [    ] o.a.s.s.SolrDispatchFilter  ___      _       Welcome to Apache Solr? version 8.2.0
   [junit4]   2> 1128409 INFO  (TEST-TestReplicationHandler.doTestStressReplication-seed#[B8FC675D5AB600A8]) [    ] o.a.s.s.SolrDispatchFilter / __| ___| |_ _   Starting in standalone mode on port null
   [junit4]   2> 1128409 INFO  (TEST-TestReplicationHandler.doTestStressReplication-seed#[B8FC675D5AB600A8]) [    ] o.a.s.s.SolrDispatchFilter \__ \/ _ \ | '_|  Install dir: null
   [junit4]   2> 1128409 INFO  (TEST-TestReplicationHandler.doTestStressReplication-seed#[B8FC675D5AB600A8]) [    ] o.a.s.s.SolrDispatchFilter |___/\___/_|_|    Start time: 2019-05-06T15:00:01.400Z
   [junit4]   2> 1128410 INFO  (TEST-TestReplicationHandler.doTestStressReplication-seed#[B8FC675D5AB600A8]) [    ] o.a.s.c.SolrXmlConfig Loading container configuration from /x1/jenkins/jenkins-slave/workspace/Lucene-Solr-NightlyTests-8.x/checkout/solr/build/solr-core/test/J2/temp/solr.handler.TestReplicationHandler_B8FC675D5AB600A8-001/solr-instance-002/solr.xml
   [junit4]   2> 1128416 INFO  (TEST-TestReplicationHandler.doTestStressReplication-seed#[B8FC675D5AB600A8]) [    ] o.a.s.c.SolrXmlConfig Configuration parameter autoReplicaFailoverWorkLoopDelay is ignored
   [junit4]   2> 1128416 INFO  (TEST-TestReplicationHandler.doTestStressReplication-seed#[B8FC675D5AB600A8]) [    ] o.a.s.c.SolrXmlConfig Configuration parameter autoReplicaFailoverBadNodeExpiration is ignored
   [junit4]   2> 1128418 INFO  (TEST-TestReplicationHandler.doTestStressReplication-seed#[B8FC675D5AB600A8]) [    ] o.a.s.c.SolrXmlConfig MBean server found: com.sun.jmx.mbeanserver.JmxMBeanServer@6a912039, but no JMX reporters were configured - adding default JMX reporter.
   [junit4]   2> 1128515 INFO  (TEST-TestReplicationHandler.doTestStressReplication-seed#[B8FC675D5AB600A8]) [    ] o.a.s.h.c.HttpShardHandlerFactory Host whitelist initialized: WhitelistHostChecker [whitelistHosts=null, whitelistHostCheckingEnabled=true]
   [junit4]   2> 1128517 WARN  (TEST-TestReplicationHandler.doTestStressReplication-seed#[B8FC675D5AB600A8]) [    ] o.e.j.u.s.S.config No Client EndPointIdentificationAlgorithm configured for SslContextFactory@7d0f0a89[provider=null,keyStore=null,trustStore=null]
   [junit4]   2> 1128521 WARN  (TEST-TestReplicationHandler.doTestStressReplication-seed#[B8FC675D5AB600A8]) [    ] o.e.j.u.s.S.config No Client EndPointIdentificationAlgorithm configured for SslContextFactory@4804ceb0[provider=null,keyStore=null,trustStore=null]
   [junit4]   2> 1128550 INFO  (TEST-TestReplicationHandler.doTestStressReplication-seed#[B8FC675D5AB600A8]) [    ] o.a.s.c.TransientSolrCoreCacheDefault Allocating transient cache for 4 transient cores
   [junit4]   2> 1128550 INFO  (TEST-TestReplicationHandler.doTestStressReplication-seed#[B8FC675D5AB600A8]) [    ] o.a.s.h.a.MetricsHistoryHandler No .system collection, keeping metrics history in memory.
   [junit4]   2> 1128583 INFO  (TEST-TestReplicationHandler.doTestStressReplication-seed#[B8FC675D5AB600A8]) [    ] o.a.s.m.r.SolrJmxReporter JMX monitoring for 'solr.node' (registry 'solr.node') enabled at server: com.sun.jmx.mbeanserver.JmxMBeanServer@6a912039
   [junit4]   2> 1128604 INFO  (TEST-TestReplicationHandler.doTestStressReplication-seed#[B8FC675D5AB600A8]) [    ] o.a.s.m.r.SolrJmxReporter JMX monitoring for 'solr.jvm' (registry 'solr.jvm') enabled at server: com.sun.jmx.mbeanserver.JmxMBeanServer@6a912039
   [junit4]   2> 1128604 INFO  (TEST-TestReplicationHandler.doTestStressReplication-seed#[B8FC675D5AB600A8]) [    ] o.a.s.m.r.SolrJmxReporter JMX monitoring for 'solr.jetty' (registry 'solr.jetty') enabled at server: com.sun.jmx.mbeanserver.JmxMBeanServer@6a912039
   [junit4]   2> 1128608 INFO  (TEST-TestReplicationHandler.doTestStressReplication-seed#[B8FC675D5AB600A8]) [    ] o.a.s.c.CorePropertiesLocator Found 1 core definitions underneath /x1/jenkins/jenkins-slave/workspace/Lucene-Solr-NightlyTests-8.x/checkout/solr/build/solr-core/test/J2/temp/solr.handler.TestReplicationHandler_B8FC675D5AB600A8-001/solr-instance-002/.
   [junit4]   2> 1128608 INFO  (TEST-TestReplicationHandler.doTestStressReplication-seed#[B8FC675D5AB600A8]) [    ] o.a.s.c.CorePropertiesLocator Cores are: [collection1]
   [junit4]   2> 1128621 INFO  (coreLoadExecutor-10408-thread-1) [    x:collection1] o.a.s.c.SolrConfig Using Lucene MatchVersion: 8.2.0
   [junit4]   2> 1128633 INFO  (coreLoadExecutor-10408-thread-1) [    x:collection1] o.a.s.s.IndexSchema [collection1] Schema name=test
   [junit4]   2> 1128636 INFO  (coreLoadExecutor-10408-thread-1) [    x:collection1] o.a.s.s.IndexSchema Loaded schema test/1.2 with uniqueid field id
   [junit4]   2> 1128636 INFO  (coreLoadExecutor-10408-thread-1) [    x:collection1] o.a.s.c.CoreContainer Creating SolrCore 'collection1' using configuration from instancedir /x1/jenkins/jenkins-slave/workspace/Lucene-Solr-NightlyTests-8.x/checkout/solr/build/solr-core/test/J2/temp/solr.handler.TestReplicationHandler_B8FC675D5AB600A8-001/solr-instance-002/./collection1, trusted=true
   [junit4]   2> 1128636 INFO  (coreLoadExecutor-10408-thread-1) [    x:collection1] o.a.s.m.r.SolrJmxReporter JMX monitoring for 'solr.core.collection1' (registry 'solr.core.collection1') enabled at server: com.sun.jmx.mbeanserver.JmxMBeanServer@6a912039
   [junit4]   2> 1128637 INFO  (coreLoadExecutor-10408-thread-1) [    x:collection1] o.a.s.c.SolrCore [[collection1] ] Opening new SolrCore at [/x1/jenkins/jenkins-slave/workspace/Lucene-Solr-NightlyTests-8.x/checkout/solr/build/solr-core/test/J2/temp/solr.handler.TestReplicationHandler_B8FC675D5AB600A8-001/solr-instance-002/collection1], dataDir=[/x1/jenkins/jenkins-slave/workspace/Lucene-Solr-NightlyTests-8.x/checkout/solr/build/solr-core/test/J2/temp/solr.handler.TestReplicationHandler_B8FC675D5AB600A8-001/solr-instance-002/./collection1/data/]
   [junit4]   2> 1128639 INFO  (coreLoadExecutor-10408-thread-1) [    x:collection1] o.a.s.u.RandomMergePolicy RandomMergePolicy wrapping class org.apache.lucene.index.TieredMergePolicy: [TieredMergePolicy: maxMergeAtOnce=22, maxMergeAtOnceExplicit=16, maxMergedSegmentMB=90.5224609375, floorSegmentMB=1.072265625, forceMergeDeletesPctAllowed=12.286914741373936, segmentsPerTier=46.0, maxCFSSegmentSizeMB=8.796093022207999E12, noCFSRatio=0.31043636666225227, deletesPctAllowed=43.40622274257977
   [junit4]   2> 1128769 INFO  (coreLoadExecutor-10408-thread-1) [    x:collection1] o.a.s.u.CommitTracker Hard AutoCommit: disabled
   [junit4]   2> 1128769 INFO  (coreLoadExecutor-10408-thread-1) [    x:collection1] o.a.s.u.CommitTracker Soft AutoCommit: disabled
   [junit4]   2> 1128771 INFO  (coreLoadExecutor-10408-thread-1) [    x:collection1] o.a.s.u.RandomMergePolicy RandomMergePolicy wrapping class org.apache.lucene.index.AlcoholicMergePolicy: [AlcoholicMergePolicy: minMergeSize=0, mergeFactor=10, maxMergeSize=1292745118, maxMergeSizeForForcedMerge=9223372036854775807, calibrateSizeByDeletes=true, maxMergeDocs=2147483647, maxCFSSegmentSizeMB=8.796093022207999E12, noCFSRatio=0.1]
   [junit4]   2> 1128772 INFO  (coreLoadExecutor-10408-thread-1) [    x:collection1] o.a.s.s.SolrIndexSearcher Opening [Searcher@7876fc30[collection1] main]
   [junit4]   2> 1128773 INFO  (coreLoadExecutor-10408-thread-1) [    x:collection1] o.a.s.r.ManagedResourceStorage File-based storage initialized to use dir: /x1/jenkins/jenkins-slave/workspace/Lucene-Solr-NightlyTests-8.x/checkout/solr/build/solr-core/test/J2/temp/solr.handler.TestReplicationHandler_B8FC675D5AB600A8-001/solr-instance-002/collection1/conf
   [junit4]   2> 1128776 INFO  (coreLoadExecutor-10408-thread-1) [    x:collection1] o.a.s.h.ReplicationHandler Poll scheduled at an interval of 1000ms
   [junit4]   2> 1128776 INFO  (coreLoadExecutor-10408-thread-1) [    x:collection1] o.a.s.h.ReplicationHandler Commits will be reserved for 10000ms.
   [junit4]   2> 1128777 INFO  (searcherExecutor-10409-thread-1-processing-x:collection1) [    x:collection1] o.a.s.c.SolrCore [collection1] Registered new searcher Searcher@7876fc30[collection1] main{ExitableDirectoryReader(UninvertingDirectoryReader())}
   [junit4]   2> 1128783 INFO  (TEST-TestReplicationHandler.doTestStressReplication-seed#[B8FC675D5AB600A8]) [    ] o.a.s.c.CoreContainer Shutting down CoreContainer instance=1911968639
   [junit4]   2> 1128784 INFO  (coreCloseExecutor-10414-thread-1) [    x:collection1] o.a.s.c.SolrCore [collection1]  CLOSING SolrCore org.apache.solr.core.SolrCore@22e51412
   [junit4]   2> 1128784 INFO  (coreCloseExecutor-10414-thread-1) [    x:collection1] o.a.s.m.SolrMetricManager Closing metric reporters for registry=solr.core.collection1, tag=22e51412
   [junit4]   2> 1128784 INFO  (coreCloseExecutor-10414-thread-1) [    x:collection1] o.a.s.m.r.SolrJmxReporter Closing reporter [org.apache.solr.metrics.reporters.SolrJmxReporter@58be007b: rootName = null, domain = solr.core.collection1, service url = null, agent id = null] for registry solr.core.collection1 / com.codahale.metrics.MetricRegistry@3ff2175a
   [junit4]   2> 1128827 INFO  (TEST-TestReplicationHandler.doTestStressReplication-seed#[B8FC675D5AB600A8]) [    ] o.a.s.m.SolrMetricManager Closing metric reporters for registry=solr.node, tag=null
   [junit4]   2> 1128827 INFO  (TEST-TestReplicationHandler.doTestStressReplication-seed#[B8FC675D5AB600A8]) [    ] o.a.s.m.r.SolrJmxReporter Closing reporter [org.apache.solr.metrics.reporters.SolrJmxReporter@3aa0f462: rootName = null, domain = solr.node, service url = null, agent id = null] for registry solr.node / com.codahale.metrics.MetricRegistry@2ad59f4d
   [junit4]   2> 1128839 INFO  (TEST-TestReplicationHandler.doTestStressReplication-seed#[B8FC675D5AB600A8]) [    ] o.a.s.m.SolrMetricManager Closing metric reporters for registry=solr.jvm, tag=null
   [junit4]   2> 1128839 INFO  (TEST-TestReplicationHandler.doTestStressReplication-seed#[B8FC675D5AB600A8]) [    ] o.a.s.m.r.SolrJmxReporter Closing reporter [org.apache.solr.metrics.reporters.SolrJmxReporter@4dca6440: rootName = null, domain = solr.jvm, service url = null, agent id = null] for registry solr.jvm / com.codahale.metrics.MetricRegistry@4a353911
   [junit4]   2> 1128844 INFO  (TEST-TestReplicationHandler.doTestStressReplication-seed#[B8FC675D5AB600A8]) [    ] o.a.s.m.SolrMetricManager Closing metric reporters for registry=solr.jetty, tag=null
   [junit4]   2> 1128844 INFO  (TEST-TestReplicationHandler.doTestStressReplication-seed#[B8FC675D5AB600A8]) [    ] o.a.s.m.r.SolrJmxReporter Closing reporter [org.apache.solr.metrics.reporters.SolrJmxReporter@fc139bc: rootName = null, domain = solr.jetty, service url = null, agent id = null] for registry solr.jetty / com.codahale.metrics.MetricRegistry@762a5c07
   [junit4]   2> 1128847 INFO  (TEST-TestReplicationHandler.doTestStressReplication-seed#[B8FC675D5AB600A8]) [    ] o.e.j.s.AbstractConnector Stopped ServerConnector@22390c04{HTTP/1.1,[http/1.1, h2c]}{127.0.0.1:0}
   [junit4]   2> 1128848 INFO  (TEST-TestReplicationHandler.doTestStressReplication-seed#[B8FC675D5AB600A8]) [    ] o.e.j.s.h.ContextHandler Stopped o.e.j.s.ServletContextHandler@4d207a{/solr,null,UNAVAILABLE}
   [junit4]   2> 1128848 INFO  (TEST-TestReplicationHandler.doTestStressReplication-seed#[B8FC675D5AB600A8]) [    ] o.e.j.s.session node0 Stopped scavenging
   [junit4]   2> 1128858 WARN  (TEST-TestReplicationHandler.doTestStressReplication-seed#[B8FC675D5AB600A8]) [    ] o.e.j.s.AbstractConnector Ignoring deprecated socket close linger time
   [junit4]   2> 1128858 INFO  (TEST-TestReplicationHandler.doTestStressReplication-seed#[B8FC675D5AB600A8]) [    ] o.a.s.c.s.e.JettySolrRunner Start Jetty (original configured port=0)
   [junit4]   2> 1128858 INFO  (TEST-TestReplicationHandler.doTestStressReplication-seed#[B8FC675D5AB600A8]) [    ] o.a.s.c.s.e.JettySolrRunner Trying to start Jetty on port 0 try number 1 ...
   [junit4]   2> 1128858 INFO  (TEST-TestReplicationHandler.doTestStressReplication-seed#[B8FC675D5AB600A8]) [    ] o.e.j.s.Server jetty-9.4.14.v20181114; built: 2018-11-14T21:20:31.478Z; git: c4550056e785fb5665914545889f21dc136ad9e6; jvm 1.8.0_191-b12
   [junit4]   2> 1128866 INFO  (TEST-TestReplicationHandler.doTestStressReplication-seed#[B8FC675D5AB600A8]) [    ] o.e.j.s.session DefaultSessionIdManager workerName=node0
   [junit4]   2> 1128866 INFO  (TEST-TestReplicationHandler.doTestStressReplication-seed#[B8FC675D5AB600A8]) [    ] o.e.j.s.session No SessionScavenger set, using defaults
   [junit4]   2> 1128866 INFO  (TEST-TestReplicationHandler.doTestStressReplication-seed#[B8FC675D5AB600A8]) [    ] o.e.j.s.session node0 Scavenging every 600000ms
   [junit4]   2> 1128867 INFO  (TEST-TestReplicationHandler.doTestStressReplication-seed#[B8FC675D5AB600A8]) [    ] o.e.j.s.h.ContextHandler Started o.e.j.s.ServletContextHandler@1c47e0ff{/solr,null,AVAILABLE}
   [junit4]   2> 1128867 INFO  (TEST-TestReplicationHandler.doTestStressReplication-seed#[B8FC675D5AB600A8]) [    ] o.e.j.s.AbstractConnector Started ServerConnector@c05a4ef{HTTP/1.1,[http/1.1, h2c]}{127.0.0.1:46064}
   [junit4]   2> 1128867 INFO  (TEST-TestReplicationHandler.doTestStressReplication-seed#[B8FC675D5AB600A8]) [    ] o.e.j.s.Server Started @1128943ms
   [junit4]   2> 1128867 INFO  (TEST-TestReplicationHandler.doTestStressReplication-seed#[B8FC675D5AB600A8]) [    ] o.a.s.c.s.e.JettySolrRunner Jetty properties: {solr.data.dir=/x1/jenkins/jenkins-slave/workspace/Lucene-Solr-NightlyTests-8.x/checkout/solr/build/solr-core/test/J2/temp/solr.handler.TestReplicationHandler_B8FC675D5AB600A8-001/solr-instance-002/collection1/data, hostContext=/solr, hostPort=46064}
   [junit4]   2> 1128868 ERROR (TEST-TestReplicationHandler.doTestStressReplication-seed#[B8FC675D5AB600A8]) [    ] o.a.s.u.StartupLoggingUtils Missing Java Option solr.log.dir. Logging may be missing or incomplete.
   [junit4]   2> 1128868 INFO  (TEST-TestReplicationHandler.doTestStressReplication-seed#[B8FC675D5AB600A8]) [    ] o.a.s.s.SolrDispatchFilter Using logger factory org.apache.logging.slf4j.Log4jLoggerFactory
   [junit4]   2> 1128868 INFO  (TEST-TestReplicationHandler.doTestStressReplication-seed#[B8FC675D5AB600A8]) [    ] o.a.s.s.SolrDispatchFilter  ___      _       Welcome to Apache Solr? version 8.2.0
   [junit4]   2> 1128868 INFO  (TEST-TestReplicationHandler.doTestStressReplication-seed#[B8FC675D5AB600A8]) [    ] o.a.s.s.SolrDispatchFilter / __| ___| |_ _   Starting in standalone mode on port null
   [junit4]   2> 1128868 INFO  (TEST-TestReplicationHandler.doTestStressReplication-seed#[B8FC675D5AB600A8]) [    ] o.a.s.s.SolrDispatchFilter \__ \/ _ \ | '_|  Install dir: null
   [junit4]   2> 1128868 INFO  (TEST-TestReplicationHandler.doTestStressReplication-seed#[B8FC675D5AB600A8]) [    ] o.a.s.s.SolrDispatchFilter |___/\___/_|_|    Start time: 2019-05-06T15:00:01.859Z
   [junit4]   2> 1128868 INFO  (TEST-TestReplicationHandler.doTestStressReplication-seed#[B8FC675D5AB600A8]) [    ] o.a.s.c.SolrXmlConfig Loading container configuration from /x1/jenkins/jenkins-slave/workspace/Lucene-Solr-NightlyTests-8.x/checkout/solr/build/solr-core/test/J2/temp/solr.handler.TestReplicationHandler_B8FC675D5AB600A8-001/solr-instance-002/solr.xml
   [junit4]   2> 1128887 INFO  (TEST-TestReplicationHandler.doTestStressReplication-seed#[B8FC675D5AB600A8]) [    ] o.a.s.c.SolrXmlConfig Configuration parameter autoReplicaFailoverWorkLoopDelay is ignored
   [junit4]   2> 1128887 INFO  (TEST-TestReplicationHandler.doTestStressReplication-seed#[B8FC675D5AB600A8]) [    ] o.a.s.c.SolrXmlConfig Configuration parameter autoReplicaFailoverBadNodeExpiration is ignored
   [junit4]   2> 1128888 INFO  (TEST-TestReplicationHandler.doTestStressReplication-seed#[B8FC675D5AB600A8]) [    ] o.a.s.c.SolrXmlConfig MBean server found: com.sun.jmx.mbeanserver.JmxMBeanServer@6a912039, but no JMX reporters were configured - adding default JMX reporter.
   [junit4]   2> 1129049 INFO  (TEST-TestReplicationHandler.doTestStressReplication-seed#[B8FC675D5AB600A8]) [    ] o.a.s.h.c.HttpShardHandlerFactory Host whitelist initialized: WhitelistHostChecker [whitelistHosts=null, whitelistHostCheckingEnabled=true]
   [junit4]   2> 1129051 WARN  (TEST-TestReplicationHandler.doTestStressReplication-seed#[B8FC675D5AB600A8]) [    ] o.e.j.u.s.S.config No Client EndPointIdentificationAlgorithm configured for SslContextFactory@2e6ff0e6[provider=null,keyStore=null,trustStore=null]
   [junit4]   2> 1129056 WARN  (TEST-TestReplicationHandler.doTestStressReplication-seed#[B8FC675D5AB600A8]) [    ] o.e.j.u.s.S.config No Client EndPointIdentificationAlgorithm configured for SslContextFactory@230d2d1d[provider=null,keyStore=null,trustStore=null]
   [junit4]   2> 1129086 INFO  (TEST-TestReplicationHandler.doTestStressReplication-seed#[B8FC675D5AB600A8]) [    ] o.a.s.c.TransientSolrCoreCacheDefault Allocating transient cache for 4 transient cores
   [junit4]   2> 1129086 INFO  (TEST-TestReplicationHandler.doTestStressReplication-seed#[B8FC675D5AB600A8]) [    ] o.a.s.h.a.MetricsHistoryHandler No .system collection, keeping metrics history in memory.
   [junit4]   2> 1129120 INFO  (TEST-TestReplicationHandler.doTestStressReplication-seed#[B8FC675D5AB600A8]) [    ] o.a.s.m.r.SolrJmxReporter JMX monitoring for 'solr.node' (registry 'solr.node') enabled at server: com.sun.jmx.mbeanserver.JmxMBeanServer@6a912039
   [junit4]   2> 1129137 INFO  (TEST-TestReplicationHandler.doTestStressReplication-seed#[B8FC675D5AB600A8]) [    ] o.a.s.m.r.SolrJmxReporter JMX monitoring for 'solr.jvm' (registry 'solr.jvm') enabled at server: com.sun.jmx.mbeanserver.JmxMBeanServer@6a912039
   [junit4]   2> 1129137 INFO  (TEST-TestReplicationHandler.doTestStressReplication-seed#[B8FC675D5AB600A8]) [    ] o.a.s.m.r.SolrJmxReporter JMX monitoring for 'solr.jetty' (registry 'solr.jetty') enabled at server: com.sun.jmx.mbeanserver.JmxMBeanServer@6a912039
   [junit4]   2> 1129140 INFO  (TEST-TestReplicationHandler.doTestStressReplication-seed#[B8FC675D5AB600A8]) [    ] o.a.s.c.CorePropertiesLocator Found 1 core definitions underneath /x1/jenkins/jenkins-slave/workspace/Lucene-Solr-NightlyTests-8.x/checkout/solr/build/solr-core/test/J2/temp/solr.handler.TestReplicationHandler_B8FC675D5AB600A8-001/solr-instance-002/.
   [junit4]   2> 1129140 INFO  (TEST-TestReplicationHandler.doTestStressReplication-seed#[B8FC675D5AB600A8]) [    ] o.a.s.c.CorePropertiesLocator Cores are: [collection1]
   [junit4]   2> 1129172 INFO  (coreLoadExecutor-10424-thread-1) [    x:collection1] o.a.s.c.SolrConfig Using Lucene MatchVersion: 8.2.0
   [junit4]   2> 1129183 INFO  (coreLoadExecutor-10424-thread-1) [    x:collection1] o.a.s.s.IndexSchema [collection1] Schema name=test
   [junit4]   2> 1129186 INFO  (coreLoadExecutor-10424-thread-1) [    x:collection1] o.a.s.s.IndexSchema Loaded schema test/1.2 with uniqueid field id
   [junit4]   2> 1129186 INFO  (coreLoadExecutor-10424-thread-1) [    x:collection1] o.a.s.c.CoreContainer Creating SolrCore 'collection1' using configuration from instancedir /x1/jenkins/jenkins-slave/workspace/Lucene-Solr-NightlyTests-8.x/checkout/solr/build/solr-core/test/J2/temp/solr.handler.TestReplicationHandler_B8FC675D5AB600A8-001/solr-instance-002/./collection1, trusted=true
   [junit4]   2> 1129187 INFO  (coreLoadExecutor-10424-thread-1) [    x:collection1] o.a.s.m.r.SolrJmxReporter JMX monitoring for 'solr.core.collection1' (registry 'solr.core.collection1') enabled at server: com.sun.jmx.mbeanserver.JmxMBeanServer@6a912039
   [junit4]   2> 1129187 INFO  (coreLoadExecutor-10424-thread-1) [    x:collection1] o.a.s.c.SolrCore [[collection1] ] Opening new SolrCore at [/x1/jenkins/jenkins-slave/workspace/Lucene-Solr-NightlyTests-8.x/checkout/solr/build/solr-core/test/J2/temp/solr.handler.TestReplicationHandler_B8FC675D5AB600A8-001/solr-instance-002/collection1], dataDir=[/x1/jenkins/jenkins-slave/workspace/Lucene-Solr-NightlyTests-8.x/checkout/solr/build/solr-core/test/J2/temp/solr.handler.TestReplicationHandler_B8FC675D5AB600A8-001/solr-instance-002/./collection1/data/]
   [junit4]   2> 1129189 INFO  (coreLoadExecutor-10424-thread-1) [    x:collection1] o.a.s.u.RandomMergePolicy RandomMergePolicy wrapping class org.apache.lucene.index.TieredMergePolicy: [TieredMergePolicy: maxMergeAtOnce=22, maxMergeAtOnceExplicit=16, maxMergedSegmentMB=90.5224609375, floorSegmentMB=1.072265625, forceMergeDeletesPctAllowed=12.286914741373936, segmentsPerTier=46.0, maxCFSSegmentSizeMB=8.796093022207999E12, noCFSRatio=0.31043636666225227, deletesPctAllowed=43.40622274257977
   [junit4]   2> 1129251 INFO  (coreLoadExecutor-10424-thread-1) [    x:collection1] o.a.s.u.CommitTracker Hard AutoCommit: disabled
   [junit4]   2> 1129251 INFO  (coreLoadExecutor-10424-thread-1) [    x:collection1] o.a.s.u.CommitTracker Soft AutoCommit: disabled
   [junit4]   2> 1129253 INFO  (coreLoadExecutor-10424-thread-1) [    x:collection1] o.a.s.u.RandomMergePolicy RandomMergePolicy wrapping class org.apache.lucene.index.AlcoholicMergePolicy: [AlcoholicMergePolicy: minMergeSize=0, mergeFactor=10, maxMergeSize=1292745118, maxMergeSizeForForcedMerge=9223372036854775807, calibrateSizeByDeletes=true, maxMergeDocs=2147483647, maxCFSSegmentSizeMB=8.796093022207999E12, noCFSRatio=0.1]
   [junit4]   2> 1129253 INFO  (coreLoadExecutor-10424-thread-1) [    x:collection1] o.a.s.s.SolrIndexSearcher Opening [Searcher@678035c0[collection1] main]
   [junit4]   2> 1129253 INFO  (coreLoadExecutor-10424-thread-1) [    x:collection1] o.a.s.r.ManagedResourceStorage File-based storage initialized to use dir: /x1/jenkins/jenkins-slave/workspace/Lucene-Solr-NightlyTests-8.x/checkout/solr/build/solr-core/test/J2/temp/solr.handler.TestReplicationHandler_B8FC675D5AB600A8-001/solr-instance-002/collection1/conf
   [junit4]   2> 1129254 INFO  (coreLoadExecutor-10424-thread-1) [    x:collection1] o.a.s.h.ReplicationHandler Commits will be reserved for 10000ms.
   [junit4]   2> 1129255 INFO  (searcherExecutor-10425-thread-1-processing-x:collection1) [    x:collection1] o.a.s.c.SolrCore [collection1] Registered new searcher Searcher@678035c0[collection1] main{ExitableDirectoryReader(UninvertingDirectoryReader())}
   [junit4]   2> 1129259 INFO  (TEST-TestReplicationHandler.doTestStressReplication-seed#[B8FC675D5AB600A8]) [    ] o.a.s.c.CoreContainer Shutting down CoreContainer instance=330405800
   [junit4]   2> 1129259 INFO  (coreCloseExecutor-10429-thread-1) [    x:collection1] o.a.s.c.SolrCore [collection1]  CLOSING SolrCore org.apache.solr.core.SolrCore@319c2bb
   [junit4]   2> 1129259 INFO  (coreCloseExecutor-10429-thread-1) [    x:collection1] o.a.s.m.SolrMetricManager Closing metric reporters for registry=solr.core.collection1, tag=319c2bb
   [junit4]   2> 1129259 INFO  (coreCloseExecutor-10429-thread-1) [    x:collection1] o.a.s.m.r.SolrJmxReporter Closing reporter [org.apache.solr.metrics.reporters.SolrJmxReporter@3eedd819: rootName = null, domain = solr.core.collection1, service url = null, agent id = null] for registry solr.core.collection1 / com.codahale.metrics.MetricRegistry@2b4117fe
   [junit4]   2> 1129278 INFO  (TEST-TestReplicationHandler.doTestStressReplication-seed#[B8FC675D5AB600A8]) [    ] o.a.s.m.SolrMetricManager Closing metric reporters for registry=solr.node, tag=null
   [junit4]   2> 1129279 INFO  (TEST-TestReplicationHandler.doTestStressReplication-seed#[B8FC675D5AB600A8]) [    ] o.a.s.m.r.SolrJmxReporter Closing reporter [org.apache.solr.metrics.reporters.SolrJmxReporter@638b541e: rootName = null, domain = solr.node, service url = null, agent id = null] for registry solr.node / com.codahale.metrics.MetricRegistry@231b8bfa
   [junit4]   2> 1129283 INFO  (TEST-TestReplicationHandler.doTestStressReplication-seed#[B8FC675D5AB600A8]) [    ] o.a.s.m.SolrMetricManager Closing metric reporters for registry=solr.jvm, tag=null
   [junit4]   2> 1129283 INFO  (TEST-TestReplicationHandler.doTestStressReplication-seed#[B8FC675D5AB600A8]) [    ] o.a.s.m.r.SolrJmxReporter Closing reporter [org.apache.solr.metrics.reporters.SolrJmxReporter@89ae49f: rootName = null, domain = solr.jvm, service url = null, agent id = null] for registry solr.jvm / com.codahale.metrics.MetricRegistry@4a353911
   [junit4]   2> 1129287 INFO  (TEST-TestReplicationHandler.doTestStressReplication-seed#[B8FC675D5AB600A8]) [    ] o.a.s.m.SolrMetricManager Closing metric reporters for registry=solr.jetty, tag=null
   [junit4]   2> 1129287 INFO  (TEST-TestReplicationHandler.doTestStressReplication-seed#[B8FC675D5AB600A8]) [    ] o.a.s.m.r.SolrJmxReporter Closing reporter [org.apache.solr.metrics.reporters.SolrJmxReporter@50f69482: rootName = null, domain = solr.jetty, service url = null, agent id = null] for registry solr.jetty / com.codahale.metrics.MetricRegistry@762a5c07
   [junit4]   2> 1129290 INFO  (TEST-TestReplicationHandler.doTestStressReplication-seed#[B8FC675D5AB600A8]) [    ] o.e.j.s.AbstractConnector Stopped ServerConnector@6d38f423{HTTP/1.1,[http/1.1, h2c]}{127.0.0.1:0}
   [junit4]   2> 1129290 INFO  (TEST-TestReplicationHandler.doTestStressReplication-seed#[B8FC675D5AB600A8]) [    ] o.e.j.s.h.ContextHandler Stopped o.e.j.s.ServletContextHandler@41bfdc93{/solr,null,UNAVAILABLE}
   [junit4]   2> 1129290 INFO  (TEST-TestReplicationHandler.doTestStressReplication-seed#[B8FC675D5AB600A8]) [    ] o.e.j.s.session node0 Stopped scavenging
   [junit4]   2> 1129291 WARN  (TEST-TestReplicationHandler.doTestStressReplication-seed#[B8FC675D5AB600A8]) [    ] o.e.j.s.AbstractConnector Ignoring deprecated socket close linger time
   [junit4]   2> 1129292 INFO  (TEST-TestReplicationHandler.doTestStressReplication-seed#[B8FC675D5AB600A8]) [    ] o.a.s.c.s.e.JettySolrRunner Start Jetty (original configured port=0)
   [junit4]   2> 1129292 INFO  (TEST-TestReplicationHandler.doTestStressReplication-seed#[B8FC675D5AB600A8]) [    ] o.a.s.c.s.e.JettySolrRunner Trying to start Jetty on port 0 try number 1 ...
   [junit4]   2> 1129292 INFO  (TEST-TestReplicationHandler.doTestStressReplication-seed#[B8FC675D5AB600A8]) [    ] o.e.j.s.Server jetty-9.4.14.v20181114; built: 2018-11-14T21:20:31.478Z; git: c4550056e785fb5665914545889f21dc136ad9e6; jvm 1.8.0_191-b12
   [junit4]   2> 1129294 INFO  (TEST-TestReplicationHandler.doTestStressReplication-seed#[B8FC675D5AB600A8]) [    ] o.e.j.s.session DefaultSessionIdManager workerName=node0
   [junit4]   2> 1129294 INFO  (TEST-TestReplicationHandler.doTestStressReplication-seed#[B8FC675D5AB600A8]) [    ] o.e.j.s.session No SessionScavenger set, using defaults
   [junit4]   2> 1129294 INFO  (TEST-TestReplicationHandler.doTestStressReplication-seed#[B8FC675D5AB600A8]) [    ] o.e.j.s.session node0 Scavenging every 600000ms
   [junit4]   2> 1129295 INFO  (TEST-TestReplicationHandler.doTestStressReplication-seed#[B8FC675D5AB600A8]) [    ] o.e.j.s.h.ContextHandler Started o.e.j.s.ServletContextHandler@4aa87b0b{/solr,null,AVAILABLE}
   [junit4]   2> 1129295 INFO  (TEST-TestReplicationHandler.doTestStressReplication-seed#[B8FC675D5AB600A8]) [    ] o.e.j.s.AbstractConnector Started ServerConnector@3a404f7e{HTTP/1.1,[http/1.1, h2c]}{127.0.0.1:35210}
   [junit4]   2> 1129295 INFO  (TEST-TestReplicationHandler.doTestStressReplication-seed#[B8FC675D5AB600A8]) [    ] o.e.j.s.Server Started @1129371ms
   [junit4]   2> 1129295 INFO  (TEST-TestReplicationHandler.doTestStressReplication-seed#[B8FC675D5AB600A8]) [    ] o.a.s.c.s.e.JettySolrRunner Jetty properties: {solr.data.dir=/x1/jenkins/jenkins-slave/workspace/Lucene-Solr-NightlyTests-8.x/checkout/solr/build/solr-core/test/J2/temp/solr.handler.TestReplicationHandler_B8FC675D5AB600A8-001/solr-instance-001/collection1/data, hostContext=/solr, hostPort=35210}
   [junit4]   2> 1129295 ERROR (TEST-TestReplicationHandler.doTestStressReplication-seed#[B8FC675D5AB600A8]) [    ] o.a.s.u.StartupLoggingUtils Missing Java Option solr.log.dir. Logging may be missing or incomplete.
   [junit4]   2> 1129295 INFO  (TEST-TestReplicationHandler.doTestStressReplication-seed#[B8FC675D5AB600A8]) [    ] o.a.s.s.SolrDispatchFilter Using logger factory org.apache.logging.slf4j.Log4jLoggerFactory
   [junit4]   2> 1129296 INFO  (TEST-TestReplicationHandler.doTestStressReplication-seed#[B8FC675D5AB600A8]) [    ] o.a.s.s.SolrDispatchFilter  ___      _       Welcome to Apache Solr? version 8.2.0
   [junit4]   2> 1129296 INFO  (TEST-TestReplicationHandler.doTestStressReplication-seed#[B8FC675D5AB600A8]) [    ] o.a.s.s.SolrDispatchFilter / __| ___| |_ _   Starting in standalone mode on port null
   [junit4]   2> 1129296 INFO  (TEST-TestReplicationHandler.doTestStressReplication-seed#[B8FC675D5AB600A8]) [    ] o.a.s.s.SolrDispatchFilter \__ \/ _ \ | '_|  Install dir: null
   [junit4]   2> 1129296 INFO  (TEST-TestReplicationHandler.doTestStressReplication-seed#[B8FC675D5AB600A8]) [    ] o.a.s.s.SolrDispatchFilter |___/\___/_|_|    Start time: 2019-05-06T15:00:02.287Z
   [junit4]   2> 1129296 INFO  (TEST-TestReplicationHandler.doTestStressReplication-seed#[B8FC675D5AB600A8]) [    ] o.a.s.c.SolrXmlConfig Loading container configuration from /x1/jenkins/jenkins-slave/workspace/Lucene-Solr-NightlyTests-8.x/checkout/solr/build/solr-core/test/J2/temp/solr.handler.TestReplicationHandler_B8FC675D5AB600A8-001/solr-instance-001/solr.xml
   [junit4]   2> 1129302 INFO  (TEST-TestReplicationHandler.doTestStressReplication-seed#[B8FC675D5AB600A8]) [    ] o.a.s.c.SolrXmlConfig Configuration parameter autoReplicaFailoverWorkLoopDelay is ignored
   [junit4]   2> 1129302 INFO  (TEST-TestReplicationHandler.doTestStressReplication-seed#[B8FC675D5AB600A8]) [    ] o.a.s.c.SolrXmlConfig Configuration parameter autoReplicaFailoverBadNodeExpiration is ignored
   [junit4]   2> 1129304 INFO  (TEST-TestReplicationHandler.doTestStressReplication-seed#[B8FC675D5AB600A8]) [    ] o.a.s.c.SolrXmlConfig MBean server found: com.sun.jmx.mbeanserver.JmxMBeanServer@6a912039, but no JMX reporters were configured - adding default JMX reporter.
   [junit4]   2> 1129383 INFO  (TEST-TestReplicationHandler.doTestStressReplication-seed#[B8FC675D5AB600A8]) [    ] o.a.s.h.c.HttpShardHandlerFactory Host whitelist initialized: WhitelistHostChecker [whitelistHosts=null, whitelistHostCheckingEnabled=true]
   [junit4]   2> 1129390 WARN  (TEST-TestReplicationHandler.doTestStressReplication-seed#[B8FC675D5AB600A8]) [    ] o.e.j.u.s.S.config No Client EndPointIdentificationAlgorithm configured for SslContextFactory@11356fb9[provider=null,keyStore=null,trustStore=null]
   [junit4]   2> 1129397 WARN  (TEST-TestReplicationHandler.doTestStressReplication-seed#[B8FC675D5AB600A8]) [    ] o.e.j.u.s.S.config No Client EndPointIdentificationAlgorithm configured for SslContextFactory@2a58a2c1[provider=null,keyStore=null,trustStore=null]
   [junit4]   2> 1129459 INFO  (TEST-TestReplicationHandler.doTestStressReplication-seed#[B8FC675D5AB600A8]) [    ] o.a.s.c.TransientSolrCoreCacheDefault Allocating transient cache for 4 transient cores
   [junit4]   2> 1129459 INFO  (TEST-TestReplicationHandler.doTestStressReplication-seed#[B8FC675D5AB600A8]) [    ] o.a.s.h.a.MetricsHistoryHandler No .system collection, keeping metrics history in memory.
   [junit4]   2> 1129494 INFO  (TEST-TestReplicationHandler.doTestStressReplication-seed#[B8FC675D5AB600A8]) [    ] o.a.s.m.r.SolrJmxReporter JMX monitoring for 'solr.node' (registry 'solr.node') enabled at server: com.sun.jmx.mbeanserver.JmxMBeanServer@6a912039
   [junit4]   2> 1129518 INFO  (TEST-TestReplicationHandler.doTestStressReplication-seed#[B8FC675D5AB600A8]) [    ] o.a.s.m.r.SolrJmxReporter JMX monitoring for 'solr.jvm' (registry 'solr.jvm') enabled at server: com.sun.jmx.mbeanserver.JmxMBeanServer@6a912039
   [junit4]   2> 1129518 INFO  (TEST-TestReplicationHandler.doTestStressReplication-seed#[B8FC675D5AB600A8]) [    ] o.a.s.m.r.SolrJmxReporter JMX monitoring for 'solr.jetty' (registry 'solr.jetty') enabled at server: com.sun.jmx.mbeanserver.JmxMBeanServer@6a912039
   [junit4]   2> 1129522 INFO  (TEST-TestReplicationHandler.doTestStressReplication-seed#[B8FC675D5AB600A8]) [    ] o.a.s.c.CorePropertiesLocator Found 1 core definitions underneath /x1/jenkins/jenkins-slave/workspace/Lucene-Solr-NightlyTests-8.x/checkout/solr/build/solr-core/test/J2/temp/solr.handler.TestReplicationHandler_B8FC675D5AB600A8-001/solr-instance-001/.
   [junit4]   2> 1129522 INFO  (TEST-TestReplicationHandler.doTestStressReplication-seed#[B8FC675D5AB600A8]) [    ] o.a.s.c.CorePropertiesLocator Cores are: [collection1]
   [junit4]   2> 1129535 INFO  (coreLoadExecutor-10439-thread-1) [    x:collection1] o.a.s.c.SolrConfig Using Lucene MatchVersion: 8.2.0
   [junit4]   2> 1129547 INFO  (coreLoadExecutor-10439-thread-1) [    x:collection1] o.a.s.s.IndexSchema [collection1] Schema name=test
   [junit4]   2> 1129549 INFO  (coreLoadExecutor-10439-thread-1) [    x:collection1] o.a.s.s.IndexSchema Loaded schema test/1.2 with uniqueid field id
   [junit4]   2> 1129549 INFO  (coreLoadExecutor-10439-thread-1) [    x:collection1] o.a.s.c.CoreContainer Creating SolrCore 'collection1' using configuration from instancedir /x1/jenkins/jenkins-slave/workspace/Lucene-Solr-NightlyTests-8.x/checkout/solr/build/solr-core/test/J2/temp/solr.handler.TestReplicationHandler_B8FC675D5AB600A8-001/solr-instance-001/./collection1, trusted=true
   [junit4]   2> 1129550 INFO  (coreLoadExecutor-10439-thread-1) [    x:collection1] o.a.s.m.r.SolrJmxReporter JMX monitoring for 'solr.core.collection1' (registry 'solr.core.collection1') enabled at server: com.sun.jmx.mbeanserver.JmxMBeanServer@6a912039
   [junit4]   2> 1129550 INFO  (coreLoadExecutor-10439-thread-1) [    x:collection1] o.a.s.c.SolrCore [[collection1] ] Opening new SolrCore at [/x1/jenkins/jenkins-slave/workspace/Lucene-Solr-NightlyTests-8.x/checkout/solr/build/solr-core/test/J2/temp/solr.handler.TestReplicationHandler_B8FC675D5AB600A8-001/solr-instance-001/collection1], dataDir=[/x1/jenkins/jenkins-slave/workspace/Lucene-Solr-NightlyTests-8.x/checkout/solr/build/solr-core/test/J2/temp/solr.handler.TestReplicationHandler_B8FC675D5AB600A8-001/solr-instance-001/./collection1/data/]
   [junit4]   2> 1129552 INFO  (coreLoadExecutor-10439-thread-1) [    x:collection1] o.a.s.u.RandomMergePolicy RandomMergePolicy wrapping class org.apache.lucene.index.TieredMergePolicy: [TieredMergePolicy: maxMergeAtOnce=22, maxMergeAtOnceExplicit=16, maxMergedSegmentMB=90.5224609375, floorSegmentMB=1.072265625, forceMergeDeletesPctAllowed=12.286914741373936, segmentsPerTier=46.0, maxCFSSegmentSizeMB=8.796093022207999E12, noCFSRatio=0.31043636666225227, deletesPctAllowed=43.40622274257977
   [junit4]   2> 1129624 INFO  (coreLoadExecutor-10439-thread-1) [    x:collection1] o.a.s.u.CommitTracker Hard AutoCommit: disabled
   [junit4]   2> 1129625 INFO  (coreLoadExecutor-10439-thread-1) [    x:collection1] o.a.s.u.CommitTracker Soft AutoCommit: disabled
   [junit4]   2> 1129626 INFO  (coreLoadExecutor-10439-thread-1) [    x:collection1] o.a.s.u.RandomMergePolicy RandomMergePolicy wrapping class org.apache.lucene.index.AlcoholicMergePolicy: [AlcoholicMergePolicy: minMergeSize=0, mergeFactor=10, maxMergeSize=1292745118, maxMergeSizeForForcedMerge=9223372036854775807, calibrateSizeByDeletes=true, maxMergeDocs=2147483647, maxCFSSegmentSizeMB=8.796093022207999E12, noCFSRatio=0.1]
   [junit4]   2> 1129626 INFO  (coreLoadExecutor-10439-thread-1) [    x:collection1] o.a.s.s.SolrIndexSearcher Opening [Searcher@61c1a15b[collection1] main]
   [junit4]   2> 1129627 INFO  (coreLoadExecutor-10439-thread-1) [    x:collection1] o.a.s.r.ManagedResourceStorage File-based storage initialized to use dir: /x1/jenkins/jenkins-slave/workspace/Lucene-Solr-NightlyTests-8.x/checkout/solr/build/solr-core/test/J2/temp/solr.handler.TestReplicationHandler_B8FC675D5AB600A8-001/solr-instance-001/collection1/conf
   [junit4]   2> 1129627 INFO  (coreLoadExecutor-10439-thread-1) [    x:collection1] o.a.s.h.ReplicationHandler Replication enabled for following config files: schema.xml
   [junit4]   2> 1129628 INFO  (coreLoadExecutor-10439-thread-1) [    x:collection1] o.a.s.h.ReplicationHandler Commits will be reserved for 10000ms.
   [junit4]   2> 1129629 INFO  (searcherExecutor-10440-thread-1-processing-x:collection1) [    x:collection1] o.a.s.c.SolrCore [collection1] Registered new searcher Searcher@61c1a15b[collection1] main{ExitableDirectoryReader(UninvertingDirectoryReader())}
   [junit4]   2> 1129632 INFO  (qtp409859053-128201) [    x:collection1] o.a.s.u.DirectUpdateHandler2 [collection1] REMOVING ALL DOCUMENTS FROM INDEX
   [junit4]   2> 1129633 INFO  (qtp409859053-128201) [    x:collection1] o.a.s.u.p.LogUpdateProcessorFactory [collection1]  webapp=/solr path=/update params={wt=javabin&version=2}{deleteByQuery=*:*} 0 1
   [junit4]   2> 1129635 INFO  (qtp1168920897-128175) [    x:collection1] o.a.s.u.DirectUpdateHandler2 [collection1] REMOVING ALL DOCUMENTS FROM INDEX
   [junit4]   2> 1129636 INFO  (qtp1168920897-128175) [    x:collection1] o.a.s.u.p.LogUpdateProcessorFactory [collection1]  webapp=/solr path=/update params={wt=javabin&version=2}{deleteByQuery=*:*} 0 1
   [junit4]   2> 1129637 INFO  (qtp1168920897-128176) [    x:collection1] o.a.s.u.DirectUpdateHandler2 start commit{,optimize=false,openSearcher=true,waitSearcher=true,expungeDeletes=false,softCommit=false,prepareCommit=false}
   [junit4]   2> 1129637 INFO  (qtp1168920897-128176) [    x:collection1] o.a.s.u.SolrIndexWriter Calling setCommitData with IW:org.apache.solr.update.SolrIndexWriter@79a68e84 commitCommandVersion:0
   [junit4]   2> 1129639 INFO  (qtp1168920897-128176) [    x:collection1] o.a.s.s.SolrIndexSearcher Opening [Searcher@365c75fb[collection1] main]
   [junit4]   2> 1129639 INFO  (qtp1168920897-128176) [    x:collection1] o.a.s.u.DirectUpdateHandler2 end_commit_flush
   [junit4]   2> 1129641 INFO  (searcherExecutor-10425-thread-1-processing-x:collection1) [    x:collection1] o.a.s.c.SolrCore [collection1] Registered new searcher Searcher@365c75fb[collection1] main{ExitableDirectoryReader(UninvertingDirectoryReader())}
   [junit4]   2> 1129641 INFO  (qtp1168920897-128176) [    x:collection1] o.a.s.u.p.LogUpdateProcessorFactory [collection1]  webapp=/solr path=/update params={waitSearcher=true&commit=true&softCommit=false&wt=javabin&version=2}{commit=} 0 4
   [junit4]   2> 1129645 INFO  (qtp409859053-128202) [    x:collection1] o.a.s.u.p.LogUpdateProcessorFactory [collection1]  webapp=/solr path=/update params={wt=javabin&version=2}{add=[0]} 0 1
   [junit4]   2> 1129646 INFO  (qtp409859053-128203) [    x:collection1] o.a.s.u.p.LogUpdateProcessorFactory [collection1]  webapp=/solr path=/update params={wt=javabin&version=2}{add=[1]} 0 0
   [junit4]   2> 1129647 INFO  (qtp409859053-128204) [    x:collection1] o.a.s.u.p.LogUpdateProcessorFactory [collection1]  webapp=/solr path=/update params={wt=javabin&version=2}{add=[2]} 0 0
   [junit4]   2> 1129647 INFO  (qtp409859053-128200) [    x:collection1] o.a.s.u.p.LogUpdateProcessorFactory [collection1]  webapp=/solr path=/update params={wt=javabin&version=2}{add=[3]} 0 0
   [junit4]   2> 1129648 INFO  (qtp409859053-128201) [    x:collection1] o.a.s.u.p.LogUpdateProcessorFactory [collection1]  webapp=/solr path=/update params={wt=javabin&version=2}{add=[4]} 0 0
   [junit4]   2> 1129649 INFO  (qtp409859053-128202) [    x:collection1] o.a.s.u.p.LogUpdateProcessorFactory [collection1]  webapp=/solr path=/update params={wt=javabin&version=2}{add=[5]} 0 0
   [junit4]   2> 1129649 INFO  (qtp409859053-128203) [    x:collection1] o.a.s.u.p.LogUpdateProcessorFactory [collection1]  webapp=/solr path=/update params={wt=javabin&version=2}{add=[6]} 0 0
   [junit4]   2> 1129653 INFO  (qtp409859053-128204) [    x:collection1] o.a.s.u.p.LogUpdateProcessorFactory [collection1]  webapp=/solr path=/update params={wt=javabin&version=2}{add=[7]} 0 0
   [junit4]   2> 1129654 INFO  (qtp409859053-128200) [    x:collection1] o.a.s.u.p.LogUpdateProcessorFactory [collection1]  webapp=/solr path=/update params={wt=javabin&version=2}{add=[8]} 0 0
   [junit4]   2> 1129654 INFO  (qtp409859053-128201) [    x:collection1] o.a.s.u.p.LogUpdateProcessorFactory [collection1]  webapp=/solr path=/update params={wt=javabin&version=2}{add=[9]} 0 0
   [junit4]   2> 1129655 INFO  (qtp409859053-128202) [    x:collection1] o.a.s.u.p.LogUpdateProcessorFactory [collection1]  webapp=/solr path=/update params={wt=javabin&version=2}{add=[10]} 0 0
   [junit4]   2> 1129655 INFO  (qtp409859053-128203) [    x:collection1] o.a.s.u.p.LogUpdateProcessorFactory [collection1]  webapp=/solr path=/update params={wt=javabin&version=2}{add=[11]} 0 0
   [junit4]   2> 1129656 INFO  (qtp409859053-128204) [    x:collection1] o.a.s.u.p.LogUpdateProcessorFactory [collection1]  webapp=/solr path=/update params={wt=javabin&version=2}{add=[12]} 0 0
   [junit4]   2> 1129656 INFO  (qtp409859053-128200) [    x:collection1] o.a.s.u.p.LogUpdateProcessorFactory [collection1]  webapp=/solr path=/update params={wt=javabin&version=2}{add=[13]} 0 0
   [junit4]   2> 1129657 INFO  (qtp409859053-128201) [    x:collection1] o.a.s.u.p.LogUpdateProcessorFactory [collection1]  webapp=/solr path=/update params={wt=javabin&version=2}{add=[14]} 0 0
   [junit4]   2> 1129658 INFO  (qtp409859053-128202) [    x:collection1] o.a.s.u.p.LogUpdateProcessorFactory [collection1]  webapp=/solr path=/update params={wt=javabin&version=2}{add=[15]} 0 0
   [junit4]   2> 1129658 INFO  (qtp409859053-128203) [    x:collection1] o.a.s.u.p.LogUpdateProcessorFactory [collection1]  webapp=/solr path=/update params={wt=javabin&version=2}{add=[16]} 0 0
   [junit4]   2> 1129659 INFO  (qtp409859053-128204) [    x:collection1] o.a.s.u.p.LogUpdateProcessorFactory [collection1]  webapp=/solr path=/update params={wt=javabin&version=2}{add=[17]} 0 0
   [junit4]   2> 1129659 INFO  (qtp409859053-128200) [    x:collection1] o.a.s.u.p.LogUpdateProcessorFactory [collection1]  webapp=/solr path=/update params={wt=javabin&version=2}{add=[18]} 0 0
   [junit4]   2> 1129660 INFO  (qtp409859053-128201) [    x:collection1] o.a.s.u.p.LogUpdateProcessorFactory [collection1]  webapp=/solr path=/update params={wt=javabin&version=2}{add=[19]} 0 0
   [junit4]   2> 1129660 INFO  (qtp409859053-128202) [    x:collection1] o.a.s.u.p.LogUpdateProcessorFactory [collection1]  webapp=/solr path=/update params={wt=javabin&version=2}{add=[20]} 0 0
   [junit4]   2> 1129661 INFO  (qtp409859053-128203) [    x:collection1] o.a.s.u.p.LogUpdateProcessorFactory [collection1]  webapp=/solr path=/update params={wt=javabin&version=2}{add=[21]} 0 0
   [junit4]   2> 1129661 INFO  (qtp409859053-128204) [    x:collection1] o.a.s.u.p.LogUpdateProcessorFactory [collection1]  webapp=/solr path=/update params={wt=javabin&version=2}{add=[22]} 0 0
   [junit4]   2> 1129662 INFO  (qtp409859053-128200) [    x:collection1] o.a.s.u.p.LogUpdateProcessorFactory [collection1]  webapp=/solr path=/update params={wt=javabin&version=2}{add=[23]} 0 0
   [junit4]   2> 1129662 INFO  (qtp409859053-128201) [    x:collection1] o.a.s.u.p.LogUpdateProcessorFactory [collection1]  webapp=/solr path=/update params={wt=javabin&version=2}{add=[24]} 0 0
   [junit4]   2> 1129663 INFO  (qtp409859053-128202) [    x:collection1] o.a.s.u.p.LogUpdateProcessorFactory [collection1]  webapp=/solr path=/update params={wt=javabin&version=2}{add=[25]} 0 0
   [junit4]   2> 1129663 INFO  (qtp409859053-128203) [    x:collection1] o.a.s.u.p.LogUpdateProcessorFactory [collection1]  webapp=/solr path=/update params={wt=javabin&version=2}{add=[26]} 0 0
   [junit4]   2> 1129664 INFO  (qtp409859053-128204) [    x:collection1] o.a.s.u.p.LogUpdateProcessorFactory [collection1]  webapp=/solr path=/update params={wt=javabin&version=2}{add=[27]} 0 0
   [junit4]   2> 1129664 INFO  (qtp409859053-128200) [    x:collection1] o.a.s.u.p.LogUpdateProcessorFactory [collection1]  webapp=/solr path=/update params={wt=javabin&version=2}{add=[28]} 0 0
   [junit4]   2> 1129665 INFO  (qtp409859053-128201) [    x:collection1] o.a.s.u.p.LogUpdateProcessorFactory [collection1]  webapp=/solr path=/update params={wt=javabin&version=2}{add=[29]} 0 0
   [junit4]   2> 1129665 INFO  (qtp409859053-128202) [    x:collection1] o.a.s.u.p.LogUpdateProcessorFactory [collection1]  webapp=/solr path=/update params={wt=javabin&version=2}{add=[30]} 0 0
   [junit4]   2> 1129666 INFO  (qtp409859053-128203) [    x:collection1] o.a.s.u.p.LogUpdateProcessorFactory [collection1]  webapp=/solr path=/update params={wt=javabin&version=2}{add=[31]} 0 0
   [junit4]   2> 1129666 INFO  (qtp409859053-128204) [    x:collection1] o.a.s.u.p.LogUpdateProcessorFactory [collection1]  webapp=/solr path=/update params={wt=javabin&version=2}{add=[32]} 0 0
   [junit4]   2> 1129667 INFO  (qtp409859053-128200) [    x:collection1] o.a.s.u.p.LogUpdateProcessorFactory [collection1]  webapp=/solr path=/update params={wt=javabin&version=2}{add=[33]} 0 0
   [junit4]   2> 1129667 INFO  (qtp409859053-128201) [    x:collection1] o.a.s.u.p.LogUpdateProcessorFactory [collection1]  webapp=/solr path=/update params={wt=javabin&version=2}{add=[34]} 0 0
   [junit4]   2> 1129669 INFO  (qtp409859053-128202) [    x:collection1] o.a.s.u.p.LogUpdateProcessorFactory [collection1]  webapp=/solr path=/update params={wt=javabin&version=2}{add=[35]} 0 0
   [junit4]   2> 1129669 INFO  (qtp409859053-128203) [    x:collection1] o.a.s.u.p.LogUpdateProcessorFactory [collection1]  webapp=/solr path=/update params={wt=javabin&version=2}{add=[36]} 0 0
   [junit4]   2> 1129670 INFO  (qtp409859053-128204) [    x:collection1] o.a.s.u.p.LogUpdateProcessorFactory [collection1]  webapp=/solr path=/update params={wt=javabin&version=2}{add=[37]} 0 0
   [junit4]   2> 1129670 INFO  (qtp409859053-128200) [    x:collection1] o.a.s.u.p.LogUpdateProcessorFactory [collection1]  webapp=/solr path=/update params={wt=javabin&version=2}{add=[38]} 0 0
   [junit4]   2> 1129671 INFO  (qtp409859053-128201) [    x:collection1] o.a.s.u.p.LogUpdateProcessorFactory [collection1]  webapp=/solr path=/update params={wt=javabin&version=2}{add=[39]} 0 0
   [junit4]   2> 1129671 INFO  (qtp409859053-128202) [    x:collection1] o.a.s.u.p.LogUpdateProcessorFactory [collection1]  webapp=/solr path=/update params={wt=javabin&version=2}{add=[40]} 0 0
   [junit4]   2> 1129672 INFO  (qtp409859053-128203) [    x:collection1] o.a.s.u.p.LogUpdateProcessorFactory [collection1]  webapp=/solr path=/update params={wt=javabin&version=2}{add=[41]} 0 0
   [junit4]   2> 1129672 INFO  (qtp409859053-128204) [    x:collection1] o.a.s.u.p.LogUpdateProcessorFactory [collection1]  webapp=/solr path=/update params={wt=javabin&version=2}{add=[42]} 0 0
   [junit4]   2> 1129673 INFO  (qtp409859053-128200) [    x:collection1] o.a.s.u.p.LogUpdateProcessorFactory [collection1]  webapp=/solr path=/update params={wt=javabin&version=2}{add=[43]} 0 0
   [junit4]   2> 1129673 INFO  (qtp409859053-128201) [    x:collection1] o.a.s.u.p.LogUpdateProcessorFactory [collection1]  webapp=/solr path=/update params={wt=javabin&version=2}{add=[44]} 0 0
   [junit4]   2> 1129674 INFO  (qtp409859053-128202) [    x:collection1] o.a.s.u.p.LogUpdateProcessorFactory [collection1]  webapp=/solr path=/update params={wt=javabin&version=2}{add=[45]} 0 0
   [junit4]   2> 1129674 INFO  (qtp409859053-128203) [    x:collection1] o.a.s.u.p.LogUpdateProcessorFactory [collection1]  webapp=/solr path=/update params={wt=javabin&version=2}{add=[46]} 0 0
   [junit4]   2> 1129675 INFO  (qtp409859053-128204) [    x:collection1] o.a.s.u.p.LogUpdateProcessorFactory [collection1]  webapp=/solr path=/update params={wt=javabin&version=2}{add=[47]} 0 0
   [junit4]   2> 1129675 INFO  (qtp409859053-128200) [    x:collection1] o.a.s.u.p.LogUpdateProcessorFactory [collection1]  webapp=/solr path=/update params={wt=javabin&version=2}{add=[48]} 0 0
   [junit4]   2> 1129676 INFO  (qtp409859053-128201) [    x:collection1] o.a.s.u.p.LogUpdateProcessorFactory [collection1]  webapp=/solr path=/update params={wt=javabin&version=2}{add=[49]} 0 0
   [junit4]   2> 1129676 INFO  (qtp409859053-128202) [    x:collection1] o.a.s.u.p.LogUpdateProcessorFactory [collection1]  webapp=/solr path=/update params={wt=javabin&version=2}{add=[50]} 0 0
   [junit4]   2> 1129677 INFO  (qtp409859053-128203) [    x:collection1] o.a.s.u.p.LogUpdateProcessorFactory [collection1]  webapp=/solr path=/update params={wt=javabin&version=2}{add=[51]} 0 0
   [junit4]   2> 1129677 INFO  (qtp409859053-128204) [    x:collection1] o.a.s.u.p.LogUpdateProcessorFactory [collection1]  webapp=/solr path=/update params={wt=javabin&version=2}{add=[52]} 0 0
   [junit4]   2> 1129678 INFO  (qtp409859053-128200) [    x:collection1] o.a.s.u.p.LogUpdateProcessorFactory [collection1]  webapp=/solr path=/update params={wt=javabin&version=2}{add=[53]} 0 0
   [junit4]   2> 1129679 INFO  (qtp409859053-128201) [    x:collection1] o.a.s.u.p.LogUpdateProcessorFactory [collection1]  webapp=/solr path=/update params={wt=javabin&version=2}{add=[54]} 0 0
   [junit4]   2> 1129681 INFO  (qtp409859053-128202) [    x:collection1] o.a.s.u.p.LogUpdateProcessorFactory [collection1]  webapp=/solr path=/update params={wt=javabin&version=2}{add=[55]} 0 0
   [junit4]   2> 1129681 INFO  (qtp409859053-128203) [    x:collection1] o.a.s.u.p.LogUpdateProcessorFactory [collection1]  webapp=/solr path=/update params={wt=javabin&version=2}{add=[56]} 0 0
   [junit4]   2> 1129682 INFO  (qtp409859053-128204) [    x:collection1] o.a.s.u.p.LogUpdateProcessorFactory [collection1]  webapp=/solr path=/update params={wt=javabin&version=2}{add=[57]} 0 0
   [junit4]   2> 1129682 INFO  (qtp409859053-128200) [    x:collection1] o.a.s.u.p.LogUpdateProcessorFactory [collection1]  webapp=/solr path=/update params={wt=javabin&version=2}{add=[58]} 0 0
   [junit4]   2> 1129683 INFO  (qtp409859053-128201) [    x:collection1] o.a.s.u.p.LogUpdateProcessorFactory [collection1]  webapp=/solr path=/update params={wt=javabin&version=2}{add=[59]} 0 0
   [junit4]   2> 1129683 INFO  (qtp409859053-128202) [    x:collection1] o.a.s.u.p.LogUpdateProcessorFactory [colle

[...truncated too long message...]

ivy-fail-disallowed-ivy-version:

ivy-fail:

ivy-fail:

ivy-configure:
[ivy:configure] :: loading settings :: file = /x1/jenkins/jenkins-slave/workspace/Lucene-Solr-NightlyTests-8.x/checkout/lucene/top-level-ivy-settings.xml

resolve:

ivy-availability-check:
[loadresource] Do not set property disallowed.ivy.jars.list as its length is 0.

-ivy-fail-disallowed-ivy-version:

ivy-fail:

ivy-configure:
[ivy:configure] :: loading settings :: file = /x1/jenkins/jenkins-slave/workspace/Lucene-Solr-NightlyTests-8.x/checkout/lucene/top-level-ivy-settings.xml

resolve:

ivy-availability-check:
[loadresource] Do not set property disallowed.ivy.jars.list as its length is 0.

-ivy-fail-disallowed-ivy-version:

ivy-fail:

ivy-fail:

ivy-configure:
[ivy:configure] :: loading settings :: file = /x1/jenkins/jenkins-slave/workspace/Lucene-Solr-NightlyTests-8.x/checkout/lucene/top-level-ivy-settings.xml

resolve:

ivy-availability-check:
[loadresource] Do not set property disallowed.ivy.jars.list as its length is 0.

-ivy-fail-disallowed-ivy-version:

ivy-fail:

ivy-configure:
[ivy:configure] :: loading settings :: file = /x1/jenkins/jenkins-slave/workspace/Lucene-Solr-NightlyTests-8.x/checkout/lucene/top-level-ivy-settings.xml

resolve:

ivy-availability-check:
[loadresource] Do not set property disallowed.ivy.jars.list as its length is 0.

-ivy-fail-disallowed-ivy-version:

ivy-fail:

ivy-fail:

ivy-configure:
[ivy:configure] :: loading settings :: file = /x1/jenkins/jenkins-slave/workspace/Lucene-Solr-NightlyTests-8.x/checkout/lucene/top-level-ivy-settings.xml

resolve:

ivy-availability-check:
[loadresource] Do not set property disallowed.ivy.jars.list as its length is 0.

-ivy-fail-disallowed-ivy-version:

ivy-fail:

ivy-fail:

ivy-configure:
[ivy:configure] :: loading settings :: file = /x1/jenkins/jenkins-slave/workspace/Lucene-Solr-NightlyTests-8.x/checkout/lucene/top-level-ivy-settings.xml

resolve:

ivy-availability-check:
[loadresource] Do not set property disallowed.ivy.jars.list as its length is 0.

-ivy-fail-disallowed-ivy-version:

ivy-fail:

ivy-fail:

ivy-configure:
[ivy:configure] :: loading settings :: file = /x1/jenkins/jenkins-slave/workspace/Lucene-Solr-NightlyTests-8.x/checkout/lucene/top-level-ivy-settings.xml

resolve:

ivy-availability-check:
[loadresource] Do not set property disallowed.ivy.jars.list as its length is 0.

-ivy-fail-disallowed-ivy-version:

ivy-fail:

ivy-fail:

ivy-configure:
[ivy:configure] :: loading settings :: file = /x1/jenkins/jenkins-slave/workspace/Lucene-Solr-NightlyTests-8.x/checkout/lucene/top-level-ivy-settings.xml

resolve:

ivy-availability-check:
[loadresource] Do not set property disallowed.ivy.jars.list as its length is 0.

-ivy-fail-disallowed-ivy-version:

ivy-fail:

ivy-fail:

ivy-configure:
[ivy:configure] :: loading settings :: file = /x1/jenkins/jenkins-slave/workspace/Lucene-Solr-NightlyTests-8.x/checkout/lucene/top-level-ivy-settings.xml

resolve:

ivy-availability-check:
[loadresource] Do not set property disallowed.ivy.jars.list as its length is 0.

-ivy-fail-disallowed-ivy-version:

ivy-fail:

ivy-fail:

ivy-configure:
[ivy:configure] :: loading settings :: file = /x1/jenkins/jenkins-slave/workspace/Lucene-Solr-NightlyTests-8.x/checkout/lucene/top-level-ivy-settings.xml

resolve:

ivy-availability-check:
[loadresource] Do not set property disallowed.ivy.jars.list as its length is 0.

-ivy-fail-disallowed-ivy-version:

ivy-fail:

ivy-fail:

ivy-configure:
[ivy:configure] :: loading settings :: file = /x1/jenkins/jenkins-slave/workspace/Lucene-Solr-NightlyTests-8.x/checkout/lucene/top-level-ivy-settings.xml

resolve:

ivy-availability-check:
[loadresource] Do not set property disallowed.ivy.jars.list as its length is 0.

-ivy-fail-disallowed-ivy-version:

ivy-fail:

ivy-fail:

ivy-configure:
[ivy:configure] :: loading settings :: file = /x1/jenkins/jenkins-slave/workspace/Lucene-Solr-NightlyTests-8.x/checkout/lucene/top-level-ivy-settings.xml

resolve:

ivy-availability-check:
[loadresource] Do not set property disallowed.ivy.jars.list as its length is 0.

-ivy-fail-disallowed-ivy-version:

ivy-fail:

ivy-fail:

ivy-configure:
[ivy:configure] :: loading settings :: file = /x1/jenkins/jenkins-slave/workspace/Lucene-Solr-NightlyTests-8.x/checkout/lucene/top-level-ivy-settings.xml

resolve:

ivy-availability-check:
[loadresource] Do not set property disallowed.ivy.jars.list as its length is 0.

-ivy-fail-disallowed-ivy-version:

ivy-fail:

ivy-fail:

ivy-configure:
[ivy:configure] :: loading settings :: file = /x1/jenkins/jenkins-slave/workspace/Lucene-Solr-NightlyTests-8.x/checkout/lucene/top-level-ivy-settings.xml

resolve:

jar-checksums:
    [mkdir] Created dir: /x1/jenkins/jenkins-slave/workspace/Lucene-Solr-NightlyTests-8.x/checkout/solr/null675684155
     [copy] Copying 239 files to /x1/jenkins/jenkins-slave/workspace/Lucene-Solr-NightlyTests-8.x/checkout/solr/null675684155
   [delete] Deleting directory /x1/jenkins/jenkins-slave/workspace/Lucene-Solr-NightlyTests-8.x/checkout/solr/null675684155

check-working-copy:
[ivy:cachepath] :: resolving dependencies :: #;working@lucene1-us-west
[ivy:cachepath] 	confs: [default]
[ivy:cachepath] 	found org.eclipse.jgit#org.eclipse.jgit;5.3.0.201903130848-r in public
[ivy:cachepath] 	found com.jcraft#jsch;0.1.54 in public
[ivy:cachepath] 	found com.jcraft#jzlib;1.1.1 in public
[ivy:cachepath] 	found com.googlecode.javaewah#JavaEWAH;1.1.6 in public
[ivy:cachepath] 	found org.slf4j#slf4j-api;1.7.2 in public
[ivy:cachepath] 	found org.bouncycastle#bcpg-jdk15on;1.60 in public
[ivy:cachepath] 	found org.bouncycastle#bcprov-jdk15on;1.60 in public
[ivy:cachepath] 	found org.bouncycastle#bcpkix-jdk15on;1.60 in public
[ivy:cachepath] 	found org.slf4j#slf4j-nop;1.7.2 in public
[ivy:cachepath] :: resolution report :: resolve 59ms :: artifacts dl 10ms
	---------------------------------------------------------------------
	|                  |            modules            ||   artifacts   |
	|       conf       | number| search|dwnlded|evicted|| number|dwnlded|
	---------------------------------------------------------------------
	|      default     |   9   |   0   |   0   |   0   ||   9   |   0   |
	---------------------------------------------------------------------
[wc-checker] Initializing working copy...
[wc-checker] Checking working copy status...

-jenkins-base:

BUILD SUCCESSFUL
Total time: 295 minutes 34 seconds
Archiving artifacts
java.lang.InterruptedException: no matches found within 10000
	at hudson.FilePath$ValidateAntFileMask.hasMatch(FilePath.java:2847)
	at hudson.FilePath$ValidateAntFileMask.invoke(FilePath.java:2726)
	at hudson.FilePath$ValidateAntFileMask.invoke(FilePath.java:2707)
	at hudson.FilePath$FileCallableWrapper.call(FilePath.java:3086)
Also:   hudson.remoting.Channel$CallSiteStackTrace: Remote call to lucene
		at hudson.remoting.Channel.attachCallSiteStackTrace(Channel.java:1741)
		at hudson.remoting.UserRequest$ExceptionResponse.retrieve(UserRequest.java:357)
		at hudson.remoting.Channel.call(Channel.java:955)
		at hudson.FilePath.act(FilePath.java:1072)
		at hudson.FilePath.act(FilePath.java:1061)
		at hudson.FilePath.validateAntFileMask(FilePath.java:2705)
		at hudson.tasks.ArtifactArchiver.perform(ArtifactArchiver.java:243)
		at hudson.tasks.BuildStepCompatibilityLayer.perform(BuildStepCompatibilityLayer.java:81)
		at hudson.tasks.BuildStepMonitor$1.perform(BuildStepMonitor.java:20)
		at hudson.model.AbstractBuild$AbstractBuildExecution.perform(AbstractBuild.java:744)
		at hudson.model.AbstractBuild$AbstractBuildExecution.performAllBuildSteps(AbstractBuild.java:690)
		at hudson.model.Build$BuildExecution.post2(Build.java:186)
		at hudson.model.AbstractBuild$AbstractBuildExecution.post(AbstractBuild.java:635)
		at hudson.model.Run.execute(Run.java:1835)
		at hudson.model.FreeStyleBuild.run(FreeStyleBuild.java:43)
		at hudson.model.ResourceController.execute(ResourceController.java:97)
		at hudson.model.Executor.run(Executor.java:429)
Caused: hudson.FilePath$TunneledInterruptedException
	at hudson.FilePath$FileCallableWrapper.call(FilePath.java:3088)
	at hudson.remoting.UserRequest.perform(UserRequest.java:212)
	at hudson.remoting.UserRequest.perform(UserRequest.java:54)
	at hudson.remoting.Request$2.run(Request.java:369)
	at hudson.remoting.InterceptingExecutorService$1.call(InterceptingExecutorService.java:72)
	at java.util.concurrent.FutureTask.run(FutureTask.java:266)
	at java.util.concurrent.ThreadPoolExecutor.runWorker(ThreadPoolExecutor.java:1142)
	at java.util.concurrent.ThreadPoolExecutor$Worker.run(ThreadPoolExecutor.java:617)
	at java.lang.Thread.run(Thread.java:748)
Caused: java.lang.InterruptedException: java.lang.InterruptedException: no matches found within 10000
	at hudson.FilePath.act(FilePath.java:1074)
	at hudson.FilePath.act(FilePath.java:1061)
	at hudson.FilePath.validateAntFileMask(FilePath.java:2705)
	at hudson.tasks.ArtifactArchiver.perform(ArtifactArchiver.java:243)
	at hudson.tasks.BuildStepCompatibilityLayer.perform(BuildStepCompatibilityLayer.java:81)
	at hudson.tasks.BuildStepMonitor$1.perform(BuildStepMonitor.java:20)
	at hudson.model.AbstractBuild$AbstractBuildExecution.perform(AbstractBuild.java:744)
	at hudson.model.AbstractBuild$AbstractBuildExecution.performAllBuildSteps(AbstractBuild.java:690)
	at hudson.model.Build$BuildExecution.post2(Build.java:186)
	at hudson.model.AbstractBuild$AbstractBuildExecution.post(AbstractBuild.java:635)
	at hudson.model.Run.execute(Run.java:1835)
	at hudson.model.FreeStyleBuild.run(FreeStyleBuild.java:43)
	at hudson.model.ResourceController.execute(ResourceController.java:97)
	at hudson.model.Executor.run(Executor.java:429)
No artifacts found that match the file pattern "**/*.events,heapdumps/**,**/hs_err_pid*". Configuration error?
Recording test results
Build step 'Publish JUnit test result report' changed build result to UNSTABLE
Email was triggered for: Unstable (Test Failures)
Sending email for trigger: Unstable (Test Failures)

Mime
View raw message