lucene-dev mailing list archives

Site index · List index
Message view « Date » · « Thread »
Top « Date » · « Thread »
From Policeman Jenkins Server <jenk...@thetaphi.de>
Subject [JENKINS] Lucene-Solr-8.x-Linux (64bit/jdk-11.0.2) - Build # 501 - Still Failing!
Date Thu, 02 May 2019 16:07:36 GMT
Build: https://jenkins.thetaphi.de/job/Lucene-Solr-8.x-Linux/501/
Java: 64bit/jdk-11.0.2 -XX:+UseCompressedOops -XX:+UseSerialGC

3 tests failed.
FAILED:  org.apache.solr.cloud.NestedShardedAtomicUpdateTest.test

Error Message:
Error from server at http://127.0.0.1:44795/collection1: no servers hosting shard: shard1

Stack Trace:
org.apache.solr.client.solrj.impl.HttpSolrClient$RemoteSolrException: Error from server at http://127.0.0.1:44795/collection1: no servers hosting shard: shard1
	at __randomizedtesting.SeedInfo.seed([A093278F8D056B8A:28C7185523F90672]:0)
	at org.apache.solr.client.solrj.impl.HttpSolrClient.executeMethod(HttpSolrClient.java:649)
	at org.apache.solr.client.solrj.impl.HttpSolrClient.request(HttpSolrClient.java:255)
	at org.apache.solr.client.solrj.impl.HttpSolrClient.request(HttpSolrClient.java:244)
	at org.apache.solr.client.solrj.SolrRequest.process(SolrRequest.java:207)
	at org.apache.solr.client.solrj.SolrClient.query(SolrClient.java:987)
	at org.apache.solr.client.solrj.SolrClient.query(SolrClient.java:1002)
	at org.apache.solr.cloud.NestedShardedAtomicUpdateTest.doNestedInplaceUpdateTest(NestedShardedAtomicUpdateTest.java:154)
	at org.apache.solr.cloud.NestedShardedAtomicUpdateTest.test(NestedShardedAtomicUpdateTest.java:56)
	at java.base/jdk.internal.reflect.NativeMethodAccessorImpl.invoke0(Native Method)
	at java.base/jdk.internal.reflect.NativeMethodAccessorImpl.invoke(NativeMethodAccessorImpl.java:62)
	at java.base/jdk.internal.reflect.DelegatingMethodAccessorImpl.invoke(DelegatingMethodAccessorImpl.java:43)
	at java.base/java.lang.reflect.Method.invoke(Method.java:566)
	at com.carrotsearch.randomizedtesting.RandomizedRunner.invoke(RandomizedRunner.java:1750)
	at com.carrotsearch.randomizedtesting.RandomizedRunner$8.evaluate(RandomizedRunner.java:938)
	at com.carrotsearch.randomizedtesting.RandomizedRunner$9.evaluate(RandomizedRunner.java:974)
	at com.carrotsearch.randomizedtesting.RandomizedRunner$10.evaluate(RandomizedRunner.java:988)
	at org.apache.solr.BaseDistributedSearchTestCase$ShardsRepeatRule$ShardsFixedStatement.callStatement(BaseDistributedSearchTestCase.java:1082)
	at org.apache.solr.BaseDistributedSearchTestCase$ShardsRepeatRule$ShardsStatement.evaluate(BaseDistributedSearchTestCase.java:1054)
	at com.carrotsearch.randomizedtesting.rules.SystemPropertiesRestoreRule$1.evaluate(SystemPropertiesRestoreRule.java:57)
	at org.apache.lucene.util.TestRuleSetupTeardownChained$1.evaluate(TestRuleSetupTeardownChained.java:49)
	at org.apache.lucene.util.AbstractBeforeAfterRule$1.evaluate(AbstractBeforeAfterRule.java:45)
	at org.apache.lucene.util.TestRuleThreadAndTestName$1.evaluate(TestRuleThreadAndTestName.java:48)
	at org.apache.lucene.util.TestRuleIgnoreAfterMaxFailures$1.evaluate(TestRuleIgnoreAfterMaxFailures.java:64)
	at org.apache.lucene.util.TestRuleMarkFailure$1.evaluate(TestRuleMarkFailure.java:47)
	at com.carrotsearch.randomizedtesting.rules.StatementAdapter.evaluate(StatementAdapter.java:36)
	at com.carrotsearch.randomizedtesting.ThreadLeakControl$StatementRunner.run(ThreadLeakControl.java:368)
	at com.carrotsearch.randomizedtesting.ThreadLeakControl.forkTimeoutingTask(ThreadLeakControl.java:817)
	at com.carrotsearch.randomizedtesting.ThreadLeakControl$3.evaluate(ThreadLeakControl.java:468)
	at com.carrotsearch.randomizedtesting.RandomizedRunner.runSingleTest(RandomizedRunner.java:947)
	at com.carrotsearch.randomizedtesting.RandomizedRunner$5.evaluate(RandomizedRunner.java:832)
	at com.carrotsearch.randomizedtesting.RandomizedRunner$6.evaluate(RandomizedRunner.java:883)
	at com.carrotsearch.randomizedtesting.RandomizedRunner$7.evaluate(RandomizedRunner.java:894)
	at com.carrotsearch.randomizedtesting.rules.StatementAdapter.evaluate(StatementAdapter.java:36)
	at com.carrotsearch.randomizedtesting.rules.SystemPropertiesRestoreRule$1.evaluate(SystemPropertiesRestoreRule.java:57)
	at org.apache.lucene.util.AbstractBeforeAfterRule$1.evaluate(AbstractBeforeAfterRule.java:45)
	at com.carrotsearch.randomizedtesting.rules.StatementAdapter.evaluate(StatementAdapter.java:36)
	at org.apache.lucene.util.TestRuleStoreClassName$1.evaluate(TestRuleStoreClassName.java:41)
	at com.carrotsearch.randomizedtesting.rules.NoShadowingOrOverridesOnMethodsRule$1.evaluate(NoShadowingOrOverridesOnMethodsRule.java:40)
	at com.carrotsearch.randomizedtesting.rules.NoShadowingOrOverridesOnMethodsRule$1.evaluate(NoShadowingOrOverridesOnMethodsRule.java:40)
	at com.carrotsearch.randomizedtesting.rules.StatementAdapter.evaluate(StatementAdapter.java:36)
	at com.carrotsearch.randomizedtesting.rules.StatementAdapter.evaluate(StatementAdapter.java:36)
	at org.apache.lucene.util.TestRuleAssertionsRequired$1.evaluate(TestRuleAssertionsRequired.java:53)
	at org.apache.lucene.util.TestRuleMarkFailure$1.evaluate(TestRuleMarkFailure.java:47)
	at org.apache.lucene.util.TestRuleIgnoreAfterMaxFailures$1.evaluate(TestRuleIgnoreAfterMaxFailures.java:64)
	at org.apache.lucene.util.TestRuleIgnoreTestSuites$1.evaluate(TestRuleIgnoreTestSuites.java:54)
	at com.carrotsearch.randomizedtesting.rules.StatementAdapter.evaluate(StatementAdapter.java:36)
	at com.carrotsearch.randomizedtesting.ThreadLeakControl$StatementRunner.run(ThreadLeakControl.java:368)
	at java.base/java.lang.Thread.run(Thread.java:834)


FAILED:  org.apache.solr.update.PeerSyncTest.test

Error Message:
Unexpected exception type, expected SolrException but got org.apache.solr.client.solrj.SolrServerException: Timeout occurred while waiting response from server at: http://127.0.0.1:33887/collection1

Stack Trace:
junit.framework.AssertionFailedError: Unexpected exception type, expected SolrException but got org.apache.solr.client.solrj.SolrServerException: Timeout occurred while waiting response from server at: http://127.0.0.1:33887/collection1
	at __randomizedtesting.SeedInfo.seed([A093278F8D056B8A:28C7185523F90672]:0)
	at org.apache.lucene.util.LuceneTestCase.expectThrows(LuceneTestCase.java:2700)
	at org.apache.lucene.util.LuceneTestCase.expectThrows(LuceneTestCase.java:2689)
	at org.apache.solr.update.PeerSyncTest.test(PeerSyncTest.java:279)
	at java.base/jdk.internal.reflect.NativeMethodAccessorImpl.invoke0(Native Method)
	at java.base/jdk.internal.reflect.NativeMethodAccessorImpl.invoke(NativeMethodAccessorImpl.java:62)
	at java.base/jdk.internal.reflect.DelegatingMethodAccessorImpl.invoke(DelegatingMethodAccessorImpl.java:43)
	at java.base/java.lang.reflect.Method.invoke(Method.java:566)
	at com.carrotsearch.randomizedtesting.RandomizedRunner.invoke(RandomizedRunner.java:1750)
	at com.carrotsearch.randomizedtesting.RandomizedRunner$8.evaluate(RandomizedRunner.java:938)
	at com.carrotsearch.randomizedtesting.RandomizedRunner$9.evaluate(RandomizedRunner.java:974)
	at com.carrotsearch.randomizedtesting.RandomizedRunner$10.evaluate(RandomizedRunner.java:988)
	at org.apache.solr.BaseDistributedSearchTestCase$ShardsRepeatRule$ShardsFixedStatement.callStatement(BaseDistributedSearchTestCase.java:1082)
	at org.apache.solr.BaseDistributedSearchTestCase$ShardsRepeatRule$ShardsStatement.evaluate(BaseDistributedSearchTestCase.java:1054)
	at com.carrotsearch.randomizedtesting.rules.SystemPropertiesRestoreRule$1.evaluate(SystemPropertiesRestoreRule.java:57)
	at org.apache.lucene.util.TestRuleSetupTeardownChained$1.evaluate(TestRuleSetupTeardownChained.java:49)
	at org.apache.lucene.util.AbstractBeforeAfterRule$1.evaluate(AbstractBeforeAfterRule.java:45)
	at org.apache.lucene.util.TestRuleThreadAndTestName$1.evaluate(TestRuleThreadAndTestName.java:48)
	at org.apache.lucene.util.TestRuleIgnoreAfterMaxFailures$1.evaluate(TestRuleIgnoreAfterMaxFailures.java:64)
	at org.apache.lucene.util.TestRuleMarkFailure$1.evaluate(TestRuleMarkFailure.java:47)
	at com.carrotsearch.randomizedtesting.rules.StatementAdapter.evaluate(StatementAdapter.java:36)
	at com.carrotsearch.randomizedtesting.ThreadLeakControl$StatementRunner.run(ThreadLeakControl.java:368)
	at com.carrotsearch.randomizedtesting.ThreadLeakControl.forkTimeoutingTask(ThreadLeakControl.java:817)
	at com.carrotsearch.randomizedtesting.ThreadLeakControl$3.evaluate(ThreadLeakControl.java:468)
	at com.carrotsearch.randomizedtesting.RandomizedRunner.runSingleTest(RandomizedRunner.java:947)
	at com.carrotsearch.randomizedtesting.RandomizedRunner$5.evaluate(RandomizedRunner.java:832)
	at com.carrotsearch.randomizedtesting.RandomizedRunner$6.evaluate(RandomizedRunner.java:883)
	at com.carrotsearch.randomizedtesting.RandomizedRunner$7.evaluate(RandomizedRunner.java:894)
	at com.carrotsearch.randomizedtesting.rules.StatementAdapter.evaluate(StatementAdapter.java:36)
	at com.carrotsearch.randomizedtesting.rules.SystemPropertiesRestoreRule$1.evaluate(SystemPropertiesRestoreRule.java:57)
	at org.apache.lucene.util.AbstractBeforeAfterRule$1.evaluate(AbstractBeforeAfterRule.java:45)
	at com.carrotsearch.randomizedtesting.rules.StatementAdapter.evaluate(StatementAdapter.java:36)
	at org.apache.lucene.util.TestRuleStoreClassName$1.evaluate(TestRuleStoreClassName.java:41)
	at com.carrotsearch.randomizedtesting.rules.NoShadowingOrOverridesOnMethodsRule$1.evaluate(NoShadowingOrOverridesOnMethodsRule.java:40)
	at com.carrotsearch.randomizedtesting.rules.NoShadowingOrOverridesOnMethodsRule$1.evaluate(NoShadowingOrOverridesOnMethodsRule.java:40)
	at com.carrotsearch.randomizedtesting.rules.StatementAdapter.evaluate(StatementAdapter.java:36)
	at com.carrotsearch.randomizedtesting.rules.StatementAdapter.evaluate(StatementAdapter.java:36)
	at org.apache.lucene.util.TestRuleAssertionsRequired$1.evaluate(TestRuleAssertionsRequired.java:53)
	at org.apache.lucene.util.TestRuleMarkFailure$1.evaluate(TestRuleMarkFailure.java:47)
	at org.apache.lucene.util.TestRuleIgnoreAfterMaxFailures$1.evaluate(TestRuleIgnoreAfterMaxFailures.java:64)
	at org.apache.lucene.util.TestRuleIgnoreTestSuites$1.evaluate(TestRuleIgnoreTestSuites.java:54)
	at com.carrotsearch.randomizedtesting.rules.StatementAdapter.evaluate(StatementAdapter.java:36)
	at com.carrotsearch.randomizedtesting.ThreadLeakControl$StatementRunner.run(ThreadLeakControl.java:368)
	at java.base/java.lang.Thread.run(Thread.java:834)
Caused by: org.apache.solr.client.solrj.SolrServerException: Timeout occurred while waiting response from server at: http://127.0.0.1:33887/collection1
	at org.apache.solr.client.solrj.impl.HttpSolrClient.executeMethod(HttpSolrClient.java:660)
	at org.apache.solr.client.solrj.impl.HttpSolrClient.request(HttpSolrClient.java:255)
	at org.apache.solr.client.solrj.impl.HttpSolrClient.request(HttpSolrClient.java:244)
	at org.apache.solr.client.solrj.SolrRequest.process(SolrRequest.java:207)
	at org.apache.solr.client.solrj.SolrRequest.process(SolrRequest.java:224)
	at org.apache.solr.BaseDistributedSearchTestCase.add(BaseDistributedSearchTestCase.java:576)
	at org.apache.solr.update.PeerSyncTest.lambda$test$0(PeerSyncTest.java:281)
	at org.apache.lucene.util.LuceneTestCase.expectThrows(LuceneTestCase.java:2695)
	... 42 more
Caused by: java.net.SocketTimeoutException: Read timed out
	at java.base/java.net.SocketInputStream.socketRead0(Native Method)
	at java.base/java.net.SocketInputStream.socketRead(SocketInputStream.java:115)
	at java.base/java.net.SocketInputStream.read(SocketInputStream.java:168)
	at java.base/java.net.SocketInputStream.read(SocketInputStream.java:140)
	at org.apache.http.impl.io.SessionInputBufferImpl.streamRead(SessionInputBufferImpl.java:137)
	at org.apache.http.impl.io.SessionInputBufferImpl.fillBuffer(SessionInputBufferImpl.java:153)
	at org.apache.http.impl.io.SessionInputBufferImpl.readLine(SessionInputBufferImpl.java:282)
	at org.apache.http.impl.conn.DefaultHttpResponseParser.parseHead(DefaultHttpResponseParser.java:138)
	at org.apache.http.impl.conn.DefaultHttpResponseParser.parseHead(DefaultHttpResponseParser.java:56)
	at org.apache.http.impl.io.AbstractMessageParser.parse(AbstractMessageParser.java:259)
	at org.apache.http.impl.DefaultBHttpClientConnection.receiveResponseHeader(DefaultBHttpClientConnection.java:163)
	at org.apache.http.impl.conn.CPoolProxy.receiveResponseHeader(CPoolProxy.java:165)
	at org.apache.http.protocol.HttpRequestExecutor.doReceiveResponse(HttpRequestExecutor.java:273)
	at org.apache.http.protocol.HttpRequestExecutor.execute(HttpRequestExecutor.java:125)
	at org.apache.http.impl.execchain.MainClientExec.execute(MainClientExec.java:272)
	at org.apache.http.impl.execchain.ProtocolExec.execute(ProtocolExec.java:185)
	at org.apache.http.impl.execchain.RetryExec.execute(RetryExec.java:89)
	at org.apache.http.impl.execchain.RedirectExec.execute(RedirectExec.java:110)
	at org.apache.http.impl.client.InternalHttpClient.doExecute(InternalHttpClient.java:185)
	at org.apache.http.impl.client.CloseableHttpClient.execute(CloseableHttpClient.java:83)
	at org.apache.http.impl.client.CloseableHttpClient.execute(CloseableHttpClient.java:56)
	at org.apache.solr.client.solrj.impl.HttpSolrClient.executeMethod(HttpSolrClient.java:548)
	... 49 more


FAILED:  org.apache.solr.update.PeerSyncWithLeaderTest.test

Error Message:
Unexpected exception type, expected SolrException but got org.apache.solr.client.solrj.SolrServerException: Timeout occurred while waiting response from server at: http://127.0.0.1:46331/collection1

Stack Trace:
junit.framework.AssertionFailedError: Unexpected exception type, expected SolrException but got org.apache.solr.client.solrj.SolrServerException: Timeout occurred while waiting response from server at: http://127.0.0.1:46331/collection1
	at __randomizedtesting.SeedInfo.seed([A093278F8D056B8A:28C7185523F90672]:0)
	at org.apache.lucene.util.LuceneTestCase.expectThrows(LuceneTestCase.java:2700)
	at org.apache.lucene.util.LuceneTestCase.expectThrows(LuceneTestCase.java:2689)
	at org.apache.solr.update.PeerSyncTest.test(PeerSyncTest.java:279)
	at java.base/jdk.internal.reflect.NativeMethodAccessorImpl.invoke0(Native Method)
	at java.base/jdk.internal.reflect.NativeMethodAccessorImpl.invoke(NativeMethodAccessorImpl.java:62)
	at java.base/jdk.internal.reflect.DelegatingMethodAccessorImpl.invoke(DelegatingMethodAccessorImpl.java:43)
	at java.base/java.lang.reflect.Method.invoke(Method.java:566)
	at com.carrotsearch.randomizedtesting.RandomizedRunner.invoke(RandomizedRunner.java:1750)
	at com.carrotsearch.randomizedtesting.RandomizedRunner$8.evaluate(RandomizedRunner.java:938)
	at com.carrotsearch.randomizedtesting.RandomizedRunner$9.evaluate(RandomizedRunner.java:974)
	at com.carrotsearch.randomizedtesting.RandomizedRunner$10.evaluate(RandomizedRunner.java:988)
	at org.apache.solr.BaseDistributedSearchTestCase$ShardsRepeatRule$ShardsFixedStatement.callStatement(BaseDistributedSearchTestCase.java:1082)
	at org.apache.solr.BaseDistributedSearchTestCase$ShardsRepeatRule$ShardsStatement.evaluate(BaseDistributedSearchTestCase.java:1054)
	at com.carrotsearch.randomizedtesting.rules.SystemPropertiesRestoreRule$1.evaluate(SystemPropertiesRestoreRule.java:57)
	at org.apache.lucene.util.TestRuleSetupTeardownChained$1.evaluate(TestRuleSetupTeardownChained.java:49)
	at org.apache.lucene.util.AbstractBeforeAfterRule$1.evaluate(AbstractBeforeAfterRule.java:45)
	at org.apache.lucene.util.TestRuleThreadAndTestName$1.evaluate(TestRuleThreadAndTestName.java:48)
	at org.apache.lucene.util.TestRuleIgnoreAfterMaxFailures$1.evaluate(TestRuleIgnoreAfterMaxFailures.java:64)
	at org.apache.lucene.util.TestRuleMarkFailure$1.evaluate(TestRuleMarkFailure.java:47)
	at com.carrotsearch.randomizedtesting.rules.StatementAdapter.evaluate(StatementAdapter.java:36)
	at com.carrotsearch.randomizedtesting.ThreadLeakControl$StatementRunner.run(ThreadLeakControl.java:368)
	at com.carrotsearch.randomizedtesting.ThreadLeakControl.forkTimeoutingTask(ThreadLeakControl.java:817)
	at com.carrotsearch.randomizedtesting.ThreadLeakControl$3.evaluate(ThreadLeakControl.java:468)
	at com.carrotsearch.randomizedtesting.RandomizedRunner.runSingleTest(RandomizedRunner.java:947)
	at com.carrotsearch.randomizedtesting.RandomizedRunner$5.evaluate(RandomizedRunner.java:832)
	at com.carrotsearch.randomizedtesting.RandomizedRunner$6.evaluate(RandomizedRunner.java:883)
	at com.carrotsearch.randomizedtesting.RandomizedRunner$7.evaluate(RandomizedRunner.java:894)
	at com.carrotsearch.randomizedtesting.rules.StatementAdapter.evaluate(StatementAdapter.java:36)
	at com.carrotsearch.randomizedtesting.rules.SystemPropertiesRestoreRule$1.evaluate(SystemPropertiesRestoreRule.java:57)
	at org.apache.lucene.util.AbstractBeforeAfterRule$1.evaluate(AbstractBeforeAfterRule.java:45)
	at com.carrotsearch.randomizedtesting.rules.StatementAdapter.evaluate(StatementAdapter.java:36)
	at org.apache.lucene.util.TestRuleStoreClassName$1.evaluate(TestRuleStoreClassName.java:41)
	at com.carrotsearch.randomizedtesting.rules.NoShadowingOrOverridesOnMethodsRule$1.evaluate(NoShadowingOrOverridesOnMethodsRule.java:40)
	at com.carrotsearch.randomizedtesting.rules.NoShadowingOrOverridesOnMethodsRule$1.evaluate(NoShadowingOrOverridesOnMethodsRule.java:40)
	at com.carrotsearch.randomizedtesting.rules.StatementAdapter.evaluate(StatementAdapter.java:36)
	at com.carrotsearch.randomizedtesting.rules.StatementAdapter.evaluate(StatementAdapter.java:36)
	at org.apache.lucene.util.TestRuleAssertionsRequired$1.evaluate(TestRuleAssertionsRequired.java:53)
	at org.apache.lucene.util.TestRuleMarkFailure$1.evaluate(TestRuleMarkFailure.java:47)
	at org.apache.lucene.util.TestRuleIgnoreAfterMaxFailures$1.evaluate(TestRuleIgnoreAfterMaxFailures.java:64)
	at org.apache.lucene.util.TestRuleIgnoreTestSuites$1.evaluate(TestRuleIgnoreTestSuites.java:54)
	at com.carrotsearch.randomizedtesting.rules.StatementAdapter.evaluate(StatementAdapter.java:36)
	at com.carrotsearch.randomizedtesting.ThreadLeakControl$StatementRunner.run(ThreadLeakControl.java:368)
	at java.base/java.lang.Thread.run(Thread.java:834)
Caused by: org.apache.solr.client.solrj.SolrServerException: Timeout occurred while waiting response from server at: http://127.0.0.1:46331/collection1
	at org.apache.solr.client.solrj.impl.HttpSolrClient.executeMethod(HttpSolrClient.java:660)
	at org.apache.solr.client.solrj.impl.HttpSolrClient.request(HttpSolrClient.java:255)
	at org.apache.solr.client.solrj.impl.HttpSolrClient.request(HttpSolrClient.java:244)
	at org.apache.solr.client.solrj.SolrRequest.process(SolrRequest.java:207)
	at org.apache.solr.client.solrj.SolrRequest.process(SolrRequest.java:224)
	at org.apache.solr.BaseDistributedSearchTestCase.add(BaseDistributedSearchTestCase.java:576)
	at org.apache.solr.update.PeerSyncTest.lambda$test$0(PeerSyncTest.java:281)
	at org.apache.lucene.util.LuceneTestCase.expectThrows(LuceneTestCase.java:2695)
	... 42 more
Caused by: java.net.SocketTimeoutException: Read timed out
	at java.base/java.net.SocketInputStream.socketRead0(Native Method)
	at java.base/java.net.SocketInputStream.socketRead(SocketInputStream.java:115)
	at java.base/java.net.SocketInputStream.read(SocketInputStream.java:168)
	at java.base/java.net.SocketInputStream.read(SocketInputStream.java:140)
	at org.apache.http.impl.io.SessionInputBufferImpl.streamRead(SessionInputBufferImpl.java:137)
	at org.apache.http.impl.io.SessionInputBufferImpl.fillBuffer(SessionInputBufferImpl.java:153)
	at org.apache.http.impl.io.SessionInputBufferImpl.readLine(SessionInputBufferImpl.java:282)
	at org.apache.http.impl.conn.DefaultHttpResponseParser.parseHead(DefaultHttpResponseParser.java:138)
	at org.apache.http.impl.conn.DefaultHttpResponseParser.parseHead(DefaultHttpResponseParser.java:56)
	at org.apache.http.impl.io.AbstractMessageParser.parse(AbstractMessageParser.java:259)
	at org.apache.http.impl.DefaultBHttpClientConnection.receiveResponseHeader(DefaultBHttpClientConnection.java:163)
	at org.apache.http.impl.conn.CPoolProxy.receiveResponseHeader(CPoolProxy.java:165)
	at org.apache.http.protocol.HttpRequestExecutor.doReceiveResponse(HttpRequestExecutor.java:273)
	at org.apache.http.protocol.HttpRequestExecutor.execute(HttpRequestExecutor.java:125)
	at org.apache.http.impl.execchain.MainClientExec.execute(MainClientExec.java:272)
	at org.apache.http.impl.execchain.ProtocolExec.execute(ProtocolExec.java:185)
	at org.apache.http.impl.execchain.RetryExec.execute(RetryExec.java:89)
	at org.apache.http.impl.execchain.RedirectExec.execute(RedirectExec.java:110)
	at org.apache.http.impl.client.InternalHttpClient.doExecute(InternalHttpClient.java:185)
	at org.apache.http.impl.client.CloseableHttpClient.execute(CloseableHttpClient.java:83)
	at org.apache.http.impl.client.CloseableHttpClient.execute(CloseableHttpClient.java:56)
	at org.apache.solr.client.solrj.impl.HttpSolrClient.executeMethod(HttpSolrClient.java:548)
	... 49 more




Build Log:
[...truncated 13399 lines...]
   [junit4] Suite: org.apache.solr.update.PeerSyncWithLeaderTest
   [junit4]   2> 284376 INFO  (SUITE-PeerSyncWithLeaderTest-seed#[A093278F8D056B8A]-worker) [    ] o.a.s.SolrTestCaseJ4 SecureRandom sanity checks: test.solr.allowed.securerandom=null & java.security.egd=file:/dev/./urandom
   [junit4]   2> Creating dataDir: /home/jenkins/workspace/Lucene-Solr-8.x-Linux/solr/build/solr-core/test/J2/temp/solr.update.PeerSyncWithLeaderTest_A093278F8D056B8A-001/init-core-data-001
   [junit4]   2> 284376 WARN  (SUITE-PeerSyncWithLeaderTest-seed#[A093278F8D056B8A]-worker) [    ] o.a.s.SolrTestCaseJ4 startTrackingSearchers: numOpens=2 numCloses=2
   [junit4]   2> 284376 INFO  (SUITE-PeerSyncWithLeaderTest-seed#[A093278F8D056B8A]-worker) [    ] o.a.s.SolrTestCaseJ4 Using PointFields (NUMERIC_POINTS_SYSPROP=true) w/NUMERIC_DOCVALUES_SYSPROP=true
   [junit4]   2> 284377 INFO  (SUITE-PeerSyncWithLeaderTest-seed#[A093278F8D056B8A]-worker) [    ] o.a.s.SolrTestCaseJ4 Randomized ssl (false) and clientAuth (false) via: @org.apache.solr.SolrTestCaseJ4$SuppressSSL(bugUrl="https://issues.apache.org/jira/browse/SOLR-5776")
   [junit4]   2> 284377 INFO  (SUITE-PeerSyncWithLeaderTest-seed#[A093278F8D056B8A]-worker) [    ] o.a.s.BaseDistributedSearchTestCase Setting hostContext system property: /
   [junit4]   2> 284377 INFO  (TEST-PeerSyncWithLeaderTest.test-seed#[A093278F8D056B8A]) [    ] o.a.s.SolrTestCaseJ4 ####initCore
   [junit4]   2> 284377 INFO  (TEST-PeerSyncWithLeaderTest.test-seed#[A093278F8D056B8A]) [    ] o.a.s.c.SolrResourceLoader [null] Added 2 libs to classloader, from paths: [/home/jenkins/workspace/Lucene-Solr-8.x-Linux/solr/core/src/test-files/solr/collection1/lib, /home/jenkins/workspace/Lucene-Solr-8.x-Linux/solr/core/src/test-files/solr/collection1/lib/classes]
   [junit4]   2> 284386 INFO  (TEST-PeerSyncWithLeaderTest.test-seed#[A093278F8D056B8A]) [    ] o.a.s.c.SolrConfig Using Lucene MatchVersion: 8.2.0
   [junit4]   2> 284408 INFO  (TEST-PeerSyncWithLeaderTest.test-seed#[A093278F8D056B8A]) [    ] o.a.s.s.IndexSchema [null] Schema name=test
   [junit4]   2> 284475 INFO  (TEST-PeerSyncWithLeaderTest.test-seed#[A093278F8D056B8A]) [    ] o.a.s.s.IndexSchema Loaded schema test/1.0 with uniqueid field id
   [junit4]   2> 284545 INFO  (TEST-PeerSyncWithLeaderTest.test-seed#[A093278F8D056B8A]) [    ] o.a.s.h.c.HttpShardHandlerFactory Host whitelist initialized: WhitelistHostChecker [whitelistHosts=null, whitelistHostCheckingEnabled=false]
   [junit4]   2> 284547 WARN  (TEST-PeerSyncWithLeaderTest.test-seed#[A093278F8D056B8A]) [    ] o.e.j.u.s.S.config No Client EndPointIdentificationAlgorithm configured for SslContextFactory@31b2d82d[provider=null,keyStore=null,trustStore=null]
   [junit4]   2> 284550 WARN  (TEST-PeerSyncWithLeaderTest.test-seed#[A093278F8D056B8A]) [    ] o.e.j.u.s.S.config No Client EndPointIdentificationAlgorithm configured for SslContextFactory@774e1fc3[provider=null,keyStore=null,trustStore=null]
   [junit4]   2> 284562 INFO  (TEST-PeerSyncWithLeaderTest.test-seed#[A093278F8D056B8A]) [    ] o.a.s.c.TransientSolrCoreCacheDefault Allocating transient cache for 2147483647 transient cores
   [junit4]   2> 284562 INFO  (TEST-PeerSyncWithLeaderTest.test-seed#[A093278F8D056B8A]) [    ] o.a.s.h.a.MetricsHistoryHandler No .system collection, keeping metrics history in memory.
   [junit4]   2> 284576 INFO  (TEST-PeerSyncWithLeaderTest.test-seed#[A093278F8D056B8A]) [    ] o.a.s.m.r.SolrJmxReporter JMX monitoring for 'solr.node' (registry 'solr.node') enabled at server: com.sun.jmx.mbeanserver.JmxMBeanServer@4d7a4ba3
   [junit4]   2> 284584 INFO  (TEST-PeerSyncWithLeaderTest.test-seed#[A093278F8D056B8A]) [    ] o.a.s.m.r.SolrJmxReporter JMX monitoring for 'solr.jvm' (registry 'solr.jvm') enabled at server: com.sun.jmx.mbeanserver.JmxMBeanServer@4d7a4ba3
   [junit4]   2> 284584 INFO  (TEST-PeerSyncWithLeaderTest.test-seed#[A093278F8D056B8A]) [    ] o.a.s.m.r.SolrJmxReporter JMX monitoring for 'solr.jetty' (registry 'solr.jetty') enabled at server: com.sun.jmx.mbeanserver.JmxMBeanServer@4d7a4ba3
   [junit4]   2> 284588 INFO  (coreLoadExecutor-1667-thread-1) [    x:collection1] o.a.s.c.SolrResourceLoader [null] Added 2 libs to classloader, from paths: [/home/jenkins/workspace/Lucene-Solr-8.x-Linux/solr/core/src/test-files/solr/collection1/lib, /home/jenkins/workspace/Lucene-Solr-8.x-Linux/solr/core/src/test-files/solr/collection1/lib/classes]
   [junit4]   2> 284601 INFO  (coreLoadExecutor-1667-thread-1) [    x:collection1] o.a.s.c.SolrConfig Using Lucene MatchVersion: 8.2.0
   [junit4]   2> 284616 INFO  (coreLoadExecutor-1667-thread-1) [    x:collection1] o.a.s.s.IndexSchema [collection1] Schema name=test
   [junit4]   2> 284708 INFO  (coreLoadExecutor-1667-thread-1) [    x:collection1] o.a.s.s.IndexSchema Loaded schema test/1.0 with uniqueid field id
   [junit4]   2> 284716 INFO  (coreLoadExecutor-1667-thread-1) [    x:collection1] o.a.s.c.CoreContainer Creating SolrCore 'collection1' using configuration from instancedir /home/jenkins/workspace/Lucene-Solr-8.x-Linux/solr/core/src/test-files/solr/collection1, trusted=true
   [junit4]   2> 284717 INFO  (coreLoadExecutor-1667-thread-1) [    x:collection1] o.a.s.m.r.SolrJmxReporter JMX monitoring for 'solr.core.collection1' (registry 'solr.core.collection1') enabled at server: com.sun.jmx.mbeanserver.JmxMBeanServer@4d7a4ba3
   [junit4]   2> 284717 INFO  (coreLoadExecutor-1667-thread-1) [    x:collection1] o.a.s.c.SolrCore [[collection1] ] Opening new SolrCore at [/home/jenkins/workspace/Lucene-Solr-8.x-Linux/solr/core/src/test-files/solr/collection1], dataDir=[/home/jenkins/workspace/Lucene-Solr-8.x-Linux/solr/build/solr-core/test/J2/temp/solr.update.PeerSyncWithLeaderTest_A093278F8D056B8A-001/init-core-data-001/]
   [junit4]   2> 284718 INFO  (coreLoadExecutor-1667-thread-1) [    x:collection1] o.a.s.u.RandomMergePolicy RandomMergePolicy wrapping class org.apache.lucene.index.TieredMergePolicy: [TieredMergePolicy: maxMergeAtOnce=42, maxMergeAtOnceExplicit=10, maxMergedSegmentMB=64.1552734375, floorSegmentMB=0.599609375, forceMergeDeletesPctAllowed=22.42510314334553, segmentsPerTier=26.0, maxCFSSegmentSizeMB=8.796093022207999E12, noCFSRatio=1.0, deletesPctAllowed=22.4799915936334
   [junit4]   2> 284719 WARN  (coreLoadExecutor-1667-thread-1) [    x:collection1] o.a.s.c.RequestHandlers INVALID paramSet a in requestHandler {type = requestHandler,name = /dump,class = DumpRequestHandler,attributes = {initParams=a, name=/dump, class=DumpRequestHandler},args = {defaults={a=A,b=B}}}
   [junit4]   2> 284767 INFO  (coreLoadExecutor-1667-thread-1) [    x:collection1] o.a.s.u.UpdateHandler Using UpdateLog implementation: org.apache.solr.update.UpdateLog
   [junit4]   2> 284767 INFO  (coreLoadExecutor-1667-thread-1) [    x:collection1] o.a.s.u.UpdateLog Initializing UpdateLog: dataDir= defaultSyncLevel=FLUSH numRecordsToKeep=100 maxNumLogsToKeep=10 numVersionBuckets=65536
   [junit4]   2> 284768 INFO  (coreLoadExecutor-1667-thread-1) [    x:collection1] o.a.s.u.CommitTracker Hard AutoCommit: disabled
   [junit4]   2> 284768 INFO  (coreLoadExecutor-1667-thread-1) [    x:collection1] o.a.s.u.CommitTracker Soft AutoCommit: disabled
   [junit4]   2> 284769 INFO  (coreLoadExecutor-1667-thread-1) [    x:collection1] o.a.s.u.RandomMergePolicy RandomMergePolicy wrapping class org.apache.lucene.index.AlcoholicMergePolicy: [AlcoholicMergePolicy: minMergeSize=0, mergeFactor=10, maxMergeSize=388791835, maxMergeSizeForForcedMerge=9223372036854775807, calibrateSizeByDeletes=true, maxMergeDocs=2147483647, maxCFSSegmentSizeMB=8.796093022207999E12, noCFSRatio=0.1]
   [junit4]   2> 284769 INFO  (coreLoadExecutor-1667-thread-1) [    x:collection1] o.a.s.s.SolrIndexSearcher Opening [Searcher@5666ee45[collection1] main]
   [junit4]   2> 284769 WARN  (coreLoadExecutor-1667-thread-1) [    x:collection1] o.a.s.r.ManagedResourceStorage Cannot write to config directory /home/jenkins/workspace/Lucene-Solr-8.x-Linux/solr/core/src/test-files/solr/collection1/conf; switching to use InMemory storage instead.
   [junit4]   2> 284769 INFO  (coreLoadExecutor-1667-thread-1) [    x:collection1] o.a.s.h.ReplicationHandler Commits will be reserved for 10000ms.
   [junit4]   2> 284769 INFO  (coreLoadExecutor-1667-thread-1) [    x:collection1] o.a.s.u.UpdateLog Could not find max version in index or recent updates, using new clock 1632434659626319872
   [junit4]   2> 284771 INFO  (searcherExecutor-1668-thread-1-processing-x:collection1) [    x:collection1] o.a.s.c.SolrCore [collection1] Registered new searcher Searcher@5666ee45[collection1] main{ExitableDirectoryReader(UninvertingDirectoryReader())}
   [junit4]   2> 284771 INFO  (TEST-PeerSyncWithLeaderTest.test-seed#[A093278F8D056B8A]) [    ] o.a.s.SolrTestCaseJ4 ####initCore end
   [junit4]   2> 284874 INFO  (TEST-PeerSyncWithLeaderTest.test-seed#[A093278F8D056B8A]) [    ] o.a.s.SolrTestCaseJ4 Writing core.properties file to /home/jenkins/workspace/Lucene-Solr-8.x-Linux/solr/build/solr-core/test/J2/temp/solr.update.PeerSyncWithLeaderTest_A093278F8D056B8A-001/tempDir-001/control/cores/collection1
   [junit4]   2> 284875 WARN  (TEST-PeerSyncWithLeaderTest.test-seed#[A093278F8D056B8A]) [    ] o.e.j.s.AbstractConnector Ignoring deprecated socket close linger time
   [junit4]   2> 284875 INFO  (TEST-PeerSyncWithLeaderTest.test-seed#[A093278F8D056B8A]) [    ] o.a.s.c.s.e.JettySolrRunner Start Jetty (original configured port=0)
   [junit4]   2> 284875 INFO  (TEST-PeerSyncWithLeaderTest.test-seed#[A093278F8D056B8A]) [    ] o.a.s.c.s.e.JettySolrRunner Trying to start Jetty on port 0 try number 1 ...
   [junit4]   2> 284875 INFO  (TEST-PeerSyncWithLeaderTest.test-seed#[A093278F8D056B8A]) [    ] o.e.j.s.Server jetty-9.4.14.v20181114; built: 2018-11-14T21:20:31.478Z; git: c4550056e785fb5665914545889f21dc136ad9e6; jvm 11.0.2+9
   [junit4]   2> 284875 INFO  (TEST-PeerSyncWithLeaderTest.test-seed#[A093278F8D056B8A]) [    ] o.e.j.s.session DefaultSessionIdManager workerName=node0
   [junit4]   2> 284875 INFO  (TEST-PeerSyncWithLeaderTest.test-seed#[A093278F8D056B8A]) [    ] o.e.j.s.session No SessionScavenger set, using defaults
   [junit4]   2> 284875 INFO  (TEST-PeerSyncWithLeaderTest.test-seed#[A093278F8D056B8A]) [    ] o.e.j.s.session node0 Scavenging every 600000ms
   [junit4]   2> 284876 INFO  (TEST-PeerSyncWithLeaderTest.test-seed#[A093278F8D056B8A]) [    ] o.e.j.s.h.ContextHandler Started o.e.j.s.ServletContextHandler@3a3c9db3{/,null,AVAILABLE}
   [junit4]   2> 284876 INFO  (TEST-PeerSyncWithLeaderTest.test-seed#[A093278F8D056B8A]) [    ] o.e.j.s.AbstractConnector Started ServerConnector@d5eebcc{HTTP/1.1,[http/1.1, h2c]}{127.0.0.1:40299}
   [junit4]   2> 284876 INFO  (TEST-PeerSyncWithLeaderTest.test-seed#[A093278F8D056B8A]) [    ] o.e.j.s.Server Started @284903ms
   [junit4]   2> 284876 INFO  (TEST-PeerSyncWithLeaderTest.test-seed#[A093278F8D056B8A]) [    ] o.a.s.c.s.e.JettySolrRunner Jetty properties: {schema=schema.xml, hostContext=/, solrconfig=solrconfig-tlog.xml, hostPort=40299, coreRootDirectory=/home/jenkins/workspace/Lucene-Solr-8.x-Linux/solr/build/solr-core/test/J2/temp/solr.update.PeerSyncWithLeaderTest_A093278F8D056B8A-001/tempDir-001/control/cores}
   [junit4]   2> 284876 ERROR (TEST-PeerSyncWithLeaderTest.test-seed#[A093278F8D056B8A]) [    ] o.a.s.u.StartupLoggingUtils Missing Java Option solr.log.dir. Logging may be missing or incomplete.
   [junit4]   2> 284876 INFO  (TEST-PeerSyncWithLeaderTest.test-seed#[A093278F8D056B8A]) [    ] o.a.s.s.SolrDispatchFilter Using logger factory org.apache.logging.slf4j.Log4jLoggerFactory
   [junit4]   2> 284877 INFO  (TEST-PeerSyncWithLeaderTest.test-seed#[A093278F8D056B8A]) [    ] o.a.s.s.SolrDispatchFilter  ___      _       Welcome to Apache Solr™ version 8.2.0
   [junit4]   2> 284877 INFO  (TEST-PeerSyncWithLeaderTest.test-seed#[A093278F8D056B8A]) [    ] o.a.s.s.SolrDispatchFilter / __| ___| |_ _   Starting in standalone mode on port null
   [junit4]   2> 284877 INFO  (TEST-PeerSyncWithLeaderTest.test-seed#[A093278F8D056B8A]) [    ] o.a.s.s.SolrDispatchFilter \__ \/ _ \ | '_|  Install dir: null
   [junit4]   2> 284877 INFO  (TEST-PeerSyncWithLeaderTest.test-seed#[A093278F8D056B8A]) [    ] o.a.s.s.SolrDispatchFilter |___/\___/_|_|    Start time: 2019-05-02T15:30:08.205090Z
   [junit4]   2> 284877 INFO  (TEST-PeerSyncWithLeaderTest.test-seed#[A093278F8D056B8A]) [    ] o.a.s.c.SolrXmlConfig Loading container configuration from /home/jenkins/workspace/Lucene-Solr-8.x-Linux/solr/build/solr-core/test/J2/temp/solr.update.PeerSyncWithLeaderTest_A093278F8D056B8A-001/tempDir-001/control/solr.xml
   [junit4]   2> 284878 INFO  (TEST-PeerSyncWithLeaderTest.test-seed#[A093278F8D056B8A]) [    ] o.a.s.c.SolrXmlConfig Configuration parameter autoReplicaFailoverWorkLoopDelay is ignored
   [junit4]   2> 284878 INFO  (TEST-PeerSyncWithLeaderTest.test-seed#[A093278F8D056B8A]) [    ] o.a.s.c.SolrXmlConfig Configuration parameter autoReplicaFailoverBadNodeExpiration is ignored
   [junit4]   2> 284879 INFO  (TEST-PeerSyncWithLeaderTest.test-seed#[A093278F8D056B8A]) [    ] o.a.s.c.SolrXmlConfig MBean server found: com.sun.jmx.mbeanserver.JmxMBeanServer@4d7a4ba3, but no JMX reporters were configured - adding default JMX reporter.
   [junit4]   2> 284940 INFO  (TEST-PeerSyncWithLeaderTest.test-seed#[A093278F8D056B8A]) [    ] o.a.s.h.c.HttpShardHandlerFactory Host whitelist initialized: WhitelistHostChecker [whitelistHosts=null, whitelistHostCheckingEnabled=false]
   [junit4]   2> 284941 WARN  (TEST-PeerSyncWithLeaderTest.test-seed#[A093278F8D056B8A]) [    ] o.e.j.u.s.S.config No Client EndPointIdentificationAlgorithm configured for SslContextFactory@3b3a961e[provider=null,keyStore=null,trustStore=null]
   [junit4]   2> 284944 WARN  (TEST-PeerSyncWithLeaderTest.test-seed#[A093278F8D056B8A]) [    ] o.e.j.u.s.S.config No Client EndPointIdentificationAlgorithm configured for SslContextFactory@21d5229[provider=null,keyStore=null,trustStore=null]
   [junit4]   2> 284961 INFO  (TEST-PeerSyncWithLeaderTest.test-seed#[A093278F8D056B8A]) [    ] o.a.s.c.TransientSolrCoreCacheDefault Allocating transient cache for 4 transient cores
   [junit4]   2> 284961 INFO  (TEST-PeerSyncWithLeaderTest.test-seed#[A093278F8D056B8A]) [    ] o.a.s.h.a.MetricsHistoryHandler No .system collection, keeping metrics history in memory.
   [junit4]   2> 284972 INFO  (TEST-PeerSyncWithLeaderTest.test-seed#[A093278F8D056B8A]) [    ] o.a.s.m.r.SolrJmxReporter JMX monitoring for 'solr.node' (registry 'solr.node') enabled at server: com.sun.jmx.mbeanserver.JmxMBeanServer@4d7a4ba3
   [junit4]   2> 284979 INFO  (TEST-PeerSyncWithLeaderTest.test-seed#[A093278F8D056B8A]) [    ] o.a.s.m.r.SolrJmxReporter JMX monitoring for 'solr.jvm' (registry 'solr.jvm') enabled at server: com.sun.jmx.mbeanserver.JmxMBeanServer@4d7a4ba3
   [junit4]   2> 284979 INFO  (TEST-PeerSyncWithLeaderTest.test-seed#[A093278F8D056B8A]) [    ] o.a.s.m.r.SolrJmxReporter JMX monitoring for 'solr.jetty' (registry 'solr.jetty') enabled at server: com.sun.jmx.mbeanserver.JmxMBeanServer@4d7a4ba3
   [junit4]   2> 284980 INFO  (TEST-PeerSyncWithLeaderTest.test-seed#[A093278F8D056B8A]) [    ] o.a.s.c.CorePropertiesLocator Found 1 core definitions underneath /home/jenkins/workspace/Lucene-Solr-8.x-Linux/solr/build/solr-core/test/J2/temp/solr.update.PeerSyncWithLeaderTest_A093278F8D056B8A-001/tempDir-001/control/cores
   [junit4]   2> 284980 INFO  (TEST-PeerSyncWithLeaderTest.test-seed#[A093278F8D056B8A]) [    ] o.a.s.c.CorePropertiesLocator Cores are: [collection1]
   [junit4]   2> 284981 INFO  (coreLoadExecutor-1681-thread-1) [    x:collection1] o.a.s.c.SolrResourceLoader [null] Added 2 libs to classloader, from paths: [/home/jenkins/workspace/Lucene-Solr-8.x-Linux/solr/core/src/test-files/solr/collection1/lib, /home/jenkins/workspace/Lucene-Solr-8.x-Linux/solr/core/src/test-files/solr/collection1/lib/classes]
   [junit4]   2> 284994 INFO  (coreLoadExecutor-1681-thread-1) [    x:collection1] o.a.s.c.SolrConfig Using Lucene MatchVersion: 8.2.0
   [junit4]   2> 285005 INFO  (coreLoadExecutor-1681-thread-1) [    x:collection1] o.a.s.s.IndexSchema [collection1] Schema name=test
   [junit4]   2> 285073 INFO  (coreLoadExecutor-1681-thread-1) [    x:collection1] o.a.s.s.IndexSchema Loaded schema test/1.0 with uniqueid field id
   [junit4]   2> 285078 INFO  (coreLoadExecutor-1681-thread-1) [    x:collection1] o.a.s.c.CoreContainer Creating SolrCore 'collection1' using configuration from configset /home/jenkins/workspace/Lucene-Solr-8.x-Linux/solr/core/src/test-files/solr/collection1, trusted=true
   [junit4]   2> 285079 INFO  (coreLoadExecutor-1681-thread-1) [    x:collection1] o.a.s.m.r.SolrJmxReporter JMX monitoring for 'solr.core.collection1' (registry 'solr.core.collection1') enabled at server: com.sun.jmx.mbeanserver.JmxMBeanServer@4d7a4ba3
   [junit4]   2> 285079 INFO  (coreLoadExecutor-1681-thread-1) [    x:collection1] o.a.s.c.SolrCore [[collection1] ] Opening new SolrCore at [/home/jenkins/workspace/Lucene-Solr-8.x-Linux/solr/core/src/test-files/solr/collection1], dataDir=[/home/jenkins/workspace/Lucene-Solr-8.x-Linux/solr/build/solr-core/test/J2/temp/solr.update.PeerSyncWithLeaderTest_A093278F8D056B8A-001/tempDir-001/control/cores/collection1/data/]
   [junit4]   2> 285080 INFO  (coreLoadExecutor-1681-thread-1) [    x:collection1] o.a.s.u.RandomMergePolicy RandomMergePolicy wrapping class org.apache.lucene.index.TieredMergePolicy: [TieredMergePolicy: maxMergeAtOnce=42, maxMergeAtOnceExplicit=10, maxMergedSegmentMB=64.1552734375, floorSegmentMB=0.599609375, forceMergeDeletesPctAllowed=22.42510314334553, segmentsPerTier=26.0, maxCFSSegmentSizeMB=8.796093022207999E12, noCFSRatio=1.0, deletesPctAllowed=22.4799915936334
   [junit4]   2> 285081 WARN  (coreLoadExecutor-1681-thread-1) [    x:collection1] o.a.s.c.RequestHandlers INVALID paramSet a in requestHandler {type = requestHandler,name = /dump,class = DumpRequestHandler,attributes = {initParams=a, name=/dump, class=DumpRequestHandler},args = {defaults={a=A,b=B}}}
   [junit4]   2> 285106 INFO  (coreLoadExecutor-1681-thread-1) [    x:collection1] o.a.s.u.UpdateHandler Using UpdateLog implementation: org.apache.solr.update.UpdateLog
   [junit4]   2> 285106 INFO  (coreLoadExecutor-1681-thread-1) [    x:collection1] o.a.s.u.UpdateLog Initializing UpdateLog: dataDir= defaultSyncLevel=FLUSH numRecordsToKeep=100 maxNumLogsToKeep=10 numVersionBuckets=65536
   [junit4]   2> 285107 INFO  (coreLoadExecutor-1681-thread-1) [    x:collection1] o.a.s.u.CommitTracker Hard AutoCommit: disabled
   [junit4]   2> 285107 INFO  (coreLoadExecutor-1681-thread-1) [    x:collection1] o.a.s.u.CommitTracker Soft AutoCommit: disabled
   [junit4]   2> 285108 INFO  (coreLoadExecutor-1681-thread-1) [    x:collection1] o.a.s.u.RandomMergePolicy RandomMergePolicy wrapping class org.apache.lucene.index.AlcoholicMergePolicy: [AlcoholicMergePolicy: minMergeSize=0, mergeFactor=10, maxMergeSize=388791835, maxMergeSizeForForcedMerge=9223372036854775807, calibrateSizeByDeletes=true, maxMergeDocs=2147483647, maxCFSSegmentSizeMB=8.796093022207999E12, noCFSRatio=0.1]
   [junit4]   2> 285108 INFO  (coreLoadExecutor-1681-thread-1) [    x:collection1] o.a.s.s.SolrIndexSearcher Opening [Searcher@1f0336c9[collection1] main]
   [junit4]   2> 285108 WARN  (coreLoadExecutor-1681-thread-1) [    x:collection1] o.a.s.r.ManagedResourceStorage Cannot write to config directory /home/jenkins/workspace/Lucene-Solr-8.x-Linux/solr/core/src/test-files/solr/collection1/conf; switching to use InMemory storage instead.
   [junit4]   2> 285109 INFO  (coreLoadExecutor-1681-thread-1) [    x:collection1] o.a.s.h.ReplicationHandler Commits will be reserved for 10000ms.
   [junit4]   2> 285109 INFO  (coreLoadExecutor-1681-thread-1) [    x:collection1] o.a.s.u.UpdateLog Could not find max version in index or recent updates, using new clock 1632434659982835712
   [junit4]   2> 285110 INFO  (searcherExecutor-1682-thread-1-processing-x:collection1) [    x:collection1] o.a.s.c.SolrCore [collection1] Registered new searcher Searcher@1f0336c9[collection1] main{ExitableDirectoryReader(UninvertingDirectoryReader())}
   [junit4]   2> 285208 INFO  (TEST-PeerSyncWithLeaderTest.test-seed#[A093278F8D056B8A]) [    ] o.a.s.SolrTestCaseJ4 Writing core.properties file to /home/jenkins/workspace/Lucene-Solr-8.x-Linux/solr/build/solr-core/test/J2/temp/solr.update.PeerSyncWithLeaderTest_A093278F8D056B8A-001/tempDir-001/shard0/cores/collection1
   [junit4]   2> 285208 WARN  (TEST-PeerSyncWithLeaderTest.test-seed#[A093278F8D056B8A]) [    ] o.e.j.s.AbstractConnector Ignoring deprecated socket close linger time
   [junit4]   2> 285209 INFO  (TEST-PeerSyncWithLeaderTest.test-seed#[A093278F8D056B8A]) [    ] o.a.s.c.s.e.JettySolrRunner Start Jetty (original configured port=0)
   [junit4]   2> 285209 INFO  (TEST-PeerSyncWithLeaderTest.test-seed#[A093278F8D056B8A]) [    ] o.a.s.c.s.e.JettySolrRunner Trying to start Jetty on port 0 try number 1 ...
   [junit4]   2> 285209 INFO  (TEST-PeerSyncWithLeaderTest.test-seed#[A093278F8D056B8A]) [    ] o.e.j.s.Server jetty-9.4.14.v20181114; built: 2018-11-14T21:20:31.478Z; git: c4550056e785fb5665914545889f21dc136ad9e6; jvm 11.0.2+9
   [junit4]   2> 285211 INFO  (TEST-PeerSyncWithLeaderTest.test-seed#[A093278F8D056B8A]) [    ] o.e.j.s.session DefaultSessionIdManager workerName=node0
   [junit4]   2> 285211 INFO  (TEST-PeerSyncWithLeaderTest.test-seed#[A093278F8D056B8A]) [    ] o.e.j.s.session No SessionScavenger set, using defaults
   [junit4]   2> 285211 INFO  (TEST-PeerSyncWithLeaderTest.test-seed#[A093278F8D056B8A]) [    ] o.e.j.s.session node0 Scavenging every 600000ms
   [junit4]   2> 285211 INFO  (TEST-PeerSyncWithLeaderTest.test-seed#[A093278F8D056B8A]) [    ] o.e.j.s.h.ContextHandler Started o.e.j.s.ServletContextHandler@5d988da5{/,null,AVAILABLE}
   [junit4]   2> 285211 INFO  (TEST-PeerSyncWithLeaderTest.test-seed#[A093278F8D056B8A]) [    ] o.e.j.s.AbstractConnector Started ServerConnector@3169c8d5{HTTP/1.1,[http/1.1, h2c]}{127.0.0.1:46331}
   [junit4]   2> 285211 INFO  (TEST-PeerSyncWithLeaderTest.test-seed#[A093278F8D056B8A]) [    ] o.e.j.s.Server Started @285238ms
   [junit4]   2> 285211 INFO  (TEST-PeerSyncWithLeaderTest.test-seed#[A093278F8D056B8A]) [    ] o.a.s.c.s.e.JettySolrRunner Jetty properties: {schema=schema.xml, hostContext=/, solrconfig=solrconfig-tlog.xml, hostPort=46331, coreRootDirectory=/home/jenkins/workspace/Lucene-Solr-8.x-Linux/solr/build/solr-core/test/J2/temp/solr.update.PeerSyncWithLeaderTest_A093278F8D056B8A-001/tempDir-001/shard0/cores}
   [junit4]   2> 285212 ERROR (TEST-PeerSyncWithLeaderTest.test-seed#[A093278F8D056B8A]) [    ] o.a.s.u.StartupLoggingUtils Missing Java Option solr.log.dir. Logging may be missing or incomplete.
   [junit4]   2> 285212 INFO  (TEST-PeerSyncWithLeaderTest.test-seed#[A093278F8D056B8A]) [    ] o.a.s.s.SolrDispatchFilter Using logger factory org.apache.logging.slf4j.Log4jLoggerFactory
   [junit4]   2> 285212 INFO  (TEST-PeerSyncWithLeaderTest.test-seed#[A093278F8D056B8A]) [    ] o.a.s.s.SolrDispatchFilter  ___      _       Welcome to Apache Solr™ version 8.2.0
   [junit4]   2> 285212 INFO  (TEST-PeerSyncWithLeaderTest.test-seed#[A093278F8D056B8A]) [    ] o.a.s.s.SolrDispatchFilter / __| ___| |_ _   Starting in standalone mode on port null
   [junit4]   2> 285212 INFO  (TEST-PeerSyncWithLeaderTest.test-seed#[A093278F8D056B8A]) [    ] o.a.s.s.SolrDispatchFilter \__ \/ _ \ | '_|  Install dir: null
   [junit4]   2> 285212 INFO  (TEST-PeerSyncWithLeaderTest.test-seed#[A093278F8D056B8A]) [    ] o.a.s.s.SolrDispatchFilter |___/\___/_|_|    Start time: 2019-05-02T15:30:08.540127Z
   [junit4]   2> 285212 INFO  (TEST-PeerSyncWithLeaderTest.test-seed#[A093278F8D056B8A]) [    ] o.a.s.c.SolrXmlConfig Loading container configuration from /home/jenkins/workspace/Lucene-Solr-8.x-Linux/solr/build/solr-core/test/J2/temp/solr.update.PeerSyncWithLeaderTest_A093278F8D056B8A-001/tempDir-001/shard0/solr.xml
   [junit4]   2> 285213 INFO  (TEST-PeerSyncWithLeaderTest.test-seed#[A093278F8D056B8A]) [    ] o.a.s.c.SolrXmlConfig Configuration parameter autoReplicaFailoverWorkLoopDelay is ignored
   [junit4]   2> 285213 INFO  (TEST-PeerSyncWithLeaderTest.test-seed#[A093278F8D056B8A]) [    ] o.a.s.c.SolrXmlConfig Configuration parameter autoReplicaFailoverBadNodeExpiration is ignored
   [junit4]   2> 285214 INFO  (TEST-PeerSyncWithLeaderTest.test-seed#[A093278F8D056B8A]) [    ] o.a.s.c.SolrXmlConfig MBean server found: com.sun.jmx.mbeanserver.JmxMBeanServer@4d7a4ba3, but no JMX reporters were configured - adding default JMX reporter.
   [junit4]   2> 285261 INFO  (TEST-PeerSyncWithLeaderTest.test-seed#[A093278F8D056B8A]) [    ] o.a.s.h.c.HttpShardHandlerFactory Host whitelist initialized: WhitelistHostChecker [whitelistHosts=null, whitelistHostCheckingEnabled=false]
   [junit4]   2> 285262 WARN  (TEST-PeerSyncWithLeaderTest.test-seed#[A093278F8D056B8A]) [    ] o.e.j.u.s.S.config No Client EndPointIdentificationAlgorithm configured for SslContextFactory@2e8ff8a7[provider=null,keyStore=null,trustStore=null]
   [junit4]   2> 285265 WARN  (TEST-PeerSyncWithLeaderTest.test-seed#[A093278F8D056B8A]) [    ] o.e.j.u.s.S.config No Client EndPointIdentificationAlgorithm configured for SslContextFactory@d25881b[provider=null,keyStore=null,trustStore=null]
   [junit4]   2> 285273 INFO  (TEST-PeerSyncWithLeaderTest.test-seed#[A093278F8D056B8A]) [    ] o.a.s.c.TransientSolrCoreCacheDefault Allocating transient cache for 4 transient cores
   [junit4]   2> 285273 INFO  (TEST-PeerSyncWithLeaderTest.test-seed#[A093278F8D056B8A]) [    ] o.a.s.h.a.MetricsHistoryHandler No .system collection, keeping metrics history in memory.
   [junit4]   2> 285284 INFO  (TEST-PeerSyncWithLeaderTest.test-seed#[A093278F8D056B8A]) [    ] o.a.s.m.r.SolrJmxReporter JMX monitoring for 'solr.node' (registry 'solr.node') enabled at server: com.sun.jmx.mbeanserver.JmxMBeanServer@4d7a4ba3
   [junit4]   2> 285293 INFO  (TEST-PeerSyncWithLeaderTest.test-seed#[A093278F8D056B8A]) [    ] o.a.s.m.r.SolrJmxReporter JMX monitoring for 'solr.jvm' (registry 'solr.jvm') enabled at server: com.sun.jmx.mbeanserver.JmxMBeanServer@4d7a4ba3
   [junit4]   2> 285293 INFO  (TEST-PeerSyncWithLeaderTest.test-seed#[A093278F8D056B8A]) [    ] o.a.s.m.r.SolrJmxReporter JMX monitoring for 'solr.jetty' (registry 'solr.jetty') enabled at server: com.sun.jmx.mbeanserver.JmxMBeanServer@4d7a4ba3
   [junit4]   2> 285294 INFO  (TEST-PeerSyncWithLeaderTest.test-seed#[A093278F8D056B8A]) [    ] o.a.s.c.CorePropertiesLocator Found 1 core definitions underneath /home/jenkins/workspace/Lucene-Solr-8.x-Linux/solr/build/solr-core/test/J2/temp/solr.update.PeerSyncWithLeaderTest_A093278F8D056B8A-001/tempDir-001/shard0/cores
   [junit4]   2> 285294 INFO  (TEST-PeerSyncWithLeaderTest.test-seed#[A093278F8D056B8A]) [    ] o.a.s.c.CorePropertiesLocator Cores are: [collection1]
   [junit4]   2> 285295 INFO  (coreLoadExecutor-1695-thread-1) [    x:collection1] o.a.s.c.SolrResourceLoader [null] Added 2 libs to classloader, from paths: [/home/jenkins/workspace/Lucene-Solr-8.x-Linux/solr/core/src/test-files/solr/collection1/lib, /home/jenkins/workspace/Lucene-Solr-8.x-Linux/solr/core/src/test-files/solr/collection1/lib/classes]
   [junit4]   2> 285306 INFO  (coreLoadExecutor-1695-thread-1) [    x:collection1] o.a.s.c.SolrConfig Using Lucene MatchVersion: 8.2.0
   [junit4]   2> 285339 INFO  (coreLoadExecutor-1695-thread-1) [    x:collection1] o.a.s.s.IndexSchema [collection1] Schema name=test
   [junit4]   2> 285443 INFO  (coreLoadExecutor-1695-thread-1) [    x:collection1] o.a.s.s.IndexSchema Loaded schema test/1.0 with uniqueid field id
   [junit4]   2> 285451 INFO  (coreLoadExecutor-1695-thread-1) [    x:collection1] o.a.s.c.CoreContainer Creating SolrCore 'collection1' using configuration from configset /home/jenkins/workspace/Lucene-Solr-8.x-Linux/solr/core/src/test-files/solr/collection1, trusted=true
   [junit4]   2> 285451 INFO  (coreLoadExecutor-1695-thread-1) [    x:collection1] o.a.s.m.r.SolrJmxReporter JMX monitoring for 'solr.core.collection1' (registry 'solr.core.collection1') enabled at server: com.sun.jmx.mbeanserver.JmxMBeanServer@4d7a4ba3
   [junit4]   2> 285452 INFO  (coreLoadExecutor-1695-thread-1) [    x:collection1] o.a.s.c.SolrCore [[collection1] ] Opening new SolrCore at [/home/jenkins/workspace/Lucene-Solr-8.x-Linux/solr/core/src/test-files/solr/collection1], dataDir=[/home/jenkins/workspace/Lucene-Solr-8.x-Linux/solr/build/solr-core/test/J2/temp/solr.update.PeerSyncWithLeaderTest_A093278F8D056B8A-001/tempDir-001/shard0/cores/collection1/data/]
   [junit4]   2> 285453 INFO  (coreLoadExecutor-1695-thread-1) [    x:collection1] o.a.s.u.RandomMergePolicy RandomMergePolicy wrapping class org.apache.lucene.index.TieredMergePolicy: [TieredMergePolicy: maxMergeAtOnce=42, maxMergeAtOnceExplicit=10, maxMergedSegmentMB=64.1552734375, floorSegmentMB=0.599609375, forceMergeDeletesPctAllowed=22.42510314334553, segmentsPerTier=26.0, maxCFSSegmentSizeMB=8.796093022207999E12, noCFSRatio=1.0, deletesPctAllowed=22.4799915936334
   [junit4]   2> 285456 WARN  (coreLoadExecutor-1695-thread-1) [    x:collection1] o.a.s.c.RequestHandlers INVALID paramSet a in requestHandler {type = requestHandler,name = /dump,class = DumpRequestHandler,attributes = {initParams=a, name=/dump, class=DumpRequestHandler},args = {defaults={a=A,b=B}}}
   [junit4]   2> 285483 INFO  (coreLoadExecutor-1695-thread-1) [    x:collection1] o.a.s.u.UpdateHandler Using UpdateLog implementation: org.apache.solr.update.UpdateLog
   [junit4]   2> 285483 INFO  (coreLoadExecutor-1695-thread-1) [    x:collection1] o.a.s.u.UpdateLog Initializing UpdateLog: dataDir= defaultSyncLevel=FLUSH numRecordsToKeep=100 maxNumLogsToKeep=10 numVersionBuckets=65536
   [junit4]   2> 285485 INFO  (coreLoadExecutor-1695-thread-1) [    x:collection1] o.a.s.u.CommitTracker Hard AutoCommit: disabled
   [junit4]   2> 285485 INFO  (coreLoadExecutor-1695-thread-1) [    x:collection1] o.a.s.u.CommitTracker Soft AutoCommit: disabled
   [junit4]   2> 285486 INFO  (coreLoadExecutor-1695-thread-1) [    x:collection1] o.a.s.u.RandomMergePolicy RandomMergePolicy wrapping class org.apache.lucene.index.AlcoholicMergePolicy: [AlcoholicMergePolicy: minMergeSize=0, mergeFactor=10, maxMergeSize=388791835, maxMergeSizeForForcedMerge=9223372036854775807, calibrateSizeByDeletes=true, maxMergeDocs=2147483647, maxCFSSegmentSizeMB=8.796093022207999E12, noCFSRatio=0.1]
   [junit4]   2> 285486 INFO  (coreLoadExecutor-1695-thread-1) [    x:collection1] o.a.s.s.SolrIndexSearcher Opening [Searcher@549f4e32[collection1] main]
   [junit4]   2> 285486 WARN  (coreLoadExecutor-1695-thread-1) [    x:collection1] o.a.s.r.ManagedResourceStorage Cannot write to config directory /home/jenkins/workspace/Lucene-Solr-8.x-Linux/solr/core/src/test-files/solr/collection1/conf; switching to use InMemory storage instead.
   [junit4]   2> 285486 INFO  (coreLoadExecutor-1695-thread-1) [    x:collection1] o.a.s.h.ReplicationHandler Commits will be reserved for 10000ms.
   [junit4]   2> 285487 INFO  (coreLoadExecutor-1695-thread-1) [    x:collection1] o.a.s.u.UpdateLog Could not find max version in index or recent updates, using new clock 1632434660379197440
   [junit4]   2> 285489 INFO  (searcherExecutor-1696-thread-1-processing-x:collection1) [    x:collection1] o.a.s.c.SolrCore [collection1] Registered new searcher Searcher@549f4e32[collection1] main{ExitableDirectoryReader(UninvertingDirectoryReader())}
   [junit4]   2> 285601 INFO  (TEST-PeerSyncWithLeaderTest.test-seed#[A093278F8D056B8A]) [    ] o.a.s.SolrTestCaseJ4 Writing core.properties file to /home/jenkins/workspace/Lucene-Solr-8.x-Linux/solr/build/solr-core/test/J2/temp/solr.update.PeerSyncWithLeaderTest_A093278F8D056B8A-001/tempDir-001/shard1/cores/collection1
   [junit4]   2> 285601 WARN  (TEST-PeerSyncWithLeaderTest.test-seed#[A093278F8D056B8A]) [    ] o.e.j.s.AbstractConnector Ignoring deprecated socket close linger time
   [junit4]   2> 285601 INFO  (TEST-PeerSyncWithLeaderTest.test-seed#[A093278F8D056B8A]) [    ] o.a.s.c.s.e.JettySolrRunner Start Jetty (original configured port=0)
   [junit4]   2> 285601 INFO  (TEST-PeerSyncWithLeaderTest.test-seed#[A093278F8D056B8A]) [    ] o.a.s.c.s.e.JettySolrRunner Trying to start Jetty on port 0 try number 1 ...
   [junit4]   2> 285601 INFO  (TEST-PeerSyncWithLeaderTest.test-seed#[A093278F8D056B8A]) [    ] o.e.j.s.Server jetty-9.4.14.v20181114; built: 2018-11-14T21:20:31.478Z; git: c4550056e785fb5665914545889f21dc136ad9e6; jvm 11.0.2+9
   [junit4]   2> 285602 INFO  (TEST-PeerSyncWithLeaderTest.test-seed#[A093278F8D056B8A]) [    ] o.e.j.s.session DefaultSessionIdManager workerName=node0
   [junit4]   2> 285602 INFO  (TEST-PeerSyncWithLeaderTest.test-seed#[A093278F8D056B8A]) [    ] o.e.j.s.session No SessionScavenger set, using defaults
   [junit4]   2> 285602 INFO  (TEST-PeerSyncWithLeaderTest.test-seed#[A093278F8D056B8A]) [    ] o.e.j.s.session node0 Scavenging every 660000ms
   [junit4]   2> 285602 INFO  (TEST-PeerSyncWithLeaderTest.test-seed#[A093278F8D056B8A]) [    ] o.e.j.s.h.ContextHandler Started o.e.j.s.ServletContextHandler@6065cdb0{/,null,AVAILABLE}
   [junit4]   2> 285603 INFO  (TEST-PeerSyncWithLeaderTest.test-seed#[A093278F8D056B8A]) [    ] o.e.j.s.AbstractConnector Started ServerConnector@1bbc3293{HTTP/1.1,[http/1.1, h2c]}{127.0.0.1:42647}
   [junit4]   2> 285603 INFO  (TEST-PeerSyncWithLeaderTest.test-seed#[A093278F8D056B8A]) [    ] o.e.j.s.Server Started @285629ms
   [junit4]   2> 285603 INFO  (TEST-PeerSyncWithLeaderTest.test-seed#[A093278F8D056B8A]) [    ] o.a.s.c.s.e.JettySolrRunner Jetty properties: {schema=schema.xml, hostContext=/, solrconfig=solrconfig-tlog.xml, hostPort=42647, coreRootDirectory=/home/jenkins/workspace/Lucene-Solr-8.x-Linux/solr/build/solr-core/test/J2/temp/solr.update.PeerSyncWithLeaderTest_A093278F8D056B8A-001/tempDir-001/shard1/cores}
   [junit4]   2> 285603 ERROR (TEST-PeerSyncWithLeaderTest.test-seed#[A093278F8D056B8A]) [    ] o.a.s.u.StartupLoggingUtils Missing Java Option solr.log.dir. Logging may be missing or incomplete.
   [junit4]   2> 285603 INFO  (TEST-PeerSyncWithLeaderTest.test-seed#[A093278F8D056B8A]) [    ] o.a.s.s.SolrDispatchFilter Using logger factory org.apache.logging.slf4j.Log4jLoggerFactory
   [junit4]   2> 285603 INFO  (TEST-PeerSyncWithLeaderTest.test-seed#[A093278F8D056B8A]) [    ] o.a.s.s.SolrDispatchFilter  ___      _       Welcome to Apache Solr™ version 8.2.0
   [junit4]   2> 285603 INFO  (TEST-PeerSyncWithLeaderTest.test-seed#[A093278F8D056B8A]) [    ] o.a.s.s.SolrDispatchFilter / __| ___| |_ _   Starting in standalone mode on port null
   [junit4]   2> 285603 INFO  (TEST-PeerSyncWithLeaderTest.test-seed#[A093278F8D056B8A]) [    ] o.a.s.s.SolrDispatchFilter \__ \/ _ \ | '_|  Install dir: null
   [junit4]   2> 285603 INFO  (TEST-PeerSyncWithLeaderTest.test-seed#[A093278F8D056B8A]) [    ] o.a.s.s.SolrDispatchFilter |___/\___/_|_|    Start time: 2019-05-02T15:30:08.931686Z
   [junit4]   2> 285603 INFO  (TEST-PeerSyncWithLeaderTest.test-seed#[A093278F8D056B8A]) [    ] o.a.s.c.SolrXmlConfig Loading container configuration from /home/jenkins/workspace/Lucene-Solr-8.x-Linux/solr/build/solr-core/test/J2/temp/solr.update.PeerSyncWithLeaderTest_A093278F8D056B8A-001/tempDir-001/shard1/solr.xml
   [junit4]   2> 285605 INFO  (TEST-PeerSyncWithLeaderTest.test-seed#[A093278F8D056B8A]) [    ] o.a.s.c.SolrXmlConfig Configuration parameter autoReplicaFailoverWorkLoopDelay is ignored
   [junit4]   2> 285605 INFO  (TEST-PeerSyncWithLeaderTest.test-seed#[A093278F8D056B8A]) [    ] o.a.s.c.SolrXmlConfig Configuration parameter autoReplicaFailoverBadNodeExpiration is ignored
   [junit4]   2> 285606 INFO  (TEST-PeerSyncWithLeaderTest.test-seed#[A093278F8D056B8A]) [    ] o.a.s.c.SolrXmlConfig MBean server found: com.sun.jmx.mbeanserver.JmxMBeanServer@4d7a4ba3, but no JMX reporters were configured - adding default JMX reporter.
   [junit4]   2> 285691 INFO  (TEST-PeerSyncWithLeaderTest.test-seed#[A093278F8D056B8A]) [    ] o.a.s.h.c.HttpShardHandlerFactory Host whitelist initialized: WhitelistHostChecker [whitelistHosts=null, whitelistHostCheckingEnabled=false]
   [junit4]   2> 285692 WARN  (TEST-PeerSyncWithLeaderTest.test-seed#[A093278F8D056B8A]) [    ] o.e.j.u.s.S.config No Client EndPointIdentificationAlgorithm configured for SslContextFactory@159e29d5[provider=null,keyStore=null,trustStore=null]
   [junit4]   2> 285694 WARN  (TEST-PeerSyncWithLeaderTest.test-seed#[A093278F8D056B8A]) [    ] o.e.j.u.s.S.config No Client EndPointIdentificationAlgorithm configured for SslContextFactory@7d7f571e[provider=null,keyStore=null,trustStore=null]
   [junit4]   2> 285704 INFO  (TEST-PeerSyncWithLeaderTest.test-seed#[A093278F8D056B8A]) [    ] o.a.s.c.TransientSolrCoreCacheDefault Allocating transient cache for 4 transient cores
   [junit4]   2> 285704 INFO  (TEST-PeerSyncWithLeaderTest.test-seed#[A093278F8D056B8A]) [    ] o.a.s.h.a.MetricsHistoryHandler No .system collection, keeping metrics history in memory.
   [junit4]   2> 285715 INFO  (TEST-PeerSyncWithLeaderTest.test-seed#[A093278F8D056B8A]) [    ] o.a.s.m.r.SolrJmxReporter JMX monitoring for 'solr.node' (registry 'solr.node') enabled at server: com.sun.jmx.mbeanserver.JmxMBeanServer@4d7a4ba3
   [junit4]   2> 285723 INFO  (TEST-PeerSyncWithLeaderTest.test-seed#[A093278F8D056B8A]) [    ] o.a.s.m.r.SolrJmxReporter JMX monitoring for 'solr.jvm' (registry 'solr.jvm') enabled at server: com.sun.jmx.mbeanserver.JmxMBeanServer@4d7a4ba3
   [junit4]   2> 285723 INFO  (TEST-PeerSyncWithLeaderTest.test-seed#[A093278F8D056B8A]) [    ] o.a.s.m.r.SolrJmxReporter JMX monitoring for 'solr.jetty' (registry 'solr.jetty') enabled at server: com.sun.jmx.mbeanserver.JmxMBeanServer@4d7a4ba3
   [junit4]   2> 285724 INFO  (TEST-PeerSyncWithLeaderTest.test-seed#[A093278F8D056B8A]) [    ] o.a.s.c.CorePropertiesLocator Found 1 core definitions underneath /home/jenkins/workspace/Lucene-Solr-8.x-Linux/solr/build/solr-core/test/J2/temp/solr.update.PeerSyncWithLeaderTest_A093278F8D056B8A-001/tempDir-001/shard1/cores
   [junit4]   2> 285724 INFO  (TEST-PeerSyncWithLeaderTest.test-seed#[A093278F8D056B8A]) [    ] o.a.s.c.CorePropertiesLocator Cores are: [collection1]
   [junit4]   2> 285725 INFO  (coreLoadExecutor-1709-thread-1) [    x:collection1] o.a.s.c.SolrResourceLoader [null] Added 2 libs to classloader, from paths: [/home/jenkins/workspace/Lucene-Solr-8.x-Linux/solr/core/src/test-files/solr/collection1/lib, /home/jenkins/workspace/Lucene-Solr-8.x-Linux/solr/core/src/test-files/solr/collection1/lib/classes]
   [junit4]   2> 285739 INFO  (coreLoadExecutor-1709-thread-1) [    x:collection1] o.a.s.c.SolrConfig Using Lucene MatchVersion: 8.2.0
   [junit4]   2> 285754 INFO  (coreLoadExecutor-1709-thread-1) [    x:collection1] o.a.s.s.IndexSchema [collection1] Schema name=test
   [junit4]   2> 285852 INFO  (coreLoadExecutor-1709-thread-1) [    x:collection1] o.a.s.s.IndexSchema Loaded schema test/1.0 with uniqueid field id
   [junit4]   2> 285862 INFO  (coreLoadExecutor-1709-thread-1) [    x:collection1] o.a.s.c.CoreContainer Creating SolrCore 'collection1' using configuration from configset /home/jenkins/workspace/Lucene-Solr-8.x-Linux/solr/core/src/test-files/solr/collection1, trusted=true
   [junit4]   2> 285862 INFO  (coreLoadExecutor-1709-thread-1) [    x:collection1] o.a.s.m.r.SolrJmxReporter JMX monitoring for 'solr.core.collection1' (registry 'solr.core.collection1') enabled at server: com.sun.jmx.mbeanserver.JmxMBeanServer@4d7a4ba3
   [junit4]   2> 285862 INFO  (coreLoadExecutor-1709-thread-1) [    x:collection1] o.a.s.c.SolrCore [[collection1] ] Opening new SolrCore at [/home/jenkins/workspace/Lucene-Solr-8.x-Linux/solr/core/src/test-files/solr/collection1], dataDir=[/home/jenkins/workspace/Lucene-Solr-8.x-Linux/solr/build/solr-core/test/J2/temp/solr.update.PeerSyncWithLeaderTest_A093278F8D056B8A-001/tempDir-001/shard1/cores/collection1/data/]
   [junit4]   2> 285864 INFO  (coreLoadExecutor-1709-thread-1) [    x:collection1] o.a.s.u.RandomMergePolicy RandomMergePolicy wrapping class org.apache.lucene.index.TieredMergePolicy: [TieredMergePolicy: maxMergeAtOnce=42, maxMergeAtOnceExplicit=10, maxMergedSegmentMB=64.1552734375, floorSegmentMB=0.599609375, forceMergeDeletesPctAllowed=22.42510314334553, segmentsPerTier=26.0, maxCFSSegmentSizeMB=8.796093022207999E12, noCFSRatio=1.0, deletesPctAllowed=22.4799915936334
   [junit4]   2> 285865 WARN  (coreLoadExecutor-1709-thread-1) [    x:collection1] o.a.s.c.RequestHandlers INVALID paramSet a in requestHandler {type = requestHandler,name = /dump,class = DumpRequestHandler,attributes = {initParams=a, name=/dump, class=DumpRequestHandler},args = {defaults={a=A,b=B}}}
   [junit4]   2> 285913 INFO  (coreLoadExecutor-1709-thread-1) [    x:collection1] o.a.s.u.UpdateHandler Using UpdateLog implementation: org.apache.solr.update.UpdateLog
   [junit4]   2> 285913 INFO  (coreLoadExecutor-1709-thread-1) [    x:collection1] o.a.s.u.UpdateLog Initializing UpdateLog: dataDir= defaultSyncLevel=FLUSH numRecordsToKeep=100 maxNumLogsToKeep=10 numVersionBuckets=65536
   [junit4]   2> 285916 INFO  (coreLoadExecutor-1709-thread-1) [    x:collection1] o.a.s.u.CommitTracker Hard AutoCommit: disabled
   [junit4]   2> 285916 INFO  (coreLoadExecutor-1709-thread-1) [    x:collection1] o.a.s.u.CommitTracker Soft AutoCommit: disabled
   [junit4]   2> 285917 INFO  (coreLoadExecutor-1709-thread-1) [    x:collection1] o.a.s.u.RandomMergePolicy RandomMergePolicy wrapping class org.apache.lucene.index.AlcoholicMergePolicy: [AlcoholicMergePolicy: minMergeSize=0, mergeFactor=10, maxMergeSize=388791835, maxMergeSizeForForcedMerge=9223372036854775807, calibrateSizeByDeletes=true, maxMergeDocs=2147483647, maxCFSSegmentSizeMB=8.796093022207999E12, noCFSRatio=0.1]
   [junit4]   2> 285917 INFO  (coreLoadExecutor-1709-thread-1) [    x:collection1] o.a.s.s.SolrIndexSearcher Opening [Searcher@2c7d36b5[collection1] main]
   [junit4]   2> 285917 WARN  (coreLoadExecutor-1709-thread-1) [    x:collection1] o.a.s.r.ManagedResourceStorage Cannot write to config directory /home/jenkins/workspace/Lucene-Solr-8.x-Linux/solr/core/src/test-files/solr/collection1/conf; switching to use InMemory storage instead.
   [junit4]   2> 285918 INFO  (coreLoadExecutor-1709-thread-1) [    x:collection1] o.a.s.h.ReplicationHandler Commits will be reserved for 10000ms.
   [junit4]   2> 285918 INFO  (coreLoadExecutor-1709-thread-1) [    x:collection1] o.a.s.u.UpdateLog Could not find max version in index or recent updates, using new clock 1632434660831133696
   [junit4]   2> 285920 INFO  (searcherExecutor-1710-thread-1-processing-x:collection1) [    x:collection1] o.a.s.c.SolrCore [collection1] Registered new searcher Searcher@2c7d36b5[collection1] main{ExitableDirectoryReader(UninvertingDirectoryReader())}
   [junit4]   2> 286011 INFO  (TEST-PeerSyncWithLeaderTest.test-seed#[A093278F8D056B8A]) [    ] o.a.s.SolrTestCaseJ4 Writing core.properties file to /home/jenkins/workspace/Lucene-Solr-8.x-Linux/solr/build/solr-core/test/J2/temp/solr.update.PeerSyncWithLeaderTest_A093278F8D056B8A-001/tempDir-001/shard2/cores/collection1
   [junit4]   2> 286011 WARN  (TEST-PeerSyncWithLeaderTest.test-seed#[A093278F8D056B8A]) [    ] o.e.j.s.AbstractConnector Ignoring deprecated socket close linger time
   [junit4]   2> 286012 INFO  (TEST-PeerSyncWithLeaderTest.test-seed#[A093278F8D056B8A]) [    ] o.a.s.c.s.e.JettySolrRunner Start Jetty (original configured port=0)
   [junit4]   2> 286012 INFO  (TEST-PeerSyncWithLeaderTest.test-seed#[A093278F8D056B8A]) [    ] o.a.s.c.s.e.JettySolrRunner Trying to start Jetty on port 0 try number 1 ...
   [junit4]   2> 286012 INFO  (TEST-PeerSyncWithLeaderTest.test-seed#[A093278F8D056B8A]) [    ] o.e.j.s.Server jetty-9.4.14.v20181114; built: 2018-11-14T21:20:31.478Z; git: c4550056e785fb5665914545889f21dc136ad9e6; jvm 11.0.2+9
   [junit4]   2> 286023 INFO  (TEST-PeerSyncWithLeaderTest.test-seed#[A093278F8D056B8A]) [    ] o.e.j.s.session DefaultSessionIdManager workerName=node0
   [junit4]   2> 286023 INFO  (TEST-PeerSyncWithLeaderTest.test-seed#[A093278F8D056B8A]) [    ] o.e.j.s.session No SessionScavenger set, using defaults
   [junit4]   2> 286023 INFO  (TEST-PeerSyncWithLeaderTest.test-seed#[A093278F8D056B8A]) [    ] o.e.j.s.session node0 Scavenging every 600000ms
   [junit4]   2> 286024 INFO  (TEST-PeerSyncWithLeaderTest.test-seed#[A093278F8D056B8A]) [    ] o.e.j.s.h.ContextHandler Started o.e.j.s.ServletContextHandler@7cfb9151{/,null,AVAILABLE}
   [junit4]   2> 286024 INFO  (TEST-PeerSyncWithLeaderTest.test-seed#[A093278F8D056B8A]) [    ] o.e.j.s.AbstractConnector Started ServerConnector@54895601{HTTP/1.1,[http/1.1, h2c]}{127.0.0.1:39437}
   [junit4]   2> 286024 INFO  (TEST-PeerSyncWithLeaderTest.test-seed#[A093278F8D056B8A]) [    ] o.e.j.s.Server Started @286051ms
   [junit4]   2> 286024 INFO  (TEST-PeerSyncWithLeaderTest.test-seed#[A093278F8D056B8A]) [    ] o.a.s.c.s.e.JettySolrRunner Jetty properties: {schema=schema.xml, hostContext=/, solrconfig=solrconfig-tlog.xml, hostPort=39437, coreRootDirectory=/home/jenkins/workspace/Lucene-Solr-8.x-Linux/solr/build/solr-core/test/J2/temp/solr.update.PeerSyncWithLeaderTest_A093278F8D056B8A-001/tempDir-001/shard2/cores}
   [junit4]   2> 286025 ERROR (TEST-PeerSyncWithLeaderTest.test-seed#[A093278F8D056B8A]) [    ] o.a.s.u.StartupLoggingUtils Missing Java Option solr.log.dir. Logging may be missing or incomplete.
   [junit4]   2> 286025 INFO  (TEST-PeerSyncWithLeaderTest.test-seed#[A093278F8D056B8A]) [    ] o.a.s.s.SolrDispatchFilter Using logger factory org.apache.logging.slf4j.Log4jLoggerFactory
   [junit4]   2> 286025 INFO  (TEST-PeerSyncWithLeaderTest.test-seed#[A093278F8D056B8A]) [    ] o.a.s.s.SolrDispatchFilter  ___      _       Welcome to Apache Solr™ version 8.2.0
   [junit4]   2> 286025 INFO  (TEST-PeerSyncWithLeaderTest.test-seed#[A093278F8D056B8A]) [    ] o.a.s.s.SolrDispatchFilter / __| ___| |_ _   Starting in standalone mode on port null
   [junit4]   2> 286025 INFO  (TEST-PeerSyncWithLeaderTest.test-seed#[A093278F8D056B8A]) [    ] o.a.s.s.SolrDispatchFilter \__ \/ _ \ | '_|  Install dir: null
   [junit4]   2> 286025 INFO  (TEST-PeerSyncWithLeaderTest.test-seed#[A093278F8D056B8A]) [    ] o.a.s.s.SolrDispatchFilter |___/\___/_|_|    Start time: 2019-05-02T15:30:09.353206Z
   [junit4]   2> 286025 INFO  (TEST-PeerSyncWithLeaderTest.test-seed#[A093278F8D056B8A]) [    ] o.a.s.c.SolrXmlConfig Loading container configuration from /home/jenkins/workspace/Lucene-Solr-8.x-Linux/solr/build/solr-core/test/J2/temp/solr.update.PeerSyncWithLeaderTest_A093278F8D056B8A-001/tempDir-001/shard2/solr.xml
   [junit4]   2> 286026 INFO  (TEST-PeerSyncWithLeaderTest.test-seed#[A093278F8D056B8A]) [    ] o.a.s.c.SolrXmlConfig Configuration parameter autoReplicaFailoverWorkLoopDelay is ignored
   [junit4]   2> 286026 INFO  (TEST-PeerSyncWithLeaderTest.test-seed#[A093278F8D056B8A]) [    ] o.a.s.c.SolrXmlConfig Configuration parameter autoReplicaFailoverBadNodeExpiration is ignored
   [junit4]   2> 286027 INFO  (TEST-PeerSyncWithLeaderTest.test-seed#[A093278F8D056B8A]) [    ] o.a.s.c.SolrXmlConfig MBean server found: com.sun.jmx.mbeanserver.JmxMBeanServer@4d7a4ba3, but no JMX reporters were configured - adding default JMX reporter.
   [junit4]   2> 286098 INFO  (TEST-PeerSyncWithLeaderTest.test-seed#[A093278F8D056B8A]) [    ] o.a.s.h.c.HttpShardHandlerFactory Host whitelist initialized: WhitelistHostChecker [whitelistHosts=null, whitelistHostCheckingEnabled=false]
   [junit4]   2> 286099 WARN  (TEST-PeerSyncWithLeaderTest.test-seed#[A093278F8D056B8A]) [    ] o.e.j.u.s.S.config No Client EndPointIdentificationAlgorithm configured for SslContextFactory@14795a12[provider=null,keyStore=null,trustStore=null]
   [junit4]   2> 286102 WARN  (TEST-PeerSyncWithLeaderTest.test-seed#[A093278F8D056B8A]) [    ] o.e.j.u.s.S.config No Client EndPointIdentificationAlgorithm configured for SslContextFactory@3bc836d3[provider=null,keyStore=null,trustStore=null]
   [junit4]   2> 286115 INFO  (TEST-PeerSyncWithLeaderTest.test-seed#[A093278F8D056B8A]) [    ] o.a.s.c.TransientSolrCoreCacheDefault Allocating transient cache for 4 transient cores
   [junit4]   2> 286115 INFO  (TEST-PeerSyncWithLeaderTest.test-seed#[A093278F8D056B8A]) [    ] o.a.s.h.a.MetricsHistoryHandler No .system collection, keeping metrics history in memory.
   [junit4]   2> 286131 INFO  (TEST-PeerSyncWithLeaderTest.test-seed#[A093278F8D056B8A]) [    ] o.a.s.m.r.SolrJmxReporter JMX monitoring for 'solr.node' (registry 'solr.node') enabled at server: com.sun.jmx.mbeanserver.JmxMBeanServer@4d7a4ba3
   [junit4]   2> 286140 INFO  (TEST-PeerSyncWithLeaderTest.test-seed#[A093278F8D056B8A]) [    ] o.a.s.m.r.SolrJmxReporter JMX monitoring for 'solr.jvm' (registry 'solr.jvm') enabled at server: com.sun.jmx.mbeanserver.JmxMBeanServer@4d7a4ba3
   [junit4]   2> 286140 INFO  (TEST-PeerSyncWithLeaderTest.test-seed#[A093278F8D056B8A]) [    ] o.a.s.m.r.SolrJmxReporter JMX monitoring for 'solr.jetty' (registry 'solr.jetty') enabled at server: com.sun.jmx.mbeanserver.JmxMBeanServer@4d7a4ba3
   [junit4]   2> 286141 INFO  (TEST-PeerSyncWithLeaderTest.test-seed#[A093278F8D056B8A]) [    ] o.a.s.c.CorePropertiesLocator Found 1 core definitions underneath /home/jenkins/workspace/Lucene-Solr-8.x-Linux/solr/build/solr-core/test/J2/temp/solr.update.PeerSyncWithLeaderTest_A093278F8D056B8A-001/tempDir-001/shard2/cores
   [junit4]   2> 286141 INFO  (TEST-PeerSyncWithLeaderTest.test-seed#[A093278F8D056B8A]) [    ] o.a.s.c.CorePropertiesLocator Cores are: [collection1]
   [junit4]   2> 286142 INFO  (coreLoadExecutor-1723-thread-1) [    x:collection1] o.a.s.c.SolrResourceLoader [null] Added 2 libs to classloader, from paths: [/home/jenkins/workspace/Lucene-Solr-8.x-Linux/solr/core/src/test-files/solr/collection1/lib, /home/jenkins/workspace/Lucene-Solr-8.x-Linux/solr/core/src/test-files/solr/collection1/lib/classes]
   [junit4]   2> 286156 INFO  (coreLoadExecutor-1723-thread-1) [    x:collection1] o.a.s.c.SolrConfig Using Lucene MatchVersion: 8.2.0
   [junit4]   2> 286170 INFO  (coreLoadExecutor-1723-thread-1) [    x:collection1] o.a.s.s.IndexSchema [collection1] Schema name=test
   [junit4]   2> 286265 INFO  (coreLoadExecutor-1723-thread-1) [    x:collection1] o.a.s.s.IndexSchema Loaded schema test/1.0 with uniqueid field id
   [junit4]   2> 286273 INFO  (coreLoadExecutor-1723-thread-1) [    x:collection1] o.a.s.c.CoreContainer Creating SolrCore 'collection1' using configuration from configset /home/jenkins/workspace/Lucene-Solr-8.x-Linux/solr/core/src/test-files/solr/collection1, trusted=true
   [junit4]   2> 286274 INFO  (coreLoadExecutor-1723-thread-1) [    x:collection1] o.a.s.m.r.SolrJmxReporter JMX monitoring for 'solr.core.collection1' (registry 'solr.core.collection1') enabled at server: com.sun.jmx.mbeanserver.JmxMBeanServer@4d7a4ba3
   [junit4]   2> 286274 INFO  (coreLoadExecutor-1723-thread-1) [    x:collection1] o.a.s.c.SolrCore [[collection1] ] Opening new SolrCore at [/home/jenkins/workspace/Lucene-Solr-8.x-Linux/solr/core/src/test-files/solr/collection1], dataDir=[/home/jenkins/workspace/Lucene-Solr-8.x-Linux/solr/build/solr-core/test/J2/temp/solr.update.PeerSyncWithLeaderTest_A093278F8D056B8A-001/tempDir-001/shard2/cores/collection1/data/]
   [junit4]   2> 286275 INFO  (coreLoadExecutor-1723-thread-1) [    x:collection1] o.a.s.u.RandomMergePolicy RandomMergePolicy wrapping class org.apache.lucene.index.TieredMergePolicy: [TieredMergePolicy: maxMergeAtOnce=42, maxMergeAtOnceExplicit=10, maxMergedSegmentMB=64.1552734375, floorSegmentMB=0.599609375, forceMergeDeletesPctAllowed=22.42510314334553, segmentsPerTier=26.0, maxCFSSegmentSizeMB=8.796093022207999E12, noCFSRatio=1.0, deletesPctAllowed=22.4799915936334
   [junit4]   2> 286276 WARN  (coreLoadExecutor-1723-thread-1) [    x:collection1] o.a.s.c.RequestHandlers INVALID paramSet a in requestHandler {type = requestHandler,name = /dump,class = DumpRequestHandler,attributes = {initParams=a, name=/dump, class=DumpRequestHandler},args = {defaults={a=A,b=B}}}
   [junit4]   2> 286300 INFO  (coreLoadExecutor-1723-thread-1) [    x:collection1] o.a.s.u.UpdateHandler Using UpdateLog implementation: org.apache.solr.update.UpdateLog
   [junit4]   2> 286300 INFO  (coreLoadExecutor-1723-thread-1) [    x:collection1] o.a.s.u.UpdateLog Initializing UpdateLog: dataDir= defaultSyncLevel=FLUSH numRecordsToKeep=100 maxNumLogsToKeep=10 numVersionBuckets=65536
   [junit4]   2> 286301 INFO  (coreLoadExecutor-1723-thread-1) [    x:collection1] o.a.s.u.CommitTracker Hard AutoCommit: disabled
   [junit4]   2> 286301 INFO  (coreLoadExecutor-1723-thread-1) [    x:collection1] o.a.s.u.CommitTracker Soft AutoCommit: disabled
   [junit4]   2> 286301 INFO  (coreLoadExecutor-1723-thread-1) [    x:collection1] o.a.s.u.RandomMergePolicy RandomMergePolicy wrapping class org.apache.lucene.index.AlcoholicMergePolicy: [AlcoholicMergePolicy: minMergeSize=0, mergeFactor=10, maxMergeSize=388791835, maxMergeSizeForForcedMerge=9223372036854775807, calibrateSizeByDeletes=true, maxMergeDocs=2147483647, maxCFSSegmentSizeMB=8.796093022207999E12, noCFSRatio=0.1]
   [junit4]   2> 286302 INFO  (coreLoadExecutor-1723-thread-1) [    x:collection1] o.a.s.s.SolrIndexSearcher Opening [Searcher@34445d4e[collection1] main]
   [junit4]   2> 286302 WARN  (coreLoadExecutor-1723-thread-1) [    x:collection1] o.a.s.r.ManagedResourceStorage Cannot write to config directory /home/jenkins/workspace/Lucene-Solr-8.x-Linux/solr/core/src/test-files/solr/collection1/conf; switching to use InMemory storage instead.
   [junit4]   2> 286302 INFO  (coreLoadExecutor-1723-thread-1) [    x:collection1] o.a.s.h.ReplicationHandler Commits will be reserved for 10000ms.
   [junit4]   2> 286302 INFO  (coreLoadExecutor-1723-thread-1) [    x:collection1] o.a.s.u.UpdateLog Could not find max version in index or recent updates, using new clock 1632434661233786880
   [junit4]   2> 286304 INFO  (TEST-PeerSyncWithLeaderTest.test-seed#[A093278F8D056B8A]) [    ] o.a.s.SolrTestCaseJ4 ###Starting test
   [junit4]   2> 286304 INFO  (searcherExecutor-1724-thread-1-processing-x:collection1) [    x:collection1] o.a.s.c.SolrCore [collection1] Registered new searcher Searcher@34445d4e[collection1] main{ExitableDirectoryReader(UninvertingDirectoryReader())}
   [junit4]   2> 286308 INFO  (qtp926984084-5464) [    x:collection1] o.a.s.u.p.LogUpdateProcessorFactory [collection1]  webapp= path=/update params={update.distrib=FROMLEADER&wt=javabin&version=2}{add=[1 (1)]} 0 1
   [junit4]   2> 286312 WARN  (qtp273936345-5485) [    x:collection1] o.a.s.u.PeerSyncWithLeader no frame of reference to tell if we've missed updates
   [junit4]   2> 286312 INFO  (qtp273936345-5485) [    x:collection1] o.a.s.c.S.Request [collection1]  webapp= path=/get params={syncWithLeader=http://127.0.0.1:46331/collection1&qt=/get&getVersions=100&wt=javabin&version=2} status=0 QTime=0
   [junit4]   2> 286314 INFO  (qtp273936345-5486) [    x:collection1] o.a.s.u.p.LogUpdateProcessorFactory [collection1]  webapp= path=/update params={update.distrib=FROMLEADER&wt=javabin&version=2}{add=[1 (1)]} 0 1
   [junit4]   2> 286315 INFO  (qtp273936345-5484) [    x:collection1] o.a.s.u.PeerSyncWithLeader PeerSync: core=collection1 url= START leader=http://127.0.0.1:46331/collection1 nUpdates=100
   [junit4]   2> 286318 INFO  (qtp926984084-5463) [    x:collection1] o.a.s.s.SolrIndexSearcher Opening [Searcher@4f267bc0[collection1] realtime]
   [junit4]   2> 286318 INFO  (qtp926984084-5463) [    x:collection1] o.a.s.u.IndexFingerprint IndexFingerprint millis:2.0 result:{maxVersionSpecified=9223372036854775807, maxVersionEncountered=1, maxInHash=1, versionsHash=-5451962507482445012, numVersions=1, numDocs=1, maxDoc=1}
   [junit4]   2> 286318 INFO  (qtp926984084-5463) [    x:collection1] o.a.s.c.S.Request [collection1]  webapp= path=/get params={distrib=false&qt=/get&getFingerprint=9223372036854775807&wt=javabin&version=2} status=0 QTime=3
   [junit4]   2> 286321 INFO  (qtp273936345-5484) [    x:collection1] o.a.s.s.SolrIndexSearcher Opening [Searcher@21a8869e[collection1] realtime]
   [junit4]   2> 286321 INFO  (qtp273936345-5484) [    x:collection1] o.a.s.u.IndexFingerprint IndexFingerprint millis:2.0 result:{maxVersionSpecified=9223372036854775807, maxVersionEncountered=1, maxInHash=1, versionsHash=-5451962507482445012, numVersions=1, numDocs=1, maxDoc=1}
   [junit4]   2> 286321 INFO  (qtp273936345-5484) [    x:collection1] o.a.s.u.PeerSyncWithLeader Fingerprint comparison result: 0
   [junit4]   2> 286321 INFO  (qtp273936345-5484) [    x:collection1] o.a.s.c.S.Request [collection1]  webapp= path=/get params={syncWithLeader=http://127.0.0.1:46331/collection1&qt=/get&getVersions=100&wt=javabin&version=2} status=0 QTime=7
   [junit4]   2> 286322 INFO  (qtp926984084-5464) [    x:collection1] o.a.s.u.DirectUpdateHandler2 start commit{_version_=1632434661254758400,optimize=false,openSearcher=true,waitSearcher=true,expungeDeletes=false,softCommit=false,prepareCommit=false}
   [junit4]   2> 286322 INFO  (qtp926984084-5464) [    x:collection1] o.a.s.u.SolrIndexWriter Calling setCommitData with IW:org.apache.solr.update.SolrIndexWriter@9957501 commitCommandVersion:1632434661254758400
   [junit4]   2> 286323 INFO  (qtp926984084-5464) [    x:collection1] o.a.s.s.SolrIndexSearcher Opening [Searcher@b9af732[collection1] main]
   [junit4]   2> 286324 INFO  (qtp926984084-5464) [    x:collection1] o.a.s.u.DirectUpdateHandler2 end_commit_flush
   [junit4]   2> 286324 INFO  (searcherExecutor-1696-thread-1-processing-x:collection1) [    x:collection1] o.a.s.c.SolrCore [collection1] Registered new searcher Searcher@b9af732[collection1] main{ExitableDirectoryReader(UninvertingDirectoryReader(Uninverting(_0(8.2.0):c1:[diagnostics={os=Linux, java.vendor=Oracle Corporation, java.version=11.0.2, java.vm.version=11.0.2+9, lucene.version=8.2.0, os.arch=amd64, java.runtime.version=11.0.2+9, source=flush, os.version=4.18.0-17-generic, timestamp=1556811009645}]:[attributes={Lucene50StoredFieldsFormat.mode=BEST_SPEED}])))}
   [junit4]   2> 286324 INFO  (qtp926984084-5464) [    x:collection1] o.a.s.u.p.LogUpdateProcessorFactory [collection1]  webapp= path=/update params={waitSearcher=true&commit=true&softCommit=false&wt=javabin&version=2}{commit=} 0 2
   [junit4]   2> 286325 INFO  (qtp273936345-5485) [    x:collection1] o.a.s.u.DirectUpdateHandler2 start commit{_version_=1632434661257904128,optimize=false,openSearcher=true,waitSearcher=true,expungeDeletes=false,softCommit=false,prepareCommit=false}
   [junit4]   2> 286325 INFO  (qtp273936345-5485) [    x:collection1] o.a.s.u.SolrIndexWriter Calling setCommitData with IW:org.apache.solr.update.SolrIndexWriter@3ed70153 commitCommandVersion:1632434661257904128
   [junit4]   2> 286326 INFO  (qtp273936345-5485) [    x:collection1] o.a.s.s.SolrIndexSearcher Opening [Searcher@259f6da5[collection1] main]
   [junit4]   2> 286326 INFO  (qtp273936345-5485) [    x:collection1] o.a.s.u.DirectUpdateHandler2 end_commit_flush
   [junit4]   2> 286327 INFO  (searcherExecutor-1710-thread-1-processing-x:collection1) [    x:collection1] o.a.s.c.SolrCore [collection1] Registered new searcher Searcher@259f6da5[collection1] main{ExitableDirectoryReader(UninvertingDirectoryReader(Uninverting(_0(8.2.0):c1:[diagnostics={os=Linux, java.vendor=Oracle Corporation, java.version=11.0.2, java.vm.version=11.0.2+9, lucene.version=8.2.0, os.arch=amd64, java.runtime.version=11.0.2+9, source=flush, os.version=4.18.0-17-generic, timestamp=1556811009648}]:[attributes={Lucene50StoredFieldsFormat.mode=BEST_SPEED}])))}
   [junit4]   2> 286327 INFO  (qtp273936345-5485) [    x:collection1] o.a.s.u.p.LogUpdateProcessorFactory [collection1]  webapp= path=/update params={waitSearcher=true&commit=true&softCommit=false&wt=javabin&version=2}{commit=} 0 2
   [junit4]   2> 286328 INFO  (qtp926984084-5465) [    x:collection1] o.a.s.c.S.Request [collection1]  webapp= path=/select params={q=*:*&wt=javabin&version=2} hits=1 status=0 QTime=0
   [junit4]   2> 286329 INFO  (qtp273936345-5486) [    x:collection1] o.a.s.c.S.Request [collection1]  webapp= path=/select params={q=*:*&wt=javabin&version=2} hits=1 status=0 QTime=0
   [junit4]   2> 286335 INFO  (qtp926984084-5463) [    x:collection1] o.a.s.u.p.LogUpdateProcessorFactory [collection1]  webapp= path=/update params={update.distrib=FROMLEADER&wt=javabin&version=2}{add=[2 (2)]} 0 4
   [junit4]   2> 286335 INFO  (qtp273936345-5484) [    x:collection1] o.a.s.u.PeerSyncWithLeader PeerSync: core=collection1 url= START leader=http://127.0.0.1:46331/collection1 nUpdates=100
   [junit4]   2> 286338 INFO  (qtp926984084-5464) [    x:collection1] o.a.s.s.SolrIndexSearcher Opening [Searcher@6bd2fcc0[collection1] realtime]
   [junit4]   2> 286338 INFO  (qtp926984084-5464) [    x:collection1] o.a.s.u.IndexFingerprint IndexFingerprint millis:2.0 result:{maxVersionSpecified=9223372036854775807, maxVersionEncountered=2, maxInHash=2, versionsHash=-1218814014108643565, numVersions=2, numDocs=2, maxDoc=1}
   [junit4]   2> 286338 INFO  (qtp926984084-5464) [    x:collection1] o.a.s.c.S.Request [collection1]  webapp= path=/get params={distrib=false&qt=/get&getFingerprint=9223372036854775807&wt=javabin&version=2} status=0 QTime=2
   [junit4]   2> 286339 INFO  (qtp273936345-5484) [    x:collection1] o.a.s.u.IndexFingerprint IndexFingerprint millis:0.0 result:{maxVersionSpecified=9223372036854775807, maxVersionEncountered=1, maxInHash=1, versionsHash=-5451962507482445012, numVersions=1, numDocs=1, maxDoc=1}
   [junit4]   2> 286339 INFO  (qtp273936345-5484) [    x:collection1] o.a.s.u.PeerSyncWithLeader Fingerprint comparison result: 1
   [junit4]   2> 286339 INFO  (qtp273936345-5484) [    x:collection1] o.a.s.u.PeerSyncWithLeader Leader fingerprint: {maxVersionSpecified=9223372036854775807, maxVersionEncountered=2, maxInHash=2, versionsHash=-1218814014108643565, numVersions=2, numDocs=2, maxDoc=1}, Our fingerprint: {maxVersionSpecified=9223372036854775807, maxVersionEncountered=1, maxInHash=1, versionsHash=-5451962507482445012, numVersions=1, numDocs=1, maxDoc=1}
   [junit4]   2> 286340 INFO  (qtp926984084-5465) [    x:collection1] o.a.s.u.IndexFingerprint IndexFingerprint millis:0.0 result:{maxVersionSpecified=9223372036854775807, maxVersionEncountered=2, maxInHash=2, versionsHash=-1218814014108643565, numVersions=2, numDocs=2, maxDoc=1}
   [junit4]   2> 286340 INFO  (qtp926984084-5465) [    x:collection1] o.a.s.c.S.Request [collection1]  webapp= path=/get params={distrib=false&qt=/get&fingerprint=true&getVersions=100&wt=javabin&version=2} status=0 QTime=0
   [junit4]   2> 286340 INFO  (qtp273936345-5484) [    x:collection1] o.a.s.u.PeerSyncWithLeader Leader fingerprint {maxVersionSpecified=9223372036854775807, maxVersionEncountered=2, maxInHash=2, versionsHash=-1218814014108643565, numVersions=2, numDocs=2, maxDoc=1}
   [junit4]   2> 286340 INFO  (qtp273936345-5484) [    x:collection1] o.a.s.u.PeerSyncWithLeader PeerSync: core=collection1 url=  Received 2 versions from http://127.0.0.1:46331/collection1
   [junit4]   2> 286341 INFO  (qtp926984084-5463) [    x:collection1] o.a.s.c.S.Request [collection1]  webapp= path=/get params={distrib=false&qt=/get&checkCanHandleVersionRanges=false&wt=javabin&version=2} status=0 QTime=0
   [junit4]   2> 286341 INFO  (qtp273936345-5484) [    x:collection1] o.a.s.u.PeerSyncWithLeader PeerSync: core=collection1 url= Requesting updates from http://127.0.0.1:46331/collection1 n=1 versions=2...2
   [junit4]   2> 286342 INFO  (qtp926984084-5463) [    x:collection1] o.a.s.c.S.Request [collection1]  webapp= path=/get params={getUpdates=2...2&distrib=false&qt=/get&onlyIfActive=false&skipDbq=true&wt=javabin&version=2} status=0 QTime=0
   [junit4]   2> 286346 INFO  (qtp273936345-5484) [    x:collection1] o.a.s.u.p.LogUpdateProcessorFactory [collection1] {add=[2 (2)]} 0 2
   [junit4]   2> 286349 INFO  (qtp273936345-5484) [    x:collection1] o.a.s.s.SolrIndexSearcher Opening [Searcher@5e1ac5e6[collection1] realtime]
   [junit4]   2> 286364 INFO  (qtp273936345-5484) [    x:collection1] o.a.s.u.IndexFingerprint IndexFingerprint millis:17.0 result:{maxVersionSpecified=9223372036854775807, maxVersionEncountered=2, maxInHash=2, versionsHash=-1218814014108643565, numVersions=2, numDocs=2, maxDoc=1}
   [junit4]   2> 286364 INFO  (qtp273936345-5484) [    x:collection1] o.a.s.u.PeerSyncWithLeader Fingerprint comparison result: 0
   [junit4]   2> 286364 INFO  (qtp273936345-5484) [    x:collection1] o.a.s.u.PeerSyncWithLeader PeerSync: core=collection1 url= DONE. sync succeeded
   [junit4]   2> 286364 INFO  (qtp273936345-5484) [    x:collection1] o.a.s.c.S.Request [collection1]  webapp= path=/get params={syncWithLeader=http://127.0.0.1:46331/collection1&qt=/get&getVersions=100&wt=javabin&version=2} status=0 QTime=28
   [junit4]   2> 286365 INFO  (qtp926984084-5464) [    x:collection1] o.a.s.u.DirectUpdateHandler2 start commit{_version_=1632434661299847168,optimize=false,openSearcher=true,waitSearcher=true,expungeDeletes=false,softCommit=false,prepareCommit=false}
   [junit4]   2> 286365 INFO  (qtp926984084-5464) [    x:collection1] o.a.s.u.SolrIndexWriter Calling setCommitData with IW:org.apache.solr.update.SolrIndexWriter@9957501 commitCommandVersion:1632434661299847168
   [junit4]   2> 286365 INFO  (qtp926984084-5464) [    x:collection1] o.a.s.s.SolrIndexSearcher Opening [Searcher@114f48ce[collection1] main]
   [junit4]   2> 286365 INFO  (qtp926984084-5464) [    x:collection1] o.a.s.u.DirectUpdateHandler2 end_commit_flush
   [junit4]   2> 286367 INFO  (searcherExecutor-1696-thread-1-processing-x:collection1) [    x:collection1] o.a.s.c.SolrCore [collection1] Registered new searcher Searcher@114f48ce[collection1] main{ExitableDirectoryReader(UninvertingDirectoryReader(Uninverting(_0(8.2.0):c1:[diagnostics={os=Linux, java.vendor=Oracle Corporation, java.version=11.0.2, java.vm.version=11.0.2+9, lucene.version=8.2.0, os.arch=amd64, java.runtime.version=11.0.2+9, source=flush, os.version=4.18.0-17-generic, timestamp=1556811009645}]:[attributes={Lucene50StoredFieldsFormat.mode=BEST_SPEED}]) Uninverting(_1(8.2.0):c1:[diagnostics={os=Linux, java.vendor=Oracle Corporation, java.version=11.0.2, java.vm.version=11.0.2+9, lucene.version=8.2.0, os.arch=amd64, java.runtime.version=11.0.2+9, source=flush, os.version=4.18.0-17-generic, timestamp=1556811009665}]:[attributes={Lucene50StoredFieldsFormat.mode=BEST_SPEED}])))}
   [junit4]   2> 286367 INFO  (qtp926984084-5464) [    x:collection1] o.a.s.u.p.LogUpdateProcessorFactory [collection1]  webapp= path=/update params={waitSearcher=true&commit=true&softCommit=false&wt=javabin&version=2}{commit=} 0 2
   [junit4]   2> 286368 INFO  (qtp273936345-5485) [    x:collection1] o.a.s.u.DirectUpdateHandler2 start commit{_version_=1632434661302992896,optimize=false,openSearcher=true,waitSearcher=true,expungeDeletes=false,softCommit=false,prepareCommit=false}
   [junit4]   2> 286368 INFO  (qtp273936345-5485) [    x:collection1] o.a.s.u.SolrIndexWriter Calling setCommitData with IW:org.apache.solr.update.SolrIndexWriter@3ed70153 commitCommandVersion:1632434661302992896
   [junit4]   2> 286368 INFO  (qtp273936345-5485) [    x:collection1] o.a.s.s.SolrIndexSearcher Opening [Searcher@4d6c81ce[collection1] main]
   [junit4]   2> 286368 INFO  (qtp273936345-5485) [    x:collection1] o.a.s.u.DirectUpdateHandler2 end_commit_flush
   [junit4]   2> 286369 INFO  (searcherExecutor-1710-thread-1-processing-x:collection1) [    x:collection1] o.a.s.c.SolrCore [collection1] Registered new searcher Searcher@4d6c81ce[collection1] main{ExitableDirectoryReader(UninvertingDirectoryReader(Uninverting(_0(8.2.0):c1:[diagnostics={os=Linux, java.vendor=Oracle Corporation, java.version=11.0.2, java.vm.version=11.0.2+9, lucene.version=8.2.0, os.arch=amd64, java.runtime.version=11.0.2+9, source=flush, os.version=4.18.0-17-generic, timestamp=1556811009648}]:[attributes={Lucene50StoredFieldsFormat.mode=BEST_SPEED}]) Uninverting(_1(8.2.0):c1:[diagnostics={os=Linux, java.vendor=Oracle Corporation, java.version=11.0.2, java.vm.version=11.0.2+9, lucene.version=8.2.0, os.arch=amd64, java.runtime.version=11.0.2+9, source=flush, os.version=4.18.0-17-generic, timestamp=1556811009676}]:[attributes={Lucene50StoredFieldsFormat.mode=BEST_SPEED}])))}
   [junit4]   2> 286370 INFO  (qtp273936345-5485) [    x:collection1] o.a.s.u.p.LogUpdateProcessorFactory [collection1]  webapp= path=/update params={waitSearcher=true&commit=true&softCommit=false&wt=javabin&version=2}{commit=} 0 1
   [junit4]   2> 286370 INFO  (qtp926984084-5465) [    x:collection1] o.a.s.c.S.Request [collection1]  webapp= path=/select params={q=*:*&wt=javabin&version=2} hits=2 status=0 QTime=0
   [junit4]   2> 286371 INFO  (qtp273936345-5486) [    x:collection1] o.a.s.c.S.Request [collection1]  webapp= path=/select params={q=*:*&wt=javabin&version=2} hits=2 status=0 QTime=0
   [junit4]   2> 286373 INFO  (qtp926984084-5463) [    x:collection1] o.a.s.u.p.LogUpdateProcessorFactory [collection1]  webapp= path=/update params={update.distrib=FROMLEADER&wt=javabin&version=2}{add=[3 (3)]} 0 1
   [junit4]   2> 286375 INFO  (qtp926984084-5464) [    x:collection1] o.a.s.u.p.Lo

[...truncated too long message...]

> 	2	/solr/collections/collection1/terms/shard2
   [junit4]   2> 	2	/solr/collections/collection1/terms/shard3
   [junit4]   2> 	2	/solr/collections/collection1/terms/shard4
   [junit4]   2> 
   [junit4]   2> Maximum concurrent data watches above limit:
   [junit4]   2> 
   [junit4]   2> 	22	/solr/collections/collection1/state.json
   [junit4]   2> 	12	/solr/clusterstate.json
   [junit4]   2> 	12	/solr/clusterprops.json
   [junit4]   2> 	7	/solr/collections/control_collection/state.json
   [junit4]   2> 	2	/solr/overseer_elect/election/72182603128373259-127.0.0.1:41817_-n_0000000001
   [junit4]   2> 
   [junit4]   2> Maximum concurrent children watches above limit:
   [junit4]   2> 
   [junit4]   2> 	12	/solr/live_nodes
   [junit4]   2> 	12	/solr/collections
   [junit4]   2> 
   [junit4]   2> 1433811 INFO  (TEST-NestedShardedAtomicUpdateTest.test-seed#[A093278F8D056B8A]) [    ] o.a.s.c.ZkTestServer parse host and port list: 127.0.0.1:43485
   [junit4]   2> 1433811 INFO  (TEST-NestedShardedAtomicUpdateTest.test-seed#[A093278F8D056B8A]) [    ] o.a.s.c.ZkTestServer connecting to 127.0.0.1 43485
   [junit4]   2> NOTE: reproduce with: ant test  -Dtestcase=NestedShardedAtomicUpdateTest -Dtests.method=test -Dtests.seed=A093278F8D056B8A -Dtests.multiplier=3 -Dtests.slow=true -Dtests.locale=en-UG -Dtests.timezone=Asia/Ashkhabad -Dtests.asserts=true -Dtests.file.encoding=UTF-8
   [junit4] ERROR   5.06s J0 | NestedShardedAtomicUpdateTest.test <<<
   [junit4]    > Throwable #1: org.apache.solr.client.solrj.impl.HttpSolrClient$RemoteSolrException: Error from server at http://127.0.0.1:44795/collection1: no servers hosting shard: shard1
   [junit4]    > 	at __randomizedtesting.SeedInfo.seed([A093278F8D056B8A:28C7185523F90672]:0)
   [junit4]    > 	at org.apache.solr.client.solrj.impl.HttpSolrClient.executeMethod(HttpSolrClient.java:649)
   [junit4]    > 	at org.apache.solr.client.solrj.impl.HttpSolrClient.request(HttpSolrClient.java:255)
   [junit4]    > 	at org.apache.solr.client.solrj.impl.HttpSolrClient.request(HttpSolrClient.java:244)
   [junit4]    > 	at org.apache.solr.client.solrj.SolrRequest.process(SolrRequest.java:207)
   [junit4]    > 	at org.apache.solr.client.solrj.SolrClient.query(SolrClient.java:987)
   [junit4]    > 	at org.apache.solr.client.solrj.SolrClient.query(SolrClient.java:1002)
   [junit4]    > 	at org.apache.solr.cloud.NestedShardedAtomicUpdateTest.doNestedInplaceUpdateTest(NestedShardedAtomicUpdateTest.java:154)
   [junit4]    > 	at org.apache.solr.cloud.NestedShardedAtomicUpdateTest.test(NestedShardedAtomicUpdateTest.java:56)
   [junit4]    > 	at java.base/jdk.internal.reflect.NativeMethodAccessorImpl.invoke0(Native Method)
   [junit4]    > 	at java.base/jdk.internal.reflect.NativeMethodAccessorImpl.invoke(NativeMethodAccessorImpl.java:62)
   [junit4]    > 	at java.base/jdk.internal.reflect.DelegatingMethodAccessorImpl.invoke(DelegatingMethodAccessorImpl.java:43)
   [junit4]    > 	at java.base/java.lang.reflect.Method.invoke(Method.java:566)
   [junit4]    > 	at org.apache.solr.BaseDistributedSearchTestCase$ShardsRepeatRule$ShardsFixedStatement.callStatement(BaseDistributedSearchTestCase.java:1082)
   [junit4]    > 	at org.apache.solr.BaseDistributedSearchTestCase$ShardsRepeatRule$ShardsStatement.evaluate(BaseDistributedSearchTestCase.java:1054)
   [junit4]    > 	at java.base/java.lang.Thread.run(Thread.java:834)
   [junit4]   2> NOTE: leaving temporary files on disk at: /home/jenkins/workspace/Lucene-Solr-8.x-Linux/solr/build/solr-core/test/J0/temp/solr.cloud.NestedShardedAtomicUpdateTest_A093278F8D056B8A-001
   [junit4]   2> May 02, 2019 3:49:17 PM com.carrotsearch.randomizedtesting.ThreadLeakControl checkThreadLeaks
   [junit4]   2> WARNING: Will linger awaiting termination of 1 leaked thread(s).
   [junit4]   2> NOTE: test params are: codec=DummyCompressingStoredFields(storedFieldsFormat=CompressingStoredFieldsFormat(compressionMode=DUMMY, chunkSize=1, maxDocsPerChunk=384, blockSize=242), termVectorsFormat=CompressingTermVectorsFormat(compressionMode=DUMMY, chunkSize=1, blockSize=242)), sim=Asserting(org.apache.lucene.search.similarities.AssertingSimilarity@1261aa45), locale=en-UG, timezone=Asia/Ashkhabad
   [junit4]   2> NOTE: Linux 4.18.0-17-generic amd64/Oracle Corporation 11.0.2 (64-bit)/cpus=8,threads=1,free=139580352,total=518979584
   [junit4]   2> NOTE: All tests run in this JVM: [BlobRepositoryCloudTest, TestRecoveryHdfs, TestQuerySenderListener, TestRandomFlRTGCloud, ConjunctionSolrSpellCheckerTest, TestInfoStreamLogging, TestShardHandlerFactory, TestLRUStatsCache, TestPrepRecovery, TestXmlQParserPlugin, SolrIndexConfigTest, SystemLogListenerTest, CollectionReloadTest, MetricsHistoryWithAuthIntegrationTest, TestStressUserVersions, ChaosMonkeySafeLeaderWithPullReplicasTest, BasicAuthIntegrationTest, CSVRequestHandlerTest, SpatialFilterTest, TestIntervalFaceting, IndexSchemaTest, TestConfigOverlay, DateMathParserTest, SpatialHeatmapFacetsTest, CdcrOpsAndBoundariesTest, TestTlogReplica, TermsComponentTest, TestFieldCacheReopen, FacetPivotSmallTest, TestLegacyTerms, TestSimClusterStateProvider, RollingRestartTest, TestSafeXMLParsing, SearchHandlerTest, HdfsBasicDistributedZk2Test, TestLegacyNumericRangeQueryBuilder, EchoParamsTest, BasicDistributedZk2Test, HdfsCollectionsAPIDistributedZkTest, DirectoryFactoryTest, TestApiFramework, RequestLoggingTest, PeerSyncWithIndexFingerprintCachingTest, JsonLoaderTest, TestCloudDeleteByQuery, BooleanFieldTest, ChaosMonkeyNothingIsSafeTest, TestSolrXml, TestComplexPhraseLeadingWildcard, TestSolrConfigHandlerCloud, MoveReplicaHDFSFailoverTest, CoreAdminRequestStatusTest, ComputePlanActionTest, TestCorePropertiesReload, ShowFileRequestHandlerTest, PeerSyncReplicationTest, SolrCoreCheckLockOnStartupTest, TestFilteredDocIdSet, TestRTGBase, TestLazyCores, NodeMutatorTest, TestNumericTerms32, HdfsWriteToMultipleCollectionsTest, RuleEngineTest, SimplePostToolTest, HttpPartitionOnCommitTest, TestUpdate, PropertiesRequestHandlerTest, CdcrVersionReplicationTest, TestOverriddenPrefixQueryForCustomFieldType, DocValuesMissingTest, MaxSizeAutoCommitTest, IgnoreCommitOptimizeUpdateProcessorFactoryTest, QueryEqualityTest, CloudExitableDirectoryReaderTest, ReindexCollectionTest, MBeansHandlerTest, ReplaceNodeTest, DistanceFunctionTest, BufferStoreTest, DistributedUpdateProcessorTest, CachingDirectoryFactoryTest, TestNumericRangeQuery64, ShardRoutingCustomTest, TestInPlaceUpdatesStandalone, TestMacros, TestRestoreCore, RequestHandlersTest, ConcurrentCreateRoutedAliasTest, AtomicUpdateProcessorFactoryTest, TlogReplayBufferedWhileIndexingTest, TestFieldCollectionResource, TestJsonFacetRefinement, RandomizedTaggerTest, DistributedQueryComponentCustomSortTest, PathHierarchyTokenizerFactoryTest, TestSimGenericDistributedQueue, CreateCollectionCleanupTest, AddReplicaTest, IndexBasedSpellCheckerTest, TestCrossCoreJoin, UpdateParamsTest, SolrSlf4jReporterTest, TestCloudSchemaless, SolrGraphiteReporterTest, TestImpersonationWithHadoopAuth, TestSimDistributedQueue, TestSimNodeLostTrigger, XsltUpdateRequestHandlerTest, TestDistribIDF, TestMissingGroups, HLLUtilTest, SystemCollectionCompatTest, TestSolrCloudWithDelegationTokens, TestRuleBasedAuthorizationPlugin, TestSolrCoreParser, BaseCdcrDistributedZkTest, TestHttpShardHandlerFactory, TestInPlaceUpdateWithRouteField, TestCoreBackup, TestExtendedDismaxParser, MetricTriggerTest, DistributedFacetPivotSmallTest, AuthToolTest, TestCollectionAPI, TestScoreJoinQPScore, CursorMarkTest, TestAtomicUpdateErrorCases, TestDistributedMap, TestCloudRecovery2, TestSolrCloudSnapshots, TestLMDirichletSimilarityFactory, TestRawTransformer, LeaderFailoverAfterPartitionTest, CollectionsAPIDistributedZkTest, TestDistributedMissingSort, RootFieldTest, TestManagedSynonymGraphFilterFactory, JWTAuthPluginTest, OverseerCollectionConfigSetProcessorTest, TestTrieFacet, TestPhraseSuggestions, AnalysisAfterCoreReloadTest, BasicFunctionalityTest, ConvertedLegacyTest, CursorPagingTest, DisMaxRequestHandlerTest, DistributedIntervalFacetingTest, SampleTest, SolrInfoBeanTest, SolrTestCaseJ4Test, TestGroupingSearch, TestHighlightDedupGrouping, TestJoin, TestRandomFaceting, TestSolrCoreProperties, TestTrie, TestReversedWildcardFilterFactory, TokenizerChainTest, TestLuceneIndexBackCompat, ActionThrottleTest, CollectionStateFormat2Test, CollectionsAPISolrJTest, DeleteShardTest, DistribCursorPagingTest, DistribJoinFromCollectionTest, DistributedQueueTest, DistributedVersionInfoTest, LeaderElectionTest, LegacyCloudClusterPropTest, MetricsHistoryIntegrationTest, MultiSolrCloudTestCaseTest, MultiThreadedOCPTest, NestedShardedAtomicUpdateTest]
   [junit4] Completed [480/855 (3!)] on J0 in 5.78s, 1 test, 1 error <<< FAILURES!

[...truncated 10309 lines...]
BUILD FAILED
/home/jenkins/workspace/Lucene-Solr-8.x-Linux/build.xml:634: The following error occurred while executing this line:
/home/jenkins/workspace/Lucene-Solr-8.x-Linux/build.xml:128: Found 1 violations in source files (File uses Mockito but has no assumeWorkingMockito() call).

Total time: 70 minutes 47 seconds
Build step 'Invoke Ant' marked build as failure
Archiving artifacts
Setting ANT_1_8_2_HOME=/home/jenkins/tools/hudson.tasks.Ant_AntInstallation/ANT_1.8.2
[WARNINGS] Skipping publisher since build result is FAILURE
Recording test results
Setting ANT_1_8_2_HOME=/home/jenkins/tools/hudson.tasks.Ant_AntInstallation/ANT_1.8.2
Email was triggered for: Failure - Any
Sending email for trigger: Failure - Any
Setting ANT_1_8_2_HOME=/home/jenkins/tools/hudson.tasks.Ant_AntInstallation/ANT_1.8.2
Setting ANT_1_8_2_HOME=/home/jenkins/tools/hudson.tasks.Ant_AntInstallation/ANT_1.8.2
Setting ANT_1_8_2_HOME=/home/jenkins/tools/hudson.tasks.Ant_AntInstallation/ANT_1.8.2
Setting ANT_1_8_2_HOME=/home/jenkins/tools/hudson.tasks.Ant_AntInstallation/ANT_1.8.2
Setting ANT_1_8_2_HOME=/home/jenkins/tools/hudson.tasks.Ant_AntInstallation/ANT_1.8.2
Setting ANT_1_8_2_HOME=/home/jenkins/tools/hudson.tasks.Ant_AntInstallation/ANT_1.8.2

Mime
View raw message