lucene-dev mailing list archives

Site index · List index
Message view « Date » · « Thread »
Top « Date » · « Thread »
From Policeman Jenkins Server <jenk...@thetaphi.de>
Subject [JENKINS] Lucene-Solr-8.x-Linux (32bit/jdk1.8.0_201) - Build # 493 - Still Failing!
Date Wed, 01 May 2019 05:08:59 GMT
Build: https://jenkins.thetaphi.de/job/Lucene-Solr-8.x-Linux/493/
Java: 32bit/jdk1.8.0_201 -client -XX:+UseConcMarkSweepGC

2 tests failed.
FAILED:  org.apache.solr.update.PeerSyncTest.test

Error Message:
Unexpected exception type, expected SolrException but got org.apache.solr.client.solrj.SolrServerException: Timeout occurred while waiting response from server at: http://127.0.0.1:38107/_ox/s/collection1

Stack Trace:
junit.framework.AssertionFailedError: Unexpected exception type, expected SolrException but got org.apache.solr.client.solrj.SolrServerException: Timeout occurred while waiting response from server at: http://127.0.0.1:38107/_ox/s/collection1
	at __randomizedtesting.SeedInfo.seed([977B0D8549419591:1F2F325FE7BDF869]:0)
	at org.apache.lucene.util.LuceneTestCase.expectThrows(LuceneTestCase.java:2700)
	at org.apache.lucene.util.LuceneTestCase.expectThrows(LuceneTestCase.java:2689)
	at org.apache.solr.update.PeerSyncTest.test(PeerSyncTest.java:279)
	at sun.reflect.NativeMethodAccessorImpl.invoke0(Native Method)
	at sun.reflect.NativeMethodAccessorImpl.invoke(NativeMethodAccessorImpl.java:62)
	at sun.reflect.DelegatingMethodAccessorImpl.invoke(DelegatingMethodAccessorImpl.java:43)
	at java.lang.reflect.Method.invoke(Method.java:498)
	at com.carrotsearch.randomizedtesting.RandomizedRunner.invoke(RandomizedRunner.java:1750)
	at com.carrotsearch.randomizedtesting.RandomizedRunner$8.evaluate(RandomizedRunner.java:938)
	at com.carrotsearch.randomizedtesting.RandomizedRunner$9.evaluate(RandomizedRunner.java:974)
	at com.carrotsearch.randomizedtesting.RandomizedRunner$10.evaluate(RandomizedRunner.java:988)
	at org.apache.solr.BaseDistributedSearchTestCase$ShardsRepeatRule$ShardsFixedStatement.callStatement(BaseDistributedSearchTestCase.java:1082)
	at org.apache.solr.BaseDistributedSearchTestCase$ShardsRepeatRule$ShardsStatement.evaluate(BaseDistributedSearchTestCase.java:1054)
	at com.carrotsearch.randomizedtesting.rules.SystemPropertiesRestoreRule$1.evaluate(SystemPropertiesRestoreRule.java:57)
	at org.apache.lucene.util.TestRuleSetupTeardownChained$1.evaluate(TestRuleSetupTeardownChained.java:49)
	at org.apache.lucene.util.AbstractBeforeAfterRule$1.evaluate(AbstractBeforeAfterRule.java:45)
	at org.apache.lucene.util.TestRuleThreadAndTestName$1.evaluate(TestRuleThreadAndTestName.java:48)
	at org.apache.lucene.util.TestRuleIgnoreAfterMaxFailures$1.evaluate(TestRuleIgnoreAfterMaxFailures.java:64)
	at org.apache.lucene.util.TestRuleMarkFailure$1.evaluate(TestRuleMarkFailure.java:47)
	at com.carrotsearch.randomizedtesting.rules.StatementAdapter.evaluate(StatementAdapter.java:36)
	at com.carrotsearch.randomizedtesting.ThreadLeakControl$StatementRunner.run(ThreadLeakControl.java:368)
	at com.carrotsearch.randomizedtesting.ThreadLeakControl.forkTimeoutingTask(ThreadLeakControl.java:817)
	at com.carrotsearch.randomizedtesting.ThreadLeakControl$3.evaluate(ThreadLeakControl.java:468)
	at com.carrotsearch.randomizedtesting.RandomizedRunner.runSingleTest(RandomizedRunner.java:947)
	at com.carrotsearch.randomizedtesting.RandomizedRunner$5.evaluate(RandomizedRunner.java:832)
	at com.carrotsearch.randomizedtesting.RandomizedRunner$6.evaluate(RandomizedRunner.java:883)
	at com.carrotsearch.randomizedtesting.RandomizedRunner$7.evaluate(RandomizedRunner.java:894)
	at com.carrotsearch.randomizedtesting.rules.StatementAdapter.evaluate(StatementAdapter.java:36)
	at com.carrotsearch.randomizedtesting.rules.SystemPropertiesRestoreRule$1.evaluate(SystemPropertiesRestoreRule.java:57)
	at org.apache.lucene.util.AbstractBeforeAfterRule$1.evaluate(AbstractBeforeAfterRule.java:45)
	at com.carrotsearch.randomizedtesting.rules.StatementAdapter.evaluate(StatementAdapter.java:36)
	at org.apache.lucene.util.TestRuleStoreClassName$1.evaluate(TestRuleStoreClassName.java:41)
	at com.carrotsearch.randomizedtesting.rules.NoShadowingOrOverridesOnMethodsRule$1.evaluate(NoShadowingOrOverridesOnMethodsRule.java:40)
	at com.carrotsearch.randomizedtesting.rules.NoShadowingOrOverridesOnMethodsRule$1.evaluate(NoShadowingOrOverridesOnMethodsRule.java:40)
	at com.carrotsearch.randomizedtesting.rules.StatementAdapter.evaluate(StatementAdapter.java:36)
	at com.carrotsearch.randomizedtesting.rules.StatementAdapter.evaluate(StatementAdapter.java:36)
	at com.carrotsearch.randomizedtesting.rules.StatementAdapter.evaluate(StatementAdapter.java:36)
	at org.apache.lucene.util.TestRuleAssertionsRequired$1.evaluate(TestRuleAssertionsRequired.java:53)
	at org.apache.lucene.util.TestRuleMarkFailure$1.evaluate(TestRuleMarkFailure.java:47)
	at org.apache.lucene.util.TestRuleIgnoreAfterMaxFailures$1.evaluate(TestRuleIgnoreAfterMaxFailures.java:64)
	at org.apache.lucene.util.TestRuleIgnoreTestSuites$1.evaluate(TestRuleIgnoreTestSuites.java:54)
	at com.carrotsearch.randomizedtesting.rules.StatementAdapter.evaluate(StatementAdapter.java:36)
	at com.carrotsearch.randomizedtesting.ThreadLeakControl$StatementRunner.run(ThreadLeakControl.java:368)
	at java.lang.Thread.run(Thread.java:748)
Caused by: org.apache.solr.client.solrj.SolrServerException: Timeout occurred while waiting response from server at: http://127.0.0.1:38107/_ox/s/collection1
	at org.apache.solr.client.solrj.impl.HttpSolrClient.executeMethod(HttpSolrClient.java:660)
	at org.apache.solr.client.solrj.impl.HttpSolrClient.request(HttpSolrClient.java:255)
	at org.apache.solr.client.solrj.impl.HttpSolrClient.request(HttpSolrClient.java:244)
	at org.apache.solr.client.solrj.SolrRequest.process(SolrRequest.java:207)
	at org.apache.solr.client.solrj.SolrRequest.process(SolrRequest.java:224)
	at org.apache.solr.BaseDistributedSearchTestCase.add(BaseDistributedSearchTestCase.java:576)
	at org.apache.solr.update.PeerSyncTest.lambda$test$0(PeerSyncTest.java:281)
	at org.apache.lucene.util.LuceneTestCase.expectThrows(LuceneTestCase.java:2695)
	... 43 more
Caused by: java.net.SocketTimeoutException: Read timed out
	at java.net.SocketInputStream.socketRead0(Native Method)
	at java.net.SocketInputStream.socketRead(SocketInputStream.java:116)
	at java.net.SocketInputStream.read(SocketInputStream.java:171)
	at java.net.SocketInputStream.read(SocketInputStream.java:141)
	at org.apache.http.impl.io.SessionInputBufferImpl.streamRead(SessionInputBufferImpl.java:137)
	at org.apache.http.impl.io.SessionInputBufferImpl.fillBuffer(SessionInputBufferImpl.java:153)
	at org.apache.http.impl.io.SessionInputBufferImpl.readLine(SessionInputBufferImpl.java:282)
	at org.apache.http.impl.conn.DefaultHttpResponseParser.parseHead(DefaultHttpResponseParser.java:138)
	at org.apache.http.impl.conn.DefaultHttpResponseParser.parseHead(DefaultHttpResponseParser.java:56)
	at org.apache.http.impl.io.AbstractMessageParser.parse(AbstractMessageParser.java:259)
	at org.apache.http.impl.DefaultBHttpClientConnection.receiveResponseHeader(DefaultBHttpClientConnection.java:163)
	at org.apache.http.impl.conn.CPoolProxy.receiveResponseHeader(CPoolProxy.java:165)
	at org.apache.http.protocol.HttpRequestExecutor.doReceiveResponse(HttpRequestExecutor.java:273)
	at org.apache.http.protocol.HttpRequestExecutor.execute(HttpRequestExecutor.java:125)
	at org.apache.http.impl.execchain.MainClientExec.execute(MainClientExec.java:272)
	at org.apache.http.impl.execchain.ProtocolExec.execute(ProtocolExec.java:185)
	at org.apache.http.impl.execchain.RetryExec.execute(RetryExec.java:89)
	at org.apache.http.impl.execchain.RedirectExec.execute(RedirectExec.java:110)
	at org.apache.http.impl.client.InternalHttpClient.doExecute(InternalHttpClient.java:185)
	at org.apache.http.impl.client.CloseableHttpClient.execute(CloseableHttpClient.java:83)
	at org.apache.http.impl.client.CloseableHttpClient.execute(CloseableHttpClient.java:56)
	at org.apache.solr.client.solrj.impl.HttpSolrClient.executeMethod(HttpSolrClient.java:548)
	... 50 more


FAILED:  org.apache.solr.update.PeerSyncWithLeaderTest.test

Error Message:
Unexpected exception type, expected SolrException but got org.apache.solr.client.solrj.SolrServerException: Timeout occurred while waiting response from server at: http://127.0.0.1:34505/ws/eb/collection1

Stack Trace:
junit.framework.AssertionFailedError: Unexpected exception type, expected SolrException but got org.apache.solr.client.solrj.SolrServerException: Timeout occurred while waiting response from server at: http://127.0.0.1:34505/ws/eb/collection1
	at __randomizedtesting.SeedInfo.seed([977B0D8549419591:1F2F325FE7BDF869]:0)
	at org.apache.lucene.util.LuceneTestCase.expectThrows(LuceneTestCase.java:2700)
	at org.apache.lucene.util.LuceneTestCase.expectThrows(LuceneTestCase.java:2689)
	at org.apache.solr.update.PeerSyncTest.test(PeerSyncTest.java:279)
	at sun.reflect.NativeMethodAccessorImpl.invoke0(Native Method)
	at sun.reflect.NativeMethodAccessorImpl.invoke(NativeMethodAccessorImpl.java:62)
	at sun.reflect.DelegatingMethodAccessorImpl.invoke(DelegatingMethodAccessorImpl.java:43)
	at java.lang.reflect.Method.invoke(Method.java:498)
	at com.carrotsearch.randomizedtesting.RandomizedRunner.invoke(RandomizedRunner.java:1750)
	at com.carrotsearch.randomizedtesting.RandomizedRunner$8.evaluate(RandomizedRunner.java:938)
	at com.carrotsearch.randomizedtesting.RandomizedRunner$9.evaluate(RandomizedRunner.java:974)
	at com.carrotsearch.randomizedtesting.RandomizedRunner$10.evaluate(RandomizedRunner.java:988)
	at org.apache.solr.BaseDistributedSearchTestCase$ShardsRepeatRule$ShardsFixedStatement.callStatement(BaseDistributedSearchTestCase.java:1082)
	at org.apache.solr.BaseDistributedSearchTestCase$ShardsRepeatRule$ShardsStatement.evaluate(BaseDistributedSearchTestCase.java:1054)
	at com.carrotsearch.randomizedtesting.rules.SystemPropertiesRestoreRule$1.evaluate(SystemPropertiesRestoreRule.java:57)
	at org.apache.lucene.util.TestRuleSetupTeardownChained$1.evaluate(TestRuleSetupTeardownChained.java:49)
	at org.apache.lucene.util.AbstractBeforeAfterRule$1.evaluate(AbstractBeforeAfterRule.java:45)
	at org.apache.lucene.util.TestRuleThreadAndTestName$1.evaluate(TestRuleThreadAndTestName.java:48)
	at org.apache.lucene.util.TestRuleIgnoreAfterMaxFailures$1.evaluate(TestRuleIgnoreAfterMaxFailures.java:64)
	at org.apache.lucene.util.TestRuleMarkFailure$1.evaluate(TestRuleMarkFailure.java:47)
	at com.carrotsearch.randomizedtesting.rules.StatementAdapter.evaluate(StatementAdapter.java:36)
	at com.carrotsearch.randomizedtesting.ThreadLeakControl$StatementRunner.run(ThreadLeakControl.java:368)
	at com.carrotsearch.randomizedtesting.ThreadLeakControl.forkTimeoutingTask(ThreadLeakControl.java:817)
	at com.carrotsearch.randomizedtesting.ThreadLeakControl$3.evaluate(ThreadLeakControl.java:468)
	at com.carrotsearch.randomizedtesting.RandomizedRunner.runSingleTest(RandomizedRunner.java:947)
	at com.carrotsearch.randomizedtesting.RandomizedRunner$5.evaluate(RandomizedRunner.java:832)
	at com.carrotsearch.randomizedtesting.RandomizedRunner$6.evaluate(RandomizedRunner.java:883)
	at com.carrotsearch.randomizedtesting.RandomizedRunner$7.evaluate(RandomizedRunner.java:894)
	at com.carrotsearch.randomizedtesting.rules.StatementAdapter.evaluate(StatementAdapter.java:36)
	at com.carrotsearch.randomizedtesting.rules.SystemPropertiesRestoreRule$1.evaluate(SystemPropertiesRestoreRule.java:57)
	at org.apache.lucene.util.AbstractBeforeAfterRule$1.evaluate(AbstractBeforeAfterRule.java:45)
	at com.carrotsearch.randomizedtesting.rules.StatementAdapter.evaluate(StatementAdapter.java:36)
	at org.apache.lucene.util.TestRuleStoreClassName$1.evaluate(TestRuleStoreClassName.java:41)
	at com.carrotsearch.randomizedtesting.rules.NoShadowingOrOverridesOnMethodsRule$1.evaluate(NoShadowingOrOverridesOnMethodsRule.java:40)
	at com.carrotsearch.randomizedtesting.rules.NoShadowingOrOverridesOnMethodsRule$1.evaluate(NoShadowingOrOverridesOnMethodsRule.java:40)
	at com.carrotsearch.randomizedtesting.rules.StatementAdapter.evaluate(StatementAdapter.java:36)
	at com.carrotsearch.randomizedtesting.rules.StatementAdapter.evaluate(StatementAdapter.java:36)
	at com.carrotsearch.randomizedtesting.rules.StatementAdapter.evaluate(StatementAdapter.java:36)
	at org.apache.lucene.util.TestRuleAssertionsRequired$1.evaluate(TestRuleAssertionsRequired.java:53)
	at org.apache.lucene.util.TestRuleMarkFailure$1.evaluate(TestRuleMarkFailure.java:47)
	at org.apache.lucene.util.TestRuleIgnoreAfterMaxFailures$1.evaluate(TestRuleIgnoreAfterMaxFailures.java:64)
	at org.apache.lucene.util.TestRuleIgnoreTestSuites$1.evaluate(TestRuleIgnoreTestSuites.java:54)
	at com.carrotsearch.randomizedtesting.rules.StatementAdapter.evaluate(StatementAdapter.java:36)
	at com.carrotsearch.randomizedtesting.ThreadLeakControl$StatementRunner.run(ThreadLeakControl.java:368)
	at java.lang.Thread.run(Thread.java:748)
Caused by: org.apache.solr.client.solrj.SolrServerException: Timeout occurred while waiting response from server at: http://127.0.0.1:34505/ws/eb/collection1
	at org.apache.solr.client.solrj.impl.HttpSolrClient.executeMethod(HttpSolrClient.java:660)
	at org.apache.solr.client.solrj.impl.HttpSolrClient.request(HttpSolrClient.java:255)
	at org.apache.solr.client.solrj.impl.HttpSolrClient.request(HttpSolrClient.java:244)
	at org.apache.solr.client.solrj.SolrRequest.process(SolrRequest.java:207)
	at org.apache.solr.client.solrj.SolrRequest.process(SolrRequest.java:224)
	at org.apache.solr.BaseDistributedSearchTestCase.add(BaseDistributedSearchTestCase.java:576)
	at org.apache.solr.update.PeerSyncTest.lambda$test$0(PeerSyncTest.java:281)
	at org.apache.lucene.util.LuceneTestCase.expectThrows(LuceneTestCase.java:2695)
	... 43 more
Caused by: java.net.SocketTimeoutException: Read timed out
	at java.net.SocketInputStream.socketRead0(Native Method)
	at java.net.SocketInputStream.socketRead(SocketInputStream.java:116)
	at java.net.SocketInputStream.read(SocketInputStream.java:171)
	at java.net.SocketInputStream.read(SocketInputStream.java:141)
	at org.apache.http.impl.io.SessionInputBufferImpl.streamRead(SessionInputBufferImpl.java:137)
	at org.apache.http.impl.io.SessionInputBufferImpl.fillBuffer(SessionInputBufferImpl.java:153)
	at org.apache.http.impl.io.SessionInputBufferImpl.readLine(SessionInputBufferImpl.java:282)
	at org.apache.http.impl.conn.DefaultHttpResponseParser.parseHead(DefaultHttpResponseParser.java:138)
	at org.apache.http.impl.conn.DefaultHttpResponseParser.parseHead(DefaultHttpResponseParser.java:56)
	at org.apache.http.impl.io.AbstractMessageParser.parse(AbstractMessageParser.java:259)
	at org.apache.http.impl.DefaultBHttpClientConnection.receiveResponseHeader(DefaultBHttpClientConnection.java:163)
	at org.apache.http.impl.conn.CPoolProxy.receiveResponseHeader(CPoolProxy.java:165)
	at org.apache.http.protocol.HttpRequestExecutor.doReceiveResponse(HttpRequestExecutor.java:273)
	at org.apache.http.protocol.HttpRequestExecutor.execute(HttpRequestExecutor.java:125)
	at org.apache.http.impl.execchain.MainClientExec.execute(MainClientExec.java:272)
	at org.apache.http.impl.execchain.ProtocolExec.execute(ProtocolExec.java:185)
	at org.apache.http.impl.execchain.RetryExec.execute(RetryExec.java:89)
	at org.apache.http.impl.execchain.RedirectExec.execute(RedirectExec.java:110)
	at org.apache.http.impl.client.InternalHttpClient.doExecute(InternalHttpClient.java:185)
	at org.apache.http.impl.client.CloseableHttpClient.execute(CloseableHttpClient.java:83)
	at org.apache.http.impl.client.CloseableHttpClient.execute(CloseableHttpClient.java:56)
	at org.apache.solr.client.solrj.impl.HttpSolrClient.executeMethod(HttpSolrClient.java:548)
	... 50 more




Build Log:
[...truncated 14643 lines...]
   [junit4] Suite: org.apache.solr.update.PeerSyncTest
   [junit4]   2> Creating dataDir: /home/jenkins/workspace/Lucene-Solr-8.x-Linux/solr/build/solr-core/test/J1/temp/solr.update.PeerSyncTest_977B0D8549419591-001/init-core-data-001
   [junit4]   2> 2478323 WARN  (SUITE-PeerSyncTest-seed#[977B0D8549419591]-worker) [    ] o.a.s.SolrTestCaseJ4 startTrackingSearchers: numOpens=18 numCloses=18
   [junit4]   2> 2478323 INFO  (SUITE-PeerSyncTest-seed#[977B0D8549419591]-worker) [    ] o.a.s.SolrTestCaseJ4 Using PointFields (NUMERIC_POINTS_SYSPROP=true) w/NUMERIC_DOCVALUES_SYSPROP=true
   [junit4]   2> 2478328 INFO  (SUITE-PeerSyncTest-seed#[977B0D8549419591]-worker) [    ] o.a.s.SolrTestCaseJ4 Randomized ssl (false) and clientAuth (false) via: @org.apache.solr.SolrTestCaseJ4$SuppressSSL(bugUrl=https://issues.apache.org/jira/browse/SOLR-5776)
   [junit4]   2> 2478328 INFO  (SUITE-PeerSyncTest-seed#[977B0D8549419591]-worker) [    ] o.a.s.SolrTestCaseJ4 SecureRandom sanity checks: test.solr.allowed.securerandom=null & java.security.egd=file:/dev/./urandom
   [junit4]   2> 2478329 INFO  (SUITE-PeerSyncTest-seed#[977B0D8549419591]-worker) [    ] o.a.s.BaseDistributedSearchTestCase Setting hostContext system property: /_ox/s
   [junit4]   2> 2478329 INFO  (TEST-PeerSyncTest.test-seed#[977B0D8549419591]) [    ] o.a.s.SolrTestCaseJ4 ####initCore
   [junit4]   2> 2478330 INFO  (TEST-PeerSyncTest.test-seed#[977B0D8549419591]) [    ] o.a.s.c.SolrResourceLoader [null] Added 2 libs to classloader, from paths: [/home/jenkins/workspace/Lucene-Solr-8.x-Linux/solr/core/src/test-files/solr/collection1/lib, /home/jenkins/workspace/Lucene-Solr-8.x-Linux/solr/core/src/test-files/solr/collection1/lib/classes]
   [junit4]   2> 2478367 INFO  (TEST-PeerSyncTest.test-seed#[977B0D8549419591]) [    ] o.a.s.c.SolrConfig Using Lucene MatchVersion: 8.1.0
   [junit4]   2> 2478456 INFO  (TEST-PeerSyncTest.test-seed#[977B0D8549419591]) [    ] o.a.s.s.IndexSchema [null] Schema name=test
   [junit4]   2> 2478766 INFO  (TEST-PeerSyncTest.test-seed#[977B0D8549419591]) [    ] o.a.s.s.IndexSchema Loaded schema test/1.0 with uniqueid field id
   [junit4]   2> 2481546 INFO  (TEST-PeerSyncTest.test-seed#[977B0D8549419591]) [    ] o.a.s.h.c.HttpShardHandlerFactory Host whitelist initialized: WhitelistHostChecker [whitelistHosts=null, whitelistHostCheckingEnabled=false]
   [junit4]   2> 2481561 WARN  (TEST-PeerSyncTest.test-seed#[977B0D8549419591]) [    ] o.e.j.u.s.S.config No Client EndPointIdentificationAlgorithm configured for SslContextFactory@1e84e00[provider=null,keyStore=null,trustStore=null]
   [junit4]   2> 2481567 WARN  (TEST-PeerSyncTest.test-seed#[977B0D8549419591]) [    ] o.e.j.u.s.S.config No Client EndPointIdentificationAlgorithm configured for SslContextFactory@1ff35e3[provider=null,keyStore=null,trustStore=null]
   [junit4]   2> 2481890 INFO  (TEST-PeerSyncTest.test-seed#[977B0D8549419591]) [    ] o.a.s.c.TransientSolrCoreCacheDefault Allocating transient cache for 2147483647 transient cores
   [junit4]   2> 2481890 INFO  (TEST-PeerSyncTest.test-seed#[977B0D8549419591]) [    ] o.a.s.h.a.MetricsHistoryHandler No .system collection, keeping metrics history in memory.
   [junit4]   2> 2481934 INFO  (TEST-PeerSyncTest.test-seed#[977B0D8549419591]) [    ] o.a.s.m.r.SolrJmxReporter JMX monitoring for 'solr.node' (registry 'solr.node') enabled at server: com.sun.jmx.mbeanserver.JmxMBeanServer@1362881
   [junit4]   2> 2481979 INFO  (TEST-PeerSyncTest.test-seed#[977B0D8549419591]) [    ] o.a.s.m.r.SolrJmxReporter JMX monitoring for 'solr.jvm' (registry 'solr.jvm') enabled at server: com.sun.jmx.mbeanserver.JmxMBeanServer@1362881
   [junit4]   2> 2481979 INFO  (TEST-PeerSyncTest.test-seed#[977B0D8549419591]) [    ] o.a.s.m.r.SolrJmxReporter JMX monitoring for 'solr.jetty' (registry 'solr.jetty') enabled at server: com.sun.jmx.mbeanserver.JmxMBeanServer@1362881
   [junit4]   2> 2481982 INFO  (coreLoadExecutor-7650-thread-1) [    x:collection1] o.a.s.c.SolrResourceLoader [null] Added 2 libs to classloader, from paths: [/home/jenkins/workspace/Lucene-Solr-8.x-Linux/solr/core/src/test-files/solr/collection1/lib, /home/jenkins/workspace/Lucene-Solr-8.x-Linux/solr/core/src/test-files/solr/collection1/lib/classes]
   [junit4]   2> 2482035 INFO  (coreLoadExecutor-7650-thread-1) [    x:collection1] o.a.s.c.SolrConfig Using Lucene MatchVersion: 8.1.0
   [junit4]   2> 2482099 INFO  (coreLoadExecutor-7650-thread-1) [    x:collection1] o.a.s.s.IndexSchema [collection1] Schema name=test
   [junit4]   2> 2482339 INFO  (coreLoadExecutor-7650-thread-1) [    x:collection1] o.a.s.s.IndexSchema Loaded schema test/1.0 with uniqueid field id
   [junit4]   2> 2482363 INFO  (coreLoadExecutor-7650-thread-1) [    x:collection1] o.a.s.c.CoreContainer Creating SolrCore 'collection1' using configuration from instancedir /home/jenkins/workspace/Lucene-Solr-8.x-Linux/solr/core/src/test-files/solr/collection1, trusted=true
   [junit4]   2> 2482364 INFO  (coreLoadExecutor-7650-thread-1) [    x:collection1] o.a.s.m.r.SolrJmxReporter JMX monitoring for 'solr.core.collection1' (registry 'solr.core.collection1') enabled at server: com.sun.jmx.mbeanserver.JmxMBeanServer@1362881
   [junit4]   2> 2482364 INFO  (coreLoadExecutor-7650-thread-1) [    x:collection1] o.a.s.c.SolrCore [[collection1] ] Opening new SolrCore at [/home/jenkins/workspace/Lucene-Solr-8.x-Linux/solr/core/src/test-files/solr/collection1], dataDir=[/home/jenkins/workspace/Lucene-Solr-8.x-Linux/solr/build/solr-core/test/J1/temp/solr.update.PeerSyncTest_977B0D8549419591-001/init-core-data-001/]
   [junit4]   2> 2482367 INFO  (coreLoadExecutor-7650-thread-1) [    x:collection1] o.a.s.u.RandomMergePolicy RandomMergePolicy wrapping class org.apache.lucene.index.AlcoholicMergePolicy: [AlcoholicMergePolicy: minMergeSize=0, mergeFactor=10, maxMergeSize=766210615, maxMergeSizeForForcedMerge=9223372036854775807, calibrateSizeByDeletes=true, maxMergeDocs=2147483647, maxCFSSegmentSizeMB=8.796093022207999E12, noCFSRatio=0.1]
   [junit4]   2> 2482370 WARN  (coreLoadExecutor-7650-thread-1) [    x:collection1] o.a.s.c.RequestHandlers INVALID paramSet a in requestHandler {type = requestHandler,name = /dump,class = DumpRequestHandler,attributes = {initParams=a, name=/dump, class=DumpRequestHandler},args = {defaults={a=A,b=B}}}
   [junit4]   2> 2482450 INFO  (coreLoadExecutor-7650-thread-1) [    x:collection1] o.a.s.u.UpdateHandler Using UpdateLog implementation: org.apache.solr.update.UpdateLog
   [junit4]   2> 2482450 INFO  (coreLoadExecutor-7650-thread-1) [    x:collection1] o.a.s.u.UpdateLog Initializing UpdateLog: dataDir= defaultSyncLevel=FLUSH numRecordsToKeep=100 maxNumLogsToKeep=10 numVersionBuckets=65536
   [junit4]   2> 2482454 INFO  (coreLoadExecutor-7650-thread-1) [    x:collection1] o.a.s.u.CommitTracker Hard AutoCommit: disabled
   [junit4]   2> 2482454 INFO  (coreLoadExecutor-7650-thread-1) [    x:collection1] o.a.s.u.CommitTracker Soft AutoCommit: disabled
   [junit4]   2> 2482456 INFO  (coreLoadExecutor-7650-thread-1) [    x:collection1] o.a.s.u.RandomMergePolicy RandomMergePolicy wrapping class org.apache.lucene.index.TieredMergePolicy: [TieredMergePolicy: maxMergeAtOnce=24, maxMergeAtOnceExplicit=36, maxMergedSegmentMB=1.03515625, floorSegmentMB=0.935546875, forceMergeDeletesPctAllowed=24.713105856908967, segmentsPerTier=48.0, maxCFSSegmentSizeMB=8.796093022207999E12, noCFSRatio=0.5379262786861285, deletesPctAllowed=39.83104854822948
   [junit4]   2> 2482456 INFO  (coreLoadExecutor-7650-thread-1) [    x:collection1] o.a.s.s.SolrIndexSearcher Opening [Searcher@1dca069[collection1] main]
   [junit4]   2> 2482457 WARN  (coreLoadExecutor-7650-thread-1) [    x:collection1] o.a.s.r.ManagedResourceStorage Cannot write to config directory /home/jenkins/workspace/Lucene-Solr-8.x-Linux/solr/core/src/test-files/solr/collection1/conf; switching to use InMemory storage instead.
   [junit4]   2> 2482458 INFO  (coreLoadExecutor-7650-thread-1) [    x:collection1] o.a.s.h.ReplicationHandler Commits will be reserved for 10000ms.
   [junit4]   2> 2482458 INFO  (coreLoadExecutor-7650-thread-1) [    x:collection1] o.a.s.u.UpdateLog Could not find max version in index or recent updates, using new clock 1632302534781566976
   [junit4]   2> 2482463 INFO  (TEST-PeerSyncTest.test-seed#[977B0D8549419591]) [    ] o.a.s.SolrTestCaseJ4 ####initCore end
   [junit4]   2> 2482470 INFO  (searcherExecutor-7651-thread-1-processing-x:collection1) [    x:collection1] o.a.s.c.SolrCore [collection1] Registered new searcher Searcher@1dca069[collection1] main{ExitableDirectoryReader(UninvertingDirectoryReader())}
   [junit4]   2> 2482581 INFO  (TEST-PeerSyncTest.test-seed#[977B0D8549419591]) [    ] o.a.s.SolrTestCaseJ4 Writing core.properties file to /home/jenkins/workspace/Lucene-Solr-8.x-Linux/solr/build/solr-core/test/J1/temp/solr.update.PeerSyncTest_977B0D8549419591-001/tempDir-001/control/cores/collection1
   [junit4]   2> 2482582 WARN  (TEST-PeerSyncTest.test-seed#[977B0D8549419591]) [    ] o.e.j.s.AbstractConnector Ignoring deprecated socket close linger time
   [junit4]   2> 2482587 INFO  (TEST-PeerSyncTest.test-seed#[977B0D8549419591]) [    ] o.a.s.c.s.e.JettySolrRunner Start Jetty (original configured port=0)
   [junit4]   2> 2482587 INFO  (TEST-PeerSyncTest.test-seed#[977B0D8549419591]) [    ] o.a.s.c.s.e.JettySolrRunner Trying to start Jetty on port 0 try number 1 ...
   [junit4]   2> 2482587 INFO  (TEST-PeerSyncTest.test-seed#[977B0D8549419591]) [    ] o.e.j.s.Server jetty-9.4.14.v20181114; built: 2018-11-14T21:20:31.478Z; git: c4550056e785fb5665914545889f21dc136ad9e6; jvm 1.8.0_201-b09
   [junit4]   2> 2482590 INFO  (TEST-PeerSyncTest.test-seed#[977B0D8549419591]) [    ] o.e.j.s.session DefaultSessionIdManager workerName=node0
   [junit4]   2> 2482590 INFO  (TEST-PeerSyncTest.test-seed#[977B0D8549419591]) [    ] o.e.j.s.session No SessionScavenger set, using defaults
   [junit4]   2> 2482590 INFO  (TEST-PeerSyncTest.test-seed#[977B0D8549419591]) [    ] o.e.j.s.session node0 Scavenging every 660000ms
   [junit4]   2> 2482591 INFO  (TEST-PeerSyncTest.test-seed#[977B0D8549419591]) [    ] o.e.j.s.h.ContextHandler Started o.e.j.s.ServletContextHandler@e93145{/_ox/s,null,AVAILABLE}
   [junit4]   2> 2482592 INFO  (TEST-PeerSyncTest.test-seed#[977B0D8549419591]) [    ] o.e.j.s.AbstractConnector Started ServerConnector@194a55a{HTTP/1.1,[http/1.1, h2c]}{127.0.0.1:37051}
   [junit4]   2> 2482592 INFO  (TEST-PeerSyncTest.test-seed#[977B0D8549419591]) [    ] o.e.j.s.Server Started @2482620ms
   [junit4]   2> 2482592 INFO  (TEST-PeerSyncTest.test-seed#[977B0D8549419591]) [    ] o.a.s.c.s.e.JettySolrRunner Jetty properties: {schema=schema.xml, solrconfig=solrconfig-tlog.xml, hostContext=/_ox/s, hostPort=37051, coreRootDirectory=/home/jenkins/workspace/Lucene-Solr-8.x-Linux/solr/build/solr-core/test/J1/temp/solr.update.PeerSyncTest_977B0D8549419591-001/tempDir-001/control/cores}
   [junit4]   2> 2482593 ERROR (TEST-PeerSyncTest.test-seed#[977B0D8549419591]) [    ] o.a.s.u.StartupLoggingUtils Missing Java Option solr.log.dir. Logging may be missing or incomplete.
   [junit4]   2> 2482593 INFO  (TEST-PeerSyncTest.test-seed#[977B0D8549419591]) [    ] o.a.s.s.SolrDispatchFilter Using logger factory org.apache.logging.slf4j.Log4jLoggerFactory
   [junit4]   2> 2482593 INFO  (TEST-PeerSyncTest.test-seed#[977B0D8549419591]) [    ] o.a.s.s.SolrDispatchFilter  ___      _       Welcome to Apache Solr™ version 8.1.0
   [junit4]   2> 2482593 INFO  (TEST-PeerSyncTest.test-seed#[977B0D8549419591]) [    ] o.a.s.s.SolrDispatchFilter / __| ___| |_ _   Starting in standalone mode on port null
   [junit4]   2> 2482593 INFO  (TEST-PeerSyncTest.test-seed#[977B0D8549419591]) [    ] o.a.s.s.SolrDispatchFilter \__ \/ _ \ | '_|  Install dir: null
   [junit4]   2> 2482593 INFO  (TEST-PeerSyncTest.test-seed#[977B0D8549419591]) [    ] o.a.s.s.SolrDispatchFilter |___/\___/_|_|    Start time: 2019-05-01T04:30:04.161Z
   [junit4]   2> 2482593 INFO  (TEST-PeerSyncTest.test-seed#[977B0D8549419591]) [    ] o.a.s.c.SolrXmlConfig Loading container configuration from /home/jenkins/workspace/Lucene-Solr-8.x-Linux/solr/build/solr-core/test/J1/temp/solr.update.PeerSyncTest_977B0D8549419591-001/tempDir-001/control/solr.xml
   [junit4]   2> 2482602 INFO  (TEST-PeerSyncTest.test-seed#[977B0D8549419591]) [    ] o.a.s.c.SolrXmlConfig Configuration parameter autoReplicaFailoverWorkLoopDelay is ignored
   [junit4]   2> 2482602 INFO  (TEST-PeerSyncTest.test-seed#[977B0D8549419591]) [    ] o.a.s.c.SolrXmlConfig Configuration parameter autoReplicaFailoverBadNodeExpiration is ignored
   [junit4]   2> 2482610 INFO  (TEST-PeerSyncTest.test-seed#[977B0D8549419591]) [    ] o.a.s.c.SolrXmlConfig MBean server found: com.sun.jmx.mbeanserver.JmxMBeanServer@1362881, but no JMX reporters were configured - adding default JMX reporter.
   [junit4]   2> 2485383 INFO  (TEST-PeerSyncTest.test-seed#[977B0D8549419591]) [    ] o.a.s.h.c.HttpShardHandlerFactory Host whitelist initialized: WhitelistHostChecker [whitelistHosts=null, whitelistHostCheckingEnabled=false]
   [junit4]   2> 2485386 WARN  (TEST-PeerSyncTest.test-seed#[977B0D8549419591]) [    ] o.e.j.u.s.S.config No Client EndPointIdentificationAlgorithm configured for SslContextFactory@12b898a[provider=null,keyStore=null,trustStore=null]
   [junit4]   2> 2485402 WARN  (TEST-PeerSyncTest.test-seed#[977B0D8549419591]) [    ] o.e.j.u.s.S.config No Client EndPointIdentificationAlgorithm configured for SslContextFactory@19ff88d[provider=null,keyStore=null,trustStore=null]
   [junit4]   2> 2485431 INFO  (TEST-PeerSyncTest.test-seed#[977B0D8549419591]) [    ] o.a.s.c.TransientSolrCoreCacheDefault Allocating transient cache for 4 transient cores
   [junit4]   2> 2485431 INFO  (TEST-PeerSyncTest.test-seed#[977B0D8549419591]) [    ] o.a.s.h.a.MetricsHistoryHandler No .system collection, keeping metrics history in memory.
   [junit4]   2> 2485497 INFO  (TEST-PeerSyncTest.test-seed#[977B0D8549419591]) [    ] o.a.s.m.r.SolrJmxReporter JMX monitoring for 'solr.node' (registry 'solr.node') enabled at server: com.sun.jmx.mbeanserver.JmxMBeanServer@1362881
   [junit4]   2> 2485526 INFO  (TEST-PeerSyncTest.test-seed#[977B0D8549419591]) [    ] o.a.s.m.r.SolrJmxReporter JMX monitoring for 'solr.jvm' (registry 'solr.jvm') enabled at server: com.sun.jmx.mbeanserver.JmxMBeanServer@1362881
   [junit4]   2> 2485527 INFO  (TEST-PeerSyncTest.test-seed#[977B0D8549419591]) [    ] o.a.s.m.r.SolrJmxReporter JMX monitoring for 'solr.jetty' (registry 'solr.jetty') enabled at server: com.sun.jmx.mbeanserver.JmxMBeanServer@1362881
   [junit4]   2> 2485530 INFO  (TEST-PeerSyncTest.test-seed#[977B0D8549419591]) [    ] o.a.s.c.CorePropertiesLocator Found 1 core definitions underneath /home/jenkins/workspace/Lucene-Solr-8.x-Linux/solr/build/solr-core/test/J1/temp/solr.update.PeerSyncTest_977B0D8549419591-001/tempDir-001/control/cores
   [junit4]   2> 2485530 INFO  (TEST-PeerSyncTest.test-seed#[977B0D8549419591]) [    ] o.a.s.c.CorePropertiesLocator Cores are: [collection1]
   [junit4]   2> 2485533 INFO  (coreLoadExecutor-7664-thread-1) [    x:collection1] o.a.s.c.SolrResourceLoader [null] Added 2 libs to classloader, from paths: [/home/jenkins/workspace/Lucene-Solr-8.x-Linux/solr/core/src/test-files/solr/collection1/lib, /home/jenkins/workspace/Lucene-Solr-8.x-Linux/solr/core/src/test-files/solr/collection1/lib/classes]
   [junit4]   2> 2485651 INFO  (coreLoadExecutor-7664-thread-1) [    x:collection1] o.a.s.c.SolrConfig Using Lucene MatchVersion: 8.1.0
   [junit4]   2> 2485732 INFO  (coreLoadExecutor-7664-thread-1) [    x:collection1] o.a.s.s.IndexSchema [collection1] Schema name=test
   [junit4]   2> 2486120 INFO  (coreLoadExecutor-7664-thread-1) [    x:collection1] o.a.s.s.IndexSchema Loaded schema test/1.0 with uniqueid field id
   [junit4]   2> 2486154 INFO  (coreLoadExecutor-7664-thread-1) [    x:collection1] o.a.s.c.CoreContainer Creating SolrCore 'collection1' using configuration from configset /home/jenkins/workspace/Lucene-Solr-8.x-Linux/solr/core/src/test-files/solr/collection1, trusted=true
   [junit4]   2> 2486154 INFO  (coreLoadExecutor-7664-thread-1) [    x:collection1] o.a.s.m.r.SolrJmxReporter JMX monitoring for 'solr.core.collection1' (registry 'solr.core.collection1') enabled at server: com.sun.jmx.mbeanserver.JmxMBeanServer@1362881
   [junit4]   2> 2486155 INFO  (coreLoadExecutor-7664-thread-1) [    x:collection1] o.a.s.c.SolrCore [[collection1] ] Opening new SolrCore at [/home/jenkins/workspace/Lucene-Solr-8.x-Linux/solr/core/src/test-files/solr/collection1], dataDir=[/home/jenkins/workspace/Lucene-Solr-8.x-Linux/solr/build/solr-core/test/J1/temp/solr.update.PeerSyncTest_977B0D8549419591-001/tempDir-001/control/cores/collection1/data/]
   [junit4]   2> 2486158 INFO  (coreLoadExecutor-7664-thread-1) [    x:collection1] o.a.s.u.RandomMergePolicy RandomMergePolicy wrapping class org.apache.lucene.index.AlcoholicMergePolicy: [AlcoholicMergePolicy: minMergeSize=0, mergeFactor=10, maxMergeSize=766210615, maxMergeSizeForForcedMerge=9223372036854775807, calibrateSizeByDeletes=true, maxMergeDocs=2147483647, maxCFSSegmentSizeMB=8.796093022207999E12, noCFSRatio=0.1]
   [junit4]   2> 2486161 WARN  (coreLoadExecutor-7664-thread-1) [    x:collection1] o.a.s.c.RequestHandlers INVALID paramSet a in requestHandler {type = requestHandler,name = /dump,class = DumpRequestHandler,attributes = {initParams=a, name=/dump, class=DumpRequestHandler},args = {defaults={a=A,b=B}}}
   [junit4]   2> 2486287 INFO  (coreLoadExecutor-7664-thread-1) [    x:collection1] o.a.s.u.UpdateHandler Using UpdateLog implementation: org.apache.solr.update.UpdateLog
   [junit4]   2> 2486287 INFO  (coreLoadExecutor-7664-thread-1) [    x:collection1] o.a.s.u.UpdateLog Initializing UpdateLog: dataDir= defaultSyncLevel=FLUSH numRecordsToKeep=100 maxNumLogsToKeep=10 numVersionBuckets=65536
   [junit4]   2> 2486292 INFO  (coreLoadExecutor-7664-thread-1) [    x:collection1] o.a.s.u.CommitTracker Hard AutoCommit: disabled
   [junit4]   2> 2486292 INFO  (coreLoadExecutor-7664-thread-1) [    x:collection1] o.a.s.u.CommitTracker Soft AutoCommit: disabled
   [junit4]   2> 2486294 INFO  (coreLoadExecutor-7664-thread-1) [    x:collection1] o.a.s.u.RandomMergePolicy RandomMergePolicy wrapping class org.apache.lucene.index.TieredMergePolicy: [TieredMergePolicy: maxMergeAtOnce=24, maxMergeAtOnceExplicit=36, maxMergedSegmentMB=1.03515625, floorSegmentMB=0.935546875, forceMergeDeletesPctAllowed=24.713105856908967, segmentsPerTier=48.0, maxCFSSegmentSizeMB=8.796093022207999E12, noCFSRatio=0.5379262786861285, deletesPctAllowed=39.83104854822948
   [junit4]   2> 2486294 INFO  (coreLoadExecutor-7664-thread-1) [    x:collection1] o.a.s.s.SolrIndexSearcher Opening [Searcher@1abc60d[collection1] main]
   [junit4]   2> 2486295 WARN  (coreLoadExecutor-7664-thread-1) [    x:collection1] o.a.s.r.ManagedResourceStorage Cannot write to config directory /home/jenkins/workspace/Lucene-Solr-8.x-Linux/solr/core/src/test-files/solr/collection1/conf; switching to use InMemory storage instead.
   [junit4]   2> 2486295 INFO  (coreLoadExecutor-7664-thread-1) [    x:collection1] o.a.s.h.ReplicationHandler Commits will be reserved for 10000ms.
   [junit4]   2> 2486296 INFO  (coreLoadExecutor-7664-thread-1) [    x:collection1] o.a.s.u.UpdateLog Could not find max version in index or recent updates, using new clock 1632302538806001664
   [junit4]   2> 2486325 INFO  (searcherExecutor-7665-thread-1-processing-x:collection1) [    x:collection1] o.a.s.c.SolrCore [collection1] Registered new searcher Searcher@1abc60d[collection1] main{ExitableDirectoryReader(UninvertingDirectoryReader())}
   [junit4]   2> 2486448 INFO  (TEST-PeerSyncTest.test-seed#[977B0D8549419591]) [    ] o.a.s.SolrTestCaseJ4 Writing core.properties file to /home/jenkins/workspace/Lucene-Solr-8.x-Linux/solr/build/solr-core/test/J1/temp/solr.update.PeerSyncTest_977B0D8549419591-001/tempDir-001/shard0/cores/collection1
   [junit4]   2> 2486449 WARN  (TEST-PeerSyncTest.test-seed#[977B0D8549419591]) [    ] o.e.j.s.AbstractConnector Ignoring deprecated socket close linger time
   [junit4]   2> 2486450 INFO  (TEST-PeerSyncTest.test-seed#[977B0D8549419591]) [    ] o.a.s.c.s.e.JettySolrRunner Start Jetty (original configured port=0)
   [junit4]   2> 2486450 INFO  (TEST-PeerSyncTest.test-seed#[977B0D8549419591]) [    ] o.a.s.c.s.e.JettySolrRunner Trying to start Jetty on port 0 try number 1 ...
   [junit4]   2> 2486450 INFO  (TEST-PeerSyncTest.test-seed#[977B0D8549419591]) [    ] o.e.j.s.Server jetty-9.4.14.v20181114; built: 2018-11-14T21:20:31.478Z; git: c4550056e785fb5665914545889f21dc136ad9e6; jvm 1.8.0_201-b09
   [junit4]   2> 2486467 INFO  (TEST-PeerSyncTest.test-seed#[977B0D8549419591]) [    ] o.e.j.s.session DefaultSessionIdManager workerName=node0
   [junit4]   2> 2486467 INFO  (TEST-PeerSyncTest.test-seed#[977B0D8549419591]) [    ] o.e.j.s.session No SessionScavenger set, using defaults
   [junit4]   2> 2486467 INFO  (TEST-PeerSyncTest.test-seed#[977B0D8549419591]) [    ] o.e.j.s.session node0 Scavenging every 600000ms
   [junit4]   2> 2486472 INFO  (TEST-PeerSyncTest.test-seed#[977B0D8549419591]) [    ] o.e.j.s.h.ContextHandler Started o.e.j.s.ServletContextHandler@12ec56f{/_ox/s,null,AVAILABLE}
   [junit4]   2> 2486474 INFO  (TEST-PeerSyncTest.test-seed#[977B0D8549419591]) [    ] o.e.j.s.AbstractConnector Started ServerConnector@ead0ac{HTTP/1.1,[http/1.1, h2c]}{127.0.0.1:38107}
   [junit4]   2> 2486475 INFO  (TEST-PeerSyncTest.test-seed#[977B0D8549419591]) [    ] o.e.j.s.Server Started @2486502ms
   [junit4]   2> 2486475 INFO  (TEST-PeerSyncTest.test-seed#[977B0D8549419591]) [    ] o.a.s.c.s.e.JettySolrRunner Jetty properties: {schema=schema.xml, solrconfig=solrconfig-tlog.xml, hostContext=/_ox/s, hostPort=38107, coreRootDirectory=/home/jenkins/workspace/Lucene-Solr-8.x-Linux/solr/build/solr-core/test/J1/temp/solr.update.PeerSyncTest_977B0D8549419591-001/tempDir-001/shard0/cores}
   [junit4]   2> 2486475 ERROR (TEST-PeerSyncTest.test-seed#[977B0D8549419591]) [    ] o.a.s.u.StartupLoggingUtils Missing Java Option solr.log.dir. Logging may be missing or incomplete.
   [junit4]   2> 2486475 INFO  (TEST-PeerSyncTest.test-seed#[977B0D8549419591]) [    ] o.a.s.s.SolrDispatchFilter Using logger factory org.apache.logging.slf4j.Log4jLoggerFactory
   [junit4]   2> 2486475 INFO  (TEST-PeerSyncTest.test-seed#[977B0D8549419591]) [    ] o.a.s.s.SolrDispatchFilter  ___      _       Welcome to Apache Solr™ version 8.1.0
   [junit4]   2> 2486475 INFO  (TEST-PeerSyncTest.test-seed#[977B0D8549419591]) [    ] o.a.s.s.SolrDispatchFilter / __| ___| |_ _   Starting in standalone mode on port null
   [junit4]   2> 2486475 INFO  (TEST-PeerSyncTest.test-seed#[977B0D8549419591]) [    ] o.a.s.s.SolrDispatchFilter \__ \/ _ \ | '_|  Install dir: null
   [junit4]   2> 2486475 INFO  (TEST-PeerSyncTest.test-seed#[977B0D8549419591]) [    ] o.a.s.s.SolrDispatchFilter |___/\___/_|_|    Start time: 2019-05-01T04:30:08.043Z
   [junit4]   2> 2486476 INFO  (TEST-PeerSyncTest.test-seed#[977B0D8549419591]) [    ] o.a.s.c.SolrXmlConfig Loading container configuration from /home/jenkins/workspace/Lucene-Solr-8.x-Linux/solr/build/solr-core/test/J1/temp/solr.update.PeerSyncTest_977B0D8549419591-001/tempDir-001/shard0/solr.xml
   [junit4]   2> 2486494 INFO  (TEST-PeerSyncTest.test-seed#[977B0D8549419591]) [    ] o.a.s.c.SolrXmlConfig Configuration parameter autoReplicaFailoverWorkLoopDelay is ignored
   [junit4]   2> 2486495 INFO  (TEST-PeerSyncTest.test-seed#[977B0D8549419591]) [    ] o.a.s.c.SolrXmlConfig Configuration parameter autoReplicaFailoverBadNodeExpiration is ignored
   [junit4]   2> 2486517 INFO  (TEST-PeerSyncTest.test-seed#[977B0D8549419591]) [    ] o.a.s.c.SolrXmlConfig MBean server found: com.sun.jmx.mbeanserver.JmxMBeanServer@1362881, but no JMX reporters were configured - adding default JMX reporter.
   [junit4]   2> 2490090 INFO  (TEST-PeerSyncTest.test-seed#[977B0D8549419591]) [    ] o.a.s.h.c.HttpShardHandlerFactory Host whitelist initialized: WhitelistHostChecker [whitelistHosts=null, whitelistHostCheckingEnabled=false]
   [junit4]   2> 2490094 WARN  (TEST-PeerSyncTest.test-seed#[977B0D8549419591]) [    ] o.e.j.u.s.S.config No Client EndPointIdentificationAlgorithm configured for SslContextFactory@16b9a94[provider=null,keyStore=null,trustStore=null]
   [junit4]   2> 2490100 WARN  (TEST-PeerSyncTest.test-seed#[977B0D8549419591]) [    ] o.e.j.u.s.S.config No Client EndPointIdentificationAlgorithm configured for SslContextFactory@166f959[provider=null,keyStore=null,trustStore=null]
   [junit4]   2> 2490123 INFO  (TEST-PeerSyncTest.test-seed#[977B0D8549419591]) [    ] o.a.s.c.TransientSolrCoreCacheDefault Allocating transient cache for 4 transient cores
   [junit4]   2> 2490124 INFO  (TEST-PeerSyncTest.test-seed#[977B0D8549419591]) [    ] o.a.s.h.a.MetricsHistoryHandler No .system collection, keeping metrics history in memory.
   [junit4]   2> 2490156 INFO  (TEST-PeerSyncTest.test-seed#[977B0D8549419591]) [    ] o.a.s.m.r.SolrJmxReporter JMX monitoring for 'solr.node' (registry 'solr.node') enabled at server: com.sun.jmx.mbeanserver.JmxMBeanServer@1362881
   [junit4]   2> 2490196 INFO  (TEST-PeerSyncTest.test-seed#[977B0D8549419591]) [    ] o.a.s.m.r.SolrJmxReporter JMX monitoring for 'solr.jvm' (registry 'solr.jvm') enabled at server: com.sun.jmx.mbeanserver.JmxMBeanServer@1362881
   [junit4]   2> 2490197 INFO  (TEST-PeerSyncTest.test-seed#[977B0D8549419591]) [    ] o.a.s.m.r.SolrJmxReporter JMX monitoring for 'solr.jetty' (registry 'solr.jetty') enabled at server: com.sun.jmx.mbeanserver.JmxMBeanServer@1362881
   [junit4]   2> 2490200 INFO  (TEST-PeerSyncTest.test-seed#[977B0D8549419591]) [    ] o.a.s.c.CorePropertiesLocator Found 1 core definitions underneath /home/jenkins/workspace/Lucene-Solr-8.x-Linux/solr/build/solr-core/test/J1/temp/solr.update.PeerSyncTest_977B0D8549419591-001/tempDir-001/shard0/cores
   [junit4]   2> 2490200 INFO  (TEST-PeerSyncTest.test-seed#[977B0D8549419591]) [    ] o.a.s.c.CorePropertiesLocator Cores are: [collection1]
   [junit4]   2> 2490201 INFO  (coreLoadExecutor-7678-thread-1) [    x:collection1] o.a.s.c.SolrResourceLoader [null] Added 2 libs to classloader, from paths: [/home/jenkins/workspace/Lucene-Solr-8.x-Linux/solr/core/src/test-files/solr/collection1/lib, /home/jenkins/workspace/Lucene-Solr-8.x-Linux/solr/core/src/test-files/solr/collection1/lib/classes]
   [junit4]   2> 2490331 INFO  (coreLoadExecutor-7678-thread-1) [    x:collection1] o.a.s.c.SolrConfig Using Lucene MatchVersion: 8.1.0
   [junit4]   2> 2490434 INFO  (coreLoadExecutor-7678-thread-1) [    x:collection1] o.a.s.s.IndexSchema [collection1] Schema name=test
   [junit4]   2> 2490733 INFO  (coreLoadExecutor-7678-thread-1) [    x:collection1] o.a.s.s.IndexSchema Loaded schema test/1.0 with uniqueid field id
   [junit4]   2> 2490752 INFO  (coreLoadExecutor-7678-thread-1) [    x:collection1] o.a.s.c.CoreContainer Creating SolrCore 'collection1' using configuration from configset /home/jenkins/workspace/Lucene-Solr-8.x-Linux/solr/core/src/test-files/solr/collection1, trusted=true
   [junit4]   2> 2490753 INFO  (coreLoadExecutor-7678-thread-1) [    x:collection1] o.a.s.m.r.SolrJmxReporter JMX monitoring for 'solr.core.collection1' (registry 'solr.core.collection1') enabled at server: com.sun.jmx.mbeanserver.JmxMBeanServer@1362881
   [junit4]   2> 2490753 INFO  (coreLoadExecutor-7678-thread-1) [    x:collection1] o.a.s.c.SolrCore [[collection1] ] Opening new SolrCore at [/home/jenkins/workspace/Lucene-Solr-8.x-Linux/solr/core/src/test-files/solr/collection1], dataDir=[/home/jenkins/workspace/Lucene-Solr-8.x-Linux/solr/build/solr-core/test/J1/temp/solr.update.PeerSyncTest_977B0D8549419591-001/tempDir-001/shard0/cores/collection1/data/]
   [junit4]   2> 2490755 INFO  (coreLoadExecutor-7678-thread-1) [    x:collection1] o.a.s.u.RandomMergePolicy RandomMergePolicy wrapping class org.apache.lucene.index.AlcoholicMergePolicy: [AlcoholicMergePolicy: minMergeSize=0, mergeFactor=10, maxMergeSize=766210615, maxMergeSizeForForcedMerge=9223372036854775807, calibrateSizeByDeletes=true, maxMergeDocs=2147483647, maxCFSSegmentSizeMB=8.796093022207999E12, noCFSRatio=0.1]
   [junit4]   2> 2490760 WARN  (coreLoadExecutor-7678-thread-1) [    x:collection1] o.a.s.c.RequestHandlers INVALID paramSet a in requestHandler {type = requestHandler,name = /dump,class = DumpRequestHandler,attributes = {initParams=a, name=/dump, class=DumpRequestHandler},args = {defaults={a=A,b=B}}}
   [junit4]   2> 2490845 INFO  (coreLoadExecutor-7678-thread-1) [    x:collection1] o.a.s.u.UpdateHandler Using UpdateLog implementation: org.apache.solr.update.UpdateLog
   [junit4]   2> 2490845 INFO  (coreLoadExecutor-7678-thread-1) [    x:collection1] o.a.s.u.UpdateLog Initializing UpdateLog: dataDir= defaultSyncLevel=FLUSH numRecordsToKeep=100 maxNumLogsToKeep=10 numVersionBuckets=65536
   [junit4]   2> 2490846 INFO  (coreLoadExecutor-7678-thread-1) [    x:collection1] o.a.s.u.CommitTracker Hard AutoCommit: disabled
   [junit4]   2> 2490846 INFO  (coreLoadExecutor-7678-thread-1) [    x:collection1] o.a.s.u.CommitTracker Soft AutoCommit: disabled
   [junit4]   2> 2490854 INFO  (coreLoadExecutor-7678-thread-1) [    x:collection1] o.a.s.u.RandomMergePolicy RandomMergePolicy wrapping class org.apache.lucene.index.TieredMergePolicy: [TieredMergePolicy: maxMergeAtOnce=24, maxMergeAtOnceExplicit=36, maxMergedSegmentMB=1.03515625, floorSegmentMB=0.935546875, forceMergeDeletesPctAllowed=24.713105856908967, segmentsPerTier=48.0, maxCFSSegmentSizeMB=8.796093022207999E12, noCFSRatio=0.5379262786861285, deletesPctAllowed=39.83104854822948
   [junit4]   2> 2490855 INFO  (coreLoadExecutor-7678-thread-1) [    x:collection1] o.a.s.s.SolrIndexSearcher Opening [Searcher@1e8363d[collection1] main]
   [junit4]   2> 2490856 WARN  (coreLoadExecutor-7678-thread-1) [    x:collection1] o.a.s.r.ManagedResourceStorage Cannot write to config directory /home/jenkins/workspace/Lucene-Solr-8.x-Linux/solr/core/src/test-files/solr/collection1/conf; switching to use InMemory storage instead.
   [junit4]   2> 2490856 INFO  (coreLoadExecutor-7678-thread-1) [    x:collection1] o.a.s.h.ReplicationHandler Commits will be reserved for 10000ms.
   [junit4]   2> 2490856 INFO  (coreLoadExecutor-7678-thread-1) [    x:collection1] o.a.s.u.UpdateLog Could not find max version in index or recent updates, using new clock 1632302543587508224
   [junit4]   2> 2490860 INFO  (searcherExecutor-7679-thread-1-processing-x:collection1) [    x:collection1] o.a.s.c.SolrCore [collection1] Registered new searcher Searcher@1e8363d[collection1] main{ExitableDirectoryReader(UninvertingDirectoryReader())}
   [junit4]   2> 2490957 INFO  (TEST-PeerSyncTest.test-seed#[977B0D8549419591]) [    ] o.a.s.SolrTestCaseJ4 Writing core.properties file to /home/jenkins/workspace/Lucene-Solr-8.x-Linux/solr/build/solr-core/test/J1/temp/solr.update.PeerSyncTest_977B0D8549419591-001/tempDir-001/shard1/cores/collection1
   [junit4]   2> 2490957 WARN  (TEST-PeerSyncTest.test-seed#[977B0D8549419591]) [    ] o.e.j.s.AbstractConnector Ignoring deprecated socket close linger time
   [junit4]   2> 2490958 INFO  (TEST-PeerSyncTest.test-seed#[977B0D8549419591]) [    ] o.a.s.c.s.e.JettySolrRunner Start Jetty (original configured port=0)
   [junit4]   2> 2490958 INFO  (TEST-PeerSyncTest.test-seed#[977B0D8549419591]) [    ] o.a.s.c.s.e.JettySolrRunner Trying to start Jetty on port 0 try number 1 ...
   [junit4]   2> 2490958 INFO  (TEST-PeerSyncTest.test-seed#[977B0D8549419591]) [    ] o.e.j.s.Server jetty-9.4.14.v20181114; built: 2018-11-14T21:20:31.478Z; git: c4550056e785fb5665914545889f21dc136ad9e6; jvm 1.8.0_201-b09
   [junit4]   2> 2490959 INFO  (TEST-PeerSyncTest.test-seed#[977B0D8549419591]) [    ] o.e.j.s.session DefaultSessionIdManager workerName=node0
   [junit4]   2> 2490959 INFO  (TEST-PeerSyncTest.test-seed#[977B0D8549419591]) [    ] o.e.j.s.session No SessionScavenger set, using defaults
   [junit4]   2> 2490959 INFO  (TEST-PeerSyncTest.test-seed#[977B0D8549419591]) [    ] o.e.j.s.session node0 Scavenging every 600000ms
   [junit4]   2> 2490959 INFO  (TEST-PeerSyncTest.test-seed#[977B0D8549419591]) [    ] o.e.j.s.h.ContextHandler Started o.e.j.s.ServletContextHandler@426b92{/_ox/s,null,AVAILABLE}
   [junit4]   2> 2490960 INFO  (TEST-PeerSyncTest.test-seed#[977B0D8549419591]) [    ] o.e.j.s.AbstractConnector Started ServerConnector@111ca6f{HTTP/1.1,[http/1.1, h2c]}{127.0.0.1:34629}
   [junit4]   2> 2490960 INFO  (TEST-PeerSyncTest.test-seed#[977B0D8549419591]) [    ] o.e.j.s.Server Started @2490988ms
   [junit4]   2> 2490960 INFO  (TEST-PeerSyncTest.test-seed#[977B0D8549419591]) [    ] o.a.s.c.s.e.JettySolrRunner Jetty properties: {schema=schema.xml, solrconfig=solrconfig-tlog.xml, hostContext=/_ox/s, hostPort=34629, coreRootDirectory=/home/jenkins/workspace/Lucene-Solr-8.x-Linux/solr/build/solr-core/test/J1/temp/solr.update.PeerSyncTest_977B0D8549419591-001/tempDir-001/shard1/cores}
   [junit4]   2> 2490961 ERROR (TEST-PeerSyncTest.test-seed#[977B0D8549419591]) [    ] o.a.s.u.StartupLoggingUtils Missing Java Option solr.log.dir. Logging may be missing or incomplete.
   [junit4]   2> 2490961 INFO  (TEST-PeerSyncTest.test-seed#[977B0D8549419591]) [    ] o.a.s.s.SolrDispatchFilter Using logger factory org.apache.logging.slf4j.Log4jLoggerFactory
   [junit4]   2> 2490961 INFO  (TEST-PeerSyncTest.test-seed#[977B0D8549419591]) [    ] o.a.s.s.SolrDispatchFilter  ___      _       Welcome to Apache Solr™ version 8.1.0
   [junit4]   2> 2490961 INFO  (TEST-PeerSyncTest.test-seed#[977B0D8549419591]) [    ] o.a.s.s.SolrDispatchFilter / __| ___| |_ _   Starting in standalone mode on port null
   [junit4]   2> 2490961 INFO  (TEST-PeerSyncTest.test-seed#[977B0D8549419591]) [    ] o.a.s.s.SolrDispatchFilter \__ \/ _ \ | '_|  Install dir: null
   [junit4]   2> 2490961 INFO  (TEST-PeerSyncTest.test-seed#[977B0D8549419591]) [    ] o.a.s.s.SolrDispatchFilter |___/\___/_|_|    Start time: 2019-05-01T04:30:12.529Z
   [junit4]   2> 2490961 INFO  (TEST-PeerSyncTest.test-seed#[977B0D8549419591]) [    ] o.a.s.c.SolrXmlConfig Loading container configuration from /home/jenkins/workspace/Lucene-Solr-8.x-Linux/solr/build/solr-core/test/J1/temp/solr.update.PeerSyncTest_977B0D8549419591-001/tempDir-001/shard1/solr.xml
   [junit4]   2> 2490972 INFO  (TEST-PeerSyncTest.test-seed#[977B0D8549419591]) [    ] o.a.s.c.SolrXmlConfig Configuration parameter autoReplicaFailoverWorkLoopDelay is ignored
   [junit4]   2> 2490972 INFO  (TEST-PeerSyncTest.test-seed#[977B0D8549419591]) [    ] o.a.s.c.SolrXmlConfig Configuration parameter autoReplicaFailoverBadNodeExpiration is ignored
   [junit4]   2> 2490977 INFO  (TEST-PeerSyncTest.test-seed#[977B0D8549419591]) [    ] o.a.s.c.SolrXmlConfig MBean server found: com.sun.jmx.mbeanserver.JmxMBeanServer@1362881, but no JMX reporters were configured - adding default JMX reporter.
   [junit4]   2> 2492029 INFO  (TEST-PeerSyncTest.test-seed#[977B0D8549419591]) [    ] o.a.s.h.c.HttpShardHandlerFactory Host whitelist initialized: WhitelistHostChecker [whitelistHosts=null, whitelistHostCheckingEnabled=false]
   [junit4]   2> 2492038 WARN  (TEST-PeerSyncTest.test-seed#[977B0D8549419591]) [    ] o.e.j.u.s.S.config No Client EndPointIdentificationAlgorithm configured for SslContextFactory@1d8d10e[provider=null,keyStore=null,trustStore=null]
   [junit4]   2> 2492047 WARN  (TEST-PeerSyncTest.test-seed#[977B0D8549419591]) [    ] o.e.j.u.s.S.config No Client EndPointIdentificationAlgorithm configured for SslContextFactory@b7750d[provider=null,keyStore=null,trustStore=null]
   [junit4]   2> 2492078 INFO  (TEST-PeerSyncTest.test-seed#[977B0D8549419591]) [    ] o.a.s.c.TransientSolrCoreCacheDefault Allocating transient cache for 4 transient cores
   [junit4]   2> 2492078 INFO  (TEST-PeerSyncTest.test-seed#[977B0D8549419591]) [    ] o.a.s.h.a.MetricsHistoryHandler No .system collection, keeping metrics history in memory.
   [junit4]   2> 2492125 INFO  (TEST-PeerSyncTest.test-seed#[977B0D8549419591]) [    ] o.a.s.m.r.SolrJmxReporter JMX monitoring for 'solr.node' (registry 'solr.node') enabled at server: com.sun.jmx.mbeanserver.JmxMBeanServer@1362881
   [junit4]   2> 2492150 INFO  (TEST-PeerSyncTest.test-seed#[977B0D8549419591]) [    ] o.a.s.m.r.SolrJmxReporter JMX monitoring for 'solr.jvm' (registry 'solr.jvm') enabled at server: com.sun.jmx.mbeanserver.JmxMBeanServer@1362881
   [junit4]   2> 2492150 INFO  (TEST-PeerSyncTest.test-seed#[977B0D8549419591]) [    ] o.a.s.m.r.SolrJmxReporter JMX monitoring for 'solr.jetty' (registry 'solr.jetty') enabled at server: com.sun.jmx.mbeanserver.JmxMBeanServer@1362881
   [junit4]   2> 2492158 INFO  (TEST-PeerSyncTest.test-seed#[977B0D8549419591]) [    ] o.a.s.c.CorePropertiesLocator Found 1 core definitions underneath /home/jenkins/workspace/Lucene-Solr-8.x-Linux/solr/build/solr-core/test/J1/temp/solr.update.PeerSyncTest_977B0D8549419591-001/tempDir-001/shard1/cores
   [junit4]   2> 2492158 INFO  (TEST-PeerSyncTest.test-seed#[977B0D8549419591]) [    ] o.a.s.c.CorePropertiesLocator Cores are: [collection1]
   [junit4]   2> 2492159 INFO  (coreLoadExecutor-7692-thread-1) [    x:collection1] o.a.s.c.SolrResourceLoader [null] Added 2 libs to classloader, from paths: [/home/jenkins/workspace/Lucene-Solr-8.x-Linux/solr/core/src/test-files/solr/collection1/lib, /home/jenkins/workspace/Lucene-Solr-8.x-Linux/solr/core/src/test-files/solr/collection1/lib/classes]
   [junit4]   2> 2492263 INFO  (coreLoadExecutor-7692-thread-1) [    x:collection1] o.a.s.c.SolrConfig Using Lucene MatchVersion: 8.1.0
   [junit4]   2> 2492370 INFO  (coreLoadExecutor-7692-thread-1) [    x:collection1] o.a.s.s.IndexSchema [collection1] Schema name=test
   [junit4]   2> 2492711 INFO  (coreLoadExecutor-7692-thread-1) [    x:collection1] o.a.s.s.IndexSchema Loaded schema test/1.0 with uniqueid field id
   [junit4]   2> 2492744 INFO  (coreLoadExecutor-7692-thread-1) [    x:collection1] o.a.s.c.CoreContainer Creating SolrCore 'collection1' using configuration from configset /home/jenkins/workspace/Lucene-Solr-8.x-Linux/solr/core/src/test-files/solr/collection1, trusted=true
   [junit4]   2> 2492744 INFO  (coreLoadExecutor-7692-thread-1) [    x:collection1] o.a.s.m.r.SolrJmxReporter JMX monitoring for 'solr.core.collection1' (registry 'solr.core.collection1') enabled at server: com.sun.jmx.mbeanserver.JmxMBeanServer@1362881
   [junit4]   2> 2492745 INFO  (coreLoadExecutor-7692-thread-1) [    x:collection1] o.a.s.c.SolrCore [[collection1] ] Opening new SolrCore at [/home/jenkins/workspace/Lucene-Solr-8.x-Linux/solr/core/src/test-files/solr/collection1], dataDir=[/home/jenkins/workspace/Lucene-Solr-8.x-Linux/solr/build/solr-core/test/J1/temp/solr.update.PeerSyncTest_977B0D8549419591-001/tempDir-001/shard1/cores/collection1/data/]
   [junit4]   2> 2492748 INFO  (coreLoadExecutor-7692-thread-1) [    x:collection1] o.a.s.u.RandomMergePolicy RandomMergePolicy wrapping class org.apache.lucene.index.AlcoholicMergePolicy: [AlcoholicMergePolicy: minMergeSize=0, mergeFactor=10, maxMergeSize=766210615, maxMergeSizeForForcedMerge=9223372036854775807, calibrateSizeByDeletes=true, maxMergeDocs=2147483647, maxCFSSegmentSizeMB=8.796093022207999E12, noCFSRatio=0.1]
   [junit4]   2> 2492773 WARN  (coreLoadExecutor-7692-thread-1) [    x:collection1] o.a.s.c.RequestHandlers INVALID paramSet a in requestHandler {type = requestHandler,name = /dump,class = DumpRequestHandler,attributes = {initParams=a, name=/dump, class=DumpRequestHandler},args = {defaults={a=A,b=B}}}
   [junit4]   2> 2492862 INFO  (coreLoadExecutor-7692-thread-1) [    x:collection1] o.a.s.u.UpdateHandler Using UpdateLog implementation: org.apache.solr.update.UpdateLog
   [junit4]   2> 2492862 INFO  (coreLoadExecutor-7692-thread-1) [    x:collection1] o.a.s.u.UpdateLog Initializing UpdateLog: dataDir= defaultSyncLevel=FLUSH numRecordsToKeep=100 maxNumLogsToKeep=10 numVersionBuckets=65536
   [junit4]   2> 2492863 INFO  (coreLoadExecutor-7692-thread-1) [    x:collection1] o.a.s.u.CommitTracker Hard AutoCommit: disabled
   [junit4]   2> 2492863 INFO  (coreLoadExecutor-7692-thread-1) [    x:collection1] o.a.s.u.CommitTracker Soft AutoCommit: disabled
   [junit4]   2> 2492891 INFO  (coreLoadExecutor-7692-thread-1) [    x:collection1] o.a.s.u.RandomMergePolicy RandomMergePolicy wrapping class org.apache.lucene.index.TieredMergePolicy: [TieredMergePolicy: maxMergeAtOnce=24, maxMergeAtOnceExplicit=36, maxMergedSegmentMB=1.03515625, floorSegmentMB=0.935546875, forceMergeDeletesPctAllowed=24.713105856908967, segmentsPerTier=48.0, maxCFSSegmentSizeMB=8.796093022207999E12, noCFSRatio=0.5379262786861285, deletesPctAllowed=39.83104854822948
   [junit4]   2> 2492892 INFO  (coreLoadExecutor-7692-thread-1) [    x:collection1] o.a.s.s.SolrIndexSearcher Opening [Searcher@145fc48[collection1] main]
   [junit4]   2> 2492892 WARN  (coreLoadExecutor-7692-thread-1) [    x:collection1] o.a.s.r.ManagedResourceStorage Cannot write to config directory /home/jenkins/workspace/Lucene-Solr-8.x-Linux/solr/core/src/test-files/solr/collection1/conf; switching to use InMemory storage instead.
   [junit4]   2> 2492893 INFO  (coreLoadExecutor-7692-thread-1) [    x:collection1] o.a.s.h.ReplicationHandler Commits will be reserved for 10000ms.
   [junit4]   2> 2492893 INFO  (coreLoadExecutor-7692-thread-1) [    x:collection1] o.a.s.u.UpdateLog Could not find max version in index or recent updates, using new clock 1632302545723457536
   [junit4]   2> 2492901 INFO  (searcherExecutor-7693-thread-1-processing-x:collection1) [    x:collection1] o.a.s.c.SolrCore [collection1] Registered new searcher Searcher@145fc48[collection1] main{ExitableDirectoryReader(UninvertingDirectoryReader())}
   [junit4]   2> 2493007 INFO  (TEST-PeerSyncTest.test-seed#[977B0D8549419591]) [    ] o.a.s.SolrTestCaseJ4 Writing core.properties file to /home/jenkins/workspace/Lucene-Solr-8.x-Linux/solr/build/solr-core/test/J1/temp/solr.update.PeerSyncTest_977B0D8549419591-001/tempDir-001/shard2/cores/collection1
   [junit4]   2> 2493008 WARN  (TEST-PeerSyncTest.test-seed#[977B0D8549419591]) [    ] o.e.j.s.AbstractConnector Ignoring deprecated socket close linger time
   [junit4]   2> 2493008 INFO  (TEST-PeerSyncTest.test-seed#[977B0D8549419591]) [    ] o.a.s.c.s.e.JettySolrRunner Start Jetty (original configured port=0)
   [junit4]   2> 2493008 INFO  (TEST-PeerSyncTest.test-seed#[977B0D8549419591]) [    ] o.a.s.c.s.e.JettySolrRunner Trying to start Jetty on port 0 try number 1 ...
   [junit4]   2> 2493008 INFO  (TEST-PeerSyncTest.test-seed#[977B0D8549419591]) [    ] o.e.j.s.Server jetty-9.4.14.v20181114; built: 2018-11-14T21:20:31.478Z; git: c4550056e785fb5665914545889f21dc136ad9e6; jvm 1.8.0_201-b09
   [junit4]   2> 2493010 INFO  (TEST-PeerSyncTest.test-seed#[977B0D8549419591]) [    ] o.e.j.s.session DefaultSessionIdManager workerName=node0
   [junit4]   2> 2493010 INFO  (TEST-PeerSyncTest.test-seed#[977B0D8549419591]) [    ] o.e.j.s.session No SessionScavenger set, using defaults
   [junit4]   2> 2493010 INFO  (TEST-PeerSyncTest.test-seed#[977B0D8549419591]) [    ] o.e.j.s.session node0 Scavenging every 660000ms
   [junit4]   2> 2493010 INFO  (TEST-PeerSyncTest.test-seed#[977B0D8549419591]) [    ] o.e.j.s.h.ContextHandler Started o.e.j.s.ServletContextHandler@1f31c78{/_ox/s,null,AVAILABLE}
   [junit4]   2> 2493011 INFO  (TEST-PeerSyncTest.test-seed#[977B0D8549419591]) [    ] o.e.j.s.AbstractConnector Started ServerConnector@c20109{HTTP/1.1,[http/1.1, h2c]}{127.0.0.1:45949}
   [junit4]   2> 2493011 INFO  (TEST-PeerSyncTest.test-seed#[977B0D8549419591]) [    ] o.e.j.s.Server Started @2493039ms
   [junit4]   2> 2493011 INFO  (TEST-PeerSyncTest.test-seed#[977B0D8549419591]) [    ] o.a.s.c.s.e.JettySolrRunner Jetty properties: {schema=schema.xml, solrconfig=solrconfig-tlog.xml, hostContext=/_ox/s, hostPort=45949, coreRootDirectory=/home/jenkins/workspace/Lucene-Solr-8.x-Linux/solr/build/solr-core/test/J1/temp/solr.update.PeerSyncTest_977B0D8549419591-001/tempDir-001/shard2/cores}
   [junit4]   2> 2493012 ERROR (TEST-PeerSyncTest.test-seed#[977B0D8549419591]) [    ] o.a.s.u.StartupLoggingUtils Missing Java Option solr.log.dir. Logging may be missing or incomplete.
   [junit4]   2> 2493012 INFO  (TEST-PeerSyncTest.test-seed#[977B0D8549419591]) [    ] o.a.s.s.SolrDispatchFilter Using logger factory org.apache.logging.slf4j.Log4jLoggerFactory
   [junit4]   2> 2493012 INFO  (TEST-PeerSyncTest.test-seed#[977B0D8549419591]) [    ] o.a.s.s.SolrDispatchFilter  ___      _       Welcome to Apache Solr™ version 8.1.0
   [junit4]   2> 2493012 INFO  (TEST-PeerSyncTest.test-seed#[977B0D8549419591]) [    ] o.a.s.s.SolrDispatchFilter / __| ___| |_ _   Starting in standalone mode on port null
   [junit4]   2> 2493012 INFO  (TEST-PeerSyncTest.test-seed#[977B0D8549419591]) [    ] o.a.s.s.SolrDispatchFilter \__ \/ _ \ | '_|  Install dir: null
   [junit4]   2> 2493012 INFO  (TEST-PeerSyncTest.test-seed#[977B0D8549419591]) [    ] o.a.s.s.SolrDispatchFilter |___/\___/_|_|    Start time: 2019-05-01T04:30:14.580Z
   [junit4]   2> 2493012 INFO  (TEST-PeerSyncTest.test-seed#[977B0D8549419591]) [    ] o.a.s.c.SolrXmlConfig Loading container configuration from /home/jenkins/workspace/Lucene-Solr-8.x-Linux/solr/build/solr-core/test/J1/temp/solr.update.PeerSyncTest_977B0D8549419591-001/tempDir-001/shard2/solr.xml
   [junit4]   2> 2493021 INFO  (TEST-PeerSyncTest.test-seed#[977B0D8549419591]) [    ] o.a.s.c.SolrXmlConfig Configuration parameter autoReplicaFailoverWorkLoopDelay is ignored
   [junit4]   2> 2493021 INFO  (TEST-PeerSyncTest.test-seed#[977B0D8549419591]) [    ] o.a.s.c.SolrXmlConfig Configuration parameter autoReplicaFailoverBadNodeExpiration is ignored
   [junit4]   2> 2493035 INFO  (TEST-PeerSyncTest.test-seed#[977B0D8549419591]) [    ] o.a.s.c.SolrXmlConfig MBean server found: com.sun.jmx.mbeanserver.JmxMBeanServer@1362881, but no JMX reporters were configured - adding default JMX reporter.
   [junit4]   2> 2494467 INFO  (TEST-PeerSyncTest.test-seed#[977B0D8549419591]) [    ] o.a.s.h.c.HttpShardHandlerFactory Host whitelist initialized: WhitelistHostChecker [whitelistHosts=null, whitelistHostCheckingEnabled=false]
   [junit4]   2> 2494470 WARN  (TEST-PeerSyncTest.test-seed#[977B0D8549419591]) [    ] o.e.j.u.s.S.config No Client EndPointIdentificationAlgorithm configured for SslContextFactory@5862ef[provider=null,keyStore=null,trustStore=null]
   [junit4]   2> 2494476 WARN  (TEST-PeerSyncTest.test-seed#[977B0D8549419591]) [    ] o.e.j.u.s.S.config No Client EndPointIdentificationAlgorithm configured for SslContextFactory@23786f[provider=null,keyStore=null,trustStore=null]
   [junit4]   2> 2494513 INFO  (TEST-PeerSyncTest.test-seed#[977B0D8549419591]) [    ] o.a.s.c.TransientSolrCoreCacheDefault Allocating transient cache for 4 transient cores
   [junit4]   2> 2494513 INFO  (TEST-PeerSyncTest.test-seed#[977B0D8549419591]) [    ] o.a.s.h.a.MetricsHistoryHandler No .system collection, keeping metrics history in memory.
   [junit4]   2> 2494556 INFO  (TEST-PeerSyncTest.test-seed#[977B0D8549419591]) [    ] o.a.s.m.r.SolrJmxReporter JMX monitoring for 'solr.node' (registry 'solr.node') enabled at server: com.sun.jmx.mbeanserver.JmxMBeanServer@1362881
   [junit4]   2> 2494581 INFO  (TEST-PeerSyncTest.test-seed#[977B0D8549419591]) [    ] o.a.s.m.r.SolrJmxReporter JMX monitoring for 'solr.jvm' (registry 'solr.jvm') enabled at server: com.sun.jmx.mbeanserver.JmxMBeanServer@1362881
   [junit4]   2> 2494582 INFO  (TEST-PeerSyncTest.test-seed#[977B0D8549419591]) [    ] o.a.s.m.r.SolrJmxReporter JMX monitoring for 'solr.jetty' (registry 'solr.jetty') enabled at server: com.sun.jmx.mbeanserver.JmxMBeanServer@1362881
   [junit4]   2> 2494588 INFO  (TEST-PeerSyncTest.test-seed#[977B0D8549419591]) [    ] o.a.s.c.CorePropertiesLocator Found 1 core definitions underneath /home/jenkins/workspace/Lucene-Solr-8.x-Linux/solr/build/solr-core/test/J1/temp/solr.update.PeerSyncTest_977B0D8549419591-001/tempDir-001/shard2/cores
   [junit4]   2> 2494588 INFO  (TEST-PeerSyncTest.test-seed#[977B0D8549419591]) [    ] o.a.s.c.CorePropertiesLocator Cores are: [collection1]
   [junit4]   2> 2494588 INFO  (coreLoadExecutor-7706-thread-1) [    x:collection1] o.a.s.c.SolrResourceLoader [null] Added 2 libs to classloader, from paths: [/home/jenkins/workspace/Lucene-Solr-8.x-Linux/solr/core/src/test-files/solr/collection1/lib, /home/jenkins/workspace/Lucene-Solr-8.x-Linux/solr/core/src/test-files/solr/collection1/lib/classes]
   [junit4]   2> 2494641 INFO  (coreLoadExecutor-7706-thread-1) [    x:collection1] o.a.s.c.SolrConfig Using Lucene MatchVersion: 8.1.0
   [junit4]   2> 2494724 INFO  (coreLoadExecutor-7706-thread-1) [    x:collection1] o.a.s.s.IndexSchema [collection1] Schema name=test
   [junit4]   2> 2494963 INFO  (coreLoadExecutor-7706-thread-1) [    x:collection1] o.a.s.s.IndexSchema Loaded schema test/1.0 with uniqueid field id
   [junit4]   2> 2494981 INFO  (coreLoadExecutor-7706-thread-1) [    x:collection1] o.a.s.c.CoreContainer Creating SolrCore 'collection1' using configuration from configset /home/jenkins/workspace/Lucene-Solr-8.x-Linux/solr/core/src/test-files/solr/collection1, trusted=true
   [junit4]   2> 2494982 INFO  (coreLoadExecutor-7706-thread-1) [    x:collection1] o.a.s.m.r.SolrJmxReporter JMX monitoring for 'solr.core.collection1' (registry 'solr.core.collection1') enabled at server: com.sun.jmx.mbeanserver.JmxMBeanServer@1362881
   [junit4]   2> 2494991 INFO  (coreLoadExecutor-7706-thread-1) [    x:collection1] o.a.s.c.SolrCore [[collection1] ] Opening new SolrCore at [/home/jenkins/workspace/Lucene-Solr-8.x-Linux/solr/core/src/test-files/solr/collection1], dataDir=[/home/jenkins/workspace/Lucene-Solr-8.x-Linux/solr/build/solr-core/test/J1/temp/solr.update.PeerSyncTest_977B0D8549419591-001/tempDir-001/shard2/cores/collection1/data/]
   [junit4]   2> 2494994 INFO  (coreLoadExecutor-7706-thread-1) [    x:collection1] o.a.s.u.RandomMergePolicy RandomMergePolicy wrapping class org.apache.lucene.index.AlcoholicMergePolicy: [AlcoholicMergePolicy: minMergeSize=0, mergeFactor=10, maxMergeSize=766210615, maxMergeSizeForForcedMerge=9223372036854775807, calibrateSizeByDeletes=true, maxMergeDocs=2147483647, maxCFSSegmentSizeMB=8.796093022207999E12, noCFSRatio=0.1]
   [junit4]   2> 2494997 WARN  (coreLoadExecutor-7706-thread-1) [    x:collection1] o.a.s.c.RequestHandlers INVALID paramSet a in requestHandler {type = requestHandler,name = /dump,class = DumpRequestHandler,attributes = {initParams=a, name=/dump, class=DumpRequestHandler},args = {defaults={a=A,b=B}}}
   [junit4]   2> 2495087 INFO  (coreLoadExecutor-7706-thread-1) [    x:collection1] o.a.s.u.UpdateHandler Using UpdateLog implementation: org.apache.solr.update.UpdateLog
   [junit4]   2> 2495087 INFO  (coreLoadExecutor-7706-thread-1) [    x:collection1] o.a.s.u.UpdateLog Initializing UpdateLog: dataDir= defaultSyncLevel=FLUSH numRecordsToKeep=100 maxNumLogsToKeep=10 numVersionBuckets=65536
   [junit4]   2> 2495093 INFO  (coreLoadExecutor-7706-thread-1) [    x:collection1] o.a.s.u.CommitTracker Hard AutoCommit: disabled
   [junit4]   2> 2495093 INFO  (coreLoadExecutor-7706-thread-1) [    x:collection1] o.a.s.u.CommitTracker Soft AutoCommit: disabled
   [junit4]   2> 2495095 INFO  (coreLoadExecutor-7706-thread-1) [    x:collection1] o.a.s.u.RandomMergePolicy RandomMergePolicy wrapping class org.apache.lucene.index.TieredMergePolicy: [TieredMergePolicy: maxMergeAtOnce=24, maxMergeAtOnceExplicit=36, maxMergedSegmentMB=1.03515625, floorSegmentMB=0.935546875, forceMergeDeletesPctAllowed=24.713105856908967, segmentsPerTier=48.0, maxCFSSegmentSizeMB=8.796093022207999E12, noCFSRatio=0.5379262786861285, deletesPctAllowed=39.83104854822948
   [junit4]   2> 2495095 INFO  (coreLoadExecutor-7706-thread-1) [    x:collection1] o.a.s.s.SolrIndexSearcher Opening [Searcher@b8631a[collection1] main]
   [junit4]   2> 2495096 WARN  (coreLoadExecutor-7706-thread-1) [    x:collection1] o.a.s.r.ManagedResourceStorage Cannot write to config directory /home/jenkins/workspace/Lucene-Solr-8.x-Linux/solr/core/src/test-files/solr/collection1/conf; switching to use InMemory storage instead.
   [junit4]   2> 2495096 INFO  (coreLoadExecutor-7706-thread-1) [    x:collection1] o.a.s.h.ReplicationHandler Commits will be reserved for 10000ms.
   [junit4]   2> 2495096 INFO  (coreLoadExecutor-7706-thread-1) [    x:collection1] o.a.s.u.UpdateLog Could not find max version in index or recent updates, using new clock 1632302548033470464
   [junit4]   2> 2495099 INFO  (TEST-PeerSyncTest.test-seed#[977B0D8549419591]) [    ] o.a.s.SolrTestCaseJ4 ###Starting test
   [junit4]   2> 2495108 INFO  (searcherExecutor-7707-thread-1-processing-x:collection1) [    x:collection1] o.a.s.c.SolrCore [collection1] Registered new searcher Searcher@b8631a[collection1] main{ExitableDirectoryReader(UninvertingDirectoryReader())}
   [junit4]   2> 2495113 INFO  (qtp11723638-25572) [    x:collection1] o.a.s.u.p.LogUpdateProcessorFactory [collection1]  webapp=/_ox/s path=/update params={update.distrib=FROMLEADER&wt=javabin&version=2}{add=[1 (1)]} 0 3
   [junit4]   2> 2495116 INFO  (qtp16722046-25593) [    x:collection1] o.a.s.u.PeerSync PeerSync: core=collection1 url= START replicas=[http://127.0.0.1:38107/_ox/s/collection1] nUpdates=100
   [junit4]   2> 2495127 INFO  (qtp11723638-25571) [    x:collection1] o.a.s.s.SolrIndexSearcher Opening [Searcher@4db0cb[collection1] realtime]
   [junit4]   2> 2495127 INFO  (qtp11723638-25571) [    x:collection1] o.a.s.u.IndexFingerprint IndexFingerprint millis:8.0 result:{maxVersionSpecified=9223372036854775807, maxVersionEncountered=1, maxInHash=1, versionsHash=-5451962507482445012, numVersions=1, numDocs=1, maxDoc=1}
   [junit4]   2> 2495128 INFO  (qtp11723638-25571) [    x:collection1] o.a.s.c.S.Request [collection1]  webapp=/_ox/s path=/get params={distrib=false&qt=/get&getFingerprint=9223372036854775807&wt=javabin&version=2} status=0 QTime=9
   [junit4]   2> 2495129 INFO  (qtp16722046-25593) [    x:collection1] o.a.s.u.IndexFingerprint IndexFingerprint millis:0.0 result:{maxVersionSpecified=9223372036854775807, maxVersionEncountered=0, maxInHash=0, versionsHash=0, numVersions=0, numDocs=0, maxDoc=0}
   [junit4]   2> 2495129 INFO  (qtp16722046-25593) [    x:collection1] o.a.s.u.PeerSync PeerSync: core=collection1 url= DONE.  We have no versions.  sync failed.
   [junit4]   2> 2495131 INFO  (qtp11723638-25572) [    x:collection1] o.a.s.u.IndexFingerprint IndexFingerprint millis:0.0 result:{maxVersionSpecified=9223372036854775807, maxVersionEncountered=1, maxInHash=1, versionsHash=-5451962507482445012, numVersions=1, numDocs=1, maxDoc=1}
   [junit4]   2> 2495131 INFO  (qtp11723638-25572) [    x:collection1] o.a.s.c.S.Request [collection1]  webapp=/_ox/s path=/get params={distrib=false&qt=/get&fingerprint=true&getVersions=100&wt=javabin&version=2} status=0 QTime=0
   [junit4]   2> 2495132 INFO  (qtp16722046-25593) [    x:collection1] o.a.s.c.S.Request [collection1]  webapp=/_ox/s path=/get params={qt=/get&getVersions=100&sync=http://127.0.0.1:38107/_ox/s/collection1&wt=javabin&version=2} status=0 QTime=16
   [junit4]   2> 2495135 INFO  (qtp16722046-25594) [    x:collection1] o.a.s.u.p.LogUpdateProcessorFactory [collection1]  webapp=/_ox/s path=/update params={update.distrib=FROMLEADER&wt=javabin&version=2}{add=[1 (1)]} 0 1
   [junit4]   2> 2495137 INFO  (qtp16722046-25592) [    x:collection1] o.a.s.u.PeerSync PeerSync: core=collection1 url= START replicas=[http://127.0.0.1:38107/_ox/s/collection1] nUpdates=100
   [junit4]   2> 2495139 INFO  (qtp11723638-25573) [    x:collection1] o.a.s.u.IndexFingerprint IndexFingerprint millis:0.0 result:{maxVersionSpecified=9223372036854775807, maxVersionEncountered=1, maxInHash=1, versionsHash=-5451962507482445012, numVersions=1, numDocs=1, maxDoc=1}
   [junit4]   2> 2495139 INFO  (qtp11723638-25573) [    x:collection1] o.a.s.c.S.Request [collection1]  webapp=/_ox/s path=/get params={distrib=false&qt=/get&getFingerprint=9223372036854775807&wt=javabin&version=2} status=0 QTime=0
   [junit4]   2> 2495151 INFO  (qtp16722046-25592) [    x:collection1] o.a.s.s.SolrIndexSearcher Opening [Searcher@4c78d8[collection1] realtime]
   [junit4]   2> 2495151 INFO  (qtp16722046-25592) [    x:collection1] o.a.s.u.IndexFingerprint IndexFingerprint millis:12.0 result:{maxVersionSpecified=9223372036854775807, maxVersionEncountered=1, maxInHash=1, versionsHash=-5451962507482445012, numVersions=1, numDocs=1, maxDoc=1}
   [junit4]   2> 2495152 INFO  (qtp16722046-25592) [    x:collection1] o.a.s.u.PeerSync We are already in sync. No need to do a PeerSync 
   [junit4]   2> 2495152 INFO  (qtp16722046-25592) [    x:collection1] o.a.s.c.S.Request [collection1]  webapp=/_ox/s path=/get params={qt=/get&getVersions=100&sync=http://127.0.0.1:38107/_ox/s/collection1&wt=javabin&version=2} status=0 QTime=15
   [junit4]   2> 2495154 INFO  (qtp11723638-25571) [    x:collection1] o.a.s.u.DirectUpdateHandler2 start commit{_version_=1632302548094287872,optimize=false,openSearcher=true,waitSearcher=true,expungeDeletes=false,softCommit=false,prepareCommit=false}
   [junit4]   2> 2495154 INFO  (qtp11723638-25571) [    x:collection1] o.a.s.u.SolrIndexWriter Calling setCommitData with IW:org.apache.solr.update.SolrIndexWriter@cfa0e9 commitCommandVersion:1632302548094287872
   [junit4]   2> 2495155 INFO  (qtp11723638-25571) [    x:collection1] o.a.s.s.SolrIndexSearcher Opening [Searcher@19d209a[collection1] main]
   [junit4]   2> 2495156 INFO  (qtp11723638-25571) [    x:collection1] o.a.s.u.DirectUpdateHandler2 end_commit_flush
   [junit4]   2> 2495162 INFO  (searcherExecutor-7679-thread-1-processing-x:collection1) [    x:collection1] o.a.s.c.SolrCore [collection1] Registered new searcher Searcher@19d209a[collection1] main{ExitableDirectoryReader(UninvertingDirectoryReader(Uninverting(_0(8.1.0):C1:[diagnostics={os=Linux, java.vendor=Oracle Corporation, java.version=1.8.0_201, java.vm.version=25.201-b09, lucene.version=8.1.0, os.arch=i386, java.runtime.version=1.8.0_201-b09, source=flush, os.version=4.18.0-17-generic, timestamp=1556685016691}]:[attributes={Lucene50StoredFieldsFormat.mode=BEST_SPEED}])))}
   [junit4]   2> 2495163 INFO  (qtp11723638-25571) [    x:collection1] o.a.s.u.p.LogUpdateProcessorFactory [collection1]  webapp=/_ox/s path=/update params={waitSearcher=true&commit=true&softCommit=false&wt=javabin&version=2}{commit=} 0 9
   [junit4]   2> 2495164 INFO  (qtp16722046-25593) [    x:collection1] o.a.s.u.DirectUpdateHandler2 start commit{_version_=1632302548104773632,optimize=false,openSearcher=true,waitSearcher=true,expungeDeletes=false,softCommit=false,prepareCommit=false}
   [junit4]   2> 2495165 INFO  (qtp16722046-25593) [    x:collection1] o.a.s.u.SolrIndexWriter Calling setCommitData with IW:org.apache.solr.update.SolrIndexWriter@2c1f8f commitCommandVersion:1632302548104773632
   [junit4]   2> 2495166 INFO  (qtp16722046-25593) [    x:collection1] o.a.s.s.SolrIndexSearcher Opening [Searcher@1dac267[collection1] main]
   [junit4]   2> 2495167 INFO  (qtp16722046-25593) [    x:collection1] o.a.s.u.DirectUpdateHandler2 end_commit_flush
   [junit4]   2> 2495171 INFO  (searcherExecutor-7693-thread-1-processing-x:collection1) [    x:collection1] o.a.s.c.SolrCore [collection1] Registered new searcher Searcher@1dac267[collection1] main{ExitableDirectoryReader(UninvertingDirectoryReader(Uninverting(_0(8.1.0):C1:[diagnostics={os=Linux, java.vendor=Oracle Corporation, java.version=1.8.0_201, java.vm.version=25.201-b09, lucene.version=8.1.0, os.arch=i386, java.runtime.version=1.8.0_201-b09, source=flush, os.version=4.18.0-17-generic, timestamp=1556685016715}]:[attributes={Lucene50StoredFieldsFormat.mode=BEST_SPEED}])))}
   [junit4]   2> 2495171 INFO  (qtp16722046-25593) [    x:collection1] o.a.s.u.p.LogUpdateProcessorFactory [collection1]  webapp=/_ox/s path=/update params={waitSearcher=true&commit=true&softCommit=false&wt=javabin&version=2}{commit=} 0 7
   [junit4]   2> 2495173 INFO  (qtp11723638-25572) [    x:collection1] o.a.s.c.S.Request [collection1]  webapp=/_ox/s path=/select params={q=*:*&wt=javabin&version=2} hits=1 status=0 QTime=0
   [junit4]   2> 2495181 INFO  (qtp16722046-25594) [    x:collection1] o.a.s.c.S.Request [collection1]  webapp=/_ox/s path=/select params={q=*:*&wt=javabin&version=2} hits=1 status=0 QTime=0
   [junit4]   2> 2495186 INFO  (qtp11723638-25573) [    x:collection1] o.a.s.u.p.LogUpdateProcessorFactory [collection1]  webapp=/_ox/s path=/update params={update.distrib=FROMLEADER&wt=javabin&version=2}{add=[2 (2)]} 0 3
   [junit4]   2> 2495188 INFO  (qtp16722046-25592) [    x:collection1] o.a.s.u.PeerSync PeerSync: core=collection1 url= START replicas=[http://127.0.0.1:38107/_ox/s/collection1] nUpdates=100
   [junit4]   2> 2495196 INFO  (qtp11723638-25571) [    x:collection1] o.a.s.s.SolrIndexSearcher Opening [Searcher@58d4bc[collection1] realtime]
   [junit4]   2> 2495197 INFO  (qtp11723638-25571) [    x:collection1] o.a.s.u.IndexFingerprint IndexFingerprint millis:7.0 result:{maxVersionSpecified=9223372036854775807, maxVersionEncountered=2, maxInHash=2, versionsHash=-1218814014108643565, numVersions=2, numDocs=2, maxDoc=1}
   [junit4]   2> 2495197 INFO  (qtp11723638-25571) [    x:collection1] o.a.s.c.S.Request [collection1]  webapp=/_ox/s path=/get params={distrib=false&qt=/get&getFingerprint=9223372036854775807&wt=javabin&version=2} status=0 QTime=7
   [junit4]   2> 2495198 INFO  (qtp16722046-25592) [    x:collection1] o.a.s.u.IndexFingerprint IndexFingerprint millis:0.0 result:{maxVersionSpecified=9223372036854775807, maxVersionEncountered=1, maxInHash=1, versionsHash=-5451962507482445012, numVersions=1, numDocs=1, maxDoc=1}
   [junit4]   2> 2495199 INFO  (qtp11723638-25572) [    x:collection1] o.a.s.u.IndexFingerprint IndexFingerprint millis:0.0 result:{maxVersionSpecified=9223372036854775807, maxVersionEncountered=2, maxInHash=2, versionsHash=-1218814014108643565, numVersions=2, numDocs=2, maxDoc=1}
   [junit4]   2> 2495199 INFO  (qtp11723638-25572) [    x:collection1] o.a.s.c.S.Request [collection1]  webapp=/_ox/s path=/get params={distrib=false&qt=/get&fingerprint=true&getVersions=100&wt=javabin&version=2} status=0 QTime=0
   [junit4]   2> 2495200 INFO  (qtp16722046-25592) [    x:collection1] o.a.s.u.PeerSync PeerSync: core=collection1 url=  Received 2 versions from http://127.0.0.1:38107/_ox/s/collection1 fingerprint:{maxVersionSpecified=9223372036854775807, maxVersionEncountered=2, maxInHash=2, versionsHash=-1218814014108643565, numVersions=2, numDocs=2, maxDoc=1}
   [junit4]   2> 2495202 INFO  (qtp11723638-25573) [    x:collection1] o.a.s.c.S.Request [collection1]  webapp=/_ox/s path=/get params={distrib=false&qt=/get&checkCanHandleVersionRanges=false&wt=javabin&version=2} status=0 QTime=0
   [junit4]   2> 2495202 INFO  (qtp16722046-25592) [    x:collection1] o.a.s.u.PeerSync PeerSync: core=collection1 url= Requesting updates from http://127.0.0.1:38107/_ox/s/collection1n=1 versions=2...2
   [junit4]   2> 2495204 INFO  (qtp11723638-25571) [    x:collection1] o.a.s.u.IndexFingerprint IndexFingerprint millis:0.0 result:{maxVersionSpecified=2, maxVersionEncountered=2, maxInHash=2, versionsHash=-1218814014108643565, numVersions=2, numDocs=2, maxDoc=1}
   [junit4]   2> 2495205 INFO  (qtp11723638-25571) [    x:collection1] o.a.s.c.S.Request [collection1]  webapp=/_ox/s path=/get params={getUpdates=2...2&distrib=false&qt=/get&fingerprint=true&onlyIfActive=false&wt=javabin&version=2} status=0 QTime=1
   [junit4]   2> 2495217 INFO  (qtp16722046-25592) [    x:collection1] o.a.s.u.p.LogUpdateProcessorFactory [collection1] {add=[2 (2)]} 0 11
   [junit4]   2> 2495226 INFO  (qtp16722046-25592) [    x:collection1] o.a.s.s.SolrIndexSearcher Opening [Searcher@11cbea7[collection1] realtime]
   [junit4]   2> 2495227 INFO  (qtp16722046-25592) [    x:collection1] o.a.s.u.IndexFingerprint IndexFingerprint millis:10.0 result:{maxVersionSpecified=2, maxVersionEncountered=2, maxInHash=2, versionsHash=-1218814014108643565, numVersions=2, numDocs=2, maxDoc=1}
   [junit4]   2> 2495227 INFO  (qtp16722046-25592) [    x:collection1] o.a.s.u.PeerSync Fingerprint comparison: 0
   [junit4]   2> 2495227 INFO  (qtp16722046-25592) [    x:collection1] o.a.s.u.PeerSync PeerSync: core=collection1 url= DONE. sync succeeded
   [junit4]   2> 2495227 INFO  (qtp16722046-25592) [    x:collection1] o.a.s.c.S.Request [collection1]  webapp=/_ox/s path=/get params={qt=/get&getVersions=100&sync=http://127.0.0.1:38107/_ox/s/collection1&wt=javabin&version=2} status=0 QTime=39
   [junit4]   2> 2495229 INFO  (qtp11723638-25572) [    x:collection1] o.a.s.u.DirectUpdateHandler2 start commit{_version_=1632302548172931072,optimize=false,openSearcher=true,waitSearcher=true,expungeDeletes=false,softCommit=false,prepareCommit=false}
   [junit4]   2> 2495229 INFO  (qtp11723638-25572) [    x:collection1] o.a.s.u.SolrIndexWriter Calling setCommitData with IW:org.apache.solr.update.SolrIndexWriter@cfa0e9 commitCommandVersion:1632302548172931072
   [junit4]   2> 2495231 INFO  (qtp11723638-25572) [    x:collection1] o.a.s.s.SolrIndexSearcher Opening [Searcher@18fd15f[collection1] main]
   [junit4]   2> 2495231 INFO  (qtp11723638-25572) [    x:collection1] o.a.s.u.DirectUpdateHandler2 end_commit_flush
   [junit4]   2> 2495240 INFO  (searcherExecutor-7679-thread-1-processing-x:collection1) [    x:collection1] o.a.s.c.SolrCore [collection1] Registered new searcher Searcher@18fd15f[collection1] main{ExitableDirectoryReader(UninvertingDirectoryReader(Uninverting(_0(8.1.0):C1:[diagnostics={os=Linux, java.vendor=Oracle Corporation, java.version=1.8.0_201, java.vm.version=25.201-b09, lucene.version=8.1.0, os.arch=i386, java.runtime.version=1.8.0_201-b09, source=flush, os.version=4.18.0-17-generic, timestamp=1556685016691}]:[attributes={Lucene50StoredFieldsFormat.mode=BEST_SPEED}]) Uninverting(_1(8.1.0):C1:[diagnostics={os=Linux, java.vendor=Oracle Corporation, java.version=1.8.0_201, java.vm.version=25.201-b09, lucene.version=8.1.0, os.arch=i386, java.runtime.version=1.8.0_201-b09, source=flush, os.version=4.18.0-17-generic, timestamp=1556685016761}]:[attributes={Lucene50StoredFieldsFormat.mode=BEST_SPEED}])))}
   [junit4]   2> 2495241 INFO  (qtp11723638-25572) [    x:collection1] o.a.s.u.p.LogUpdateProcessorFactory [collection1]  webapp=/_ox/s path=/update params={waitSearcher=true&commit=true&softCommit=false&wt=javabin&version=2}{commit=} 0 12
   [junit4]   2> 2495242 INFO  (qtp16722046-25593) [    x:collection1] o.a.s.u.DirectUpdateHandler2 start commit{_version_=1632302548186562560,optimize=false,openSearcher=true,waitSearcher=true,expungeDeletes=false,softCommit=false,prepareCommit=false}
   [junit4]   2> 2495242 INFO  (qtp16722046-25593) [    x:collection1] o.a.s.u.SolrIndexWriter Calling setCommitData with IW:org.apache.solr.update.SolrIndexWriter@2c1f8f commitCommandVersion:1632302548186562560
   [junit4]   2> 2495244 INFO  (qtp16722046-25593) [    x:collection1] o.a.s.s.SolrIndexSearcher Opening [Searcher@2480e[collection1] main]
   [junit4]   2> 2495245 INFO  (qtp16722046-25593) [    x:collection1] o.a.s.u.DirectUpdateHandler2 end_commit_flush
   [junit4]   2> 2495250 INFO  (searcherExecutor-7693-thread-1-processing-x:collection1) [    x:collection1] o.a.s.c.SolrCore [collection1] Registered new searcher Searcher@2480e[collection1] main{ExitableDirectoryReader(UninvertingDirectoryReader(Uninverting(_0(8.1.0):C1:[diagnostics={os=Linux, java.vendor=Oracle Corporation, java.version=1.8.0_201, java.vm.version=25.201-b09, lucene.version=8.1.0, os.arch=i386, java.runtime.version=1.8.0_201-b09, source=flush, os.version=4.18.0-17-generic, timestamp=1556685016715}]:[attributes={Lucene50StoredFieldsFormat.mode=BEST_SPEED}]) Uninverting(_1(8.1.0):C1:[diagnostics={os=Linux, java.vendor=Oracle Corporation, java.version=1.8.0_201, java.vm.version=25.201-b09, lucene.version=8.1.0, os.arch=i386, java.runtime.version=1.8.0_201-b09, source=flush, os.version=4.18.0-17-generic, timestamp=1556685016790}]:[attributes={Lucene50StoredFieldsFormat.mode=BEST_SPEED}])))}
   [junit4]   2> 2495251 INFO  (qtp16722046-25593) [    x:collection1] o.a.s.u.p.LogUpdateProcessorFactory [collection1]  webapp=/_ox/s path=/update params={waitSearcher=true&commit=true&softCommit=false&wt=javabin&version=2}{commit=} 0 8
   [junit4]   2> 2495252 INFO  (qtp11723638-25573) [    x:collection1] o.a.s.c.S.Request [collection1]  webapp=/_ox/s path=/select params={q=*:*&wt=javabin&version=2} hits=2 status=0 QTime=0
   [junit4]   2> 2495255 INFO  (qtp16722046-25594) [    x:collection1] o.a.s.c.S.Request [collection1]  webapp=/_ox/s path=/select params={q=*:*&wt=javabin&version=2} hits=2 status=0 QTime=0
   [junit4]   2> 2495261 INFO  (qtp11723638-25571) [    x:collection1] o.a.s.u.p.LogUpdateProcessorFactory [collection1]  webapp=/_ox/s path=/update params={update.distrib=FROMLEADER&wt=javabin&version=2}{add=[3 (3)]} 0 2
   [junit4]   2> 2495264 INFO  (qtp11723638-25572) [    x:collection1] o.a.s.u.p.LogUpdateProcessorFactory [collection1]  webapp=/_ox/s path=/update params={update.distrib=FROMLEADER&wt=javabin&version=2}{add=[4 (4)]} 0 1
   [junit4]   2> 2495267 INFO  (qtp11723638-25573) [    x:collection1] o.a.s.u.p.LogUpdateProcessorFactory [collection1]  webapp=/_ox/s path=/update params={update.distrib=FROMLEADER&wt=javabin&version=2}{add=[5 (5)]} 0 1
   [junit4]   2> 2495270 INFO  (qtp11723638-25571) [    x:collection1] o.a.s.u.p.LogUpdateProcessorFactory [collection1]  webapp=/_ox/s path=/update params={update.distrib=FROMLEADER&wt=javabin&version=2}{add=[6 (6)]} 0 1
   [junit4]   2> 2495273 INFO  (qtp11723638-25572) [    x:collection1] o.a.s.u.p.LogUpdateProcessorFactory [collection1]  webapp=/_ox/s path=/update params={update.distrib=FROMLEADER&wt=javabin&version=2}{add=[7 (7)]} 0 1
   [junit4]   2> 2495276 INFO  (qtp11723638-25573) [    x:collection1] o.a.s.u.p.LogUpdateProcessorFactory [collection1]  webapp=/_ox/s path=/update params={update.distrib=FROMLEADER&wt=javabin&version=2}{add=[8 (8)]} 0 1
   [junit4]   2> 2495278 INFO  (qtp11723638-25571) [    x:collection1] o.a.s.u.p.LogUpdateProcessorFactory [collection1]  webapp=/_ox/s path=/update params={update.distrib=FROMLEADER&wt=javabin&version=2}{add=[9 (9)]} 0 1
   [junit4]   2> 2495281 INFO  (qtp11723638-25572) [    x:collection1] o.a.s.u.p.LogUpdateProcessorFactory [collection1]  webapp=/_ox/s path=/update params={update.distrib=FROMLEADER&wt=javabin&version=2}{add=[10 (10)]} 0 1
   [junit4]   2> 2495282 INFO  (qtp16722046-25592) [    x:collection1] o.a.s.u.PeerSync PeerSync: core=collection1 url= START replicas=[http://127.0.0.1:38107/_ox/s/collection1] nUpdates=100
   [junit4]   2> 2495300 INFO  (qtp11723638-25573) [    x:collection1] o.a.s.s.SolrIndexSearcher Opening [Searcher@10e3eba[collection1] realtime]
   [junit4]   2> 2495301 INFO  (qtp11723638-25573) [    x:collection1] o.a.s.u.IndexFingerprint IndexFingerprint millis:17.0 result:{maxVersionSpecified=9223372036854775807, maxVersionEncountered=10, maxInHash=10, versionsHash=-5671163287542876028, numVersions=10, numDocs=10, maxDoc=8}
   [junit4]   2> 2495301 INFO  (qtp11723638-25573) [    x:collection1] o.a.s.c.S.Request [collection1]  webapp=/_ox/s path=/get params={distrib=false&qt=/get&getFingerprint=9223372036854775807&wt=javabin&version=2} status=0 QTime=17
   [junit4]   2> 2495302 INFO  (qtp16722046-25592) [    x:collection1] o.a.s.u.IndexFingerprint IndexFingerprint millis:0.0 result:{maxVersionSpecified=9223372036854775807, maxVersionEncountered=2, maxInHash=2, versionsHash=-1218814014108643565, numVersions=2, numDocs=2, maxDoc=1}
   [junit4]   2> 2495303 INFO  (qtp11723638-25571) [    x:collection1] o.a.s.u.IndexFingerprint IndexFingerprint millis:0.0 result:{maxVersionSpecified=9223372036854775807, maxVersionEncountered=10, maxInHash=10, versionsHash=-5671163287542876028, numVersions=10, numDocs=10, maxDoc=8}
   [junit4]   2> 2495304 INFO  (qtp11723638-25571) [    x:collection1] o.a.s.c.S.Request [collection1]  webapp=/_ox/s path=/get params={distrib=false&qt=/get&fingerprint=true&getVersions=100&wt=javabin&version=2} status=0 QTime=1
   [junit4]   2> 2495304 INFO  (qtp16722046-25592) [    x:collection1] o.a.s.u.PeerSync PeerSync: core=collection1 url=  Received 10 versions from http://127.0.0.1:38107/_ox/s/collection1 fingerprint:{maxVersionSpecified=9223372036854775807, maxVersionEncountered=10, maxInHash=10, versionsHash=-5671163287542876028, numVersions=10, numDocs=10, maxDoc=8}
   [junit4]   2> 2495305 INFO  (qtp11723638-25572) [    x:collection1] o.a.s.c.S.Request [collection1]  webapp=/_ox/s path=/get params={distrib=false&qt=/get&checkCanHandleVersionRanges=false&wt=javabin&version=2} status=0 QTime=0
   [junit4]   2> 2495306 INFO  (qtp16722046-25592) [    x:collection1] o.a.s.u.PeerSync PeerSync: core=collection1 url= Requesting updates from http://127.0.0.1:38107/_ox/s/collection1n=8 versions=3...10
   [junit4]   2> 2495308 INFO  (qtp11723638-25573) [    x:collection1] o.a.s.u.IndexFingerprint IndexFingerprint millis:0.0 result:{maxVersionSpecified=10, maxVersionEncountered=10, maxInHash=10, versionsHash=-5671163287542876028, numVersions=10, numDocs=10, maxDoc=8}
   [junit4]   2> 2495308 INFO  (qtp11723638-25573) [    x:collection1] o.a.s.c.S.Request [collection1]  webapp=/_ox/s path=/get params={getUpdates=3...10&distrib=false&qt=/get&fingerprint=true&onlyIfActive=false&wt=javabin&version=2} status=0 QTime=1
   [junit4]   2> 2495317 INFO  (qtp16722046-25592) [    x:collection1] o.a.s.u.p.LogUpdateProcessorFactory [collection1] {add=[3 (3), 4 (4), 5 (5), 6 (6), 7 (7), 8 (8), 9 (9), 10 (10)]} 0 7
   [junit4]   2> 2495330 INFO  (qtp16722046-25592) [    x:collection1] o.a.s.s.SolrIndexSearcher Opening [Searcher@8a964a[collection1] realtime]
   [junit4]   2> 2495331 INFO  (qtp16722046-25592) [    x:collection1] o.a.s.u.IndexFingerprint IndexFingerprint millis:14.0 result:{maxVersionSpecified=10, maxVersionEncountered=10, maxInHash=10, versionsHash=-5671163287542876028, numVersions=10, numDocs=10, maxDoc=8}
   [junit4]   2> 2495331 INFO  (qtp16722046-25592) [    x:collection1] o.a.s.u.PeerSync Fingerprint comparison: 0
   [junit4]   2> 2495331 INFO  (qtp16722046-25592) [    x:collection1] o.a.s.u.PeerSync PeerSync: core=collection1 url= DONE. sync succeeded
   [junit4]   2> 

[...truncated too long message...]

orters for registry=solr.core.collection1, tag=19a64ef
   [junit4]   2> 3915137 INFO  (coreCloseExecutor-12291-thread-1) [    x:collection1] o.a.s.m.r.SolrJmxReporter Closing reporter [org.apache.solr.metrics.reporters.SolrJmxReporter@1337856: rootName = null, domain = solr.core.collection1, service url = null, agent id = null] for registry solr.core.collection1 / com.codahale.metrics.MetricRegistry@1e268c8
   [junit4]   2> 3915141 INFO  (SUITE-PeerSyncWithLeaderTest-seed#[977B0D8549419591]-worker) [    ] o.a.s.m.SolrMetricManager Closing metric reporters for registry=solr.node, tag=null
   [junit4]   2> 3915141 INFO  (SUITE-PeerSyncWithLeaderTest-seed#[977B0D8549419591]-worker) [    ] o.a.s.m.r.SolrJmxReporter Closing reporter [org.apache.solr.metrics.reporters.SolrJmxReporter@10151de: rootName = null, domain = solr.node, service url = null, agent id = null] for registry solr.node / com.codahale.metrics.MetricRegistry@113df70
   [junit4]   2> 3915141 INFO  (SUITE-PeerSyncWithLeaderTest-seed#[977B0D8549419591]-worker) [    ] o.a.s.m.SolrMetricManager Closing metric reporters for registry=solr.jvm, tag=null
   [junit4]   2> 3915141 INFO  (SUITE-PeerSyncWithLeaderTest-seed#[977B0D8549419591]-worker) [    ] o.a.s.m.r.SolrJmxReporter Closing reporter [org.apache.solr.metrics.reporters.SolrJmxReporter@a5fa33: rootName = null, domain = solr.jvm, service url = null, agent id = null] for registry solr.jvm / com.codahale.metrics.MetricRegistry@1429612
   [junit4]   2> 3915142 INFO  (SUITE-PeerSyncWithLeaderTest-seed#[977B0D8549419591]-worker) [    ] o.a.s.m.SolrMetricManager Closing metric reporters for registry=solr.jetty, tag=null
   [junit4]   2> 3915142 INFO  (SUITE-PeerSyncWithLeaderTest-seed#[977B0D8549419591]-worker) [    ] o.a.s.m.r.SolrJmxReporter Closing reporter [org.apache.solr.metrics.reporters.SolrJmxReporter@1aa4fad: rootName = null, domain = solr.jetty, service url = null, agent id = null] for registry solr.jetty / com.codahale.metrics.MetricRegistry@f722a7
   [junit4]   2> NOTE: leaving temporary files on disk at: /home/jenkins/workspace/Lucene-Solr-8.x-Linux/solr/build/solr-core/test/J1/temp/solr.update.PeerSyncWithLeaderTest_977B0D8549419591-001
   [junit4]   2> NOTE: test params are: codec=Asserting(Lucene80): {title_stringNoNorms=PostingsFormat(name=Direct), title_stemmed=PostingsFormat(name=MockRandom), multiDefault=PostingsFormat(name=MockRandom), _root_=PostingsFormat(name=Direct), id=FSTOrd50, text=Lucene50(blocksize=128), title=PostingsFormat(name=MockRandom), title_lettertok=FSTOrd50}, docValues:{range_facet_l_dv=DocValuesFormat(name=Direct), _version_=DocValuesFormat(name=Asserting), val_i_dvo=DocValuesFormat(name=Direct), range_facet_i_dv=DocValuesFormat(name=Asserting), intDvoDefault=DocValuesFormat(name=Lucene80), timestamp=DocValuesFormat(name=Asserting)}, maxPointsInLeafNode=743, maxMBSortInHeap=7.460872513966815, sim=Asserting(org.apache.lucene.search.similarities.AssertingSimilarity@b053dd), locale=mt-MT, timezone=America/Bahia
   [junit4]   2> NOTE: Linux 4.18.0-17-generic i386/Oracle Corporation 1.8.0_201 (32-bit)/cpus=8,threads=1,free=168677304,total=518979584
   [junit4]   2> NOTE: All tests run in this JVM: [ResourceLoaderTest, TriggerIntegrationTest, TestPayloadCheckQParserPlugin, TestSSLRandomization, LargeFieldTest, UniqFieldsUpdateProcessorFactoryTest, JavabinLoaderTest, DistributedFacetPivotLongTailTest, TestSearcherReuse, TestTolerantSearch, TestHighlightDedupGrouping, BlockCacheTest, VersionInfoTest, TestCloudSearcherWarming, NodeAddedTriggerIntegrationTest, Tagger2Test, TestOrdValues, ConfigureRecoveryStrategyTest, CdcrReplicationHandlerTest, TestCursorMarkWithoutUniqueKey, RemoteQueryErrorTest, CdcrWithNodesRestartsTest, ConcurrentDeleteAndCreateCollectionTest, ClassificationUpdateProcessorFactoryTest, TestLeaderElectionWithEmptyReplica, SchemaApiFailureTest, ShardSplitTest, BasicFunctionalityTest, TestUseDocValuesAsStored2, SuggesterWFSTTest, TestPullReplica, SparseHLLTest, TransactionLogTest, SSLMigrationTest, TestJsonFacets, TestManagedStopFilterFactory, TestOmitPositions, CollectionTooManyReplicasTest, TestDocSet, TestSha256AuthenticationProvider, TestLMJelinekMercerSimilarityFactory, AuditLoggerIntegrationTest, ZkCLITest, LeaderElectionIntegrationTest, TestMultiValuedNumericRangeQuery, TestDynamicURP, TestLuceneMatchVersion, IgnoreLargeDocumentProcessorFactoryTest, TestSimExecutePlanAction, TestRemoteStreaming, ChaosMonkeyNothingIsSafeWithPullReplicasTest, TriLevelCompositeIdRoutingTest, MultiThreadedOCPTest, QueryParsingTest, ExternalFileFieldSortTest, TestPerFieldSimilarity, TestSubQueryTransformerDistrib, TestCloudPseudoReturnFields, TestTolerantUpdateProcessorCloud, TestCloudInspectUtil, TestFieldCacheSort, TestExactSharedStatsCache, TestStressInPlaceUpdates, DocValuesMultiTest, StatsComponentTest, TestNamedUpdateProcessors, TestChildDocTransformerHierarchy, TestReplicationHandlerDiskOverFlow, StatelessScriptUpdateProcessorFactoryTest, HdfsTlogReplayBufferedWhileIndexingTest, OrderedExecutorTest, RegexBytesRefFilterTest, RecoveryAfterSoftCommitTest, TestSolrFieldCacheBean, ShardsWhitelistTest, TestCollationField, TestMergePolicyConfig, FullHLLTest, TestCustomStream, DistributedQueryComponentOptimizationTest, TestFieldResource, TestAddFieldRealTimeGet, TestFieldCacheWithThreads, BigEndianAscendingWordSerializerTest, TestAuthorizationFramework, TestEmbeddedSolrServerConstructors, TestDistributedStatsComponentCardinality, DirectSolrConnectionTest, ZookeeperStatusHandlerTest, TestDocTermOrdsUninvertLimit, TestMaxScoreQueryParser, ScheduledMaintenanceTriggerTest, TestDeleteCollectionOnDownNodes, TestSolrCLIRunExample, HighlighterMaxOffsetTest, CircularListTest, JSONWriterTest, ManagedSchemaRoundRobinCloudTest, BlockJoinFacetSimpleTest, TestBM25SimilarityFactory, InfixSuggestersTest, TestJsonRequest, OutOfBoxZkACLAndCredentialsProvidersTest, ResponseHeaderTest, NodeLostTriggerTest, MetricsHandlerTest, TestPivotHelperCode, SolrIndexMetricsTest, ConnectionReuseTest, MinimalSchemaTest, ShardRoutingTest, IndexSizeTriggerTest, DirectSolrSpellCheckerTest, TestRandomFaceting, DisMaxRequestHandlerTest, TestExceedMaxTermLength, TestLFUCache, FullSolrCloudDistribCmdsTest, TestConfigSetsAPIExclusivity, TestSimpleTextCodec, TestDynamicFieldCollectionResource, AdminHandlersProxyTest, DistributedFacetPivotWhiteBoxTest, TestSort, TestRealTimeGet, HttpPartitionTest, MetricsConfigTest, ResponseBuilderTest, BasicDistributedZkTest, SolrCLIZkUtilsTest, DistributedExpandComponentTest, RulesTest, HdfsNNFailoverTest, SplitShardTest, PeerSyncTest, TestDistributedSearch, LoggingHandlerTest, SortByFunctionTest, AssignTest, AsyncCallRequestStatusResponseTest, TestCollectionsAPIViaSolrCloudCluster, AutoAddReplicasPlanActionTest, ComputePlanActionTest, TestSimNodeAddedTrigger, TestSimNodeLostTrigger, TestSimPolicyCloud, TestSimTriggerIntegration, HdfsBasicDistributedZk2Test, HdfsBasicDistributedZkTest, HdfsChaosMonkeyNothingIsSafeTest, HdfsRecoveryZkTest, HdfsRestartWhileUpdatingTest, HdfsSyncSliceTest, HdfsWriteToMultipleCollectionsTest, StressHdfsTest, TestClusterStateMutator, ZkStateReaderTest, ZkStateWriterTest, ImplicitSnitchTest, DirectoryFactoryTest, ExitableDirectoryReaderTest, HdfsDirectoryFactoryTest, PluginInfoTest, QueryResultKeyTest, RAMDirectoryFactoryTest, SolrCoreCheckLockOnStartupTest, SolrCoreTest, TestCoreContainer, TestSolrDeletionPolicy1, TestSolrIndexConfig, TestSolrCoreSnapshots, MoreLikeThisHandlerTest, TestBlobHandler, TestReplicationHandler, TermVectorComponentDistributedTest, CheckHdfsIndexTest, TestBulkSchemaConcurrent, TestManagedSchemaAPI, TestSortableTextField, AnalyticsQueryTest, CurrencyRangeFacetCloudTest, SignificantTermsQParserPluginTest, SortSpecParsingTest, TestComplexPhraseQParserPlugin, TestExtendedDismaxParser, TestFoldingMultitermQuery, TestGraphTermsQParserPlugin, TestHashQParserPlugin, TestIndexSearcher, TestMultiWordSynonyms, TestNoOpRegenerator, TestPseudoReturnFields, TestRTGBase, TestRandomCollapseQParserPlugin, TestReload, TestSolr4Spatial, TestSolr4Spatial2, TestStressUserVersions, TestStressVersions, TestTrieFacet, TestXmlQParserPlugin, RangeFacetCloudTest, TestCloudJSONFacetJoinDomain, TestCloudJSONFacetSKG, BasicAuthIntegrationTest, JWTAuthPluginTest, TestImpersonationWithHadoopAuth, TestSolrCloudWithHadoopAuthPlugin, IndexBasedSpellCheckerTest, SuggesterFSTTest, TestAnalyzedSuggestions, TestFreeTextSuggestions, HdfsLockFactoryTest, TestNumericTerms32, TestUninvertingReader, AddBlockUpdateTest, AnalysisErrorHandlingTest, CdcrUpdateLogTest, DataDrivenBlockJoinTest, DirectUpdateHandlerTest, PeerSyncWithLeaderTest]
   [junit4] Completed [828/855 (2!)] on J1 in 147.56s, 1 test, 1 failure <<< FAILURES!

[...truncated 9064 lines...]
BUILD FAILED
/home/jenkins/workspace/Lucene-Solr-8.x-Linux/build.xml:634: The following error occurred while executing this line:
/home/jenkins/workspace/Lucene-Solr-8.x-Linux/build.xml:128: Found 1 violations in source files (File uses Mockito but has no assumeWorkingMockito() call).

Total time: 137 minutes 35 seconds
Build step 'Invoke Ant' marked build as failure
Archiving artifacts
Setting ANT_1_8_2_HOME=/home/jenkins/tools/hudson.tasks.Ant_AntInstallation/ANT_1.8.2
[WARNINGS] Skipping publisher since build result is FAILURE
Recording test results
Setting ANT_1_8_2_HOME=/home/jenkins/tools/hudson.tasks.Ant_AntInstallation/ANT_1.8.2
Email was triggered for: Failure - Any
Sending email for trigger: Failure - Any
Setting ANT_1_8_2_HOME=/home/jenkins/tools/hudson.tasks.Ant_AntInstallation/ANT_1.8.2
Setting ANT_1_8_2_HOME=/home/jenkins/tools/hudson.tasks.Ant_AntInstallation/ANT_1.8.2
Setting ANT_1_8_2_HOME=/home/jenkins/tools/hudson.tasks.Ant_AntInstallation/ANT_1.8.2
Setting ANT_1_8_2_HOME=/home/jenkins/tools/hudson.tasks.Ant_AntInstallation/ANT_1.8.2
Setting ANT_1_8_2_HOME=/home/jenkins/tools/hudson.tasks.Ant_AntInstallation/ANT_1.8.2
Setting ANT_1_8_2_HOME=/home/jenkins/tools/hudson.tasks.Ant_AntInstallation/ANT_1.8.2

Mime
View raw message