lucene-dev mailing list archives

Site index · List index
Message view « Date » · « Thread »
Top « Date » · « Thread »
From Policeman Jenkins Server <jenk...@thetaphi.de>
Subject [JENKINS] Lucene-Solr-8.1-Linux (64bit/jdk-11.0.2) - Build # 280 - Unstable!
Date Sat, 04 May 2019 12:08:05 GMT
Build: https://jenkins.thetaphi.de/job/Lucene-Solr-8.1-Linux/280/
Java: 64bit/jdk-11.0.2 -XX:+UseCompressedOops -XX:+UseConcMarkSweepGC

4 tests failed.
FAILED:  org.apache.solr.cloud.OverseerRolesTest.testDesignatedOverseerRestarts

Error Message:
Timed out waiting for overseer state change. The current overseer is: 127.0.0.1:37759_solr

Stack Trace:
java.lang.AssertionError: Timed out waiting for overseer state change. The current overseer is: 127.0.0.1:37759_solr
	at __randomizedtesting.SeedInfo.seed([E799306D24F40484:EFB827321AAA168E]:0)
	at org.junit.Assert.fail(Assert.java:88)
	at org.apache.solr.cloud.OverseerRolesTest.waitForNewOverseer(OverseerRolesTest.java:70)
	at org.apache.solr.cloud.OverseerRolesTest.waitForNewOverseer(OverseerRolesTest.java:75)
	at org.apache.solr.cloud.OverseerRolesTest.testDesignatedOverseerRestarts(OverseerRolesTest.java:188)
	at java.base/jdk.internal.reflect.NativeMethodAccessorImpl.invoke0(Native Method)
	at java.base/jdk.internal.reflect.NativeMethodAccessorImpl.invoke(NativeMethodAccessorImpl.java:62)
	at java.base/jdk.internal.reflect.DelegatingMethodAccessorImpl.invoke(DelegatingMethodAccessorImpl.java:43)
	at java.base/java.lang.reflect.Method.invoke(Method.java:566)
	at com.carrotsearch.randomizedtesting.RandomizedRunner.invoke(RandomizedRunner.java:1750)
	at com.carrotsearch.randomizedtesting.RandomizedRunner$8.evaluate(RandomizedRunner.java:938)
	at com.carrotsearch.randomizedtesting.RandomizedRunner$9.evaluate(RandomizedRunner.java:974)
	at com.carrotsearch.randomizedtesting.RandomizedRunner$10.evaluate(RandomizedRunner.java:988)
	at com.carrotsearch.randomizedtesting.rules.SystemPropertiesRestoreRule$1.evaluate(SystemPropertiesRestoreRule.java:57)
	at org.apache.lucene.util.TestRuleSetupTeardownChained$1.evaluate(TestRuleSetupTeardownChained.java:49)
	at org.apache.lucene.util.AbstractBeforeAfterRule$1.evaluate(AbstractBeforeAfterRule.java:45)
	at org.apache.lucene.util.TestRuleThreadAndTestName$1.evaluate(TestRuleThreadAndTestName.java:48)
	at org.apache.lucene.util.TestRuleIgnoreAfterMaxFailures$1.evaluate(TestRuleIgnoreAfterMaxFailures.java:64)
	at org.apache.lucene.util.TestRuleMarkFailure$1.evaluate(TestRuleMarkFailure.java:47)
	at com.carrotsearch.randomizedtesting.rules.StatementAdapter.evaluate(StatementAdapter.java:36)
	at com.carrotsearch.randomizedtesting.ThreadLeakControl$StatementRunner.run(ThreadLeakControl.java:368)
	at com.carrotsearch.randomizedtesting.ThreadLeakControl.forkTimeoutingTask(ThreadLeakControl.java:817)
	at com.carrotsearch.randomizedtesting.ThreadLeakControl$3.evaluate(ThreadLeakControl.java:468)
	at com.carrotsearch.randomizedtesting.RandomizedRunner.runSingleTest(RandomizedRunner.java:947)
	at com.carrotsearch.randomizedtesting.RandomizedRunner$5.evaluate(RandomizedRunner.java:832)
	at com.carrotsearch.randomizedtesting.RandomizedRunner$6.evaluate(RandomizedRunner.java:883)
	at com.carrotsearch.randomizedtesting.RandomizedRunner$7.evaluate(RandomizedRunner.java:894)
	at com.carrotsearch.randomizedtesting.rules.StatementAdapter.evaluate(StatementAdapter.java:36)
	at com.carrotsearch.randomizedtesting.rules.SystemPropertiesRestoreRule$1.evaluate(SystemPropertiesRestoreRule.java:57)
	at org.apache.lucene.util.AbstractBeforeAfterRule$1.evaluate(AbstractBeforeAfterRule.java:45)
	at com.carrotsearch.randomizedtesting.rules.StatementAdapter.evaluate(StatementAdapter.java:36)
	at org.apache.lucene.util.TestRuleStoreClassName$1.evaluate(TestRuleStoreClassName.java:41)
	at com.carrotsearch.randomizedtesting.rules.NoShadowingOrOverridesOnMethodsRule$1.evaluate(NoShadowingOrOverridesOnMethodsRule.java:40)
	at com.carrotsearch.randomizedtesting.rules.NoShadowingOrOverridesOnMethodsRule$1.evaluate(NoShadowingOrOverridesOnMethodsRule.java:40)
	at com.carrotsearch.randomizedtesting.rules.StatementAdapter.evaluate(StatementAdapter.java:36)
	at com.carrotsearch.randomizedtesting.rules.StatementAdapter.evaluate(StatementAdapter.java:36)
	at org.apache.lucene.util.TestRuleAssertionsRequired$1.evaluate(TestRuleAssertionsRequired.java:53)
	at org.apache.lucene.util.TestRuleMarkFailure$1.evaluate(TestRuleMarkFailure.java:47)
	at org.apache.lucene.util.TestRuleIgnoreAfterMaxFailures$1.evaluate(TestRuleIgnoreAfterMaxFailures.java:64)
	at org.apache.lucene.util.TestRuleIgnoreTestSuites$1.evaluate(TestRuleIgnoreTestSuites.java:54)
	at com.carrotsearch.randomizedtesting.rules.StatementAdapter.evaluate(StatementAdapter.java:36)
	at com.carrotsearch.randomizedtesting.ThreadLeakControl$StatementRunner.run(ThreadLeakControl.java:368)
	at java.base/java.lang.Thread.run(Thread.java:834)


FAILED:  org.apache.solr.cloud.OverseerRolesTest.testDesignatedOverseerRestarts

Error Message:
Timed out waiting for overseer state change. The current overseer is: 127.0.0.1:45993_solr

Stack Trace:
java.lang.AssertionError: Timed out waiting for overseer state change. The current overseer is: 127.0.0.1:45993_solr
	at __randomizedtesting.SeedInfo.seed([E799306D24F40484:EFB827321AAA168E]:0)
	at org.junit.Assert.fail(Assert.java:88)
	at org.apache.solr.cloud.OverseerRolesTest.waitForNewOverseer(OverseerRolesTest.java:70)
	at org.apache.solr.cloud.OverseerRolesTest.waitForNewOverseer(OverseerRolesTest.java:75)
	at org.apache.solr.cloud.OverseerRolesTest.testDesignatedOverseerRestarts(OverseerRolesTest.java:188)
	at java.base/jdk.internal.reflect.NativeMethodAccessorImpl.invoke0(Native Method)
	at java.base/jdk.internal.reflect.NativeMethodAccessorImpl.invoke(NativeMethodAccessorImpl.java:62)
	at java.base/jdk.internal.reflect.DelegatingMethodAccessorImpl.invoke(DelegatingMethodAccessorImpl.java:43)
	at java.base/java.lang.reflect.Method.invoke(Method.java:566)
	at com.carrotsearch.randomizedtesting.RandomizedRunner.invoke(RandomizedRunner.java:1750)
	at com.carrotsearch.randomizedtesting.RandomizedRunner$8.evaluate(RandomizedRunner.java:938)
	at com.carrotsearch.randomizedtesting.RandomizedRunner$9.evaluate(RandomizedRunner.java:974)
	at com.carrotsearch.randomizedtesting.RandomizedRunner$10.evaluate(RandomizedRunner.java:988)
	at com.carrotsearch.randomizedtesting.rules.SystemPropertiesRestoreRule$1.evaluate(SystemPropertiesRestoreRule.java:57)
	at org.apache.lucene.util.TestRuleSetupTeardownChained$1.evaluate(TestRuleSetupTeardownChained.java:49)
	at org.apache.lucene.util.AbstractBeforeAfterRule$1.evaluate(AbstractBeforeAfterRule.java:45)
	at org.apache.lucene.util.TestRuleThreadAndTestName$1.evaluate(TestRuleThreadAndTestName.java:48)
	at org.apache.lucene.util.TestRuleIgnoreAfterMaxFailures$1.evaluate(TestRuleIgnoreAfterMaxFailures.java:64)
	at org.apache.lucene.util.TestRuleMarkFailure$1.evaluate(TestRuleMarkFailure.java:47)
	at com.carrotsearch.randomizedtesting.rules.StatementAdapter.evaluate(StatementAdapter.java:36)
	at com.carrotsearch.randomizedtesting.ThreadLeakControl$StatementRunner.run(ThreadLeakControl.java:368)
	at com.carrotsearch.randomizedtesting.ThreadLeakControl.forkTimeoutingTask(ThreadLeakControl.java:817)
	at com.carrotsearch.randomizedtesting.ThreadLeakControl$3.evaluate(ThreadLeakControl.java:468)
	at com.carrotsearch.randomizedtesting.RandomizedRunner.runSingleTest(RandomizedRunner.java:947)
	at com.carrotsearch.randomizedtesting.RandomizedRunner$5.evaluate(RandomizedRunner.java:832)
	at com.carrotsearch.randomizedtesting.RandomizedRunner$6.evaluate(RandomizedRunner.java:883)
	at com.carrotsearch.randomizedtesting.RandomizedRunner$7.evaluate(RandomizedRunner.java:894)
	at com.carrotsearch.randomizedtesting.rules.StatementAdapter.evaluate(StatementAdapter.java:36)
	at com.carrotsearch.randomizedtesting.rules.SystemPropertiesRestoreRule$1.evaluate(SystemPropertiesRestoreRule.java:57)
	at org.apache.lucene.util.AbstractBeforeAfterRule$1.evaluate(AbstractBeforeAfterRule.java:45)
	at com.carrotsearch.randomizedtesting.rules.StatementAdapter.evaluate(StatementAdapter.java:36)
	at org.apache.lucene.util.TestRuleStoreClassName$1.evaluate(TestRuleStoreClassName.java:41)
	at com.carrotsearch.randomizedtesting.rules.NoShadowingOrOverridesOnMethodsRule$1.evaluate(NoShadowingOrOverridesOnMethodsRule.java:40)
	at com.carrotsearch.randomizedtesting.rules.NoShadowingOrOverridesOnMethodsRule$1.evaluate(NoShadowingOrOverridesOnMethodsRule.java:40)
	at com.carrotsearch.randomizedtesting.rules.StatementAdapter.evaluate(StatementAdapter.java:36)
	at com.carrotsearch.randomizedtesting.rules.StatementAdapter.evaluate(StatementAdapter.java:36)
	at org.apache.lucene.util.TestRuleAssertionsRequired$1.evaluate(TestRuleAssertionsRequired.java:53)
	at org.apache.lucene.util.TestRuleMarkFailure$1.evaluate(TestRuleMarkFailure.java:47)
	at org.apache.lucene.util.TestRuleIgnoreAfterMaxFailures$1.evaluate(TestRuleIgnoreAfterMaxFailures.java:64)
	at org.apache.lucene.util.TestRuleIgnoreTestSuites$1.evaluate(TestRuleIgnoreTestSuites.java:54)
	at com.carrotsearch.randomizedtesting.rules.StatementAdapter.evaluate(StatementAdapter.java:36)
	at com.carrotsearch.randomizedtesting.ThreadLeakControl$StatementRunner.run(ThreadLeakControl.java:368)
	at java.base/java.lang.Thread.run(Thread.java:834)


FAILED:  org.apache.solr.cloud.OverseerRolesTest.testDesignatedOverseerRestarts

Error Message:
Timed out waiting for overseer state change. The current overseer is: 127.0.0.1:36405_solr

Stack Trace:
java.lang.AssertionError: Timed out waiting for overseer state change. The current overseer is: 127.0.0.1:36405_solr
	at __randomizedtesting.SeedInfo.seed([E799306D24F40484:EFB827321AAA168E]:0)
	at org.junit.Assert.fail(Assert.java:88)
	at org.apache.solr.cloud.OverseerRolesTest.waitForNewOverseer(OverseerRolesTest.java:70)
	at org.apache.solr.cloud.OverseerRolesTest.waitForNewOverseer(OverseerRolesTest.java:75)
	at org.apache.solr.cloud.OverseerRolesTest.testDesignatedOverseerRestarts(OverseerRolesTest.java:188)
	at java.base/jdk.internal.reflect.NativeMethodAccessorImpl.invoke0(Native Method)
	at java.base/jdk.internal.reflect.NativeMethodAccessorImpl.invoke(NativeMethodAccessorImpl.java:62)
	at java.base/jdk.internal.reflect.DelegatingMethodAccessorImpl.invoke(DelegatingMethodAccessorImpl.java:43)
	at java.base/java.lang.reflect.Method.invoke(Method.java:566)
	at com.carrotsearch.randomizedtesting.RandomizedRunner.invoke(RandomizedRunner.java:1750)
	at com.carrotsearch.randomizedtesting.RandomizedRunner$8.evaluate(RandomizedRunner.java:938)
	at com.carrotsearch.randomizedtesting.RandomizedRunner$9.evaluate(RandomizedRunner.java:974)
	at com.carrotsearch.randomizedtesting.RandomizedRunner$10.evaluate(RandomizedRunner.java:988)
	at com.carrotsearch.randomizedtesting.rules.SystemPropertiesRestoreRule$1.evaluate(SystemPropertiesRestoreRule.java:57)
	at org.apache.lucene.util.TestRuleSetupTeardownChained$1.evaluate(TestRuleSetupTeardownChained.java:49)
	at org.apache.lucene.util.AbstractBeforeAfterRule$1.evaluate(AbstractBeforeAfterRule.java:45)
	at org.apache.lucene.util.TestRuleThreadAndTestName$1.evaluate(TestRuleThreadAndTestName.java:48)
	at org.apache.lucene.util.TestRuleIgnoreAfterMaxFailures$1.evaluate(TestRuleIgnoreAfterMaxFailures.java:64)
	at org.apache.lucene.util.TestRuleMarkFailure$1.evaluate(TestRuleMarkFailure.java:47)
	at com.carrotsearch.randomizedtesting.rules.StatementAdapter.evaluate(StatementAdapter.java:36)
	at com.carrotsearch.randomizedtesting.ThreadLeakControl$StatementRunner.run(ThreadLeakControl.java:368)
	at com.carrotsearch.randomizedtesting.ThreadLeakControl.forkTimeoutingTask(ThreadLeakControl.java:817)
	at com.carrotsearch.randomizedtesting.ThreadLeakControl$3.evaluate(ThreadLeakControl.java:468)
	at com.carrotsearch.randomizedtesting.RandomizedRunner.runSingleTest(RandomizedRunner.java:947)
	at com.carrotsearch.randomizedtesting.RandomizedRunner$5.evaluate(RandomizedRunner.java:832)
	at com.carrotsearch.randomizedtesting.RandomizedRunner$6.evaluate(RandomizedRunner.java:883)
	at com.carrotsearch.randomizedtesting.RandomizedRunner$7.evaluate(RandomizedRunner.java:894)
	at com.carrotsearch.randomizedtesting.rules.StatementAdapter.evaluate(StatementAdapter.java:36)
	at com.carrotsearch.randomizedtesting.rules.SystemPropertiesRestoreRule$1.evaluate(SystemPropertiesRestoreRule.java:57)
	at org.apache.lucene.util.AbstractBeforeAfterRule$1.evaluate(AbstractBeforeAfterRule.java:45)
	at com.carrotsearch.randomizedtesting.rules.StatementAdapter.evaluate(StatementAdapter.java:36)
	at org.apache.lucene.util.TestRuleStoreClassName$1.evaluate(TestRuleStoreClassName.java:41)
	at com.carrotsearch.randomizedtesting.rules.NoShadowingOrOverridesOnMethodsRule$1.evaluate(NoShadowingOrOverridesOnMethodsRule.java:40)
	at com.carrotsearch.randomizedtesting.rules.NoShadowingOrOverridesOnMethodsRule$1.evaluate(NoShadowingOrOverridesOnMethodsRule.java:40)
	at com.carrotsearch.randomizedtesting.rules.StatementAdapter.evaluate(StatementAdapter.java:36)
	at com.carrotsearch.randomizedtesting.rules.StatementAdapter.evaluate(StatementAdapter.java:36)
	at org.apache.lucene.util.TestRuleAssertionsRequired$1.evaluate(TestRuleAssertionsRequired.java:53)
	at org.apache.lucene.util.TestRuleMarkFailure$1.evaluate(TestRuleMarkFailure.java:47)
	at org.apache.lucene.util.TestRuleIgnoreAfterMaxFailures$1.evaluate(TestRuleIgnoreAfterMaxFailures.java:64)
	at org.apache.lucene.util.TestRuleIgnoreTestSuites$1.evaluate(TestRuleIgnoreTestSuites.java:54)
	at com.carrotsearch.randomizedtesting.rules.StatementAdapter.evaluate(StatementAdapter.java:36)
	at com.carrotsearch.randomizedtesting.ThreadLeakControl$StatementRunner.run(ThreadLeakControl.java:368)
	at java.base/java.lang.Thread.run(Thread.java:834)


FAILED:  org.apache.solr.cloud.OverseerRolesTest.testDesignatedOverseerRestarts

Error Message:
Timed out waiting for overseer state change. The current overseer is: 127.0.0.1:44767_solr

Stack Trace:
java.lang.AssertionError: Timed out waiting for overseer state change. The current overseer is: 127.0.0.1:44767_solr
	at __randomizedtesting.SeedInfo.seed([E799306D24F40484:EFB827321AAA168E]:0)
	at org.junit.Assert.fail(Assert.java:88)
	at org.apache.solr.cloud.OverseerRolesTest.waitForNewOverseer(OverseerRolesTest.java:70)
	at org.apache.solr.cloud.OverseerRolesTest.waitForNewOverseer(OverseerRolesTest.java:75)
	at org.apache.solr.cloud.OverseerRolesTest.testDesignatedOverseerRestarts(OverseerRolesTest.java:188)
	at java.base/jdk.internal.reflect.NativeMethodAccessorImpl.invoke0(Native Method)
	at java.base/jdk.internal.reflect.NativeMethodAccessorImpl.invoke(NativeMethodAccessorImpl.java:62)
	at java.base/jdk.internal.reflect.DelegatingMethodAccessorImpl.invoke(DelegatingMethodAccessorImpl.java:43)
	at java.base/java.lang.reflect.Method.invoke(Method.java:566)
	at com.carrotsearch.randomizedtesting.RandomizedRunner.invoke(RandomizedRunner.java:1750)
	at com.carrotsearch.randomizedtesting.RandomizedRunner$8.evaluate(RandomizedRunner.java:938)
	at com.carrotsearch.randomizedtesting.RandomizedRunner$9.evaluate(RandomizedRunner.java:974)
	at com.carrotsearch.randomizedtesting.RandomizedRunner$10.evaluate(RandomizedRunner.java:988)
	at com.carrotsearch.randomizedtesting.rules.SystemPropertiesRestoreRule$1.evaluate(SystemPropertiesRestoreRule.java:57)
	at org.apache.lucene.util.TestRuleSetupTeardownChained$1.evaluate(TestRuleSetupTeardownChained.java:49)
	at org.apache.lucene.util.AbstractBeforeAfterRule$1.evaluate(AbstractBeforeAfterRule.java:45)
	at org.apache.lucene.util.TestRuleThreadAndTestName$1.evaluate(TestRuleThreadAndTestName.java:48)
	at org.apache.lucene.util.TestRuleIgnoreAfterMaxFailures$1.evaluate(TestRuleIgnoreAfterMaxFailures.java:64)
	at org.apache.lucene.util.TestRuleMarkFailure$1.evaluate(TestRuleMarkFailure.java:47)
	at com.carrotsearch.randomizedtesting.rules.StatementAdapter.evaluate(StatementAdapter.java:36)
	at com.carrotsearch.randomizedtesting.ThreadLeakControl$StatementRunner.run(ThreadLeakControl.java:368)
	at com.carrotsearch.randomizedtesting.ThreadLeakControl.forkTimeoutingTask(ThreadLeakControl.java:817)
	at com.carrotsearch.randomizedtesting.ThreadLeakControl$3.evaluate(ThreadLeakControl.java:468)
	at com.carrotsearch.randomizedtesting.RandomizedRunner.runSingleTest(RandomizedRunner.java:947)
	at com.carrotsearch.randomizedtesting.RandomizedRunner$5.evaluate(RandomizedRunner.java:832)
	at com.carrotsearch.randomizedtesting.RandomizedRunner$6.evaluate(RandomizedRunner.java:883)
	at com.carrotsearch.randomizedtesting.RandomizedRunner$7.evaluate(RandomizedRunner.java:894)
	at com.carrotsearch.randomizedtesting.rules.StatementAdapter.evaluate(StatementAdapter.java:36)
	at com.carrotsearch.randomizedtesting.rules.SystemPropertiesRestoreRule$1.evaluate(SystemPropertiesRestoreRule.java:57)
	at org.apache.lucene.util.AbstractBeforeAfterRule$1.evaluate(AbstractBeforeAfterRule.java:45)
	at com.carrotsearch.randomizedtesting.rules.StatementAdapter.evaluate(StatementAdapter.java:36)
	at org.apache.lucene.util.TestRuleStoreClassName$1.evaluate(TestRuleStoreClassName.java:41)
	at com.carrotsearch.randomizedtesting.rules.NoShadowingOrOverridesOnMethodsRule$1.evaluate(NoShadowingOrOverridesOnMethodsRule.java:40)
	at com.carrotsearch.randomizedtesting.rules.NoShadowingOrOverridesOnMethodsRule$1.evaluate(NoShadowingOrOverridesOnMethodsRule.java:40)
	at com.carrotsearch.randomizedtesting.rules.StatementAdapter.evaluate(StatementAdapter.java:36)
	at com.carrotsearch.randomizedtesting.rules.StatementAdapter.evaluate(StatementAdapter.java:36)
	at org.apache.lucene.util.TestRuleAssertionsRequired$1.evaluate(TestRuleAssertionsRequired.java:53)
	at org.apache.lucene.util.TestRuleMarkFailure$1.evaluate(TestRuleMarkFailure.java:47)
	at org.apache.lucene.util.TestRuleIgnoreAfterMaxFailures$1.evaluate(TestRuleIgnoreAfterMaxFailures.java:64)
	at org.apache.lucene.util.TestRuleIgnoreTestSuites$1.evaluate(TestRuleIgnoreTestSuites.java:54)
	at com.carrotsearch.randomizedtesting.rules.StatementAdapter.evaluate(StatementAdapter.java:36)
	at com.carrotsearch.randomizedtesting.ThreadLeakControl$StatementRunner.run(ThreadLeakControl.java:368)
	at java.base/java.lang.Thread.run(Thread.java:834)




Build Log:
[...truncated 2083 lines...]
   [junit4] JVM J1: stderr was not empty, see: /home/jenkins/workspace/Lucene-Solr-8.1-Linux/lucene/build/core/test/temp/junit4-J1-20190504_105252_38912578913962548311964.syserr
   [junit4] >>> JVM J1 emitted unexpected output (verbatim) ----
   [junit4] OpenJDK 64-Bit Server VM warning: Option UseConcMarkSweepGC was deprecated in version 9.0 and will likely be removed in a future release.
   [junit4] <<< JVM J1: EOF ----

   [junit4] JVM J0: stderr was not empty, see: /home/jenkins/workspace/Lucene-Solr-8.1-Linux/lucene/build/core/test/temp/junit4-J0-20190504_105252_389151340619841299788.syserr
   [junit4] >>> JVM J0 emitted unexpected output (verbatim) ----
   [junit4] OpenJDK 64-Bit Server VM warning: Option UseConcMarkSweepGC was deprecated in version 9.0 and will likely be removed in a future release.
   [junit4] <<< JVM J0: EOF ----

[...truncated 5 lines...]
   [junit4] JVM J2: stderr was not empty, see: /home/jenkins/workspace/Lucene-Solr-8.1-Linux/lucene/build/core/test/temp/junit4-J2-20190504_105252_3898374921556692800341.syserr
   [junit4] >>> JVM J2 emitted unexpected output (verbatim) ----
   [junit4] OpenJDK 64-Bit Server VM warning: Option UseConcMarkSweepGC was deprecated in version 9.0 and will likely be removed in a future release.
   [junit4] <<< JVM J2: EOF ----

[...truncated 304 lines...]
   [junit4] JVM J1: stderr was not empty, see: /home/jenkins/workspace/Lucene-Solr-8.1-Linux/lucene/build/test-framework/test/temp/junit4-J1-20190504_110235_3449715076385267055639.syserr
   [junit4] >>> JVM J1 emitted unexpected output (verbatim) ----
   [junit4] OpenJDK 64-Bit Server VM warning: Option UseConcMarkSweepGC was deprecated in version 9.0 and will likely be removed in a future release.
   [junit4] <<< JVM J1: EOF ----

[...truncated 5 lines...]
   [junit4] JVM J0: stderr was not empty, see: /home/jenkins/workspace/Lucene-Solr-8.1-Linux/lucene/build/test-framework/test/temp/junit4-J0-20190504_110235_3446565989143502488132.syserr
   [junit4] >>> JVM J0 emitted unexpected output (verbatim) ----
   [junit4] OpenJDK 64-Bit Server VM warning: Option UseConcMarkSweepGC was deprecated in version 9.0 and will likely be removed in a future release.
   [junit4] <<< JVM J0: EOF ----

[...truncated 3 lines...]
   [junit4] JVM J2: stderr was not empty, see: /home/jenkins/workspace/Lucene-Solr-8.1-Linux/lucene/build/test-framework/test/temp/junit4-J2-20190504_110235_3441900808334610885004.syserr
   [junit4] >>> JVM J2 emitted unexpected output (verbatim) ----
   [junit4] OpenJDK 64-Bit Server VM warning: Option UseConcMarkSweepGC was deprecated in version 9.0 and will likely be removed in a future release.
   [junit4] <<< JVM J2: EOF ----

[...truncated 1080 lines...]
   [junit4] JVM J1: stderr was not empty, see: /home/jenkins/workspace/Lucene-Solr-8.1-Linux/lucene/build/analysis/common/test/temp/junit4-J1-20190504_110518_7131910207456514866488.syserr
   [junit4] >>> JVM J1 emitted unexpected output (verbatim) ----
   [junit4] OpenJDK 64-Bit Server VM warning: Option UseConcMarkSweepGC was deprecated in version 9.0 and will likely be removed in a future release.
   [junit4] <<< JVM J1: EOF ----

[...truncated 3 lines...]
   [junit4] JVM J0: stderr was not empty, see: /home/jenkins/workspace/Lucene-Solr-8.1-Linux/lucene/build/analysis/common/test/temp/junit4-J0-20190504_110518_71313509601803790216154.syserr
   [junit4] >>> JVM J0 emitted unexpected output (verbatim) ----
   [junit4] OpenJDK 64-Bit Server VM warning: Option UseConcMarkSweepGC was deprecated in version 9.0 and will likely be removed in a future release.
   [junit4] <<< JVM J0: EOF ----

[...truncated 3 lines...]
   [junit4] JVM J2: stderr was not empty, see: /home/jenkins/workspace/Lucene-Solr-8.1-Linux/lucene/build/analysis/common/test/temp/junit4-J2-20190504_110518_7137110075369292232883.syserr
   [junit4] >>> JVM J2 emitted unexpected output (verbatim) ----
   [junit4] OpenJDK 64-Bit Server VM warning: Option UseConcMarkSweepGC was deprecated in version 9.0 and will likely be removed in a future release.
   [junit4] <<< JVM J2: EOF ----

[...truncated 258 lines...]
   [junit4] JVM J2: stderr was not empty, see: /home/jenkins/workspace/Lucene-Solr-8.1-Linux/lucene/build/analysis/icu/test/temp/junit4-J2-20190504_110708_3756735903369431353110.syserr
   [junit4] >>> JVM J2 emitted unexpected output (verbatim) ----
   [junit4] OpenJDK 64-Bit Server VM warning: Option UseConcMarkSweepGC was deprecated in version 9.0 and will likely be removed in a future release.
   [junit4] <<< JVM J2: EOF ----

   [junit4] JVM J0: stderr was not empty, see: /home/jenkins/workspace/Lucene-Solr-8.1-Linux/lucene/build/analysis/icu/test/temp/junit4-J0-20190504_110708_3743254125400875506581.syserr
   [junit4] >>> JVM J0 emitted unexpected output (verbatim) ----
   [junit4] OpenJDK 64-Bit Server VM warning: Option UseConcMarkSweepGC was deprecated in version 9.0 and will likely be removed in a future release.
   [junit4] <<< JVM J0: EOF ----

[...truncated 3 lines...]
   [junit4] JVM J1: stderr was not empty, see: /home/jenkins/workspace/Lucene-Solr-8.1-Linux/lucene/build/analysis/icu/test/temp/junit4-J1-20190504_110708_3751175302599629627317.syserr
   [junit4] >>> JVM J1 emitted unexpected output (verbatim) ----
   [junit4] OpenJDK 64-Bit Server VM warning: Option UseConcMarkSweepGC was deprecated in version 9.0 and will likely be removed in a future release.
   [junit4] <<< JVM J1: EOF ----

[...truncated 251 lines...]
   [junit4] JVM J1: stderr was not empty, see: /home/jenkins/workspace/Lucene-Solr-8.1-Linux/lucene/build/analysis/kuromoji/test/temp/junit4-J1-20190504_110727_20117693651674372140397.syserr
   [junit4] >>> JVM J1 emitted unexpected output (verbatim) ----
   [junit4] OpenJDK 64-Bit Server VM warning: Option UseConcMarkSweepGC was deprecated in version 9.0 and will likely be removed in a future release.
   [junit4] <<< JVM J1: EOF ----

[...truncated 5 lines...]
   [junit4] JVM J0: stderr was not empty, see: /home/jenkins/workspace/Lucene-Solr-8.1-Linux/lucene/build/analysis/kuromoji/test/temp/junit4-J0-20190504_110727_20110847743412175850754.syserr
   [junit4] >>> JVM J0 emitted unexpected output (verbatim) ----
   [junit4] OpenJDK 64-Bit Server VM warning: Option UseConcMarkSweepGC was deprecated in version 9.0 and will likely be removed in a future release.
   [junit4] <<< JVM J0: EOF ----

[...truncated 3 lines...]
   [junit4] JVM J2: stderr was not empty, see: /home/jenkins/workspace/Lucene-Solr-8.1-Linux/lucene/build/analysis/kuromoji/test/temp/junit4-J2-20190504_110727_2012663751904835254342.syserr
   [junit4] >>> JVM J2 emitted unexpected output (verbatim) ----
   [junit4] OpenJDK 64-Bit Server VM warning: Option UseConcMarkSweepGC was deprecated in version 9.0 and will likely be removed in a future release.
   [junit4] <<< JVM J2: EOF ----

[...truncated 162 lines...]
   [junit4] JVM J1: stderr was not empty, see: /home/jenkins/workspace/Lucene-Solr-8.1-Linux/lucene/build/analysis/morfologik/test/temp/junit4-J1-20190504_110754_49915031577574711977365.syserr
   [junit4] >>> JVM J1 emitted unexpected output (verbatim) ----
   [junit4] OpenJDK 64-Bit Server VM warning: Option UseConcMarkSweepGC was deprecated in version 9.0 and will likely be removed in a future release.
   [junit4] <<< JVM J1: EOF ----

[...truncated 3 lines...]
   [junit4] JVM J0: stderr was not empty, see: /home/jenkins/workspace/Lucene-Solr-8.1-Linux/lucene/build/analysis/morfologik/test/temp/junit4-J0-20190504_110754_49915149803250234231620.syserr
   [junit4] >>> JVM J0 emitted unexpected output (verbatim) ----
   [junit4] OpenJDK 64-Bit Server VM warning: Option UseConcMarkSweepGC was deprecated in version 9.0 and will likely be removed in a future release.
   [junit4] <<< JVM J0: EOF ----

[...truncated 3 lines...]
   [junit4] JVM J2: stderr was not empty, see: /home/jenkins/workspace/Lucene-Solr-8.1-Linux/lucene/build/analysis/morfologik/test/temp/junit4-J2-20190504_110754_49918339551869592750026.syserr
   [junit4] >>> JVM J2 emitted unexpected output (verbatim) ----
   [junit4] OpenJDK 64-Bit Server VM warning: Option UseConcMarkSweepGC was deprecated in version 9.0 and will likely be removed in a future release.
   [junit4] <<< JVM J2: EOF ----

[...truncated 204 lines...]
   [junit4] JVM J2: stderr was not empty, see: /home/jenkins/workspace/Lucene-Solr-8.1-Linux/lucene/build/analysis/nori/test/temp/junit4-J2-20190504_110758_98912658601790130212110.syserr
   [junit4] >>> JVM J2 emitted unexpected output (verbatim) ----
   [junit4] OpenJDK 64-Bit Server VM warning: Option UseConcMarkSweepGC was deprecated in version 9.0 and will likely be removed in a future release.
   [junit4] <<< JVM J2: EOF ----

[...truncated 3 lines...]
   [junit4] JVM J0: stderr was not empty, see: /home/jenkins/workspace/Lucene-Solr-8.1-Linux/lucene/build/analysis/nori/test/temp/junit4-J0-20190504_110758_98914734501948155960748.syserr
   [junit4] >>> JVM J0 emitted unexpected output (verbatim) ----
   [junit4] OpenJDK 64-Bit Server VM warning: Option UseConcMarkSweepGC was deprecated in version 9.0 and will likely be removed in a future release.
   [junit4] <<< JVM J0: EOF ----

[...truncated 6 lines...]
   [junit4] JVM J1: stderr was not empty, see: /home/jenkins/workspace/Lucene-Solr-8.1-Linux/lucene/build/analysis/nori/test/temp/junit4-J1-20190504_110758_9893983017576202770486.syserr
   [junit4] >>> JVM J1 emitted unexpected output (verbatim) ----
   [junit4] OpenJDK 64-Bit Server VM warning: Option UseConcMarkSweepGC was deprecated in version 9.0 and will likely be removed in a future release.
   [junit4] <<< JVM J1: EOF ----

[...truncated 174 lines...]
   [junit4] JVM J2: stderr was not empty, see: /home/jenkins/workspace/Lucene-Solr-8.1-Linux/lucene/build/analysis/opennlp/test/temp/junit4-J2-20190504_110809_29216383401147372699550.syserr
   [junit4] >>> JVM J2 emitted unexpected output (verbatim) ----
   [junit4] OpenJDK 64-Bit Server VM warning: Option UseConcMarkSweepGC was deprecated in version 9.0 and will likely be removed in a future release.
   [junit4] <<< JVM J2: EOF ----

   [junit4] JVM J1: stderr was not empty, see: /home/jenkins/workspace/Lucene-Solr-8.1-Linux/lucene/build/analysis/opennlp/test/temp/junit4-J1-20190504_110809_29215538465673358132036.syserr
   [junit4] >>> JVM J1 emitted unexpected output (verbatim) ----
   [junit4] OpenJDK 64-Bit Server VM warning: Option UseConcMarkSweepGC was deprecated in version 9.0 and will likely be removed in a future release.
   [junit4] <<< JVM J1: EOF ----

   [junit4] JVM J0: stderr was not empty, see: /home/jenkins/workspace/Lucene-Solr-8.1-Linux/lucene/build/analysis/opennlp/test/temp/junit4-J0-20190504_110809_29211815770668657118540.syserr
   [junit4] >>> JVM J0 emitted unexpected output (verbatim) ----
   [junit4] OpenJDK 64-Bit Server VM warning: Option UseConcMarkSweepGC was deprecated in version 9.0 and will likely be removed in a future release.
   [junit4] <<< JVM J0: EOF ----

[...truncated 173 lines...]
   [junit4] JVM J0: stderr was not empty, see: /home/jenkins/workspace/Lucene-Solr-8.1-Linux/lucene/build/analysis/phonetic/test/temp/junit4-J0-20190504_110812_5367734599724329068383.syserr
   [junit4] >>> JVM J0 emitted unexpected output (verbatim) ----
   [junit4] OpenJDK 64-Bit Server VM warning: Option UseConcMarkSweepGC was deprecated in version 9.0 and will likely be removed in a future release.
   [junit4] <<< JVM J0: EOF ----

[...truncated 6 lines...]
   [junit4] JVM J1: stderr was not empty, see: /home/jenkins/workspace/Lucene-Solr-8.1-Linux/lucene/build/analysis/phonetic/test/temp/junit4-J1-20190504_110812_53611420593669349786438.syserr
   [junit4] >>> JVM J1 emitted unexpected output (verbatim) ----
   [junit4] OpenJDK 64-Bit Server VM warning: Option UseConcMarkSweepGC was deprecated in version 9.0 and will likely be removed in a future release.
   [junit4] <<< JVM J1: EOF ----

[...truncated 3 lines...]
   [junit4] JVM J2: stderr was not empty, see: /home/jenkins/workspace/Lucene-Solr-8.1-Linux/lucene/build/analysis/phonetic/test/temp/junit4-J2-20190504_110812_53615922122614101165904.syserr
   [junit4] >>> JVM J2 emitted unexpected output (verbatim) ----
   [junit4] OpenJDK 64-Bit Server VM warning: Option UseConcMarkSweepGC was deprecated in version 9.0 and will likely be removed in a future release.
   [junit4] <<< JVM J2: EOF ----

[...truncated 161 lines...]
   [junit4] JVM J0: stderr was not empty, see: /home/jenkins/workspace/Lucene-Solr-8.1-Linux/lucene/build/analysis/smartcn/test/temp/junit4-J0-20190504_110823_604107643291290429855.syserr
   [junit4] >>> JVM J0 emitted unexpected output (verbatim) ----
   [junit4] OpenJDK 64-Bit Server VM warning: Option UseConcMarkSweepGC was deprecated in version 9.0 and will likely be removed in a future release.
   [junit4] <<< JVM J0: EOF ----

[...truncated 3 lines...]
   [junit4] JVM J1: stderr was not empty, see: /home/jenkins/workspace/Lucene-Solr-8.1-Linux/lucene/build/analysis/smartcn/test/temp/junit4-J1-20190504_110823_6044678641361537831725.syserr
   [junit4] >>> JVM J1 emitted unexpected output (verbatim) ----
   [junit4] OpenJDK 64-Bit Server VM warning: Option UseConcMarkSweepGC was deprecated in version 9.0 and will likely be removed in a future release.
   [junit4] <<< JVM J1: EOF ----

[...truncated 162 lines...]
   [junit4] JVM J1: stderr was not empty, see: /home/jenkins/workspace/Lucene-Solr-8.1-Linux/lucene/build/analysis/stempel/test/temp/junit4-J1-20190504_110830_7703485654802072975142.syserr
   [junit4] >>> JVM J1 emitted unexpected output (verbatim) ----
   [junit4] OpenJDK 64-Bit Server VM warning: Option UseConcMarkSweepGC was deprecated in version 9.0 and will likely be removed in a future release.
   [junit4] <<< JVM J1: EOF ----

[...truncated 6 lines...]
   [junit4] JVM J2: stderr was not empty, see: /home/jenkins/workspace/Lucene-Solr-8.1-Linux/lucene/build/analysis/stempel/test/temp/junit4-J2-20190504_110830_77010139097737203077893.syserr
   [junit4] >>> JVM J2 emitted unexpected output (verbatim) ----
   [junit4] OpenJDK 64-Bit Server VM warning: Option UseConcMarkSweepGC was deprecated in version 9.0 and will likely be removed in a future release.
   [junit4] <<< JVM J2: EOF ----

   [junit4] JVM J0: stderr was not empty, see: /home/jenkins/workspace/Lucene-Solr-8.1-Linux/lucene/build/analysis/stempel/test/temp/junit4-J0-20190504_110830_77010842015375873472735.syserr
   [junit4] >>> JVM J0 emitted unexpected output (verbatim) ----
   [junit4] OpenJDK 64-Bit Server VM warning: Option UseConcMarkSweepGC was deprecated in version 9.0 and will likely be removed in a future release.
   [junit4] <<< JVM J0: EOF ----

[...truncated 177 lines...]
   [junit4] JVM J2: stderr was not empty, see: /home/jenkins/workspace/Lucene-Solr-8.1-Linux/lucene/build/backward-codecs/test/temp/junit4-J2-20190504_110833_8291429831069826897345.syserr
   [junit4] >>> JVM J2 emitted unexpected output (verbatim) ----
   [junit4] OpenJDK 64-Bit Server VM warning: Option UseConcMarkSweepGC was deprecated in version 9.0 and will likely be removed in a future release.
   [junit4] <<< JVM J2: EOF ----

[...truncated 19 lines...]
   [junit4] JVM J0: stderr was not empty, see: /home/jenkins/workspace/Lucene-Solr-8.1-Linux/lucene/build/backward-codecs/test/temp/junit4-J0-20190504_110833_82815626316985236916323.syserr
   [junit4] >>> JVM J0 emitted unexpected output (verbatim) ----
   [junit4] OpenJDK 64-Bit Server VM warning: Option UseConcMarkSweepGC was deprecated in version 9.0 and will likely be removed in a future release.
   [junit4] <<< JVM J0: EOF ----

[...truncated 9 lines...]
   [junit4] JVM J1: stderr was not empty, see: /home/jenkins/workspace/Lucene-Solr-8.1-Linux/lucene/build/backward-codecs/test/temp/junit4-J1-20190504_110833_82812297512819502230349.syserr
   [junit4] >>> JVM J1 emitted unexpected output (verbatim) ----
   [junit4] OpenJDK 64-Bit Server VM warning: Option UseConcMarkSweepGC was deprecated in version 9.0 and will likely be removed in a future release.
   [junit4] <<< JVM J1: EOF ----

[...truncated 1551 lines...]
   [junit4] JVM J2: stderr was not empty, see: /home/jenkins/workspace/Lucene-Solr-8.1-Linux/lucene/build/benchmark/test/temp/junit4-J2-20190504_111229_7695762857718074051093.syserr
   [junit4] >>> JVM J2 emitted unexpected output (verbatim) ----
   [junit4] OpenJDK 64-Bit Server VM warning: Option UseConcMarkSweepGC was deprecated in version 9.0 and will likely be removed in a future release.
   [junit4] <<< JVM J2: EOF ----

   [junit4] JVM J0: stderr was not empty, see: /home/jenkins/workspace/Lucene-Solr-8.1-Linux/lucene/build/benchmark/test/temp/junit4-J0-20190504_111229_7699080504309689469943.syserr
   [junit4] >>> JVM J0 emitted unexpected output (verbatim) ----
   [junit4] OpenJDK 64-Bit Server VM warning: Option UseConcMarkSweepGC was deprecated in version 9.0 and will likely be removed in a future release.
   [junit4] <<< JVM J0: EOF ----

   [junit4] JVM J1: stderr was not empty, see: /home/jenkins/workspace/Lucene-Solr-8.1-Linux/lucene/build/benchmark/test/temp/junit4-J1-20190504_111229_7699537605160043002393.syserr
   [junit4] >>> JVM J1 emitted unexpected output (verbatim) ----
   [junit4] OpenJDK 64-Bit Server VM warning: Option UseConcMarkSweepGC was deprecated in version 9.0 and will likely be removed in a future release.
   [junit4] <<< JVM J1: EOF ----

[...truncated 253 lines...]
   [junit4] JVM J0: stderr was not empty, see: /home/jenkins/workspace/Lucene-Solr-8.1-Linux/lucene/build/classification/test/temp/junit4-J0-20190504_111239_07417396552685652593684.syserr
   [junit4] JVM J2: stderr was not empty, see: /home/jenkins/workspace/Lucene-Solr-8.1-Linux/lucene/build/classification/test/temp/junit4-J2-20190504_111239_07414917965892177887465.syserr
   [junit4] >>> JVM J0 emitted unexpected output (verbatim) ----
   [junit4] OpenJDK 64-Bit Server VM warning: Option UseConcMarkSweepGC was deprecated in version 9.0 and will likely be removed in a future release.
   [junit4] <<< JVM J0: EOF ----

[...truncated 6 lines...]
   [junit4] JVM J1: stderr was not empty, see: /home/jenkins/workspace/Lucene-Solr-8.1-Linux/lucene/build/classification/test/temp/junit4-J1-20190504_111239_0744299035575272789070.syserr
   [junit4] >>> JVM J1 emitted unexpected output (verbatim) ----
   [junit4] OpenJDK 64-Bit Server VM warning: Option UseConcMarkSweepGC was deprecated in version 9.0 and will likely be removed in a future release.
   [junit4] <<< JVM J1: EOF ----

[...truncated 255 lines...]
   [junit4] JVM J2: stderr was not empty, see: /home/jenkins/workspace/Lucene-Solr-8.1-Linux/lucene/build/codecs/test/temp/junit4-J2-20190504_111250_5906366315121384774429.syserr
   [junit4] >>> JVM J2 emitted unexpected output (verbatim) ----
   [junit4] OpenJDK 64-Bit Server VM warning: Option UseConcMarkSweepGC was deprecated in version 9.0 and will likely be removed in a future release.
   [junit4] <<< JVM J2: EOF ----

[...truncated 5 lines...]
   [junit4] JVM J1: stderr was not empty, see: /home/jenkins/workspace/Lucene-Solr-8.1-Linux/lucene/build/codecs/test/temp/junit4-J1-20190504_111250_58917199891642360120536.syserr
   [junit4] >>> JVM J1 emitted unexpected output (verbatim) ----
   [junit4] OpenJDK 64-Bit Server VM warning: Option UseConcMarkSweepGC was deprecated in version 9.0 and will likely be removed in a future release.
   [junit4] <<< JVM J1: EOF ----

[...truncated 8 lines...]
   [junit4] JVM J0: stderr was not empty, see: /home/jenkins/workspace/Lucene-Solr-8.1-Linux/lucene/build/codecs/test/temp/junit4-J0-20190504_111250_5892553256533129492272.syserr
   [junit4] >>> JVM J0 emitted unexpected output (verbatim) ----
   [junit4] OpenJDK 64-Bit Server VM warning: Option UseConcMarkSweepGC was deprecated in version 9.0 and will likely be removed in a future release.
   [junit4] <<< JVM J0: EOF ----

[...truncated 230 lines...]
   [junit4] JVM J1: stderr was not empty, see: /home/jenkins/workspace/Lucene-Solr-8.1-Linux/lucene/build/demo/test/temp/junit4-J1-20190504_111537_3479422363519461927915.syserr
   [junit4] >>> JVM J1 emitted unexpected output (verbatim) ----
   [junit4] OpenJDK 64-Bit Server VM warning: Option UseConcMarkSweepGC was deprecated in version 9.0 and will likely be removed in a future release.
   [junit4] <<< JVM J1: EOF ----

[...truncated 6 lines...]
   [junit4] JVM J2: stderr was not empty, see: /home/jenkins/workspace/Lucene-Solr-8.1-Linux/lucene/build/demo/test/temp/junit4-J2-20190504_111537_3472920057988960707633.syserr
   [junit4] >>> JVM J2 emitted unexpected output (verbatim) ----
   [junit4] OpenJDK 64-Bit Server VM warning: Option UseConcMarkSweepGC was deprecated in version 9.0 and will likely be removed in a future release.
   [junit4] <<< JVM J2: EOF ----

   [junit4] JVM J0: stderr was not empty, see: /home/jenkins/workspace/Lucene-Solr-8.1-Linux/lucene/build/demo/test/temp/junit4-J0-20190504_111537_3471684277507015959649.syserr
   [junit4] >>> JVM J0 emitted unexpected output (verbatim) ----
   [junit4] OpenJDK 64-Bit Server VM warning: Option UseConcMarkSweepGC was deprecated in version 9.0 and will likely be removed in a future release.
   [junit4] <<< JVM J0: EOF ----

[...truncated 176 lines...]
   [junit4] JVM J2: stderr was not empty, see: /home/jenkins/workspace/Lucene-Solr-8.1-Linux/lucene/build/expressions/test/temp/junit4-J2-20190504_111540_9534544341158486516680.syserr
   [junit4] >>> JVM J2 emitted unexpected output (verbatim) ----
   [junit4] OpenJDK 64-Bit Server VM warning: Option UseConcMarkSweepGC was deprecated in version 9.0 and will likely be removed in a future release.
   [junit4] <<< JVM J2: EOF ----

   [junit4] JVM J0: stderr was not empty, see: /home/jenkins/workspace/Lucene-Solr-8.1-Linux/lucene/build/expressions/test/temp/junit4-J0-20190504_111540_9531186200143525938748.syserr
   [junit4] >>> JVM J0 emitted unexpected output (verbatim) ----
   [junit4] OpenJDK 64-Bit Server VM warning: Option UseConcMarkSweepGC was deprecated in version 9.0 and will likely be removed in a future release.
   [junit4] <<< JVM J0: EOF ----

[...truncated 3 lines...]
   [junit4] JVM J1: stderr was not empty, see: /home/jenkins/workspace/Lucene-Solr-8.1-Linux/lucene/build/expressions/test/temp/junit4-J1-20190504_111540_95314915410404071768309.syserr
   [junit4] >>> JVM J1 emitted unexpected output (verbatim) ----
   [junit4] OpenJDK 64-Bit Server VM warning: Option UseConcMarkSweepGC was deprecated in version 9.0 and will likely be removed in a future release.
   [junit4] <<< JVM J1: EOF ----

[...truncated 237 lines...]
   [junit4] JVM J1: stderr was not empty, see: /home/jenkins/workspace/Lucene-Solr-8.1-Linux/lucene/build/facet/test/temp/junit4-J1-20190504_111549_8187562625976431873575.syserr
   [junit4] >>> JVM J1 emitted unexpected output (verbatim) ----
   [junit4] OpenJDK 64-Bit Server VM warning: Option UseConcMarkSweepGC was deprecated in version 9.0 and will likely be removed in a future release.
   [junit4] <<< JVM J1: EOF ----

   [junit4] JVM J0: stderr was not empty, see: /home/jenkins/workspace/Lucene-Solr-8.1-Linux/lucene/build/facet/test/temp/junit4-J0-20190504_111549_81816985849686447888562.syserr
   [junit4] >>> JVM J0 emitted unexpected output (verbatim) ----
   [junit4] OpenJDK 64-Bit Server VM warning: Option UseConcMarkSweepGC was deprecated in version 9.0 and will likely be removed in a future release.
   [junit4] <<< JVM J0: EOF ----

[...truncated 3 lines...]
   [junit4] JVM J2: stderr was not empty, see: /home/jenkins/workspace/Lucene-Solr-8.1-Linux/lucene/build/facet/test/temp/junit4-J2-20190504_111549_8182294127247772143332.syserr
   [junit4] >>> JVM J2 emitted unexpected output (verbatim) ----
   [junit4] OpenJDK 64-Bit Server VM warning: Option UseConcMarkSweepGC was deprecated in version 9.0 and will likely be removed in a future release.
   [junit4] <<< JVM J2: EOF ----

[...truncated 185 lines...]
   [junit4] JVM J1: stderr was not empty, see: /home/jenkins/workspace/Lucene-Solr-8.1-Linux/lucene/build/grouping/test/temp/junit4-J1-20190504_111638_0221070773865811122065.syserr
   [junit4] >>> JVM J1 emitted unexpected output (verbatim) ----
   [junit4] OpenJDK 64-Bit Server VM warning: Option UseConcMarkSweepGC was deprecated in version 9.0 and will likely be removed in a future release.
   [junit4] <<< JVM J1: EOF ----

   [junit4] JVM J0: stderr was not empty, see: /home/jenkins/workspace/Lucene-Solr-8.1-Linux/lucene/build/grouping/test/temp/junit4-J0-20190504_111638_0221955966387478358653.syserr
   [junit4] >>> JVM J0 emitted unexpected output (verbatim) ----
   [junit4] OpenJDK 64-Bit Server VM warning: Option UseConcMarkSweepGC was deprecated in version 9.0 and will likely be removed in a future release.
   [junit4] <<< JVM J0: EOF ----

[...truncated 3 lines...]
   [junit4] JVM J2: stderr was not empty, see: /home/jenkins/workspace/Lucene-Solr-8.1-Linux/lucene/build/grouping/test/temp/junit4-J2-20190504_111638_02213148120505164548327.syserr
   [junit4] >>> JVM J2 emitted unexpected output (verbatim) ----
   [junit4] OpenJDK 64-Bit Server VM warning: Option UseConcMarkSweepGC was deprecated in version 9.0 and will likely be removed in a future release.
   [junit4] <<< JVM J2: EOF ----

[...truncated 255 lines...]
   [junit4] JVM J1: stderr was not empty, see: /home/jenkins/workspace/Lucene-Solr-8.1-Linux/lucene/build/highlighter/test/temp/junit4-J1-20190504_111655_04013504282402775152270.syserr
   [junit4] >>> JVM J1 emitted unexpected output (verbatim) ----
   [junit4] OpenJDK 64-Bit Server VM warning: Option UseConcMarkSweepGC was deprecated in version 9.0 and will likely be removed in a future release.
   [junit4] <<< JVM J1: EOF ----

   [junit4] JVM J0: stderr was not empty, see: /home/jenkins/workspace/Lucene-Solr-8.1-Linux/lucene/build/highlighter/test/temp/junit4-J0-20190504_111655_04013719290147527223614.syserr
   [junit4] >>> JVM J0 emitted unexpected output (verbatim) ----
   [junit4] OpenJDK 64-Bit Server VM warning: Option UseConcMarkSweepGC was deprecated in version 9.0 and will likely be removed in a future release.
   [junit4] <<< JVM J0: EOF ----

[...truncated 6 lines...]
   [junit4] JVM J2: stderr was not empty, see: /home/jenkins/workspace/Lucene-Solr-8.1-Linux/lucene/build/highlighter/test/temp/junit4-J2-20190504_111655_04010286483161576323072.syserr
   [junit4] >>> JVM J2 emitted unexpected output (verbatim) ----
   [junit4] OpenJDK 64-Bit Server VM warning: Option UseConcMarkSweepGC was deprecated in version 9.0 and will likely be removed in a future release.
   [junit4] <<< JVM J2: EOF ----

[...truncated 169 lines...]
   [junit4] JVM J1: stderr was not empty, see: /home/jenkins/workspace/Lucene-Solr-8.1-Linux/lucene/build/join/test/temp/junit4-J1-20190504_111714_035893825525206864417.syserr
   [junit4] >>> JVM J1 emitted unexpected output (verbatim) ----
   [junit4] OpenJDK 64-Bit Server VM warning: Option UseConcMarkSweepGC was deprecated in version 9.0 and will likely be removed in a future release.
   [junit4] <<< JVM J1: EOF ----

   [junit4] JVM J2: stderr was not empty, see: /home/jenkins/workspace/Lucene-Solr-8.1-Linux/lucene/build/join/test/temp/junit4-J2-20190504_111714_0358158813247877851490.syserr
   [junit4] >>> JVM J2 emitted unexpected output (verbatim) ----
   [junit4] OpenJDK 64-Bit Server VM warning: Option UseConcMarkSweepGC was deprecated in version 9.0 and will likely be removed in a future release.
   [junit4] <<< JVM J2: EOF ----

[...truncated 6 lines...]
   [junit4] JVM J0: stderr was not empty, see: /home/jenkins/workspace/Lucene-Solr-8.1-Linux/lucene/build/join/test/temp/junit4-J0-20190504_111714_0357747589723856207330.syserr
   [junit4] >>> JVM J0 emitted unexpected output (verbatim) ----
   [junit4] OpenJDK 64-Bit Server VM warning: Option UseConcMarkSweepGC was deprecated in version 9.0 and will likely be removed in a future release.
   [junit4] <<< JVM J0: EOF ----

[...truncated 306 lines...]
   [junit4] JVM J2: stderr was not empty, see: /home/jenkins/workspace/Lucene-Solr-8.1-Linux/lucene/build/luke/test/temp/junit4-J2-20190504_111743_9178764317021671280033.syserr
   [junit4] >>> JVM J2 emitted unexpected output (verbatim) ----
   [junit4] OpenJDK 64-Bit Server VM warning: Option UseConcMarkSweepGC was deprecated in version 9.0 and will likely be removed in a future release.
   [junit4] <<< JVM J2: EOF ----

   [junit4] JVM J1: stderr was not empty, see: /home/jenkins/workspace/Lucene-Solr-8.1-Linux/lucene/build/luke/test/temp/junit4-J1-20190504_111743_91717606283370675504801.syserr
   [junit4] >>> JVM J1 emitted unexpected output (verbatim) ----
   [junit4] OpenJDK 64-Bit Server VM warning: Option UseConcMarkSweepGC was deprecated in version 9.0 and will likely be removed in a future release.
   [junit4] <<< JVM J1: EOF ----

   [junit4] JVM J0: stderr was not empty, see: /home/jenkins/workspace/Lucene-Solr-8.1-Linux/lucene/build/luke/test/temp/junit4-J0-20190504_111743_9172875402711489445226.syserr
   [junit4] >>> JVM J0 emitted unexpected output (verbatim) ----
   [junit4] OpenJDK 64-Bit Server VM warning: Option UseConcMarkSweepGC was deprecated in version 9.0 and will likely be removed in a future release.
   [junit4] <<< JVM J0: EOF ----

[...truncated 157 lines...]
   [junit4] JVM J0: stderr was not empty, see: /home/jenkins/workspace/Lucene-Solr-8.1-Linux/lucene/build/memory/test/temp/junit4-J0-20190504_111749_7803578958919166099273.syserr
   [junit4] >>> JVM J0 emitted unexpected output (verbatim) ----
   [junit4] OpenJDK 64-Bit Server VM warning: Option UseConcMarkSweepGC was deprecated in version 9.0 and will likely be removed in a future release.
   [junit4] <<< JVM J0: EOF ----

[...truncated 3 lines...]
   [junit4] JVM J1: stderr was not empty, see: /home/jenkins/workspace/Lucene-Solr-8.1-Linux/lucene/build/memory/test/temp/junit4-J1-20190504_111749_7805206013844329344075.syserr
   [junit4] >>> JVM J1 emitted unexpected output (verbatim) ----
   [junit4] OpenJDK 64-Bit Server VM warning: Option UseConcMarkSweepGC was deprecated in version 9.0 and will likely be removed in a future release.
   [junit4] <<< JVM J1: EOF ----

[...truncated 188 lines...]
   [junit4] JVM J0: stderr was not empty, see: /home/jenkins/workspace/Lucene-Solr-8.1-Linux/lucene/build/misc/test/temp/junit4-J0-20190504_111800_8714348799577851290048.syserr
   [junit4] >>> JVM J0 emitted unexpected output (verbatim) ----
   [junit4] OpenJDK 64-Bit Server VM warning: Option UseConcMarkSweepGC was deprecated in version 9.0 and will likely be removed in a future release.
   [junit4] <<< JVM J0: EOF ----

   [junit4] JVM J2: stderr was not empty, see: /home/jenkins/workspace/Lucene-Solr-8.1-Linux/lucene/build/misc/test/temp/junit4-J2-20190504_111800_8714747860984891582190.syserr
   [junit4] >>> JVM J2 emitted unexpected output (verbatim) ----
   [junit4] OpenJDK 64-Bit Server VM warning: Option UseConcMarkSweepGC was deprecated in version 9.0 and will likely be removed in a future release.
   [junit4] <<< JVM J2: EOF ----

[...truncated 3 lines...]
   [junit4] JVM J1: stderr was not empty, see: /home/jenkins/workspace/Lucene-Solr-8.1-Linux/lucene/build/misc/test/temp/junit4-J1-20190504_111800_87118189897821382990988.syserr
   [junit4] >>> JVM J1 emitted unexpected output (verbatim) ----
   [junit4] OpenJDK 64-Bit Server VM warning: Option UseConcMarkSweepGC was deprecated in version 9.0 and will likely be removed in a future release.
   [junit4] <<< JVM J1: EOF ----

[...truncated 309 lines...]
   [junit4] JVM J0: stderr was not empty, see: /home/jenkins/workspace/Lucene-Solr-8.1-Linux/lucene/build/queries/test/temp/junit4-J0-20190504_111829_5845952415333824940146.syserr
   [junit4] >>> JVM J0 emitted unexpected output (verbatim) ----
   [junit4] OpenJDK 64-Bit Server VM warning: Option UseConcMarkSweepGC was deprecated in version 9.0 and will likely be removed in a future release.
   [junit4] <<< JVM J0: EOF ----

[...truncated 3 lines...]
   [junit4] JVM J1: stderr was not empty, see: /home/jenkins/workspace/Lucene-Solr-8.1-Linux/lucene/build/queries/test/temp/junit4-J1-20190504_111829_58413085575997112264550.syserr
   [junit4] >>> JVM J1 emitted unexpected output (verbatim) ----
   [junit4] OpenJDK 64-Bit Server VM warning: Option UseConcMarkSweepGC was deprecated in version 9.0 and will likely be removed in a future release.
   [junit4] <<< JVM J1: EOF ----

   [junit4] JVM J2: stderr was not empty, see: /home/jenkins/workspace/Lucene-Solr-8.1-Linux/lucene/build/queries/test/temp/junit4-J2-20190504_111829_5847850975039411911320.syserr
   [junit4] >>> JVM J2 emitted unexpected output (verbatim) ----
   [junit4] OpenJDK 64-Bit Server VM warning: Option UseConcMarkSweepGC was deprecated in version 9.0 and will likely be removed in a future release.
   [junit4] <<< JVM J2: EOF ----

[...truncated 231 lines...]
   [junit4] JVM J0: stderr was not empty, see: /home/jenkins/workspace/Lucene-Solr-8.1-Linux/lucene/build/queryparser/test/temp/junit4-J0-20190504_111838_4356043135698278744978.syserr
   [junit4] >>> JVM J0 emitted unexpected output (verbatim) ----
   [junit4] OpenJDK 64-Bit Server VM warning: Option UseConcMarkSweepGC was deprecated in version 9.0 and will likely be removed in a future release.
   [junit4] <<< JVM J0: EOF ----

[...truncated 3 lines...]
   [junit4] JVM J2: stderr was not empty, see: /home/jenkins/workspace/Lucene-Solr-8.1-Linux/lucene/build/queryparser/test/temp/junit4-J2-20190504_111838_43511471457947573158346.syserr
   [junit4] >>> JVM J2 emitted unexpected output (verbatim) ----
   [junit4] OpenJDK 64-Bit Server VM warning: Option UseConcMarkSweepGC was deprecated in version 9.0 and will likely be removed in a future release.
   [junit4] <<< JVM J2: EOF ----

[...truncated 3 lines...]
   [junit4] JVM J1: stderr was not empty, see: /home/jenkins/workspace/Lucene-Solr-8.1-Linux/lucene/build/queryparser/test/temp/junit4-J1-20190504_111838_4355427334656033744245.syserr
   [junit4] >>> JVM J1 emitted unexpected output (verbatim) ----
   [junit4] OpenJDK 64-Bit Server VM warning: Option UseConcMarkSweepGC was deprecated in version 9.0 and will likely be removed in a future release.
   [junit4] <<< JVM J1: EOF ----

[...truncated 216 lines...]
   [junit4] JVM J1: stderr was not empty, see: /home/jenkins/workspace/Lucene-Solr-8.1-Linux/lucene/build/replicator/test/temp/junit4-J1-20190504_111847_2785968927625376570464.syserr
   [junit4] >>> JVM J1 emitted unexpected output (verbatim) ----
   [junit4] OpenJDK 64-Bit Server VM warning: Option UseConcMarkSweepGC was deprecated in version 9.0 and will likely be removed in a future release.
   [junit4] <<< JVM J1: EOF ----

[...truncated 3 lines...]
   [junit4] JVM J2: stderr was not empty, see: /home/jenkins/workspace/Lucene-Solr-8.1-Linux/lucene/build/replicator/test/temp/junit4-J2-20190504_111847_278459699663446114170.syserr
   [junit4] >>> JVM J2 emitted unexpected output (verbatim) ----
   [junit4] OpenJDK 64-Bit Server VM warning: Option UseConcMarkSweepGC was deprecated in version 9.0 and will likely be removed in a future release.
   [junit4] <<< JVM J2: EOF ----

[...truncated 3 lines...]
   [junit4] JVM J0: stderr was not empty, see: /home/jenkins/workspace/Lucene-Solr-8.1-Linux/lucene/build/replicator/test/temp/junit4-J0-20190504_111847_27814228649713522257024.syserr
   [junit4] >>> JVM J0 emitted unexpected output (verbatim) ----
   [junit4] OpenJDK 64-Bit Server VM warning: Option UseConcMarkSweepGC was deprecated in version 9.0 and will likely be removed in a future release.
   [junit4] <<< JVM J0: EOF ----

[...truncated 250 lines...]
   [junit4] JVM J1: stderr was not empty, see: /home/jenkins/workspace/Lucene-Solr-8.1-Linux/lucene/build/sandbox/test/temp/junit4-J1-20190504_111901_60613931418984979977978.syserr
   [junit4] >>> JVM J1 emitted unexpected output (verbatim) ----
   [junit4] OpenJDK 64-Bit Server VM warning: Option UseConcMarkSweepGC was deprecated in version 9.0 and will likely be removed in a future release.
   [junit4] <<< JVM J1: EOF ----

[...truncated 3 lines...]
   [junit4] JVM J2: stderr was not empty, see: /home/jenkins/workspace/Lucene-Solr-8.1-Linux/lucene/build/sandbox/test/temp/junit4-J2-20190504_111901_6069352838558727465876.syserr
   [junit4] >>> JVM J2 emitted unexpected output (verbatim) ----
   [junit4] OpenJDK 64-Bit Server VM warning: Option UseConcMarkSweepGC was deprecated in version 9.0 and will likely be removed in a future release.
   [junit4] <<< JVM J2: EOF ----

[...truncated 3 lines...]
   [junit4] JVM J0: stderr was not empty, see: /home/jenkins/workspace/Lucene-Solr-8.1-Linux/lucene/build/sandbox/test/temp/junit4-J0-20190504_111901_606372596618910206232.syserr
   [junit4] >>> JVM J0 emitted unexpected output (verbatim) ----
   [junit4] OpenJDK 64-Bit Server VM warning: Option UseConcMarkSweepGC was deprecated in version 9.0 and will likely be removed in a future release.
   [junit4] <<< JVM J0: EOF ----

[...truncated 299 lines...]
   [junit4] JVM J0: stderr was not empty, see: /home/jenkins/workspace/Lucene-Solr-8.1-Linux/lucene/build/spatial-extras/test/temp/junit4-J0-20190504_112006_76716722278221511772138.syserr
   [junit4] >>> JVM J0 emitted unexpected output (verbatim) ----
   [junit4] OpenJDK 64-Bit Server VM warning: Option UseConcMarkSweepGC was deprecated in version 9.0 and will likely be removed in a future release.
   [junit4] <<< JVM J0: EOF ----

[...truncated 3 lines...]
   [junit4] JVM J2: stderr was not empty, see: /home/jenkins/workspace/Lucene-Solr-8.1-Linux/lucene/build/spatial-extras/test/temp/junit4-J2-20190504_112006_76713420321887702942332.syserr
   [junit4] >>> JVM J2 emitted unexpected output (verbatim) ----
   [junit4] OpenJDK 64-Bit Server VM warning: Option UseConcMarkSweepGC was deprecated in version 9.0 and will likely be removed in a future release.
   [junit4] <<< JVM J2: EOF ----

[...truncated 3 lines...]
   [junit4] JVM J1: stderr was not empty, see: /home/jenkins/workspace/Lucene-Solr-8.1-Linux/lucene/build/spatial-extras/test/temp/junit4-J1-20190504_112006_76714143580872148700488.syserr
   [junit4] >>> JVM J1 emitted unexpected output (verbatim) ----
   [junit4] OpenJDK 64-Bit Server VM warning: Option UseConcMarkSweepGC was deprecated in version 9.0 and will likely be removed in a future release.
   [junit4] <<< JVM J1: EOF ----

[...truncated 153 lines...]
   [junit4] JVM J0: stderr was not empty, see: /home/jenkins/workspace/Lucene-Solr-8.1-Linux/lucene/build/spatial/test/temp/junit4-J0-20190504_112034_52117806157356648267821.syserr
   [junit4] >>> JVM J0 emitted unexpected output (verbatim) ----
   [junit4] OpenJDK 64-Bit Server VM warning: Option UseConcMarkSweepGC was deprecated in version 9.0 and will likely be removed in a future release.
   [junit4] <<< JVM J0: EOF ----

[...truncated 184 lines...]
   [junit4] JVM J2: stderr was not empty, see: /home/jenkins/workspace/Lucene-Solr-8.1-Linux/lucene/build/spatial3d/test/temp/junit4-J2-20190504_112036_4903382229024757831468.syserr
   [junit4] >>> JVM J2 emitted unexpected output (verbatim) ----
   [junit4] OpenJDK 64-Bit Server VM warning: Option UseConcMarkSweepGC was deprecated in version 9.0 and will likely be removed in a future release.
   [junit4] <<< JVM J2: EOF ----

[...truncated 3 lines...]
   [junit4] JVM J1: stderr was not empty, see: /home/jenkins/workspace/Lucene-Solr-8.1-Linux/lucene/build/spatial3d/test/temp/junit4-J1-20190504_112036_49016113509810497651719.syserr
   [junit4] >>> JVM J1 emitted unexpected output (verbatim) ----
   [junit4] OpenJDK 64-Bit Server VM warning: Option UseConcMarkSweepGC was deprecated in version 9.0 and will likely be removed in a future release.
   [junit4] <<< JVM J1: EOF ----

[...truncated 6 lines...]
   [junit4] JVM J0: stderr was not empty, see: /home/jenkins/workspace/Lucene-Solr-8.1-Linux/lucene/build/spatial3d/test/temp/junit4-J0-20190504_112036_4904135511858300709310.syserr
   [junit4] >>> JVM J0 emitted unexpected output (verbatim) ----
   [junit4] OpenJDK 64-Bit Server VM warning: Option UseConcMarkSweepGC was deprecated in version 9.0 and will likely be removed in a future release.
   [junit4] <<< JVM J0: EOF ----

[...truncated 249 lines...]
   [junit4] JVM J2: stderr was not empty, see: /home/jenkins/workspace/Lucene-Solr-8.1-Linux/lucene/build/suggest/test/temp/junit4-J2-20190504_112204_5531284070672775597296.syserr
   [junit4] >>> JVM J2 emitted unexpected output (verbatim) ----
   [junit4] OpenJDK 64-Bit Server VM warning: Option UseConcMarkSweepGC was deprecated in version 9.0 and will likely be removed in a future release.
   [junit4] <<< JVM J2: EOF ----

[...truncated 6 lines...]
   [junit4] JVM J1: stderr was not empty, see: /home/jenkins/workspace/Lucene-Solr-8.1-Linux/lucene/build/suggest/test/temp/junit4-J1-20190504_112204_55317996874005755958941.syserr
   [junit4] >>> JVM J1 emitted unexpected output (verbatim) ----
   [junit4] OpenJDK 64-Bit Server VM warning: Option UseConcMarkSweepGC was deprecated in version 9.0 and will likely be removed in a future release.
   [junit4] <<< JVM J1: EOF ----

[...truncated 12 lines...]
   [junit4] JVM J0: stderr was not empty, see: /home/jenkins/workspace/Lucene-Solr-8.1-Linux/lucene/build/suggest/test/temp/junit4-J0-20190504_112204_55310496173492013407047.syserr
   [junit4] >>> JVM J0 emitted unexpected output (verbatim) ----
   [junit4] OpenJDK 64-Bit Server VM warning: Option UseConcMarkSweepGC was deprecated in version 9.0 and will likely be removed in a future release.
   [junit4] <<< JVM J0: EOF ----

[...truncated 1992 lines...]
   [junit4] Suite: org.apache.solr.cloud.OverseerRolesTest
   [junit4]   2> 218190 INFO  (SUITE-OverseerRolesTest-seed#[E799306D24F40484]-worker) [    ] o.a.s.SolrTestCaseJ4 SecureRandom sanity checks: test.solr.allowed.securerandom=null & java.security.egd=file:/dev/./urandom
   [junit4]   2> Creating dataDir: /home/jenkins/workspace/Lucene-Solr-8.1-Linux/solr/build/solr-core/test/J2/temp/solr.cloud.OverseerRolesTest_E799306D24F40484-001/init-core-data-001
   [junit4]   2> 218191 INFO  (SUITE-OverseerRolesTest-seed#[E799306D24F40484]-worker) [    ] o.a.s.SolrTestCaseJ4 Using PointFields (NUMERIC_POINTS_SYSPROP=true) w/NUMERIC_DOCVALUES_SYSPROP=true
   [junit4]   2> 218191 INFO  (SUITE-OverseerRolesTest-seed#[E799306D24F40484]-worker) [    ] o.a.s.SolrTestCaseJ4 Randomized ssl (false) and clientAuth (true) via: @org.apache.solr.util.RandomizeSSL(reason="", ssl=0.0/0.0, value=0.0/0.0, clientAuth=0.0/0.0)
   [junit4]   2> 218191 INFO  (SUITE-OverseerRolesTest-seed#[E799306D24F40484]-worker) [    ] o.a.s.c.MiniSolrCloudCluster Starting cluster of 6 servers in /home/jenkins/workspace/Lucene-Solr-8.1-Linux/solr/build/solr-core/test/J2/temp/solr.cloud.OverseerRolesTest_E799306D24F40484-001/tempDir-001
   [junit4]   2> 218191 INFO  (SUITE-OverseerRolesTest-seed#[E799306D24F40484]-worker) [    ] o.a.s.c.ZkTestServer STARTING ZK TEST SERVER
   [junit4]   2> 218192 INFO  (ZkTestServer Run Thread) [    ] o.a.s.c.ZkTestServer client port:0.0.0.0/0.0.0.0:0
   [junit4]   2> 218192 INFO  (ZkTestServer Run Thread) [    ] o.a.s.c.ZkTestServer Starting server
   [junit4]   2> 218292 INFO  (SUITE-OverseerRolesTest-seed#[E799306D24F40484]-worker) [    ] o.a.s.c.ZkTestServer start zk server on port:33855
   [junit4]   2> 218292 INFO  (SUITE-OverseerRolesTest-seed#[E799306D24F40484]-worker) [    ] o.a.s.c.ZkTestServer parse host and port list: 127.0.0.1:33855
   [junit4]   2> 218292 INFO  (SUITE-OverseerRolesTest-seed#[E799306D24F40484]-worker) [    ] o.a.s.c.ZkTestServer connecting to 127.0.0.1 33855
   [junit4]   2> 218294 INFO  (zkConnectionManagerCallback-6690-thread-1) [    ] o.a.s.c.c.ConnectionManager zkClient has connected
   [junit4]   2> 218295 INFO  (zkConnectionManagerCallback-6692-thread-1) [    ] o.a.s.c.c.ConnectionManager zkClient has connected
   [junit4]   2> 218296 INFO  (zkConnectionManagerCallback-6694-thread-1) [    ] o.a.s.c.c.ConnectionManager zkClient has connected
   [junit4]   2> 218297 WARN  (jetty-launcher-6695-thread-1) [    ] o.e.j.s.AbstractConnector Ignoring deprecated socket close linger time
   [junit4]   2> 218297 WARN  (jetty-launcher-6695-thread-2) [    ] o.e.j.s.AbstractConnector Ignoring deprecated socket close linger time
   [junit4]   2> 218297 WARN  (jetty-launcher-6695-thread-3) [    ] o.e.j.s.AbstractConnector Ignoring deprecated socket close linger time
   [junit4]   2> 218297 INFO  (jetty-launcher-6695-thread-2) [    ] o.a.s.c.s.e.JettySolrRunner Start Jetty (original configured port=0)
   [junit4]   2> 218297 INFO  (jetty-launcher-6695-thread-2) [    ] o.a.s.c.s.e.JettySolrRunner Trying to start Jetty on port 0 try number 1 ...
   [junit4]   2> 218298 INFO  (jetty-launcher-6695-thread-1) [    ] o.a.s.c.s.e.JettySolrRunner Start Jetty (original configured port=0)
   [junit4]   2> 218298 INFO  (jetty-launcher-6695-thread-1) [    ] o.a.s.c.s.e.JettySolrRunner Trying to start Jetty on port 0 try number 1 ...
   [junit4]   2> 218298 INFO  (jetty-launcher-6695-thread-2) [    ] o.e.j.s.Server jetty-9.4.14.v20181114; built: 2018-11-14T21:20:31.478Z; git: c4550056e785fb5665914545889f21dc136ad9e6; jvm 11.0.2+9
   [junit4]   2> 218298 INFO  (jetty-launcher-6695-thread-1) [    ] o.e.j.s.Server jetty-9.4.14.v20181114; built: 2018-11-14T21:20:31.478Z; git: c4550056e785fb5665914545889f21dc136ad9e6; jvm 11.0.2+9
   [junit4]   2> 218301 INFO  (jetty-launcher-6695-thread-3) [    ] o.a.s.c.s.e.JettySolrRunner Start Jetty (original configured port=0)
   [junit4]   2> 218301 INFO  (jetty-launcher-6695-thread-3) [    ] o.a.s.c.s.e.JettySolrRunner Trying to start Jetty on port 0 try number 1 ...
   [junit4]   2> 218301 INFO  (jetty-launcher-6695-thread-3) [    ] o.e.j.s.Server jetty-9.4.14.v20181114; built: 2018-11-14T21:20:31.478Z; git: c4550056e785fb5665914545889f21dc136ad9e6; jvm 11.0.2+9
   [junit4]   2> 218301 WARN  (jetty-launcher-6695-thread-4) [    ] o.e.j.s.AbstractConnector Ignoring deprecated socket close linger time
   [junit4]   2> 218302 INFO  (jetty-launcher-6695-thread-4) [    ] o.a.s.c.s.e.JettySolrRunner Start Jetty (original configured port=0)
   [junit4]   2> 218302 INFO  (jetty-launcher-6695-thread-4) [    ] o.a.s.c.s.e.JettySolrRunner Trying to start Jetty on port 0 try number 1 ...
   [junit4]   2> 218302 INFO  (jetty-launcher-6695-thread-4) [    ] o.e.j.s.Server jetty-9.4.14.v20181114; built: 2018-11-14T21:20:31.478Z; git: c4550056e785fb5665914545889f21dc136ad9e6; jvm 11.0.2+9
   [junit4]   2> 218304 WARN  (jetty-launcher-6695-thread-5) [    ] o.e.j.s.AbstractConnector Ignoring deprecated socket close linger time
   [junit4]   2> 218305 WARN  (jetty-launcher-6695-thread-6) [    ] o.e.j.s.AbstractConnector Ignoring deprecated socket close linger time
   [junit4]   2> 218305 INFO  (jetty-launcher-6695-thread-5) [    ] o.a.s.c.s.e.JettySolrRunner Start Jetty (original configured port=0)
   [junit4]   2> 218305 INFO  (jetty-launcher-6695-thread-5) [    ] o.a.s.c.s.e.JettySolrRunner Trying to start Jetty on port 0 try number 1 ...
   [junit4]   2> 218305 INFO  (jetty-launcher-6695-thread-5) [    ] o.e.j.s.Server jetty-9.4.14.v20181114; built: 2018-11-14T21:20:31.478Z; git: c4550056e785fb5665914545889f21dc136ad9e6; jvm 11.0.2+9
   [junit4]   2> 218305 INFO  (jetty-launcher-6695-thread-6) [    ] o.a.s.c.s.e.JettySolrRunner Start Jetty (original configured port=0)
   [junit4]   2> 218305 INFO  (jetty-launcher-6695-thread-6) [    ] o.a.s.c.s.e.JettySolrRunner Trying to start Jetty on port 0 try number 1 ...
   [junit4]   2> 218305 INFO  (jetty-launcher-6695-thread-2) [    ] o.e.j.s.session DefaultSessionIdManager workerName=node0
   [junit4]   2> 218305 INFO  (jetty-launcher-6695-thread-2) [    ] o.e.j.s.session No SessionScavenger set, using defaults
   [junit4]   2> 218305 INFO  (jetty-launcher-6695-thread-6) [    ] o.e.j.s.Server jetty-9.4.14.v20181114; built: 2018-11-14T21:20:31.478Z; git: c4550056e785fb5665914545889f21dc136ad9e6; jvm 11.0.2+9
   [junit4]   2> 218305 INFO  (jetty-launcher-6695-thread-2) [    ] o.e.j.s.session node0 Scavenging every 600000ms
   [junit4]   2> 218305 INFO  (jetty-launcher-6695-thread-2) [    ] o.e.j.s.h.ContextHandler Started o.e.j.s.ServletContextHandler@63f0f0ad{/solr,null,AVAILABLE}
   [junit4]   2> 218306 INFO  (jetty-launcher-6695-thread-2) [    ] o.e.j.s.AbstractConnector Started ServerConnector@5520d00f{HTTP/1.1,[http/1.1, h2c]}{127.0.0.1:40013}
   [junit4]   2> 218306 INFO  (jetty-launcher-6695-thread-2) [    ] o.e.j.s.Server Started @218327ms
   [junit4]   2> 218306 INFO  (jetty-launcher-6695-thread-2) [    ] o.a.s.c.s.e.JettySolrRunner Jetty properties: {hostContext=/solr, hostPort=40013}
   [junit4]   2> 218306 ERROR (jetty-launcher-6695-thread-2) [    ] o.a.s.u.StartupLoggingUtils Missing Java Option solr.log.dir. Logging may be missing or incomplete.
   [junit4]   2> 218306 INFO  (jetty-launcher-6695-thread-2) [    ] o.a.s.s.SolrDispatchFilter Using logger factory org.apache.logging.slf4j.Log4jLoggerFactory
   [junit4]   2> 218306 INFO  (jetty-launcher-6695-thread-2) [    ] o.a.s.s.SolrDispatchFilter  ___      _       Welcome to Apache Solr? version 8.1.0
   [junit4]   2> 218306 INFO  (jetty-launcher-6695-thread-2) [    ] o.a.s.s.SolrDispatchFilter / __| ___| |_ _   Starting in cloud mode on port null
   [junit4]   2> 218306 INFO  (jetty-launcher-6695-thread-2) [    ] o.a.s.s.SolrDispatchFilter \__ \/ _ \ | '_|  Install dir: null
   [junit4]   2> 218306 INFO  (jetty-launcher-6695-thread-2) [    ] o.a.s.s.SolrDispatchFilter |___/\___/_|_|    Start time: 2019-05-04T11:27:01.036432Z
   [junit4]   2> 218312 INFO  (jetty-launcher-6695-thread-4) [    ] o.e.j.s.session DefaultSessionIdManager workerName=node0
   [junit4]   2> 218312 INFO  (jetty-launcher-6695-thread-4) [    ] o.e.j.s.session No SessionScavenger set, using defaults
   [junit4]   2> 218312 INFO  (jetty-launcher-6695-thread-4) [    ] o.e.j.s.session node0 Scavenging every 660000ms
   [junit4]   2> 218313 INFO  (jetty-launcher-6695-thread-4) [    ] o.e.j.s.h.ContextHandler Started o.e.j.s.ServletContextHandler@5f790975{/solr,null,AVAILABLE}
   [junit4]   2> 218313 INFO  (jetty-launcher-6695-thread-3) [    ] o.e.j.s.session DefaultSessionIdManager workerName=node0
   [junit4]   2> 218313 INFO  (jetty-launcher-6695-thread-3) [    ] o.e.j.s.session No SessionScavenger set, using defaults
   [junit4]   2> 218313 INFO  (jetty-launcher-6695-thread-3) [    ] o.e.j.s.session node0 Scavenging every 600000ms
   [junit4]   2> 218313 INFO  (jetty-launcher-6695-thread-4) [    ] o.e.j.s.AbstractConnector Started ServerConnector@40ea423c{HTTP/1.1,[http/1.1, h2c]}{127.0.0.1:42301}
   [junit4]   2> 218313 INFO  (jetty-launcher-6695-thread-4) [    ] o.e.j.s.Server Started @218335ms
   [junit4]   2> 218313 INFO  (jetty-launcher-6695-thread-4) [    ] o.a.s.c.s.e.JettySolrRunner Jetty properties: {hostContext=/solr, hostPort=42301}
   [junit4]   2> 218313 INFO  (jetty-launcher-6695-thread-5) [    ] o.e.j.s.session DefaultSessionIdManager workerName=node0
   [junit4]   2> 218313 INFO  (jetty-launcher-6695-thread-5) [    ] o.e.j.s.session No SessionScavenger set, using defaults
   [junit4]   2> 218313 INFO  (jetty-launcher-6695-thread-5) [    ] o.e.j.s.session node0 Scavenging every 600000ms
   [junit4]   2> 218313 INFO  (jetty-launcher-6695-thread-3) [    ] o.e.j.s.h.ContextHandler Started o.e.j.s.ServletContextHandler@2cb242b5{/solr,null,AVAILABLE}
   [junit4]   2> 218313 INFO  (zkConnectionManagerCallback-6697-thread-1) [    ] o.a.s.c.c.ConnectionManager zkClient has connected
   [junit4]   2> 218313 ERROR (jetty-launcher-6695-thread-4) [    ] o.a.s.u.StartupLoggingUtils Missing Java Option solr.log.dir. Logging may be missing or incomplete.
   [junit4]   2> 218313 INFO  (jetty-launcher-6695-thread-4) [    ] o.a.s.s.SolrDispatchFilter Using logger factory org.apache.logging.slf4j.Log4jLoggerFactory
   [junit4]   2> 218313 INFO  (jetty-launcher-6695-thread-4) [    ] o.a.s.s.SolrDispatchFilter  ___      _       Welcome to Apache Solr? version 8.1.0
   [junit4]   2> 218313 INFO  (jetty-launcher-6695-thread-4) [    ] o.a.s.s.SolrDispatchFilter / __| ___| |_ _   Starting in cloud mode on port null
   [junit4]   2> 218313 INFO  (jetty-launcher-6695-thread-4) [    ] o.a.s.s.SolrDispatchFilter \__ \/ _ \ | '_|  Install dir: null
   [junit4]   2> 218313 INFO  (jetty-launcher-6695-thread-4) [    ] o.a.s.s.SolrDispatchFilter |___/\___/_|_|    Start time: 2019-05-04T11:27:01.043829Z
   [junit4]   2> 218313 INFO  (jetty-launcher-6695-thread-6) [    ] o.e.j.s.session DefaultSessionIdManager workerName=node0
   [junit4]   2> 218313 INFO  (jetty-launcher-6695-thread-6) [    ] o.e.j.s.session No SessionScavenger set, using defaults
   [junit4]   2> 218313 INFO  (jetty-launcher-6695-thread-6) [    ] o.e.j.s.session node0 Scavenging every 600000ms
   [junit4]   2> 218313 INFO  (jetty-launcher-6695-thread-5) [    ] o.e.j.s.h.ContextHandler Started o.e.j.s.ServletContextHandler@658e3037{/solr,null,AVAILABLE}
   [junit4]   2> 218313 INFO  (jetty-launcher-6695-thread-2) [    ] o.a.s.s.SolrDispatchFilter solr.xml found in ZooKeeper. Loading...
   [junit4]   2> 218314 INFO  (jetty-launcher-6695-thread-1) [    ] o.e.j.s.session DefaultSessionIdManager workerName=node0
   [junit4]   2> 218314 INFO  (jetty-launcher-6695-thread-1) [    ] o.e.j.s.session No SessionScavenger set, using defaults
   [junit4]   2> 218314 INFO  (jetty-launcher-6695-thread-1) [    ] o.e.j.s.session node0 Scavenging every 660000ms
   [junit4]   2> 218314 INFO  (jetty-launcher-6695-thread-3) [    ] o.e.j.s.AbstractConnector Started ServerConnector@495c1a20{HTTP/1.1,[http/1.1, h2c]}{127.0.0.1:45745}
   [junit4]   2> 218314 INFO  (jetty-launcher-6695-thread-3) [    ] o.e.j.s.Server Started @218335ms
   [junit4]   2> 218314 INFO  (jetty-launcher-6695-thread-5) [    ] o.e.j.s.AbstractConnector Started ServerConnector@5ddf7d8d{HTTP/1.1,[http/1.1, h2c]}{127.0.0.1:39337}
   [junit4]   2> 218314 INFO  (jetty-launcher-6695-thread-5) [    ] o.e.j.s.Server Started @218335ms
   [junit4]   2> 218314 INFO  (jetty-launcher-6695-thread-3) [    ] o.a.s.c.s.e.JettySolrRunner Jetty properties: {hostContext=/solr, hostPort=45745}
   [junit4]   2> 218314 INFO  (jetty-launcher-6695-thread-5) [    ] o.a.s.c.s.e.JettySolrRunner Jetty properties: {hostContext=/solr, hostPort=39337}
   [junit4]   2> 218314 ERROR (jetty-launcher-6695-thread-3) [    ] o.a.s.u.StartupLoggingUtils Missing Java Option solr.log.dir. Logging may be missing or incomplete.
   [junit4]   2> 218314 INFO  (jetty-launcher-6695-thread-3) [    ] o.a.s.s.SolrDispatchFilter Using logger factory org.apache.logging.slf4j.Log4jLoggerFactory
   [junit4]   2> 218314 ERROR (jetty-launcher-6695-thread-5) [    ] o.a.s.u.StartupLoggingUtils Missing Java Option solr.log.dir. Logging may be missing or incomplete.
   [junit4]   2> 218314 INFO  (jetty-launcher-6695-thread-5) [    ] o.a.s.s.SolrDispatchFilter Using logger factory org.apache.logging.slf4j.Log4jLoggerFactory
   [junit4]   2> 218314 INFO  (jetty-launcher-6695-thread-3) [    ] o.a.s.s.SolrDispatchFilter  ___      _       Welcome to Apache Solr? version 8.1.0
   [junit4]   2> 218314 INFO  (jetty-launcher-6695-thread-3) [    ] o.a.s.s.SolrDispatchFilter / __| ___| |_ _   Starting in cloud mode on port null
   [junit4]   2> 218314 INFO  (jetty-launcher-6695-thread-5) [    ] o.a.s.s.SolrDispatchFilter  ___      _       Welcome to Apache Solr? version 8.1.0
   [junit4]   2> 218314 INFO  (jetty-launcher-6695-thread-3) [    ] o.a.s.s.SolrDispatchFilter \__ \/ _ \ | '_|  Install dir: null
   [junit4]   2> 218314 INFO  (jetty-launcher-6695-thread-5) [    ] o.a.s.s.SolrDispatchFilter / __| ___| |_ _   Starting in cloud mode on port null
   [junit4]   2> 218314 INFO  (jetty-launcher-6695-thread-5) [    ] o.a.s.s.SolrDispatchFilter \__ \/ _ \ | '_|  Install dir: null
   [junit4]   2> 218314 INFO  (jetty-launcher-6695-thread-3) [    ] o.a.s.s.SolrDispatchFilter |___/\___/_|_|    Start time: 2019-05-04T11:27:01.044519Z
   [junit4]   2> 218314 INFO  (jetty-launcher-6695-thread-5) [    ] o.a.s.s.SolrDispatchFilter |___/\___/_|_|    Start time: 2019-05-04T11:27:01.044545Z
   [junit4]   2> 218318 INFO  (jetty-launcher-6695-thread-6) [    ] o.e.j.s.h.ContextHandler Started o.e.j.s.ServletContextHandler@51f82a63{/solr,null,AVAILABLE}
   [junit4]   2> 218318 INFO  (jetty-launcher-6695-thread-6) [    ] o.e.j.s.AbstractConnector Started ServerConnector@a331230{HTTP/1.1,[http/1.1, h2c]}{127.0.0.1:34671}
   [junit4]   2> 218318 INFO  (jetty-launcher-6695-thread-6) [    ] o.e.j.s.Server Started @218340ms
   [junit4]   2> 218318 INFO  (jetty-launcher-6695-thread-6) [    ] o.a.s.c.s.e.JettySolrRunner Jetty properties: {hostContext=/solr, hostPort=34671}
   [junit4]   2> 218318 ERROR (jetty-launcher-6695-thread-6) [    ] o.a.s.u.StartupLoggingUtils Missing Java Option solr.log.dir. Logging may be missing or incomplete.
   [junit4]   2> 218318 INFO  (jetty-launcher-6695-thread-6) [    ] o.a.s.s.SolrDispatchFilter Using logger factory org.apache.logging.slf4j.Log4jLoggerFactory
   [junit4]   2> 218318 INFO  (jetty-launcher-6695-thread-6) [    ] o.a.s.s.SolrDispatchFilter  ___      _       Welcome to Apache Solr? version 8.1.0
   [junit4]   2> 218318 INFO  (jetty-launcher-6695-thread-6) [    ] o.a.s.s.SolrDispatchFilter / __| ___| |_ _   Starting in cloud mode on port null
   [junit4]   2> 218318 INFO  (jetty-launcher-6695-thread-6) [    ] o.a.s.s.SolrDispatchFilter \__ \/ _ \ | '_|  Install dir: null
   [junit4]   2> 218318 INFO  (jetty-launcher-6695-thread-6) [    ] o.a.s.s.SolrDispatchFilter |___/\___/_|_|    Start time: 2019-05-04T11:27:01.048799Z
   [junit4]   2> 218321 INFO  (zkConnectionManagerCallback-6701-thread-1) [    ] o.a.s.c.c.ConnectionManager zkClient has connected
   [junit4]   2> 218322 INFO  (jetty-launcher-6695-thread-5) [    ] o.a.s.s.SolrDispatchFilter solr.xml found in ZooKeeper. Loading...
   [junit4]   2> 218330 INFO  (zkConnectionManagerCallback-6699-thread-1) [    ] o.a.s.c.c.ConnectionManager zkClient has connected
   [junit4]   2> 218330 INFO  (jetty-launcher-6695-thread-4) [    ] o.a.s.s.SolrDispatchFilter solr.xml found in ZooKeeper. Loading...
   [junit4]   2> 218330 INFO  (jetty-launcher-6695-thread-1) [    ] o.e.j.s.h.ContextHandler Started o.e.j.s.ServletContextHandler@7ed38e41{/solr,null,AVAILABLE}
   [junit4]   2> 218331 INFO  (jetty-launcher-6695-thread-1) [    ] o.e.j.s.AbstractConnector Started ServerConnector@58ebc3e3{HTTP/1.1,[http/1.1, h2c]}{127.0.0.1:44767}
   [junit4]   2> 218331 INFO  (jetty-launcher-6695-thread-1) [    ] o.e.j.s.Server Started @218353ms
   [junit4]   2> 218331 INFO  (zkConnectionManagerCallback-6706-thread-1) [    ] o.a.s.c.c.ConnectionManager zkClient has connected
   [junit4]   2> 218331 INFO  (jetty-launcher-6695-thread-1) [    ] o.a.s.c.s.e.JettySolrRunner Jetty properties: {hostContext=/solr, hostPort=44767}
   [junit4]   2> 218331 ERROR (jetty-launcher-6695-thread-1) [    ] o.a.s.u.StartupLoggingUtils Missing Java Option solr.log.dir. Logging may be missing or incomplete.
   [junit4]   2> 218331 INFO  (jetty-launcher-6695-thread-1) [    ] o.a.s.s.SolrDispatchFilter Using logger factory org.apache.logging.slf4j.Log4jLoggerFactory
   [junit4]   2> 218331 INFO  (jetty-launcher-6695-thread-1) [    ] o.a.s.s.SolrDispatchFilter  ___      _       Welcome to Apache Solr? version 8.1.0
   [junit4]   2> 218331 INFO  (jetty-launcher-6695-thread-1) [    ] o.a.s.s.SolrDispatchFilter / __| ___| |_ _   Starting in cloud mode on port null
   [junit4]   2> 218331 INFO  (jetty-launcher-6695-thread-1) [    ] o.a.s.s.SolrDispatchFilter \__ \/ _ \ | '_|  Install dir: null
   [junit4]   2> 218331 INFO  (jetty-launcher-6695-thread-1) [    ] o.a.s.s.SolrDispatchFilter |___/\___/_|_|    Start time: 2019-05-04T11:27:01.061870Z
   [junit4]   2> 218333 WARN  (NIOServerCxn.Factory:0.0.0.0/0.0.0.0:0) [    ] o.a.z.s.NIOServerCnxn Unable to read additional data from client sessionid 0x1007b0ea09f0004, likely client has closed socket
   [junit4]   2> 218334 INFO  (zkConnectionManagerCallback-6708-thread-1) [    ] o.a.s.c.c.ConnectionManager zkClient has connected
   [junit4]   2> 218337 INFO  (jetty-launcher-6695-thread-6) [    ] o.a.s.s.SolrDispatchFilter solr.xml found in ZooKeeper. Loading...
   [junit4]   2> 218338 INFO  (zkConnectionManagerCallback-6703-thread-1) [    ] o.a.s.c.c.ConnectionManager zkClient has connected
   [junit4]   2> 218338 INFO  (jetty-launcher-6695-thread-1) [    ] o.a.s.s.SolrDispatchFilter solr.xml found in ZooKeeper. Loading...
   [junit4]   2> 218338 INFO  (jetty-launcher-6695-thread-3) [    ] o.a.s.s.SolrDispatchFilter solr.xml found in ZooKeeper. Loading...
   [junit4]   2> 218386 INFO  (jetty-launcher-6695-thread-3) [    ] o.a.s.h.c.HttpShardHandlerFactory Host whitelist initialized: WhitelistHostChecker [whitelistHosts=null, whitelistHostCheckingEnabled=true]
   [junit4]   2> 218394 WARN  (jetty-launcher-6695-thread-3) [    ] o.e.j.u.s.S.config No Client EndPointIdentificationAlgorithm configured for SslContextFactory@15a6d58e[provider=null,keyStore=null,trustStore=null]
   [junit4]   2> 218397 WARN  (jetty-launcher-6695-thread-3) [    ] o.e.j.u.s.S.config No Client EndPointIdentificationAlgorithm configured for SslContextFactory@2d1b9bf7[provider=null,keyStore=null,trustStore=null]
   [junit4]   2> 218398 INFO  (jetty-launcher-6695-thread-3) [    ] o.a.s.c.ZkContainer Zookeeper client=127.0.0.1:33855/solr
   [junit4]   2> 218409 INFO  (jetty-launcher-6695-thread-2) [    ] o.a.s.h.c.HttpShardHandlerFactory Host whitelist initialized: WhitelistHostChecker [whitelistHosts=null, whitelistHostCheckingEnabled=true]
   [junit4]   2> 218413 INFO  (zkConnectionManagerCallback-6719-thread-1) [    ] o.a.s.c.c.ConnectionManager zkClient has connected
   [junit4]   2> 218413 WARN  (jetty-launcher-6695-thread-2) [    ] o.e.j.u.s.S.config No Client EndPointIdentificationAlgorithm configured for SslContextFactory@52e7bf8d[provider=null,keyStore=null,trustStore=null]
   [junit4]   2> 218416 INFO  (jetty-launcher-6695-thread-6) [    ] o.a.s.h.c.HttpShardHandlerFactory Host whitelist initialized: WhitelistHostChecker [whitelistHosts=null, whitelistHostCheckingEnabled=true]
   [junit4]   2> 218418 INFO  (zkConnectionManagerCallback-6722-thread-1) [    ] o.a.s.c.c.ConnectionManager zkClient has connected
   [junit4]   2> 218418 WARN  (jetty-launcher-6695-thread-6) [    ] o.e.j.u.s.S.config No Client EndPointIdentificationAlgorithm configured for SslContextFactory@1eb1eb33[provider=null,keyStore=null,trustStore=null]
   [junit4]   2> 218422 WARN  (jetty-launcher-6695-thread-2) [    ] o.e.j.u.s.S.config No Client EndPointIdentificationAlgorithm configured for SslContextFactory@7c990af3[provider=null,keyStore=null,trustStore=null]
   [junit4]   2> 218426 INFO  (jetty-launcher-6695-thread-2) [    ] o.a.s.c.ZkContainer Zookeeper client=127.0.0.1:33855/solr
   [junit4]   2> 218430 WARN  (jetty-launcher-6695-thread-6) [    ] o.e.j.u.s.S.config No Client EndPointIdentificationAlgorithm configured for SslContextFactory@59a7fc97[provider=null,keyStore=null,trustStore=null]
   [junit4]   2> 218431 INFO  (jetty-launcher-6695-thread-6) [    ] o.a.s.c.ZkContainer Zookeeper client=127.0.0.1:33855/solr
   [junit4]   2> 218445 INFO  (zkConnectionManagerCallback-6732-thread-1) [    ] o.a.s.c.c.ConnectionManager zkClient has connected
   [junit4]   2> 218448 INFO  (jetty-launcher-6695-thread-3) [n:127.0.0.1:45745_solr    ] o.a.s.c.OverseerElectionContext I am going to be the leader 127.0.0.1:45745_solr
   [junit4]   2> 218448 INFO  (jetty-launcher-6695-thread-3) [n:127.0.0.1:45745_solr    ] o.a.s.c.Overseer Overseer (id=72192896792461322-127.0.0.1:45745_solr-n_0000000000) starting
   [junit4]   2> 218461 INFO  (zkConnectionManagerCallback-6735-thread-1) [    ] o.a.s.c.c.ConnectionManager zkClient has connected
   [junit4]   2> 218465 INFO  (zkConnectionManagerCallback-6742-thread-1) [    ] o.a.s.c.c.ConnectionManager zkClient has connected
   [junit4]   2> 218465 INFO  (zkConnectionManagerCallback-6737-thread-1) [    ] o.a.s.c.c.ConnectionManager zkClient has connected
   [junit4]   2> 218466 INFO  (jetty-launcher-6695-thread-3) [n:127.0.0.1:45745_solr    ] o.a.s.c.s.i.ZkClientClusterStateProvider Cluster at 127.0.0.1:33855/solr ready
   [junit4]   2> 218468 INFO  (jetty-launcher-6695-thread-2) [n:127.0.0.1:40013_solr    ] o.a.s.c.ZkController Register node as live in ZooKeeper:/live_nodes/127.0.0.1:40013_solr
   [junit4]   2> 218478 INFO  (zkConnectionManagerCallback-6744-thread-1) [    ] o.a.s.c.c.ConnectionManager zkClient has connected
   [junit4]   2> 218478 INFO  (zkCallback-6721-thread-1) [    ] o.a.s.c.c.ZkStateReader Updated live nodes from ZooKeeper... (0) -> (1)
   [junit4]   2> 218478 INFO  (OverseerStateUpdate-72192896792461322-127.0.0.1:45745_solr-n_0000000000) [n:127.0.0.1:45745_solr    ] o.a.s.c.Overseer Starting to work on the main queue : 127.0.0.1:45745_solr
   [junit4]   2> 218480 INFO  (jetty-launcher-6695-thread-6) [n:127.0.0.1:34671_solr    ] o.a.s.c.c.ZkStateReader Updated live nodes from ZooKeeper... (0) -> (1)
   [junit4]   2> 218480 INFO  (zkCallback-6741-thread-1) [    ] o.a.s.c.c.ZkStateReader Updated live nodes from ZooKeeper... (0) -> (1)
   [junit4]   2> 218481 INFO  (zkCallback-6736-thread-1) [    ] o.a.s.c.c.ZkStateReader Updated live nodes from ZooKeeper... (0) -> (1)
   [junit4]   2> 218482 INFO  (jetty-launcher-6695-thread-6) [n:127.0.0.1:34671_solr    ] o.a.s.c.ZkController Publish node=127.0.0.1:34671_solr as DOWN
   [junit4]   2> 218483 INFO  (jetty-launcher-6695-thread-6) [n:127.0.0.1:34671_solr    ] o.a.s.c.TransientSolrCoreCacheDefault Allocating transient cache for 2147483647 transient cores
   [junit4]   2> 218483 INFO  (jetty-launcher-6695-thread-6) [n:127.0.0.1:34671_solr    ] o.a.s.c.ZkController Register node as live in ZooKeeper:/live_nodes/127.0.0.1:34671_solr
   [junit4]   2> 218483 INFO  (zkCallback-6736-thread-1) [    ] o.a.s.c.c.ZkStateReader Updated live nodes from ZooKeeper... (1) -> (2)
   [junit4]   2> 218483 INFO  (zkCallback-6721-thread-1) [    ] o.a.s.c.c.ZkStateReader Updated live nodes from ZooKeeper... (1) -> (2)
   [junit4]   2> 218483 INFO  (zkCallback-6741-thread-1) [    ] o.a.s.c.c.ZkStateReader Updated live nodes from ZooKeeper... (1) -> (2)
   [junit4]   2> 218484 INFO  (jetty-launcher-6695-thread-1) [    ] o.a.s.h.c.HttpShardHandlerFactory Host whitelist initialized: WhitelistHostChecker [whitelistHosts=null, whitelistHostCheckingEnabled=true]
   [junit4]   2> 218485 INFO  (jetty-launcher-6695-thread-3) [n:127.0.0.1:45745_solr    ] o.a.s.c.ZkController Publish node=127.0.0.1:45745_solr as DOWN
   [junit4]   2> 218486 INFO  (jetty-launcher-6695-thread-3) [n:127.0.0.1:45745_solr    ] o.a.s.c.TransientSolrCoreCacheDefault Allocating transient cache for 2147483647 transient cores
   [junit4]   2> 218486 INFO  (jetty-launcher-6695-thread-3) [n:127.0.0.1:45745_solr    ] o.a.s.c.ZkController Register node as live in ZooKeeper:/live_nodes/127.0.0.1:45745_solr
   [junit4]   2> 218486 INFO  (zkCallback-6736-thread-1) [    ] o.a.s.c.c.ZkStateReader Updated live nodes from ZooKeeper... (2) -> (3)
   [junit4]   2> 218486 INFO  (zkCallback-6721-thread-1) [    ] o.a.s.c.c.ZkStateReader Updated live nodes from ZooKeeper... (2) -> (3)
   [junit4]   2> 218486 INFO  (zkCallback-6741-thread-1) [    ] o.a.s.c.c.ZkStateReader Updated live nodes from ZooKeeper... (2) -> (3)
   [junit4]   2> 218489 INFO  (zkCallback-6743-thread-1) [    ] o.a.s.c.c.ZkStateReader Updated live nodes from ZooKeeper... (1) -> (3)
   [junit4]   2> 218490 WARN  (jetty-launcher-6695-thread-1) [    ] o.e.j.u.s.S.config No Client EndPointIdentificationAlgorithm configured for SslContextFactory@3d714980[provider=null,keyStore=null,trustStore=null]
   [junit4]   2> 218501 INFO  (zkConnectionManagerCallback-6760-thread-1) [    ] o.a.s.c.c.ConnectionManager zkClient has connected
   [junit4]   2> 218501 INFO  (jetty-launcher-6695-thread-4) [    ] o.a.s.h.c.HttpShardHandlerFactory Host whitelist initialized: WhitelistHostChecker [whitelistHosts=null, whitelistHostCheckingEnabled=true]
   [junit4]   2> 218501 INFO  (zkConnectionManagerCallback-6753-thread-1) [    ] o.a.s.c.c.ConnectionManager zkClient has connected
   [junit4]   2> 218502 INFO  (jetty-launcher-6695-thread-6) [n:127.0.0.1:34671_solr    ] o.a.s.c.c.ZkStateReader Updated live nodes from ZooKeeper... (0) -> (3)
   [junit4]   2> 218502 INFO  (jetty-launcher-6695-thread-2) [n:127.0.0.1:40013_solr    ] o.a.s.c.c.ZkStateReader Updated live nodes from ZooKeeper... (0) -> (3)
   [junit4]   2> 218502 INFO  (jetty-launcher-6695-thread-6) [n:127.0.0.1:34671_solr    ] o.a.s.c.s.i.ZkClientClusterStateProvider Cluster at 127.0.0.1:33855/solr ready
   [junit4]   2> 218503 INFO  (jetty-launcher-6695-thread-2) [n:127.0.0.1:40013_solr    ] o.a.s.c.s.i.ZkClientClusterStateProvider Cluster at 127.0.0.1:33855/solr ready
   [junit4]   2> 218512 INFO  (jetty-launcher-6695-thread-5) [    ] o.a.s.h.c.HttpShardHandlerFactory Host whitelist initialized: WhitelistHostChecker [whitelistHosts=null, whitelistHostCheckingEnabled=true]
   [junit4]   2> 218513 WARN  (jetty-launcher-6695-thread-5) [    ] o.e.j.u.s.S.config No Client EndPointIdentificationAlgorithm configured for SslContextFactory@caf63a7[provider=null,keyStore=null,trustStore=null]
   [junit4]   2> 218514 INFO  (jetty-launcher-6695-thread-6) [n:127.0.0.1:34671_solr    ] o.a.s.h.a.MetricsHistoryHandler No .system collection, keeping metrics history in memory.
   [junit4]   2> 218514 INFO  (jetty-launcher-6695-thread-2) [n:127.0.0.1:40013_solr    ] o.a.s.h.a.MetricsHistoryHandler No .system collection, keeping metrics history in memory.
   [junit4]   2> 218514 INFO  (jetty-launcher-6695-thread-3) [n:127.0.0.1:45745_solr    ] o.a.s.h.a.MetricsHistoryHandler No .system collection, keeping metrics history in memory.
   [junit4]   2> 218514 WARN  (jetty-launcher-6695-thread-4) [    ] o.e.j.u.s.S.config No Client EndPointIdentificationAlgorithm configured for SslContextFactory@10ec6d63[provider=null,keyStore=null,trustStore=null]
   [junit4]   2> 218515 WARN  (jetty-launcher-6695-thread-1) [    ] o.e.j.u.s.S.config No Client EndPointIdentificationAlgorithm configured for SslContextFactory@20437012[provider=null,keyStore=null,trustStore=null]
   [junit4]   2> 218515 WARN  (jetty-launcher-6695-thread-5) [    ] o.e.j.u.s.S.config No Client EndPointIdentificationAlgorithm configured for SslContextFactory@33d5ca3c[provider=null,keyStore=null,trustStore=null]
   [junit4]   2> 218516 INFO  (jetty-launcher-6695-thread-1) [    ] o.a.s.c.ZkContainer Zookeeper client=127.0.0.1:33855/solr
   [junit4]   2> 218516 INFO  (jetty-launcher-6695-thread-5) [    ] o.a.s.c.ZkContainer Zookeeper client=127.0.0.1:33855/solr
   [junit4]   2> 218517 WARN  (jetty-launcher-6695-thread-4) [    ] o.e.j.u.s.S.config No Client EndPointIdentificationAlgorithm configured for SslContextFactory@58bb2503[provider=null,keyStore=null,trustStore=null]
   [junit4]   2> 218518 INFO  (jetty-launcher-6695-thread-4) [    ] o.a.s.c.ZkContainer Zookeeper client=127.0.0.1:33855/solr
   [junit4]   2> 218519 INFO  (zkConnectionManagerCallback-6776-thread-1) [    ] o.a.s.c.c.ConnectionManager zkClient has connected
   [junit4]   2> 218519 INFO  (zkConnectionManagerCallback-6772-thread-1) [    ] o.a.s.c.c.ConnectionManager zkClient has connected
   [junit4]   2> 218519 INFO  (zkConnectionManagerCallback-6779-thread-1) [    ] o.a.s.c.c.ConnectionManager zkClient has connected
   [junit4]   2> 218521 WARN  (NIOServerCxn.Factory:0.0.0.0/0.0.0.0:0) [    ] o.a.z.s.NIOServerCnxn Unable to read additional data from client sessionid 0x1007b0ea09f0012, likely client has closed socket
   [junit4]   2> 218523 INFO  (zkConnectionManagerCallback-6785-thread-1) [    ] o.a.s.c.c.ConnectionManager zkClient has connected
   [junit4]   2> 218523 INFO  (zkConnectionManagerCallback-6782-thread-1) [   

[...truncated too long message...]

 [junit4]   2> 37660 INFO  (zkCallback-265-thread-1) [    ] o.a.s.c.c.ZkStateReader Updated live nodes from ZooKeeper... (5) -> (1)
   [junit4]   2> 37660 INFO  (zkCallback-274-thread-1) [    ] o.a.s.c.c.ZkStateReader Updated live nodes from ZooKeeper... (5) -> (1)
   [junit4]   2> 37660 INFO  (zkCallback-295-thread-1) [    ] o.a.s.c.c.ZkStateReader Updated live nodes from ZooKeeper... (5) -> (1)
   [junit4]   2> 37661 INFO  (zkCallback-224-thread-1) [    ] o.a.s.c.c.ZkStateReader Updated live nodes from ZooKeeper... (5) -> (1)
   [junit4]   2> 37661 WARN  (NIOServerCxn.Factory:0.0.0.0/0.0.0.0:0) [    ] o.a.z.s.NIOServerCnxn Unable to read additional data from client sessionid 0x1007b3376f20015, likely client has closed socket
   [junit4]   2> 37661 WARN  (NIOServerCxn.Factory:0.0.0.0/0.0.0.0:0) [    ] o.a.z.s.NIOServerCnxn Unable to read additional data from client sessionid 0x1007b3376f2001a, likely client has closed socket
   [junit4]   2> 37667 INFO  (closeThreadPool-350-thread-1) [    ] o.a.s.c.Overseer Overseer (id=72193055007047692-127.0.0.1:36405_solr-n_0000000025) closing
   [junit4]   2> 37667 INFO  (jetty-closer-330-thread-6) [    ] o.e.j.s.AbstractConnector Stopped ServerConnector@27c7f45e{HTTP/1.1,[http/1.1, h2c]}{127.0.0.1:0}
   [junit4]   2> 37667 INFO  (jetty-closer-330-thread-4) [    ] o.a.s.c.Overseer Overseer (id=72193055007047692-127.0.0.1:36405_solr-n_0000000025) closing
   [junit4]   2> 37667 WARN  (NIOServerCxn.Factory:0.0.0.0/0.0.0.0:0) [    ] o.a.z.s.NIOServerCnxn Unable to read additional data from client sessionid 0x1007b3376f2000c, likely client has closed socket
   [junit4]   2> 37668 INFO  (jetty-closer-330-thread-3) [    ] o.e.j.s.AbstractConnector Stopped ServerConnector@74226a18{HTTP/1.1,[http/1.1, h2c]}{127.0.0.1:0}
   [junit4]   2> 37668 INFO  (jetty-closer-330-thread-6) [    ] o.e.j.s.h.ContextHandler Stopped o.e.j.s.ServletContextHandler@3549262f{/solr,null,UNAVAILABLE}
   [junit4]   2> 37668 INFO  (jetty-closer-330-thread-6) [    ] o.e.j.s.session node0 Stopped scavenging
   [junit4]   2> 37668 INFO  (jetty-closer-330-thread-3) [    ] o.e.j.s.h.ContextHandler Stopped o.e.j.s.ServletContextHandler@22858e84{/solr,null,UNAVAILABLE}
   [junit4]   2> 37670 INFO  (jetty-closer-330-thread-3) [    ] o.e.j.s.session node0 Stopped scavenging
   [junit4]   2> 37670 INFO  (jetty-closer-330-thread-1) [    ] o.e.j.s.AbstractConnector Stopped ServerConnector@5fdbae99{HTTP/1.1,[http/1.1, h2c]}{127.0.0.1:0}
   [junit4]   2> 37670 INFO  (jetty-closer-330-thread-1) [    ] o.e.j.s.h.ContextHandler Stopped o.e.j.s.ServletContextHandler@2d54b584{/solr,null,UNAVAILABLE}
   [junit4]   2> 37670 INFO  (jetty-closer-330-thread-1) [    ] o.e.j.s.session node0 Stopped scavenging
   [junit4]   2> 37671 INFO  (jetty-closer-330-thread-2) [    ] o.e.j.s.AbstractConnector Stopped ServerConnector@6069c14a{HTTP/1.1,[http/1.1, h2c]}{127.0.0.1:0}
   [junit4]   2> 37671 INFO  (jetty-closer-330-thread-2) [    ] o.e.j.s.h.ContextHandler Stopped o.e.j.s.ServletContextHandler@5f9debf{/solr,null,UNAVAILABLE}
   [junit4]   2> 37671 INFO  (jetty-closer-330-thread-2) [    ] o.e.j.s.session node0 Stopped scavenging
   [junit4]   2> 37672 INFO  (jetty-closer-330-thread-4) [    ] o.e.j.s.AbstractConnector Stopped ServerConnector@77fcd154{HTTP/1.1,[http/1.1, h2c]}{127.0.0.1:0}
   [junit4]   2> 37672 INFO  (jetty-closer-330-thread-4) [    ] o.e.j.s.h.ContextHandler Stopped o.e.j.s.ServletContextHandler@533b3210{/solr,null,UNAVAILABLE}
   [junit4]   2> 37672 INFO  (jetty-closer-330-thread-4) [    ] o.e.j.s.session node0 Stopped scavenging
   [junit4]   2> 37673 INFO  (SUITE-OverseerRolesTest-seed#[E799306D24F40484]-worker) [    ] o.a.s.c.ZkTestServer Shutting down ZkTestServer.
   [junit4]   2> 37674 WARN  (ZkTestServer Run Thread) [    ] o.a.s.c.ZkTestServer Watch limit violations: 
   [junit4]   2> Maximum concurrent create/delete watches above limit:
   [junit4]   2> 
   [junit4]   2> 	15	/solr/clusterprops.json
   [junit4]   2> 	15	/solr/aliases.json
   [junit4]   2> 	7	/solr/security.json
   [junit4]   2> 
   [junit4]   2> Maximum concurrent data watches above limit:
   [junit4]   2> 
   [junit4]   2> 	15	/solr/clusterstate.json
   [junit4]   2> 	9	/solr/autoscaling.json
   [junit4]   2> 	4	/solr/overseer_elect/election/72193055007047692-127.0.0.1:36405_solr-n_0000000010
   [junit4]   2> 	3	/solr/overseer_elect/election/72193055007047705-127.0.0.1:33041_solr-n_0000000023
   [junit4]   2> 	3	/solr/overseer_elect/election/72193055007047705-127.0.0.1:33041_solr-n_0000000005
   [junit4]   2> 	3	/solr/overseer_elect/election/72193055007047694-127.0.0.1:37389_solr-n_0000000021
   [junit4]   2> 	3	/solr/overseer_elect/election/72193055007047692-127.0.0.1:36405_solr-n_0000000003
   [junit4]   2> 	2	/solr/overseer_elect/election/72193055007047694-127.0.0.1:37389_solr-n_0000000014
   [junit4]   2> 	2	/solr/overseer_elect/election/72193055007047705-127.0.0.1:33041_solr-n_0000000015
   [junit4]   2> 	2	/solr/overseer_elect/election/72193055007047691-127.0.0.1:39047_solr-n_0000000008
   [junit4]   2> 	2	/solr/overseer_elect/election/72193055007047691-127.0.0.1:39047_solr-n_0000000002
   [junit4]   2> 	2	/solr/overseer_elect/election/72193055007047694-127.0.0.1:37389_solr-n_0000000000
   [junit4]   2> 	2	/solr/overseer_elect/election/72193055007047696-127.0.0.1:36353_solr-n_0000000001
   [junit4]   2> 
   [junit4]   2> Maximum concurrent children watches above limit:
   [junit4]   2> 
   [junit4]   2> 	15	/solr/collections
   [junit4]   2> 	14	/solr/live_nodes
   [junit4]   2> 	9	/solr/autoscaling/events/.scheduled_maintenance
   [junit4]   2> 	9	/solr/overseer/queue-work
   [junit4]   2> 	8	/solr/autoscaling/events/.auto_add_replicas
   [junit4]   2> 	4	/solr/overseer/collection-queue-work
   [junit4]   2> 	3	/solr/overseer/queue
   [junit4]   2> 
   [junit4]   2> 37677 INFO  (SUITE-OverseerRolesTest-seed#[E799306D24F40484]-worker) [    ] o.a.s.c.ZkTestServer parse host and port list: 127.0.0.1:33255
   [junit4]   2> 37677 INFO  (SUITE-OverseerRolesTest-seed#[E799306D24F40484]-worker) [    ] o.a.s.c.ZkTestServer connecting to 127.0.0.1 33255
   [junit4]   2> NOTE: leaving temporary files on disk at: /home/jenkins/workspace/Lucene-Solr-8.1-Linux/solr/build/solr-core/test/J0/temp/solr.cloud.OverseerRolesTest_E799306D24F40484-002
   [junit4]   2> May 04, 2019 12:07:29 PM com.carrotsearch.randomizedtesting.ThreadLeakControl checkThreadLeaks
   [junit4]   2> WARNING: Will linger awaiting termination of 1 leaked thread(s).
   [junit4]   2> NOTE: test params are: codec=CheapBastard, sim=Asserting(org.apache.lucene.search.similarities.AssertingSimilarity@2105d209), locale=en-TC, timezone=Africa/Bujumbura
   [junit4]   2> NOTE: Linux 4.18.0-17-generic amd64/Oracle Corporation 11.0.2 (64-bit)/cpus=8,threads=1,free=376817104,total=518979584
   [junit4]   2> NOTE: All tests run in this JVM: [OverseerRolesTest, OverseerRolesTest]
   [junit4] Completed [5/5 (5!)] on J0 in 14.79s, 2 tests, 1 failure <<< FAILURES!

[...truncated 1 lines...]
   [junit4] JVM J2: stderr was not empty, see: /home/jenkins/workspace/Lucene-Solr-8.1-Linux/solr/build/solr-core/test/temp/junit4-J2-20190504_120651_35217863561737656537647.syserr
   [junit4] >>> JVM J2 emitted unexpected output (verbatim) ----
   [junit4] OpenJDK 64-Bit Server VM warning: Option UseConcMarkSweepGC was deprecated in version 9.0 and will likely be removed in a future release.
   [junit4] <<< JVM J2: EOF ----

   [junit4] JVM J0: stderr was not empty, see: /home/jenkins/workspace/Lucene-Solr-8.1-Linux/solr/build/solr-core/test/temp/junit4-J0-20190504_120651_3527321285605353835593.syserr
   [junit4] >>> JVM J0 emitted unexpected output (verbatim) ----
   [junit4] OpenJDK 64-Bit Server VM warning: Option UseConcMarkSweepGC was deprecated in version 9.0 and will likely be removed in a future release.
   [junit4] <<< JVM J0: EOF ----

[...truncated 14 lines...]
BUILD FAILED
/home/jenkins/workspace/Lucene-Solr-8.1-Linux/lucene/common-build.xml:1573: The following error occurred while executing this line:
/home/jenkins/workspace/Lucene-Solr-8.1-Linux/lucene/common-build.xml:1100: There were test failures: 5 suites, 10 tests, 5 failures [seed: E799306D24F40484]

Total time: 40 seconds

[repro] Setting last failure code to 256

[repro] Failures:
[repro]   5/5 failed: org.apache.solr.cloud.OverseerRolesTest
[repro] Exiting with code 256
+ mv lucene/build lucene/build.repro
+ mv solr/build solr/build.repro
+ mv lucene/build.orig lucene/build
+ mv solr/build.orig solr/build
Archiving artifacts
Setting ANT_1_8_2_HOME=/home/jenkins/tools/hudson.tasks.Ant_AntInstallation/ANT_1.8.2
[WARNINGS] Parsing warnings in console log with parser Java Compiler (javac)
Setting ANT_1_8_2_HOME=/home/jenkins/tools/hudson.tasks.Ant_AntInstallation/ANT_1.8.2
No credentials specified
Setting ANT_1_8_2_HOME=/home/jenkins/tools/hudson.tasks.Ant_AntInstallation/ANT_1.8.2
<Git Blamer> Using GitBlamer to create author and commit information for all warnings.
<Git Blamer> GIT_COMMIT=85b4f2634bd2a04fe2771b7f6cafd87296b0100e, workspace=/home/jenkins/workspace/Lucene-Solr-8.1-Linux
[WARNINGS] Computing warning deltas based on reference build #279
Recording test results
Setting ANT_1_8_2_HOME=/home/jenkins/tools/hudson.tasks.Ant_AntInstallation/ANT_1.8.2
Build step 'Publish JUnit test result report' changed build result to UNSTABLE
Email was triggered for: Unstable (Test Failures)
Sending email for trigger: Unstable (Test Failures)
Setting ANT_1_8_2_HOME=/home/jenkins/tools/hudson.tasks.Ant_AntInstallation/ANT_1.8.2
Setting ANT_1_8_2_HOME=/home/jenkins/tools/hudson.tasks.Ant_AntInstallation/ANT_1.8.2
Setting ANT_1_8_2_HOME=/home/jenkins/tools/hudson.tasks.Ant_AntInstallation/ANT_1.8.2
Setting ANT_1_8_2_HOME=/home/jenkins/tools/hudson.tasks.Ant_AntInstallation/ANT_1.8.2
Setting ANT_1_8_2_HOME=/home/jenkins/tools/hudson.tasks.Ant_AntInstallation/ANT_1.8.2
Setting ANT_1_8_2_HOME=/home/jenkins/tools/hudson.tasks.Ant_AntInstallation/ANT_1.8.2

Mime
View raw message