lucene-dev mailing list archives

Site index · List index
Message view « Date » · « Thread »
Top « Date » · « Thread »
From Policeman Jenkins Server <jenk...@thetaphi.de>
Subject [JENKINS-EA] Lucene-Solr-8.x-Linux (64bit/jdk-13-ea+18) - Build # 497 - Still Failing!
Date Wed, 01 May 2019 23:00:32 GMT
Build: https://jenkins.thetaphi.de/job/Lucene-Solr-8.x-Linux/497/
Java: 64bit/jdk-13-ea+18 -XX:+UseCompressedOops -XX:+UseG1GC

2 tests failed.
FAILED:  org.apache.solr.update.PeerSyncTest.test

Error Message:
Unexpected exception type, expected SolrException but got org.apache.solr.client.solrj.SolrServerException: Timeout occurred while waiting response from server at: http://127.0.0.1:40955/collection1

Stack Trace:
junit.framework.AssertionFailedError: Unexpected exception type, expected SolrException but got org.apache.solr.client.solrj.SolrServerException: Timeout occurred while waiting response from server at: http://127.0.0.1:40955/collection1
	at __randomizedtesting.SeedInfo.seed([210E5D84D603E444:A95A625E78FF89BC]:0)
	at org.apache.lucene.util.LuceneTestCase.expectThrows(LuceneTestCase.java:2700)
	at org.apache.lucene.util.LuceneTestCase.expectThrows(LuceneTestCase.java:2689)
	at org.apache.solr.update.PeerSyncTest.test(PeerSyncTest.java:279)
	at java.base/jdk.internal.reflect.NativeMethodAccessorImpl.invoke0(Native Method)
	at java.base/jdk.internal.reflect.NativeMethodAccessorImpl.invoke(NativeMethodAccessorImpl.java:62)
	at java.base/jdk.internal.reflect.DelegatingMethodAccessorImpl.invoke(DelegatingMethodAccessorImpl.java:43)
	at java.base/java.lang.reflect.Method.invoke(Method.java:567)
	at com.carrotsearch.randomizedtesting.RandomizedRunner.invoke(RandomizedRunner.java:1750)
	at com.carrotsearch.randomizedtesting.RandomizedRunner$8.evaluate(RandomizedRunner.java:938)
	at com.carrotsearch.randomizedtesting.RandomizedRunner$9.evaluate(RandomizedRunner.java:974)
	at com.carrotsearch.randomizedtesting.RandomizedRunner$10.evaluate(RandomizedRunner.java:988)
	at org.apache.solr.BaseDistributedSearchTestCase$ShardsRepeatRule$ShardsFixedStatement.callStatement(BaseDistributedSearchTestCase.java:1082)
	at org.apache.solr.BaseDistributedSearchTestCase$ShardsRepeatRule$ShardsStatement.evaluate(BaseDistributedSearchTestCase.java:1054)
	at com.carrotsearch.randomizedtesting.rules.SystemPropertiesRestoreRule$1.evaluate(SystemPropertiesRestoreRule.java:57)
	at org.apache.lucene.util.TestRuleSetupTeardownChained$1.evaluate(TestRuleSetupTeardownChained.java:49)
	at org.apache.lucene.util.AbstractBeforeAfterRule$1.evaluate(AbstractBeforeAfterRule.java:45)
	at org.apache.lucene.util.TestRuleThreadAndTestName$1.evaluate(TestRuleThreadAndTestName.java:48)
	at org.apache.lucene.util.TestRuleIgnoreAfterMaxFailures$1.evaluate(TestRuleIgnoreAfterMaxFailures.java:64)
	at org.apache.lucene.util.TestRuleMarkFailure$1.evaluate(TestRuleMarkFailure.java:47)
	at com.carrotsearch.randomizedtesting.rules.StatementAdapter.evaluate(StatementAdapter.java:36)
	at com.carrotsearch.randomizedtesting.ThreadLeakControl$StatementRunner.run(ThreadLeakControl.java:368)
	at com.carrotsearch.randomizedtesting.ThreadLeakControl.forkTimeoutingTask(ThreadLeakControl.java:817)
	at com.carrotsearch.randomizedtesting.ThreadLeakControl$3.evaluate(ThreadLeakControl.java:468)
	at com.carrotsearch.randomizedtesting.RandomizedRunner.runSingleTest(RandomizedRunner.java:947)
	at com.carrotsearch.randomizedtesting.RandomizedRunner$5.evaluate(RandomizedRunner.java:832)
	at com.carrotsearch.randomizedtesting.RandomizedRunner$6.evaluate(RandomizedRunner.java:883)
	at com.carrotsearch.randomizedtesting.RandomizedRunner$7.evaluate(RandomizedRunner.java:894)
	at com.carrotsearch.randomizedtesting.rules.StatementAdapter.evaluate(StatementAdapter.java:36)
	at com.carrotsearch.randomizedtesting.rules.SystemPropertiesRestoreRule$1.evaluate(SystemPropertiesRestoreRule.java:57)
	at org.apache.lucene.util.AbstractBeforeAfterRule$1.evaluate(AbstractBeforeAfterRule.java:45)
	at com.carrotsearch.randomizedtesting.rules.StatementAdapter.evaluate(StatementAdapter.java:36)
	at org.apache.lucene.util.TestRuleStoreClassName$1.evaluate(TestRuleStoreClassName.java:41)
	at com.carrotsearch.randomizedtesting.rules.NoShadowingOrOverridesOnMethodsRule$1.evaluate(NoShadowingOrOverridesOnMethodsRule.java:40)
	at com.carrotsearch.randomizedtesting.rules.NoShadowingOrOverridesOnMethodsRule$1.evaluate(NoShadowingOrOverridesOnMethodsRule.java:40)
	at com.carrotsearch.randomizedtesting.rules.StatementAdapter.evaluate(StatementAdapter.java:36)
	at com.carrotsearch.randomizedtesting.rules.StatementAdapter.evaluate(StatementAdapter.java:36)
	at org.apache.lucene.util.TestRuleAssertionsRequired$1.evaluate(TestRuleAssertionsRequired.java:53)
	at org.apache.lucene.util.TestRuleMarkFailure$1.evaluate(TestRuleMarkFailure.java:47)
	at org.apache.lucene.util.TestRuleIgnoreAfterMaxFailures$1.evaluate(TestRuleIgnoreAfterMaxFailures.java:64)
	at org.apache.lucene.util.TestRuleIgnoreTestSuites$1.evaluate(TestRuleIgnoreTestSuites.java:54)
	at com.carrotsearch.randomizedtesting.rules.StatementAdapter.evaluate(StatementAdapter.java:36)
	at com.carrotsearch.randomizedtesting.ThreadLeakControl$StatementRunner.run(ThreadLeakControl.java:368)
	at java.base/java.lang.Thread.run(Thread.java:835)
Caused by: org.apache.solr.client.solrj.SolrServerException: Timeout occurred while waiting response from server at: http://127.0.0.1:40955/collection1
	at org.apache.solr.client.solrj.impl.HttpSolrClient.executeMethod(HttpSolrClient.java:660)
	at org.apache.solr.client.solrj.impl.HttpSolrClient.request(HttpSolrClient.java:255)
	at org.apache.solr.client.solrj.impl.HttpSolrClient.request(HttpSolrClient.java:244)
	at org.apache.solr.client.solrj.SolrRequest.process(SolrRequest.java:207)
	at org.apache.solr.client.solrj.SolrRequest.process(SolrRequest.java:224)
	at org.apache.solr.BaseDistributedSearchTestCase.add(BaseDistributedSearchTestCase.java:576)
	at org.apache.solr.update.PeerSyncTest.lambda$test$0(PeerSyncTest.java:281)
	at org.apache.lucene.util.LuceneTestCase.expectThrows(LuceneTestCase.java:2695)
	... 42 more
Caused by: java.net.SocketTimeoutException: Read timed out
	at java.base/java.net.SocketInputStream.socketRead0(Native Method)
	at java.base/java.net.SocketInputStream.socketRead(SocketInputStream.java:115)
	at java.base/java.net.SocketInputStream.read(SocketInputStream.java:168)
	at java.base/java.net.SocketInputStream.read(SocketInputStream.java:140)
	at java.base/java.net.Socket$SocketInputStream.read(Socket.java:972)
	at org.apache.http.impl.io.SessionInputBufferImpl.streamRead(SessionInputBufferImpl.java:137)
	at org.apache.http.impl.io.SessionInputBufferImpl.fillBuffer(SessionInputBufferImpl.java:153)
	at org.apache.http.impl.io.SessionInputBufferImpl.readLine(SessionInputBufferImpl.java:282)
	at org.apache.http.impl.conn.DefaultHttpResponseParser.parseHead(DefaultHttpResponseParser.java:138)
	at org.apache.http.impl.conn.DefaultHttpResponseParser.parseHead(DefaultHttpResponseParser.java:56)
	at org.apache.http.impl.io.AbstractMessageParser.parse(AbstractMessageParser.java:259)
	at org.apache.http.impl.DefaultBHttpClientConnection.receiveResponseHeader(DefaultBHttpClientConnection.java:163)
	at org.apache.http.impl.conn.CPoolProxy.receiveResponseHeader(CPoolProxy.java:165)
	at org.apache.http.protocol.HttpRequestExecutor.doReceiveResponse(HttpRequestExecutor.java:273)
	at org.apache.http.protocol.HttpRequestExecutor.execute(HttpRequestExecutor.java:125)
	at org.apache.http.impl.execchain.MainClientExec.execute(MainClientExec.java:272)
	at org.apache.http.impl.execchain.ProtocolExec.execute(ProtocolExec.java:185)
	at org.apache.http.impl.execchain.RetryExec.execute(RetryExec.java:89)
	at org.apache.http.impl.execchain.RedirectExec.execute(RedirectExec.java:110)
	at org.apache.http.impl.client.InternalHttpClient.doExecute(InternalHttpClient.java:185)
	at org.apache.http.impl.client.CloseableHttpClient.execute(CloseableHttpClient.java:83)
	at org.apache.http.impl.client.CloseableHttpClient.execute(CloseableHttpClient.java:56)
	at org.apache.solr.client.solrj.impl.HttpSolrClient.executeMethod(HttpSolrClient.java:548)
	... 49 more


FAILED:  org.apache.solr.update.PeerSyncWithLeaderTest.test

Error Message:
Unexpected exception type, expected SolrException but got org.apache.solr.client.solrj.SolrServerException: Timeout occurred while waiting response from server at: http://127.0.0.1:34141/collection1

Stack Trace:
junit.framework.AssertionFailedError: Unexpected exception type, expected SolrException but got org.apache.solr.client.solrj.SolrServerException: Timeout occurred while waiting response from server at: http://127.0.0.1:34141/collection1
	at __randomizedtesting.SeedInfo.seed([210E5D84D603E444:A95A625E78FF89BC]:0)
	at org.apache.lucene.util.LuceneTestCase.expectThrows(LuceneTestCase.java:2700)
	at org.apache.lucene.util.LuceneTestCase.expectThrows(LuceneTestCase.java:2689)
	at org.apache.solr.update.PeerSyncTest.test(PeerSyncTest.java:279)
	at java.base/jdk.internal.reflect.NativeMethodAccessorImpl.invoke0(Native Method)
	at java.base/jdk.internal.reflect.NativeMethodAccessorImpl.invoke(NativeMethodAccessorImpl.java:62)
	at java.base/jdk.internal.reflect.DelegatingMethodAccessorImpl.invoke(DelegatingMethodAccessorImpl.java:43)
	at java.base/java.lang.reflect.Method.invoke(Method.java:567)
	at com.carrotsearch.randomizedtesting.RandomizedRunner.invoke(RandomizedRunner.java:1750)
	at com.carrotsearch.randomizedtesting.RandomizedRunner$8.evaluate(RandomizedRunner.java:938)
	at com.carrotsearch.randomizedtesting.RandomizedRunner$9.evaluate(RandomizedRunner.java:974)
	at com.carrotsearch.randomizedtesting.RandomizedRunner$10.evaluate(RandomizedRunner.java:988)
	at org.apache.solr.BaseDistributedSearchTestCase$ShardsRepeatRule$ShardsFixedStatement.callStatement(BaseDistributedSearchTestCase.java:1082)
	at org.apache.solr.BaseDistributedSearchTestCase$ShardsRepeatRule$ShardsStatement.evaluate(BaseDistributedSearchTestCase.java:1054)
	at com.carrotsearch.randomizedtesting.rules.SystemPropertiesRestoreRule$1.evaluate(SystemPropertiesRestoreRule.java:57)
	at org.apache.lucene.util.TestRuleSetupTeardownChained$1.evaluate(TestRuleSetupTeardownChained.java:49)
	at org.apache.lucene.util.AbstractBeforeAfterRule$1.evaluate(AbstractBeforeAfterRule.java:45)
	at org.apache.lucene.util.TestRuleThreadAndTestName$1.evaluate(TestRuleThreadAndTestName.java:48)
	at org.apache.lucene.util.TestRuleIgnoreAfterMaxFailures$1.evaluate(TestRuleIgnoreAfterMaxFailures.java:64)
	at org.apache.lucene.util.TestRuleMarkFailure$1.evaluate(TestRuleMarkFailure.java:47)
	at com.carrotsearch.randomizedtesting.rules.StatementAdapter.evaluate(StatementAdapter.java:36)
	at com.carrotsearch.randomizedtesting.ThreadLeakControl$StatementRunner.run(ThreadLeakControl.java:368)
	at com.carrotsearch.randomizedtesting.ThreadLeakControl.forkTimeoutingTask(ThreadLeakControl.java:817)
	at com.carrotsearch.randomizedtesting.ThreadLeakControl$3.evaluate(ThreadLeakControl.java:468)
	at com.carrotsearch.randomizedtesting.RandomizedRunner.runSingleTest(RandomizedRunner.java:947)
	at com.carrotsearch.randomizedtesting.RandomizedRunner$5.evaluate(RandomizedRunner.java:832)
	at com.carrotsearch.randomizedtesting.RandomizedRunner$6.evaluate(RandomizedRunner.java:883)
	at com.carrotsearch.randomizedtesting.RandomizedRunner$7.evaluate(RandomizedRunner.java:894)
	at com.carrotsearch.randomizedtesting.rules.StatementAdapter.evaluate(StatementAdapter.java:36)
	at com.carrotsearch.randomizedtesting.rules.SystemPropertiesRestoreRule$1.evaluate(SystemPropertiesRestoreRule.java:57)
	at org.apache.lucene.util.AbstractBeforeAfterRule$1.evaluate(AbstractBeforeAfterRule.java:45)
	at com.carrotsearch.randomizedtesting.rules.StatementAdapter.evaluate(StatementAdapter.java:36)
	at org.apache.lucene.util.TestRuleStoreClassName$1.evaluate(TestRuleStoreClassName.java:41)
	at com.carrotsearch.randomizedtesting.rules.NoShadowingOrOverridesOnMethodsRule$1.evaluate(NoShadowingOrOverridesOnMethodsRule.java:40)
	at com.carrotsearch.randomizedtesting.rules.NoShadowingOrOverridesOnMethodsRule$1.evaluate(NoShadowingOrOverridesOnMethodsRule.java:40)
	at com.carrotsearch.randomizedtesting.rules.StatementAdapter.evaluate(StatementAdapter.java:36)
	at com.carrotsearch.randomizedtesting.rules.StatementAdapter.evaluate(StatementAdapter.java:36)
	at org.apache.lucene.util.TestRuleAssertionsRequired$1.evaluate(TestRuleAssertionsRequired.java:53)
	at org.apache.lucene.util.TestRuleMarkFailure$1.evaluate(TestRuleMarkFailure.java:47)
	at org.apache.lucene.util.TestRuleIgnoreAfterMaxFailures$1.evaluate(TestRuleIgnoreAfterMaxFailures.java:64)
	at org.apache.lucene.util.TestRuleIgnoreTestSuites$1.evaluate(TestRuleIgnoreTestSuites.java:54)
	at com.carrotsearch.randomizedtesting.rules.StatementAdapter.evaluate(StatementAdapter.java:36)
	at com.carrotsearch.randomizedtesting.ThreadLeakControl$StatementRunner.run(ThreadLeakControl.java:368)
	at java.base/java.lang.Thread.run(Thread.java:835)
Caused by: org.apache.solr.client.solrj.SolrServerException: Timeout occurred while waiting response from server at: http://127.0.0.1:34141/collection1
	at org.apache.solr.client.solrj.impl.HttpSolrClient.executeMethod(HttpSolrClient.java:660)
	at org.apache.solr.client.solrj.impl.HttpSolrClient.request(HttpSolrClient.java:255)
	at org.apache.solr.client.solrj.impl.HttpSolrClient.request(HttpSolrClient.java:244)
	at org.apache.solr.client.solrj.SolrRequest.process(SolrRequest.java:207)
	at org.apache.solr.client.solrj.SolrRequest.process(SolrRequest.java:224)
	at org.apache.solr.BaseDistributedSearchTestCase.add(BaseDistributedSearchTestCase.java:576)
	at org.apache.solr.update.PeerSyncTest.lambda$test$0(PeerSyncTest.java:281)
	at org.apache.lucene.util.LuceneTestCase.expectThrows(LuceneTestCase.java:2695)
	... 42 more
Caused by: java.net.SocketTimeoutException: Read timed out
	at java.base/java.net.SocketInputStream.socketRead0(Native Method)
	at java.base/java.net.SocketInputStream.socketRead(SocketInputStream.java:115)
	at java.base/java.net.SocketInputStream.read(SocketInputStream.java:168)
	at java.base/java.net.SocketInputStream.read(SocketInputStream.java:140)
	at java.base/java.net.Socket$SocketInputStream.read(Socket.java:972)
	at org.apache.http.impl.io.SessionInputBufferImpl.streamRead(SessionInputBufferImpl.java:137)
	at org.apache.http.impl.io.SessionInputBufferImpl.fillBuffer(SessionInputBufferImpl.java:153)
	at org.apache.http.impl.io.SessionInputBufferImpl.readLine(SessionInputBufferImpl.java:282)
	at org.apache.http.impl.conn.DefaultHttpResponseParser.parseHead(DefaultHttpResponseParser.java:138)
	at org.apache.http.impl.conn.DefaultHttpResponseParser.parseHead(DefaultHttpResponseParser.java:56)
	at org.apache.http.impl.io.AbstractMessageParser.parse(AbstractMessageParser.java:259)
	at org.apache.http.impl.DefaultBHttpClientConnection.receiveResponseHeader(DefaultBHttpClientConnection.java:163)
	at org.apache.http.impl.conn.CPoolProxy.receiveResponseHeader(CPoolProxy.java:165)
	at org.apache.http.protocol.HttpRequestExecutor.doReceiveResponse(HttpRequestExecutor.java:273)
	at org.apache.http.protocol.HttpRequestExecutor.execute(HttpRequestExecutor.java:125)
	at org.apache.http.impl.execchain.MainClientExec.execute(MainClientExec.java:272)
	at org.apache.http.impl.execchain.ProtocolExec.execute(ProtocolExec.java:185)
	at org.apache.http.impl.execchain.RetryExec.execute(RetryExec.java:89)
	at org.apache.http.impl.execchain.RedirectExec.execute(RedirectExec.java:110)
	at org.apache.http.impl.client.InternalHttpClient.doExecute(InternalHttpClient.java:185)
	at org.apache.http.impl.client.CloseableHttpClient.execute(CloseableHttpClient.java:83)
	at org.apache.http.impl.client.CloseableHttpClient.execute(CloseableHttpClient.java:56)
	at org.apache.solr.client.solrj.impl.HttpSolrClient.executeMethod(HttpSolrClient.java:548)
	... 49 more




Build Log:
[...truncated 13772 lines...]
   [junit4] Suite: org.apache.solr.update.PeerSyncTest
   [junit4]   2> Creating dataDir: /home/jenkins/workspace/Lucene-Solr-8.x-Linux/solr/build/solr-core/test/J1/temp/solr.update.PeerSyncTest_210E5D84D603E444-001/init-core-data-001
   [junit4]   2> 598718 WARN  (SUITE-PeerSyncTest-seed#[210E5D84D603E444]-worker) [    ] o.a.s.SolrTestCaseJ4 startTrackingSearchers: numOpens=2 numCloses=2
   [junit4]   2> 598718 INFO  (SUITE-PeerSyncTest-seed#[210E5D84D603E444]-worker) [    ] o.a.s.SolrTestCaseJ4 Using PointFields (NUMERIC_POINTS_SYSPROP=true) w/NUMERIC_DOCVALUES_SYSPROP=true
   [junit4]   2> 598719 INFO  (SUITE-PeerSyncTest-seed#[210E5D84D603E444]-worker) [    ] o.a.s.SolrTestCaseJ4 Randomized ssl (false) and clientAuth (false) via: @org.apache.solr.SolrTestCaseJ4$SuppressSSL(bugUrl="https://issues.apache.org/jira/browse/SOLR-5776")
   [junit4]   2> 598719 INFO  (SUITE-PeerSyncTest-seed#[210E5D84D603E444]-worker) [    ] o.a.s.SolrTestCaseJ4 SecureRandom sanity checks: test.solr.allowed.securerandom=null & java.security.egd=file:/dev/./urandom
   [junit4]   2> 598719 INFO  (SUITE-PeerSyncTest-seed#[210E5D84D603E444]-worker) [    ] o.a.s.BaseDistributedSearchTestCase Setting hostContext system property: /
   [junit4]   2> 598719 INFO  (TEST-PeerSyncTest.test-seed#[210E5D84D603E444]) [    ] o.a.s.SolrTestCaseJ4 ####initCore
   [junit4]   2> 598719 INFO  (TEST-PeerSyncTest.test-seed#[210E5D84D603E444]) [    ] o.a.s.c.SolrResourceLoader [null] Added 2 libs to classloader, from paths: [/home/jenkins/workspace/Lucene-Solr-8.x-Linux/solr/core/src/test-files/solr/collection1/lib, /home/jenkins/workspace/Lucene-Solr-8.x-Linux/solr/core/src/test-files/solr/collection1/lib/classes]
   [junit4]   2> 598734 INFO  (TEST-PeerSyncTest.test-seed#[210E5D84D603E444]) [    ] o.a.s.c.SolrConfig Using Lucene MatchVersion: 8.2.0
   [junit4]   2> 598751 INFO  (TEST-PeerSyncTest.test-seed#[210E5D84D603E444]) [    ] o.a.s.s.IndexSchema [null] Schema name=test
   [junit4]   2> 598842 INFO  (TEST-PeerSyncTest.test-seed#[210E5D84D603E444]) [    ] o.a.s.s.IndexSchema Loaded schema test/1.0 with uniqueid field id
   [junit4]   2> 598930 INFO  (TEST-PeerSyncTest.test-seed#[210E5D84D603E444]) [    ] o.a.s.h.c.HttpShardHandlerFactory Host whitelist initialized: WhitelistHostChecker [whitelistHosts=null, whitelistHostCheckingEnabled=false]
   [junit4]   2> 598931 WARN  (TEST-PeerSyncTest.test-seed#[210E5D84D603E444]) [    ] o.e.j.u.s.S.config No Client EndPointIdentificationAlgorithm configured for SslContextFactory@30a612d[provider=null,keyStore=null,trustStore=null]
   [junit4]   2> 598933 WARN  (TEST-PeerSyncTest.test-seed#[210E5D84D603E444]) [    ] o.e.j.u.s.S.config No Client EndPointIdentificationAlgorithm configured for SslContextFactory@2dac0a9e[provider=null,keyStore=null,trustStore=null]
   [junit4]   2> 598952 INFO  (TEST-PeerSyncTest.test-seed#[210E5D84D603E444]) [    ] o.a.s.c.TransientSolrCoreCacheDefault Allocating transient cache for 2147483647 transient cores
   [junit4]   2> 598952 INFO  (TEST-PeerSyncTest.test-seed#[210E5D84D603E444]) [    ] o.a.s.h.a.MetricsHistoryHandler No .system collection, keeping metrics history in memory.
   [junit4]   2> 598962 INFO  (TEST-PeerSyncTest.test-seed#[210E5D84D603E444]) [    ] o.a.s.m.r.SolrJmxReporter JMX monitoring for 'solr.node' (registry 'solr.node') enabled at server: com.sun.jmx.mbeanserver.JmxMBeanServer@6da4ea38
   [junit4]   2> 598968 INFO  (TEST-PeerSyncTest.test-seed#[210E5D84D603E444]) [    ] o.a.s.m.r.SolrJmxReporter JMX monitoring for 'solr.jvm' (registry 'solr.jvm') enabled at server: com.sun.jmx.mbeanserver.JmxMBeanServer@6da4ea38
   [junit4]   2> 598968 INFO  (TEST-PeerSyncTest.test-seed#[210E5D84D603E444]) [    ] o.a.s.m.r.SolrJmxReporter JMX monitoring for 'solr.jetty' (registry 'solr.jetty') enabled at server: com.sun.jmx.mbeanserver.JmxMBeanServer@6da4ea38
   [junit4]   2> 598969 INFO  (coreLoadExecutor-3523-thread-1) [    x:collection1] o.a.s.c.SolrResourceLoader [null] Added 2 libs to classloader, from paths: [/home/jenkins/workspace/Lucene-Solr-8.x-Linux/solr/core/src/test-files/solr/collection1/lib, /home/jenkins/workspace/Lucene-Solr-8.x-Linux/solr/core/src/test-files/solr/collection1/lib/classes]
   [junit4]   2> 598983 INFO  (coreLoadExecutor-3523-thread-1) [    x:collection1] o.a.s.c.SolrConfig Using Lucene MatchVersion: 8.2.0
   [junit4]   2> 598999 INFO  (coreLoadExecutor-3523-thread-1) [    x:collection1] o.a.s.s.IndexSchema [collection1] Schema name=test
   [junit4]   2> 599058 INFO  (coreLoadExecutor-3523-thread-1) [    x:collection1] o.a.s.s.IndexSchema Loaded schema test/1.0 with uniqueid field id
   [junit4]   2> 599064 INFO  (coreLoadExecutor-3523-thread-1) [    x:collection1] o.a.s.c.CoreContainer Creating SolrCore 'collection1' using configuration from instancedir /home/jenkins/workspace/Lucene-Solr-8.x-Linux/solr/core/src/test-files/solr/collection1, trusted=true
   [junit4]   2> 599064 INFO  (coreLoadExecutor-3523-thread-1) [    x:collection1] o.a.s.m.r.SolrJmxReporter JMX monitoring for 'solr.core.collection1' (registry 'solr.core.collection1') enabled at server: com.sun.jmx.mbeanserver.JmxMBeanServer@6da4ea38
   [junit4]   2> 599064 INFO  (coreLoadExecutor-3523-thread-1) [    x:collection1] o.a.s.c.SolrCore [[collection1] ] Opening new SolrCore at [/home/jenkins/workspace/Lucene-Solr-8.x-Linux/solr/core/src/test-files/solr/collection1], dataDir=[/home/jenkins/workspace/Lucene-Solr-8.x-Linux/solr/build/solr-core/test/J1/temp/solr.update.PeerSyncTest_210E5D84D603E444-001/init-core-data-001/]
   [junit4]   2> 599065 INFO  (coreLoadExecutor-3523-thread-1) [    x:collection1] o.a.s.u.RandomMergePolicy RandomMergePolicy wrapping class org.apache.lucene.index.LogDocMergePolicy: [LogDocMergePolicy: minMergeSize=1000, mergeFactor=27, maxMergeSize=9223372036854775807, maxMergeSizeForForcedMerge=9223372036854775807, calibrateSizeByDeletes=true, maxMergeDocs=2147483647, maxCFSSegmentSizeMB=8.796093022207999E12, noCFSRatio=0.0]
   [junit4]   2> 599067 WARN  (coreLoadExecutor-3523-thread-1) [    x:collection1] o.a.s.c.RequestHandlers INVALID paramSet a in requestHandler {type = requestHandler,name = /dump,class = DumpRequestHandler,attributes = {initParams=a, name=/dump, class=DumpRequestHandler},args = {defaults={a=A,b=B}}}
   [junit4]   2> 599088 INFO  (coreLoadExecutor-3523-thread-1) [    x:collection1] o.a.s.u.UpdateHandler Using UpdateLog implementation: org.apache.solr.update.UpdateLog
   [junit4]   2> 599088 INFO  (coreLoadExecutor-3523-thread-1) [    x:collection1] o.a.s.u.UpdateLog Initializing UpdateLog: dataDir= defaultSyncLevel=FLUSH numRecordsToKeep=100 maxNumLogsToKeep=10 numVersionBuckets=65536
   [junit4]   2> 599089 INFO  (coreLoadExecutor-3523-thread-1) [    x:collection1] o.a.s.u.CommitTracker Hard AutoCommit: disabled
   [junit4]   2> 599089 INFO  (coreLoadExecutor-3523-thread-1) [    x:collection1] o.a.s.u.CommitTracker Soft AutoCommit: disabled
   [junit4]   2> 599089 INFO  (coreLoadExecutor-3523-thread-1) [    x:collection1] o.a.s.u.RandomMergePolicy RandomMergePolicy wrapping class org.apache.lucene.index.TieredMergePolicy: [TieredMergePolicy: maxMergeAtOnce=40, maxMergeAtOnceExplicit=45, maxMergedSegmentMB=49.5654296875, floorSegmentMB=1.212890625, forceMergeDeletesPctAllowed=18.26064651360654, segmentsPerTier=34.0, maxCFSSegmentSizeMB=8.796093022207999E12, noCFSRatio=0.8004516974074918, deletesPctAllowed=23.562549902012847
   [junit4]   2> 599089 INFO  (coreLoadExecutor-3523-thread-1) [    x:collection1] o.a.s.s.SolrIndexSearcher Opening [Searcher@612716ef[collection1] main]
   [junit4]   2> 599090 WARN  (coreLoadExecutor-3523-thread-1) [    x:collection1] o.a.s.r.ManagedResourceStorage Cannot write to config directory /home/jenkins/workspace/Lucene-Solr-8.x-Linux/solr/core/src/test-files/solr/collection1/conf; switching to use InMemory storage instead.
   [junit4]   2> 599090 INFO  (coreLoadExecutor-3523-thread-1) [    x:collection1] o.a.s.h.ReplicationHandler Commits will be reserved for 10000ms.
   [junit4]   2> 599090 INFO  (coreLoadExecutor-3523-thread-1) [    x:collection1] o.a.s.u.UpdateLog Could not find max version in index or recent updates, using new clock 1632370107182219264
   [junit4]   2> 599092 INFO  (TEST-PeerSyncTest.test-seed#[210E5D84D603E444]) [    ] o.a.s.SolrTestCaseJ4 ####initCore end
   [junit4]   2> 599092 INFO  (searcherExecutor-3524-thread-1-processing-x:collection1) [    x:collection1] o.a.s.c.SolrCore [collection1] Registered new searcher Searcher@612716ef[collection1] main{ExitableDirectoryReader(UninvertingDirectoryReader())}
   [junit4]   2> 599172 INFO  (TEST-PeerSyncTest.test-seed#[210E5D84D603E444]) [    ] o.a.s.SolrTestCaseJ4 Writing core.properties file to /home/jenkins/workspace/Lucene-Solr-8.x-Linux/solr/build/solr-core/test/J1/temp/solr.update.PeerSyncTest_210E5D84D603E444-001/tempDir-001/control/cores/collection1
   [junit4]   2> 599173 WARN  (TEST-PeerSyncTest.test-seed#[210E5D84D603E444]) [    ] o.e.j.s.AbstractConnector Ignoring deprecated socket close linger time
   [junit4]   2> 599174 INFO  (TEST-PeerSyncTest.test-seed#[210E5D84D603E444]) [    ] o.a.s.c.s.e.JettySolrRunner Start Jetty (original configured port=0)
   [junit4]   2> 599174 INFO  (TEST-PeerSyncTest.test-seed#[210E5D84D603E444]) [    ] o.a.s.c.s.e.JettySolrRunner Trying to start Jetty on port 0 try number 1 ...
   [junit4]   2> 599174 INFO  (TEST-PeerSyncTest.test-seed#[210E5D84D603E444]) [    ] o.e.j.s.Server jetty-9.4.14.v20181114; built: 2018-11-14T21:20:31.478Z; git: c4550056e785fb5665914545889f21dc136ad9e6; jvm 13-ea+18
   [junit4]   2> 599178 INFO  (TEST-PeerSyncTest.test-seed#[210E5D84D603E444]) [    ] o.e.j.s.session DefaultSessionIdManager workerName=node0
   [junit4]   2> 599178 INFO  (TEST-PeerSyncTest.test-seed#[210E5D84D603E444]) [    ] o.e.j.s.session No SessionScavenger set, using defaults
   [junit4]   2> 599178 INFO  (TEST-PeerSyncTest.test-seed#[210E5D84D603E444]) [    ] o.e.j.s.session node0 Scavenging every 600000ms
   [junit4]   2> 599179 INFO  (TEST-PeerSyncTest.test-seed#[210E5D84D603E444]) [    ] o.e.j.s.h.ContextHandler Started o.e.j.s.ServletContextHandler@56d55272{/,null,AVAILABLE}
   [junit4]   2> 599179 INFO  (TEST-PeerSyncTest.test-seed#[210E5D84D603E444]) [    ] o.e.j.s.AbstractConnector Started ServerConnector@68546a7d{HTTP/1.1,[http/1.1, h2c]}{127.0.0.1:36265}
   [junit4]   2> 599179 INFO  (TEST-PeerSyncTest.test-seed#[210E5D84D603E444]) [    ] o.e.j.s.Server Started @599196ms
   [junit4]   2> 599179 INFO  (TEST-PeerSyncTest.test-seed#[210E5D84D603E444]) [    ] o.a.s.c.s.e.JettySolrRunner Jetty properties: {schema=schema.xml, hostContext=/, solrconfig=solrconfig-tlog.xml, hostPort=36265, coreRootDirectory=/home/jenkins/workspace/Lucene-Solr-8.x-Linux/solr/build/solr-core/test/J1/temp/solr.update.PeerSyncTest_210E5D84D603E444-001/tempDir-001/control/cores}
   [junit4]   2> 599179 ERROR (TEST-PeerSyncTest.test-seed#[210E5D84D603E444]) [    ] o.a.s.u.StartupLoggingUtils Missing Java Option solr.log.dir. Logging may be missing or incomplete.
   [junit4]   2> 599179 INFO  (TEST-PeerSyncTest.test-seed#[210E5D84D603E444]) [    ] o.a.s.s.SolrDispatchFilter Using logger factory org.apache.logging.slf4j.Log4jLoggerFactory
   [junit4]   2> 599179 INFO  (TEST-PeerSyncTest.test-seed#[210E5D84D603E444]) [    ] o.a.s.s.SolrDispatchFilter  ___      _       Welcome to Apache Solr™ version 8.2.0
   [junit4]   2> 599179 INFO  (TEST-PeerSyncTest.test-seed#[210E5D84D603E444]) [    ] o.a.s.s.SolrDispatchFilter / __| ___| |_ _   Starting in standalone mode on port null
   [junit4]   2> 599179 INFO  (TEST-PeerSyncTest.test-seed#[210E5D84D603E444]) [    ] o.a.s.s.SolrDispatchFilter \__ \/ _ \ | '_|  Install dir: null
   [junit4]   2> 599180 INFO  (TEST-PeerSyncTest.test-seed#[210E5D84D603E444]) [    ] o.a.s.s.SolrDispatchFilter |___/\___/_|_|    Start time: 2019-05-01T22:24:06.178997Z
   [junit4]   2> 599180 INFO  (TEST-PeerSyncTest.test-seed#[210E5D84D603E444]) [    ] o.a.s.c.SolrXmlConfig Loading container configuration from /home/jenkins/workspace/Lucene-Solr-8.x-Linux/solr/build/solr-core/test/J1/temp/solr.update.PeerSyncTest_210E5D84D603E444-001/tempDir-001/control/solr.xml
   [junit4]   2> 599182 INFO  (TEST-PeerSyncTest.test-seed#[210E5D84D603E444]) [    ] o.a.s.c.SolrXmlConfig Configuration parameter autoReplicaFailoverWorkLoopDelay is ignored
   [junit4]   2> 599182 INFO  (TEST-PeerSyncTest.test-seed#[210E5D84D603E444]) [    ] o.a.s.c.SolrXmlConfig Configuration parameter autoReplicaFailoverBadNodeExpiration is ignored
   [junit4]   2> 599183 INFO  (TEST-PeerSyncTest.test-seed#[210E5D84D603E444]) [    ] o.a.s.c.SolrXmlConfig MBean server found: com.sun.jmx.mbeanserver.JmxMBeanServer@6da4ea38, but no JMX reporters were configured - adding default JMX reporter.
   [junit4]   2> 599334 INFO  (TEST-PeerSyncTest.test-seed#[210E5D84D603E444]) [    ] o.a.s.h.c.HttpShardHandlerFactory Host whitelist initialized: WhitelistHostChecker [whitelistHosts=null, whitelistHostCheckingEnabled=false]
   [junit4]   2> 599334 WARN  (TEST-PeerSyncTest.test-seed#[210E5D84D603E444]) [    ] o.e.j.u.s.S.config No Client EndPointIdentificationAlgorithm configured for SslContextFactory@19264da7[provider=null,keyStore=null,trustStore=null]
   [junit4]   2> 599336 WARN  (TEST-PeerSyncTest.test-seed#[210E5D84D603E444]) [    ] o.e.j.u.s.S.config No Client EndPointIdentificationAlgorithm configured for SslContextFactory@1a45a061[provider=null,keyStore=null,trustStore=null]
   [junit4]   2> 599344 INFO  (TEST-PeerSyncTest.test-seed#[210E5D84D603E444]) [    ] o.a.s.c.TransientSolrCoreCacheDefault Allocating transient cache for 4 transient cores
   [junit4]   2> 599345 INFO  (TEST-PeerSyncTest.test-seed#[210E5D84D603E444]) [    ] o.a.s.h.a.MetricsHistoryHandler No .system collection, keeping metrics history in memory.
   [junit4]   2> 599356 INFO  (TEST-PeerSyncTest.test-seed#[210E5D84D603E444]) [    ] o.a.s.m.r.SolrJmxReporter JMX monitoring for 'solr.node' (registry 'solr.node') enabled at server: com.sun.jmx.mbeanserver.JmxMBeanServer@6da4ea38
   [junit4]   2> 599363 INFO  (TEST-PeerSyncTest.test-seed#[210E5D84D603E444]) [    ] o.a.s.m.r.SolrJmxReporter JMX monitoring for 'solr.jvm' (registry 'solr.jvm') enabled at server: com.sun.jmx.mbeanserver.JmxMBeanServer@6da4ea38
   [junit4]   2> 599363 INFO  (TEST-PeerSyncTest.test-seed#[210E5D84D603E444]) [    ] o.a.s.m.r.SolrJmxReporter JMX monitoring for 'solr.jetty' (registry 'solr.jetty') enabled at server: com.sun.jmx.mbeanserver.JmxMBeanServer@6da4ea38
   [junit4]   2> 599365 INFO  (TEST-PeerSyncTest.test-seed#[210E5D84D603E444]) [    ] o.a.s.c.CorePropertiesLocator Found 1 core definitions underneath /home/jenkins/workspace/Lucene-Solr-8.x-Linux/solr/build/solr-core/test/J1/temp/solr.update.PeerSyncTest_210E5D84D603E444-001/tempDir-001/control/cores
   [junit4]   2> 599365 INFO  (TEST-PeerSyncTest.test-seed#[210E5D84D603E444]) [    ] o.a.s.c.CorePropertiesLocator Cores are: [collection1]
   [junit4]   2> 599365 INFO  (coreLoadExecutor-3537-thread-1) [    x:collection1] o.a.s.c.SolrResourceLoader [null] Added 2 libs to classloader, from paths: [/home/jenkins/workspace/Lucene-Solr-8.x-Linux/solr/core/src/test-files/solr/collection1/lib, /home/jenkins/workspace/Lucene-Solr-8.x-Linux/solr/core/src/test-files/solr/collection1/lib/classes]
   [junit4]   2> 599377 INFO  (coreLoadExecutor-3537-thread-1) [    x:collection1] o.a.s.c.SolrConfig Using Lucene MatchVersion: 8.2.0
   [junit4]   2> 599392 INFO  (coreLoadExecutor-3537-thread-1) [    x:collection1] o.a.s.s.IndexSchema [collection1] Schema name=test
   [junit4]   2> 599455 INFO  (coreLoadExecutor-3537-thread-1) [    x:collection1] o.a.s.s.IndexSchema Loaded schema test/1.0 with uniqueid field id
   [junit4]   2> 599463 INFO  (coreLoadExecutor-3537-thread-1) [    x:collection1] o.a.s.c.CoreContainer Creating SolrCore 'collection1' using configuration from configset /home/jenkins/workspace/Lucene-Solr-8.x-Linux/solr/core/src/test-files/solr/collection1, trusted=true
   [junit4]   2> 599464 INFO  (coreLoadExecutor-3537-thread-1) [    x:collection1] o.a.s.m.r.SolrJmxReporter JMX monitoring for 'solr.core.collection1' (registry 'solr.core.collection1') enabled at server: com.sun.jmx.mbeanserver.JmxMBeanServer@6da4ea38
   [junit4]   2> 599464 INFO  (coreLoadExecutor-3537-thread-1) [    x:collection1] o.a.s.c.SolrCore [[collection1] ] Opening new SolrCore at [/home/jenkins/workspace/Lucene-Solr-8.x-Linux/solr/core/src/test-files/solr/collection1], dataDir=[/home/jenkins/workspace/Lucene-Solr-8.x-Linux/solr/build/solr-core/test/J1/temp/solr.update.PeerSyncTest_210E5D84D603E444-001/tempDir-001/control/cores/collection1/data/]
   [junit4]   2> 599465 INFO  (coreLoadExecutor-3537-thread-1) [    x:collection1] o.a.s.u.RandomMergePolicy RandomMergePolicy wrapping class org.apache.lucene.index.LogDocMergePolicy: [LogDocMergePolicy: minMergeSize=1000, mergeFactor=27, maxMergeSize=9223372036854775807, maxMergeSizeForForcedMerge=9223372036854775807, calibrateSizeByDeletes=true, maxMergeDocs=2147483647, maxCFSSegmentSizeMB=8.796093022207999E12, noCFSRatio=0.0]
   [junit4]   2> 599466 WARN  (coreLoadExecutor-3537-thread-1) [    x:collection1] o.a.s.c.RequestHandlers INVALID paramSet a in requestHandler {type = requestHandler,name = /dump,class = DumpRequestHandler,attributes = {initParams=a, name=/dump, class=DumpRequestHandler},args = {defaults={a=A,b=B}}}
   [junit4]   2> 599490 INFO  (coreLoadExecutor-3537-thread-1) [    x:collection1] o.a.s.u.UpdateHandler Using UpdateLog implementation: org.apache.solr.update.UpdateLog
   [junit4]   2> 599490 INFO  (coreLoadExecutor-3537-thread-1) [    x:collection1] o.a.s.u.UpdateLog Initializing UpdateLog: dataDir= defaultSyncLevel=FLUSH numRecordsToKeep=100 maxNumLogsToKeep=10 numVersionBuckets=65536
   [junit4]   2> 599491 INFO  (coreLoadExecutor-3537-thread-1) [    x:collection1] o.a.s.u.CommitTracker Hard AutoCommit: disabled
   [junit4]   2> 599491 INFO  (coreLoadExecutor-3537-thread-1) [    x:collection1] o.a.s.u.CommitTracker Soft AutoCommit: disabled
   [junit4]   2> 599492 INFO  (coreLoadExecutor-3537-thread-1) [    x:collection1] o.a.s.u.RandomMergePolicy RandomMergePolicy wrapping class org.apache.lucene.index.TieredMergePolicy: [TieredMergePolicy: maxMergeAtOnce=40, maxMergeAtOnceExplicit=45, maxMergedSegmentMB=49.5654296875, floorSegmentMB=1.212890625, forceMergeDeletesPctAllowed=18.26064651360654, segmentsPerTier=34.0, maxCFSSegmentSizeMB=8.796093022207999E12, noCFSRatio=0.8004516974074918, deletesPctAllowed=23.562549902012847
   [junit4]   2> 599492 INFO  (coreLoadExecutor-3537-thread-1) [    x:collection1] o.a.s.s.SolrIndexSearcher Opening [Searcher@2a6b97ff[collection1] main]
   [junit4]   2> 599492 WARN  (coreLoadExecutor-3537-thread-1) [    x:collection1] o.a.s.r.ManagedResourceStorage Cannot write to config directory /home/jenkins/workspace/Lucene-Solr-8.x-Linux/solr/core/src/test-files/solr/collection1/conf; switching to use InMemory storage instead.
   [junit4]   2> 599492 INFO  (coreLoadExecutor-3537-thread-1) [    x:collection1] o.a.s.h.ReplicationHandler Commits will be reserved for 10000ms.
   [junit4]   2> 599492 INFO  (coreLoadExecutor-3537-thread-1) [    x:collection1] o.a.s.u.UpdateLog Could not find max version in index or recent updates, using new clock 1632370107603746816
   [junit4]   2> 599494 INFO  (searcherExecutor-3538-thread-1-processing-x:collection1) [    x:collection1] o.a.s.c.SolrCore [collection1] Registered new searcher Searcher@2a6b97ff[collection1] main{ExitableDirectoryReader(UninvertingDirectoryReader())}
   [junit4]   2> 599565 INFO  (TEST-PeerSyncTest.test-seed#[210E5D84D603E444]) [    ] o.a.s.SolrTestCaseJ4 Writing core.properties file to /home/jenkins/workspace/Lucene-Solr-8.x-Linux/solr/build/solr-core/test/J1/temp/solr.update.PeerSyncTest_210E5D84D603E444-001/tempDir-001/shard0/cores/collection1
   [junit4]   2> 599566 WARN  (TEST-PeerSyncTest.test-seed#[210E5D84D603E444]) [    ] o.e.j.s.AbstractConnector Ignoring deprecated socket close linger time
   [junit4]   2> 599566 INFO  (TEST-PeerSyncTest.test-seed#[210E5D84D603E444]) [    ] o.a.s.c.s.e.JettySolrRunner Start Jetty (original configured port=0)
   [junit4]   2> 599566 INFO  (TEST-PeerSyncTest.test-seed#[210E5D84D603E444]) [    ] o.a.s.c.s.e.JettySolrRunner Trying to start Jetty on port 0 try number 1 ...
   [junit4]   2> 599566 INFO  (TEST-PeerSyncTest.test-seed#[210E5D84D603E444]) [    ] o.e.j.s.Server jetty-9.4.14.v20181114; built: 2018-11-14T21:20:31.478Z; git: c4550056e785fb5665914545889f21dc136ad9e6; jvm 13-ea+18
   [junit4]   2> 599567 INFO  (TEST-PeerSyncTest.test-seed#[210E5D84D603E444]) [    ] o.e.j.s.session DefaultSessionIdManager workerName=node0
   [junit4]   2> 599567 INFO  (TEST-PeerSyncTest.test-seed#[210E5D84D603E444]) [    ] o.e.j.s.session No SessionScavenger set, using defaults
   [junit4]   2> 599567 INFO  (TEST-PeerSyncTest.test-seed#[210E5D84D603E444]) [    ] o.e.j.s.session node0 Scavenging every 660000ms
   [junit4]   2> 599567 INFO  (TEST-PeerSyncTest.test-seed#[210E5D84D603E444]) [    ] o.e.j.s.h.ContextHandler Started o.e.j.s.ServletContextHandler@79aa6e72{/,null,AVAILABLE}
   [junit4]   2> 599568 INFO  (TEST-PeerSyncTest.test-seed#[210E5D84D603E444]) [    ] o.e.j.s.AbstractConnector Started ServerConnector@69a9eddd{HTTP/1.1,[http/1.1, h2c]}{127.0.0.1:40955}
   [junit4]   2> 599568 INFO  (TEST-PeerSyncTest.test-seed#[210E5D84D603E444]) [    ] o.e.j.s.Server Started @599585ms
   [junit4]   2> 599568 INFO  (TEST-PeerSyncTest.test-seed#[210E5D84D603E444]) [    ] o.a.s.c.s.e.JettySolrRunner Jetty properties: {schema=schema.xml, hostContext=/, solrconfig=solrconfig-tlog.xml, hostPort=40955, coreRootDirectory=/home/jenkins/workspace/Lucene-Solr-8.x-Linux/solr/build/solr-core/test/J1/temp/solr.update.PeerSyncTest_210E5D84D603E444-001/tempDir-001/shard0/cores}
   [junit4]   2> 599568 ERROR (TEST-PeerSyncTest.test-seed#[210E5D84D603E444]) [    ] o.a.s.u.StartupLoggingUtils Missing Java Option solr.log.dir. Logging may be missing or incomplete.
   [junit4]   2> 599568 INFO  (TEST-PeerSyncTest.test-seed#[210E5D84D603E444]) [    ] o.a.s.s.SolrDispatchFilter Using logger factory org.apache.logging.slf4j.Log4jLoggerFactory
   [junit4]   2> 599568 INFO  (TEST-PeerSyncTest.test-seed#[210E5D84D603E444]) [    ] o.a.s.s.SolrDispatchFilter  ___      _       Welcome to Apache Solr™ version 8.2.0
   [junit4]   2> 599568 INFO  (TEST-PeerSyncTest.test-seed#[210E5D84D603E444]) [    ] o.a.s.s.SolrDispatchFilter / __| ___| |_ _   Starting in standalone mode on port null
   [junit4]   2> 599568 INFO  (TEST-PeerSyncTest.test-seed#[210E5D84D603E444]) [    ] o.a.s.s.SolrDispatchFilter \__ \/ _ \ | '_|  Install dir: null
   [junit4]   2> 599568 INFO  (TEST-PeerSyncTest.test-seed#[210E5D84D603E444]) [    ] o.a.s.s.SolrDispatchFilter |___/\___/_|_|    Start time: 2019-05-01T22:24:06.567537Z
   [junit4]   2> 599568 INFO  (TEST-PeerSyncTest.test-seed#[210E5D84D603E444]) [    ] o.a.s.c.SolrXmlConfig Loading container configuration from /home/jenkins/workspace/Lucene-Solr-8.x-Linux/solr/build/solr-core/test/J1/temp/solr.update.PeerSyncTest_210E5D84D603E444-001/tempDir-001/shard0/solr.xml
   [junit4]   2> 599570 INFO  (TEST-PeerSyncTest.test-seed#[210E5D84D603E444]) [    ] o.a.s.c.SolrXmlConfig Configuration parameter autoReplicaFailoverWorkLoopDelay is ignored
   [junit4]   2> 599570 INFO  (TEST-PeerSyncTest.test-seed#[210E5D84D603E444]) [    ] o.a.s.c.SolrXmlConfig Configuration parameter autoReplicaFailoverBadNodeExpiration is ignored
   [junit4]   2> 599571 INFO  (TEST-PeerSyncTest.test-seed#[210E5D84D603E444]) [    ] o.a.s.c.SolrXmlConfig MBean server found: com.sun.jmx.mbeanserver.JmxMBeanServer@6da4ea38, but no JMX reporters were configured - adding default JMX reporter.
   [junit4]   2> 599621 INFO  (TEST-PeerSyncTest.test-seed#[210E5D84D603E444]) [    ] o.a.s.h.c.HttpShardHandlerFactory Host whitelist initialized: WhitelistHostChecker [whitelistHosts=null, whitelistHostCheckingEnabled=false]
   [junit4]   2> 599622 WARN  (TEST-PeerSyncTest.test-seed#[210E5D84D603E444]) [    ] o.e.j.u.s.S.config No Client EndPointIdentificationAlgorithm configured for SslContextFactory@35883735[provider=null,keyStore=null,trustStore=null]
   [junit4]   2> 599624 WARN  (TEST-PeerSyncTest.test-seed#[210E5D84D603E444]) [    ] o.e.j.u.s.S.config No Client EndPointIdentificationAlgorithm configured for SslContextFactory@eb45198[provider=null,keyStore=null,trustStore=null]
   [junit4]   2> 599633 INFO  (TEST-PeerSyncTest.test-seed#[210E5D84D603E444]) [    ] o.a.s.c.TransientSolrCoreCacheDefault Allocating transient cache for 4 transient cores
   [junit4]   2> 599633 INFO  (TEST-PeerSyncTest.test-seed#[210E5D84D603E444]) [    ] o.a.s.h.a.MetricsHistoryHandler No .system collection, keeping metrics history in memory.
   [junit4]   2> 599644 INFO  (TEST-PeerSyncTest.test-seed#[210E5D84D603E444]) [    ] o.a.s.m.r.SolrJmxReporter JMX monitoring for 'solr.node' (registry 'solr.node') enabled at server: com.sun.jmx.mbeanserver.JmxMBeanServer@6da4ea38
   [junit4]   2> 599653 INFO  (TEST-PeerSyncTest.test-seed#[210E5D84D603E444]) [    ] o.a.s.m.r.SolrJmxReporter JMX monitoring for 'solr.jvm' (registry 'solr.jvm') enabled at server: com.sun.jmx.mbeanserver.JmxMBeanServer@6da4ea38
   [junit4]   2> 599653 INFO  (TEST-PeerSyncTest.test-seed#[210E5D84D603E444]) [    ] o.a.s.m.r.SolrJmxReporter JMX monitoring for 'solr.jetty' (registry 'solr.jetty') enabled at server: com.sun.jmx.mbeanserver.JmxMBeanServer@6da4ea38
   [junit4]   2> 599654 INFO  (TEST-PeerSyncTest.test-seed#[210E5D84D603E444]) [    ] o.a.s.c.CorePropertiesLocator Found 1 core definitions underneath /home/jenkins/workspace/Lucene-Solr-8.x-Linux/solr/build/solr-core/test/J1/temp/solr.update.PeerSyncTest_210E5D84D603E444-001/tempDir-001/shard0/cores
   [junit4]   2> 599654 INFO  (TEST-PeerSyncTest.test-seed#[210E5D84D603E444]) [    ] o.a.s.c.CorePropertiesLocator Cores are: [collection1]
   [junit4]   2> 599655 INFO  (coreLoadExecutor-3551-thread-1) [    x:collection1] o.a.s.c.SolrResourceLoader [null] Added 2 libs to classloader, from paths: [/home/jenkins/workspace/Lucene-Solr-8.x-Linux/solr/core/src/test-files/solr/collection1/lib, /home/jenkins/workspace/Lucene-Solr-8.x-Linux/solr/core/src/test-files/solr/collection1/lib/classes]
   [junit4]   2> 599664 INFO  (coreLoadExecutor-3551-thread-1) [    x:collection1] o.a.s.c.SolrConfig Using Lucene MatchVersion: 8.2.0
   [junit4]   2> 599681 INFO  (coreLoadExecutor-3551-thread-1) [    x:collection1] o.a.s.s.IndexSchema [collection1] Schema name=test
   [junit4]   2> 599741 INFO  (coreLoadExecutor-3551-thread-1) [    x:collection1] o.a.s.s.IndexSchema Loaded schema test/1.0 with uniqueid field id
   [junit4]   2> 599747 INFO  (coreLoadExecutor-3551-thread-1) [    x:collection1] o.a.s.c.CoreContainer Creating SolrCore 'collection1' using configuration from configset /home/jenkins/workspace/Lucene-Solr-8.x-Linux/solr/core/src/test-files/solr/collection1, trusted=true
   [junit4]   2> 599747 INFO  (coreLoadExecutor-3551-thread-1) [    x:collection1] o.a.s.m.r.SolrJmxReporter JMX monitoring for 'solr.core.collection1' (registry 'solr.core.collection1') enabled at server: com.sun.jmx.mbeanserver.JmxMBeanServer@6da4ea38
   [junit4]   2> 599747 INFO  (coreLoadExecutor-3551-thread-1) [    x:collection1] o.a.s.c.SolrCore [[collection1] ] Opening new SolrCore at [/home/jenkins/workspace/Lucene-Solr-8.x-Linux/solr/core/src/test-files/solr/collection1], dataDir=[/home/jenkins/workspace/Lucene-Solr-8.x-Linux/solr/build/solr-core/test/J1/temp/solr.update.PeerSyncTest_210E5D84D603E444-001/tempDir-001/shard0/cores/collection1/data/]
   [junit4]   2> 599748 INFO  (coreLoadExecutor-3551-thread-1) [    x:collection1] o.a.s.u.RandomMergePolicy RandomMergePolicy wrapping class org.apache.lucene.index.LogDocMergePolicy: [LogDocMergePolicy: minMergeSize=1000, mergeFactor=27, maxMergeSize=9223372036854775807, maxMergeSizeForForcedMerge=9223372036854775807, calibrateSizeByDeletes=true, maxMergeDocs=2147483647, maxCFSSegmentSizeMB=8.796093022207999E12, noCFSRatio=0.0]
   [junit4]   2> 599749 WARN  (coreLoadExecutor-3551-thread-1) [    x:collection1] o.a.s.c.RequestHandlers INVALID paramSet a in requestHandler {type = requestHandler,name = /dump,class = DumpRequestHandler,attributes = {initParams=a, name=/dump, class=DumpRequestHandler},args = {defaults={a=A,b=B}}}
   [junit4]   2> 599772 INFO  (coreLoadExecutor-3551-thread-1) [    x:collection1] o.a.s.u.UpdateHandler Using UpdateLog implementation: org.apache.solr.update.UpdateLog
   [junit4]   2> 599772 INFO  (coreLoadExecutor-3551-thread-1) [    x:collection1] o.a.s.u.UpdateLog Initializing UpdateLog: dataDir= defaultSyncLevel=FLUSH numRecordsToKeep=100 maxNumLogsToKeep=10 numVersionBuckets=65536
   [junit4]   2> 599773 INFO  (coreLoadExecutor-3551-thread-1) [    x:collection1] o.a.s.u.CommitTracker Hard AutoCommit: disabled
   [junit4]   2> 599773 INFO  (coreLoadExecutor-3551-thread-1) [    x:collection1] o.a.s.u.CommitTracker Soft AutoCommit: disabled
   [junit4]   2> 599774 INFO  (coreLoadExecutor-3551-thread-1) [    x:collection1] o.a.s.u.RandomMergePolicy RandomMergePolicy wrapping class org.apache.lucene.index.TieredMergePolicy: [TieredMergePolicy: maxMergeAtOnce=40, maxMergeAtOnceExplicit=45, maxMergedSegmentMB=49.5654296875, floorSegmentMB=1.212890625, forceMergeDeletesPctAllowed=18.26064651360654, segmentsPerTier=34.0, maxCFSSegmentSizeMB=8.796093022207999E12, noCFSRatio=0.8004516974074918, deletesPctAllowed=23.562549902012847
   [junit4]   2> 599774 INFO  (coreLoadExecutor-3551-thread-1) [    x:collection1] o.a.s.s.SolrIndexSearcher Opening [Searcher@1fde183[collection1] main]
   [junit4]   2> 599774 WARN  (coreLoadExecutor-3551-thread-1) [    x:collection1] o.a.s.r.ManagedResourceStorage Cannot write to config directory /home/jenkins/workspace/Lucene-Solr-8.x-Linux/solr/core/src/test-files/solr/collection1/conf; switching to use InMemory storage instead.
   [junit4]   2> 599774 INFO  (coreLoadExecutor-3551-thread-1) [    x:collection1] o.a.s.h.ReplicationHandler Commits will be reserved for 10000ms.
   [junit4]   2> 599774 INFO  (coreLoadExecutor-3551-thread-1) [    x:collection1] o.a.s.u.UpdateLog Could not find max version in index or recent updates, using new clock 1632370107899445248
   [junit4]   2> 599776 INFO  (searcherExecutor-3552-thread-1-processing-x:collection1) [    x:collection1] o.a.s.c.SolrCore [collection1] Registered new searcher Searcher@1fde183[collection1] main{ExitableDirectoryReader(UninvertingDirectoryReader())}
   [junit4]   2> 599857 INFO  (TEST-PeerSyncTest.test-seed#[210E5D84D603E444]) [    ] o.a.s.SolrTestCaseJ4 Writing core.properties file to /home/jenkins/workspace/Lucene-Solr-8.x-Linux/solr/build/solr-core/test/J1/temp/solr.update.PeerSyncTest_210E5D84D603E444-001/tempDir-001/shard1/cores/collection1
   [junit4]   2> 599858 WARN  (TEST-PeerSyncTest.test-seed#[210E5D84D603E444]) [    ] o.e.j.s.AbstractConnector Ignoring deprecated socket close linger time
   [junit4]   2> 599858 INFO  (TEST-PeerSyncTest.test-seed#[210E5D84D603E444]) [    ] o.a.s.c.s.e.JettySolrRunner Start Jetty (original configured port=0)
   [junit4]   2> 599858 INFO  (TEST-PeerSyncTest.test-seed#[210E5D84D603E444]) [    ] o.a.s.c.s.e.JettySolrRunner Trying to start Jetty on port 0 try number 1 ...
   [junit4]   2> 599858 INFO  (TEST-PeerSyncTest.test-seed#[210E5D84D603E444]) [    ] o.e.j.s.Server jetty-9.4.14.v20181114; built: 2018-11-14T21:20:31.478Z; git: c4550056e785fb5665914545889f21dc136ad9e6; jvm 13-ea+18
   [junit4]   2> 599859 INFO  (TEST-PeerSyncTest.test-seed#[210E5D84D603E444]) [    ] o.e.j.s.session DefaultSessionIdManager workerName=node0
   [junit4]   2> 599859 INFO  (TEST-PeerSyncTest.test-seed#[210E5D84D603E444]) [    ] o.e.j.s.session No SessionScavenger set, using defaults
   [junit4]   2> 599859 INFO  (TEST-PeerSyncTest.test-seed#[210E5D84D603E444]) [    ] o.e.j.s.session node0 Scavenging every 660000ms
   [junit4]   2> 599859 INFO  (TEST-PeerSyncTest.test-seed#[210E5D84D603E444]) [    ] o.e.j.s.h.ContextHandler Started o.e.j.s.ServletContextHandler@f244383{/,null,AVAILABLE}
   [junit4]   2> 599859 INFO  (TEST-PeerSyncTest.test-seed#[210E5D84D603E444]) [    ] o.e.j.s.AbstractConnector Started ServerConnector@44d7bb4e{HTTP/1.1,[http/1.1, h2c]}{127.0.0.1:39175}
   [junit4]   2> 599859 INFO  (TEST-PeerSyncTest.test-seed#[210E5D84D603E444]) [    ] o.e.j.s.Server Started @599876ms
   [junit4]   2> 599859 INFO  (TEST-PeerSyncTest.test-seed#[210E5D84D603E444]) [    ] o.a.s.c.s.e.JettySolrRunner Jetty properties: {schema=schema.xml, hostContext=/, solrconfig=solrconfig-tlog.xml, hostPort=39175, coreRootDirectory=/home/jenkins/workspace/Lucene-Solr-8.x-Linux/solr/build/solr-core/test/J1/temp/solr.update.PeerSyncTest_210E5D84D603E444-001/tempDir-001/shard1/cores}
   [junit4]   2> 599859 ERROR (TEST-PeerSyncTest.test-seed#[210E5D84D603E444]) [    ] o.a.s.u.StartupLoggingUtils Missing Java Option solr.log.dir. Logging may be missing or incomplete.
   [junit4]   2> 599859 INFO  (TEST-PeerSyncTest.test-seed#[210E5D84D603E444]) [    ] o.a.s.s.SolrDispatchFilter Using logger factory org.apache.logging.slf4j.Log4jLoggerFactory
   [junit4]   2> 599859 INFO  (TEST-PeerSyncTest.test-seed#[210E5D84D603E444]) [    ] o.a.s.s.SolrDispatchFilter  ___      _       Welcome to Apache Solr™ version 8.2.0
   [junit4]   2> 599859 INFO  (TEST-PeerSyncTest.test-seed#[210E5D84D603E444]) [    ] o.a.s.s.SolrDispatchFilter / __| ___| |_ _   Starting in standalone mode on port null
   [junit4]   2> 599859 INFO  (TEST-PeerSyncTest.test-seed#[210E5D84D603E444]) [    ] o.a.s.s.SolrDispatchFilter \__ \/ _ \ | '_|  Install dir: null
   [junit4]   2> 599860 INFO  (TEST-PeerSyncTest.test-seed#[210E5D84D603E444]) [    ] o.a.s.s.SolrDispatchFilter |___/\___/_|_|    Start time: 2019-05-01T22:24:06.859001Z
   [junit4]   2> 599860 INFO  (TEST-PeerSyncTest.test-seed#[210E5D84D603E444]) [    ] o.a.s.c.SolrXmlConfig Loading container configuration from /home/jenkins/workspace/Lucene-Solr-8.x-Linux/solr/build/solr-core/test/J1/temp/solr.update.PeerSyncTest_210E5D84D603E444-001/tempDir-001/shard1/solr.xml
   [junit4]   2> 599861 INFO  (TEST-PeerSyncTest.test-seed#[210E5D84D603E444]) [    ] o.a.s.c.SolrXmlConfig Configuration parameter autoReplicaFailoverWorkLoopDelay is ignored
   [junit4]   2> 599861 INFO  (TEST-PeerSyncTest.test-seed#[210E5D84D603E444]) [    ] o.a.s.c.SolrXmlConfig Configuration parameter autoReplicaFailoverBadNodeExpiration is ignored
   [junit4]   2> 599862 INFO  (TEST-PeerSyncTest.test-seed#[210E5D84D603E444]) [    ] o.a.s.c.SolrXmlConfig MBean server found: com.sun.jmx.mbeanserver.JmxMBeanServer@6da4ea38, but no JMX reporters were configured - adding default JMX reporter.
   [junit4]   2> 599933 INFO  (TEST-PeerSyncTest.test-seed#[210E5D84D603E444]) [    ] o.a.s.h.c.HttpShardHandlerFactory Host whitelist initialized: WhitelistHostChecker [whitelistHosts=null, whitelistHostCheckingEnabled=false]
   [junit4]   2> 599934 WARN  (TEST-PeerSyncTest.test-seed#[210E5D84D603E444]) [    ] o.e.j.u.s.S.config No Client EndPointIdentificationAlgorithm configured for SslContextFactory@5d219d4f[provider=null,keyStore=null,trustStore=null]
   [junit4]   2> 599936 WARN  (TEST-PeerSyncTest.test-seed#[210E5D84D603E444]) [    ] o.e.j.u.s.S.config No Client EndPointIdentificationAlgorithm configured for SslContextFactory@bcb1f1e[provider=null,keyStore=null,trustStore=null]
   [junit4]   2> 599949 INFO  (TEST-PeerSyncTest.test-seed#[210E5D84D603E444]) [    ] o.a.s.c.TransientSolrCoreCacheDefault Allocating transient cache for 4 transient cores
   [junit4]   2> 599949 INFO  (TEST-PeerSyncTest.test-seed#[210E5D84D603E444]) [    ] o.a.s.h.a.MetricsHistoryHandler No .system collection, keeping metrics history in memory.
   [junit4]   2> 599967 INFO  (TEST-PeerSyncTest.test-seed#[210E5D84D603E444]) [    ] o.a.s.m.r.SolrJmxReporter JMX monitoring for 'solr.node' (registry 'solr.node') enabled at server: com.sun.jmx.mbeanserver.JmxMBeanServer@6da4ea38
   [junit4]   2> 599983 INFO  (TEST-PeerSyncTest.test-seed#[210E5D84D603E444]) [    ] o.a.s.m.r.SolrJmxReporter JMX monitoring for 'solr.jvm' (registry 'solr.jvm') enabled at server: com.sun.jmx.mbeanserver.JmxMBeanServer@6da4ea38
   [junit4]   2> 599983 INFO  (TEST-PeerSyncTest.test-seed#[210E5D84D603E444]) [    ] o.a.s.m.r.SolrJmxReporter JMX monitoring for 'solr.jetty' (registry 'solr.jetty') enabled at server: com.sun.jmx.mbeanserver.JmxMBeanServer@6da4ea38
   [junit4]   2> 599985 INFO  (TEST-PeerSyncTest.test-seed#[210E5D84D603E444]) [    ] o.a.s.c.CorePropertiesLocator Found 1 core definitions underneath /home/jenkins/workspace/Lucene-Solr-8.x-Linux/solr/build/solr-core/test/J1/temp/solr.update.PeerSyncTest_210E5D84D603E444-001/tempDir-001/shard1/cores
   [junit4]   2> 599985 INFO  (TEST-PeerSyncTest.test-seed#[210E5D84D603E444]) [    ] o.a.s.c.CorePropertiesLocator Cores are: [collection1]
   [junit4]   2> 599985 INFO  (coreLoadExecutor-3565-thread-1) [    x:collection1] o.a.s.c.SolrResourceLoader [null] Added 2 libs to classloader, from paths: [/home/jenkins/workspace/Lucene-Solr-8.x-Linux/solr/core/src/test-files/solr/collection1/lib, /home/jenkins/workspace/Lucene-Solr-8.x-Linux/solr/core/src/test-files/solr/collection1/lib/classes]
   [junit4]   2> 600004 INFO  (coreLoadExecutor-3565-thread-1) [    x:collection1] o.a.s.c.SolrConfig Using Lucene MatchVersion: 8.2.0
   [junit4]   2> 600025 INFO  (coreLoadExecutor-3565-thread-1) [    x:collection1] o.a.s.s.IndexSchema [collection1] Schema name=test
   [junit4]   2> 600102 INFO  (coreLoadExecutor-3565-thread-1) [    x:collection1] o.a.s.s.IndexSchema Loaded schema test/1.0 with uniqueid field id
   [junit4]   2> 600108 INFO  (coreLoadExecutor-3565-thread-1) [    x:collection1] o.a.s.c.CoreContainer Creating SolrCore 'collection1' using configuration from configset /home/jenkins/workspace/Lucene-Solr-8.x-Linux/solr/core/src/test-files/solr/collection1, trusted=true
   [junit4]   2> 600109 INFO  (coreLoadExecutor-3565-thread-1) [    x:collection1] o.a.s.m.r.SolrJmxReporter JMX monitoring for 'solr.core.collection1' (registry 'solr.core.collection1') enabled at server: com.sun.jmx.mbeanserver.JmxMBeanServer@6da4ea38
   [junit4]   2> 600109 INFO  (coreLoadExecutor-3565-thread-1) [    x:collection1] o.a.s.c.SolrCore [[collection1] ] Opening new SolrCore at [/home/jenkins/workspace/Lucene-Solr-8.x-Linux/solr/core/src/test-files/solr/collection1], dataDir=[/home/jenkins/workspace/Lucene-Solr-8.x-Linux/solr/build/solr-core/test/J1/temp/solr.update.PeerSyncTest_210E5D84D603E444-001/tempDir-001/shard1/cores/collection1/data/]
   [junit4]   2> 600110 INFO  (coreLoadExecutor-3565-thread-1) [    x:collection1] o.a.s.u.RandomMergePolicy RandomMergePolicy wrapping class org.apache.lucene.index.LogDocMergePolicy: [LogDocMergePolicy: minMergeSize=1000, mergeFactor=27, maxMergeSize=9223372036854775807, maxMergeSizeForForcedMerge=9223372036854775807, calibrateSizeByDeletes=true, maxMergeDocs=2147483647, maxCFSSegmentSizeMB=8.796093022207999E12, noCFSRatio=0.0]
   [junit4]   2> 600111 WARN  (coreLoadExecutor-3565-thread-1) [    x:collection1] o.a.s.c.RequestHandlers INVALID paramSet a in requestHandler {type = requestHandler,name = /dump,class = DumpRequestHandler,attributes = {initParams=a, name=/dump, class=DumpRequestHandler},args = {defaults={a=A,b=B}}}
   [junit4]   2> 600144 INFO  (coreLoadExecutor-3565-thread-1) [    x:collection1] o.a.s.u.UpdateHandler Using UpdateLog implementation: org.apache.solr.update.UpdateLog
   [junit4]   2> 600144 INFO  (coreLoadExecutor-3565-thread-1) [    x:collection1] o.a.s.u.UpdateLog Initializing UpdateLog: dataDir= defaultSyncLevel=FLUSH numRecordsToKeep=100 maxNumLogsToKeep=10 numVersionBuckets=65536
   [junit4]   2> 600145 INFO  (coreLoadExecutor-3565-thread-1) [    x:collection1] o.a.s.u.CommitTracker Hard AutoCommit: disabled
   [junit4]   2> 600145 INFO  (coreLoadExecutor-3565-thread-1) [    x:collection1] o.a.s.u.CommitTracker Soft AutoCommit: disabled
   [junit4]   2> 600145 INFO  (coreLoadExecutor-3565-thread-1) [    x:collection1] o.a.s.u.RandomMergePolicy RandomMergePolicy wrapping class org.apache.lucene.index.TieredMergePolicy: [TieredMergePolicy: maxMergeAtOnce=40, maxMergeAtOnceExplicit=45, maxMergedSegmentMB=49.5654296875, floorSegmentMB=1.212890625, forceMergeDeletesPctAllowed=18.26064651360654, segmentsPerTier=34.0, maxCFSSegmentSizeMB=8.796093022207999E12, noCFSRatio=0.8004516974074918, deletesPctAllowed=23.562549902012847
   [junit4]   2> 600146 INFO  (coreLoadExecutor-3565-thread-1) [    x:collection1] o.a.s.s.SolrIndexSearcher Opening [Searcher@3c178cb4[collection1] main]
   [junit4]   2> 600146 WARN  (coreLoadExecutor-3565-thread-1) [    x:collection1] o.a.s.r.ManagedResourceStorage Cannot write to config directory /home/jenkins/workspace/Lucene-Solr-8.x-Linux/solr/core/src/test-files/solr/collection1/conf; switching to use InMemory storage instead.
   [junit4]   2> 600146 INFO  (coreLoadExecutor-3565-thread-1) [    x:collection1] o.a.s.h.ReplicationHandler Commits will be reserved for 10000ms.
   [junit4]   2> 600146 INFO  (coreLoadExecutor-3565-thread-1) [    x:collection1] o.a.s.u.UpdateLog Could not find max version in index or recent updates, using new clock 1632370108289515520
   [junit4]   2> 600148 INFO  (searcherExecutor-3566-thread-1-processing-x:collection1) [    x:collection1] o.a.s.c.SolrCore [collection1] Registered new searcher Searcher@3c178cb4[collection1] main{ExitableDirectoryReader(UninvertingDirectoryReader())}
   [junit4]   2> 600221 INFO  (TEST-PeerSyncTest.test-seed#[210E5D84D603E444]) [    ] o.a.s.SolrTestCaseJ4 Writing core.properties file to /home/jenkins/workspace/Lucene-Solr-8.x-Linux/solr/build/solr-core/test/J1/temp/solr.update.PeerSyncTest_210E5D84D603E444-001/tempDir-001/shard2/cores/collection1
   [junit4]   2> 600221 WARN  (TEST-PeerSyncTest.test-seed#[210E5D84D603E444]) [    ] o.e.j.s.AbstractConnector Ignoring deprecated socket close linger time
   [junit4]   2> 600222 INFO  (TEST-PeerSyncTest.test-seed#[210E5D84D603E444]) [    ] o.a.s.c.s.e.JettySolrRunner Start Jetty (original configured port=0)
   [junit4]   2> 600222 INFO  (TEST-PeerSyncTest.test-seed#[210E5D84D603E444]) [    ] o.a.s.c.s.e.JettySolrRunner Trying to start Jetty on port 0 try number 1 ...
   [junit4]   2> 600222 INFO  (TEST-PeerSyncTest.test-seed#[210E5D84D603E444]) [    ] o.e.j.s.Server jetty-9.4.14.v20181114; built: 2018-11-14T21:20:31.478Z; git: c4550056e785fb5665914545889f21dc136ad9e6; jvm 13-ea+18
   [junit4]   2> 600222 INFO  (TEST-PeerSyncTest.test-seed#[210E5D84D603E444]) [    ] o.e.j.s.session DefaultSessionIdManager workerName=node0
   [junit4]   2> 600222 INFO  (TEST-PeerSyncTest.test-seed#[210E5D84D603E444]) [    ] o.e.j.s.session No SessionScavenger set, using defaults
   [junit4]   2> 600222 INFO  (TEST-PeerSyncTest.test-seed#[210E5D84D603E444]) [    ] o.e.j.s.session node0 Scavenging every 600000ms
   [junit4]   2> 600223 INFO  (TEST-PeerSyncTest.test-seed#[210E5D84D603E444]) [    ] o.e.j.s.h.ContextHandler Started o.e.j.s.ServletContextHandler@1567deaf{/,null,AVAILABLE}
   [junit4]   2> 600223 INFO  (TEST-PeerSyncTest.test-seed#[210E5D84D603E444]) [    ] o.e.j.s.AbstractConnector Started ServerConnector@33ed0306{HTTP/1.1,[http/1.1, h2c]}{127.0.0.1:35087}
   [junit4]   2> 600223 INFO  (TEST-PeerSyncTest.test-seed#[210E5D84D603E444]) [    ] o.e.j.s.Server Started @600240ms
   [junit4]   2> 600223 INFO  (TEST-PeerSyncTest.test-seed#[210E5D84D603E444]) [    ] o.a.s.c.s.e.JettySolrRunner Jetty properties: {schema=schema.xml, hostContext=/, solrconfig=solrconfig-tlog.xml, hostPort=35087, coreRootDirectory=/home/jenkins/workspace/Lucene-Solr-8.x-Linux/solr/build/solr-core/test/J1/temp/solr.update.PeerSyncTest_210E5D84D603E444-001/tempDir-001/shard2/cores}
   [junit4]   2> 600223 ERROR (TEST-PeerSyncTest.test-seed#[210E5D84D603E444]) [    ] o.a.s.u.StartupLoggingUtils Missing Java Option solr.log.dir. Logging may be missing or incomplete.
   [junit4]   2> 600223 INFO  (TEST-PeerSyncTest.test-seed#[210E5D84D603E444]) [    ] o.a.s.s.SolrDispatchFilter Using logger factory org.apache.logging.slf4j.Log4jLoggerFactory
   [junit4]   2> 600224 INFO  (TEST-PeerSyncTest.test-seed#[210E5D84D603E444]) [    ] o.a.s.s.SolrDispatchFilter  ___      _       Welcome to Apache Solr™ version 8.2.0
   [junit4]   2> 600224 INFO  (TEST-PeerSyncTest.test-seed#[210E5D84D603E444]) [    ] o.a.s.s.SolrDispatchFilter / __| ___| |_ _   Starting in standalone mode on port null
   [junit4]   2> 600224 INFO  (TEST-PeerSyncTest.test-seed#[210E5D84D603E444]) [    ] o.a.s.s.SolrDispatchFilter \__ \/ _ \ | '_|  Install dir: null
   [junit4]   2> 600224 INFO  (TEST-PeerSyncTest.test-seed#[210E5D84D603E444]) [    ] o.a.s.s.SolrDispatchFilter |___/\___/_|_|    Start time: 2019-05-01T22:24:07.223143Z
   [junit4]   2> 600224 INFO  (TEST-PeerSyncTest.test-seed#[210E5D84D603E444]) [    ] o.a.s.c.SolrXmlConfig Loading container configuration from /home/jenkins/workspace/Lucene-Solr-8.x-Linux/solr/build/solr-core/test/J1/temp/solr.update.PeerSyncTest_210E5D84D603E444-001/tempDir-001/shard2/solr.xml
   [junit4]   2> 600227 INFO  (TEST-PeerSyncTest.test-seed#[210E5D84D603E444]) [    ] o.a.s.c.SolrXmlConfig Configuration parameter autoReplicaFailoverWorkLoopDelay is ignored
   [junit4]   2> 600227 INFO  (TEST-PeerSyncTest.test-seed#[210E5D84D603E444]) [    ] o.a.s.c.SolrXmlConfig Configuration parameter autoReplicaFailoverBadNodeExpiration is ignored
   [junit4]   2> 600227 INFO  (TEST-PeerSyncTest.test-seed#[210E5D84D603E444]) [    ] o.a.s.c.SolrXmlConfig MBean server found: com.sun.jmx.mbeanserver.JmxMBeanServer@6da4ea38, but no JMX reporters were configured - adding default JMX reporter.
   [junit4]   2> 600290 INFO  (TEST-PeerSyncTest.test-seed#[210E5D84D603E444]) [    ] o.a.s.h.c.HttpShardHandlerFactory Host whitelist initialized: WhitelistHostChecker [whitelistHosts=null, whitelistHostCheckingEnabled=false]
   [junit4]   2> 600291 WARN  (TEST-PeerSyncTest.test-seed#[210E5D84D603E444]) [    ] o.e.j.u.s.S.config No Client EndPointIdentificationAlgorithm configured for SslContextFactory@5b49d12[provider=null,keyStore=null,trustStore=null]
   [junit4]   2> 600293 WARN  (TEST-PeerSyncTest.test-seed#[210E5D84D603E444]) [    ] o.e.j.u.s.S.config No Client EndPointIdentificationAlgorithm configured for SslContextFactory@7f73c917[provider=null,keyStore=null,trustStore=null]
   [junit4]   2> 600302 INFO  (TEST-PeerSyncTest.test-seed#[210E5D84D603E444]) [    ] o.a.s.c.TransientSolrCoreCacheDefault Allocating transient cache for 4 transient cores
   [junit4]   2> 600302 INFO  (TEST-PeerSyncTest.test-seed#[210E5D84D603E444]) [    ] o.a.s.h.a.MetricsHistoryHandler No .system collection, keeping metrics history in memory.
   [junit4]   2> 600321 INFO  (TEST-PeerSyncTest.test-seed#[210E5D84D603E444]) [    ] o.a.s.m.r.SolrJmxReporter JMX monitoring for 'solr.node' (registry 'solr.node') enabled at server: com.sun.jmx.mbeanserver.JmxMBeanServer@6da4ea38
   [junit4]   2> 600336 INFO  (TEST-PeerSyncTest.test-seed#[210E5D84D603E444]) [    ] o.a.s.m.r.SolrJmxReporter JMX monitoring for 'solr.jvm' (registry 'solr.jvm') enabled at server: com.sun.jmx.mbeanserver.JmxMBeanServer@6da4ea38
   [junit4]   2> 600336 INFO  (TEST-PeerSyncTest.test-seed#[210E5D84D603E444]) [    ] o.a.s.m.r.SolrJmxReporter JMX monitoring for 'solr.jetty' (registry 'solr.jetty') enabled at server: com.sun.jmx.mbeanserver.JmxMBeanServer@6da4ea38
   [junit4]   2> 600337 INFO  (TEST-PeerSyncTest.test-seed#[210E5D84D603E444]) [    ] o.a.s.c.CorePropertiesLocator Found 1 core definitions underneath /home/jenkins/workspace/Lucene-Solr-8.x-Linux/solr/build/solr-core/test/J1/temp/solr.update.PeerSyncTest_210E5D84D603E444-001/tempDir-001/shard2/cores
   [junit4]   2> 600337 INFO  (TEST-PeerSyncTest.test-seed#[210E5D84D603E444]) [    ] o.a.s.c.CorePropertiesLocator Cores are: [collection1]
   [junit4]   2> 600338 INFO  (coreLoadExecutor-3579-thread-1) [    x:collection1] o.a.s.c.SolrResourceLoader [null] Added 2 libs to classloader, from paths: [/home/jenkins/workspace/Lucene-Solr-8.x-Linux/solr/core/src/test-files/solr/collection1/lib, /home/jenkins/workspace/Lucene-Solr-8.x-Linux/solr/core/src/test-files/solr/collection1/lib/classes]
   [junit4]   2> 600359 INFO  (coreLoadExecutor-3579-thread-1) [    x:collection1] o.a.s.c.SolrConfig Using Lucene MatchVersion: 8.2.0
   [junit4]   2> 600375 INFO  (coreLoadExecutor-3579-thread-1) [    x:collection1] o.a.s.s.IndexSchema [collection1] Schema name=test
   [junit4]   2> 600453 INFO  (coreLoadExecutor-3579-thread-1) [    x:collection1] o.a.s.s.IndexSchema Loaded schema test/1.0 with uniqueid field id
   [junit4]   2> 600461 INFO  (coreLoadExecutor-3579-thread-1) [    x:collection1] o.a.s.c.CoreContainer Creating SolrCore 'collection1' using configuration from configset /home/jenkins/workspace/Lucene-Solr-8.x-Linux/solr/core/src/test-files/solr/collection1, trusted=true
   [junit4]   2> 600461 INFO  (coreLoadExecutor-3579-thread-1) [    x:collection1] o.a.s.m.r.SolrJmxReporter JMX monitoring for 'solr.core.collection1' (registry 'solr.core.collection1') enabled at server: com.sun.jmx.mbeanserver.JmxMBeanServer@6da4ea38
   [junit4]   2> 600461 INFO  (coreLoadExecutor-3579-thread-1) [    x:collection1] o.a.s.c.SolrCore [[collection1] ] Opening new SolrCore at [/home/jenkins/workspace/Lucene-Solr-8.x-Linux/solr/core/src/test-files/solr/collection1], dataDir=[/home/jenkins/workspace/Lucene-Solr-8.x-Linux/solr/build/solr-core/test/J1/temp/solr.update.PeerSyncTest_210E5D84D603E444-001/tempDir-001/shard2/cores/collection1/data/]
   [junit4]   2> 600463 INFO  (coreLoadExecutor-3579-thread-1) [    x:collection1] o.a.s.u.RandomMergePolicy RandomMergePolicy wrapping class org.apache.lucene.index.LogDocMergePolicy: [LogDocMergePolicy: minMergeSize=1000, mergeFactor=27, maxMergeSize=9223372036854775807, maxMergeSizeForForcedMerge=9223372036854775807, calibrateSizeByDeletes=true, maxMergeDocs=2147483647, maxCFSSegmentSizeMB=8.796093022207999E12, noCFSRatio=0.0]
   [junit4]   2> 600464 WARN  (coreLoadExecutor-3579-thread-1) [    x:collection1] o.a.s.c.RequestHandlers INVALID paramSet a in requestHandler {type = requestHandler,name = /dump,class = DumpRequestHandler,attributes = {initParams=a, name=/dump, class=DumpRequestHandler},args = {defaults={a=A,b=B}}}
   [junit4]   2> 600498 INFO  (coreLoadExecutor-3579-thread-1) [    x:collection1] o.a.s.u.UpdateHandler Using UpdateLog implementation: org.apache.solr.update.UpdateLog
   [junit4]   2> 600498 INFO  (coreLoadExecutor-3579-thread-1) [    x:collection1] o.a.s.u.UpdateLog Initializing UpdateLog: dataDir= defaultSyncLevel=FLUSH numRecordsToKeep=100 maxNumLogsToKeep=10 numVersionBuckets=65536
   [junit4]   2> 600513 INFO  (coreLoadExecutor-3579-thread-1) [    x:collection1] o.a.s.u.CommitTracker Hard AutoCommit: disabled
   [junit4]   2> 600513 INFO  (coreLoadExecutor-3579-thread-1) [    x:collection1] o.a.s.u.CommitTracker Soft AutoCommit: disabled
   [junit4]   2> 600513 INFO  (coreLoadExecutor-3579-thread-1) [    x:collection1] o.a.s.u.RandomMergePolicy RandomMergePolicy wrapping class org.apache.lucene.index.TieredMergePolicy: [TieredMergePolicy: maxMergeAtOnce=40, maxMergeAtOnceExplicit=45, maxMergedSegmentMB=49.5654296875, floorSegmentMB=1.212890625, forceMergeDeletesPctAllowed=18.26064651360654, segmentsPerTier=34.0, maxCFSSegmentSizeMB=8.796093022207999E12, noCFSRatio=0.8004516974074918, deletesPctAllowed=23.562549902012847
   [junit4]   2> 600514 INFO  (coreLoadExecutor-3579-thread-1) [    x:collection1] o.a.s.s.SolrIndexSearcher Opening [Searcher@5e711dba[collection1] main]
   [junit4]   2> 600514 WARN  (coreLoadExecutor-3579-thread-1) [    x:collection1] o.a.s.r.ManagedResourceStorage Cannot write to config directory /home/jenkins/workspace/Lucene-Solr-8.x-Linux/solr/core/src/test-files/solr/collection1/conf; switching to use InMemory storage instead.
   [junit4]   2> 600514 INFO  (coreLoadExecutor-3579-thread-1) [    x:collection1] o.a.s.h.ReplicationHandler Commits will be reserved for 10000ms.
   [junit4]   2> 600514 INFO  (coreLoadExecutor-3579-thread-1) [    x:collection1] o.a.s.u.UpdateLog Could not find max version in index or recent updates, using new clock 1632370108675391488
   [junit4]   2> 600516 INFO  (TEST-PeerSyncTest.test-seed#[210E5D84D603E444]) [    ] o.a.s.SolrTestCaseJ4 ###Starting test
   [junit4]   2> 600516 INFO  (searcherExecutor-3580-thread-1-processing-x:collection1) [    x:collection1] o.a.s.c.SolrCore [collection1] Registered new searcher Searcher@5e711dba[collection1] main{ExitableDirectoryReader(UninvertingDirectoryReader())}
   [junit4]   2> 600519 INFO  (qtp462059887-12578) [    x:collection1] o.a.s.u.p.LogUpdateProcessorFactory [collection1]  webapp= path=/update params={update.distrib=FROMLEADER&wt=javabin&version=2}{add=[1 (1)]} 0 1
   [junit4]   2> 600520 INFO  (qtp1113024006-12599) [    x:collection1] o.a.s.u.PeerSync PeerSync: core=collection1 url= START replicas=[http://127.0.0.1:40955/collection1] nUpdates=100
   [junit4]   2> 600526 INFO  (qtp462059887-12577) [    x:collection1] o.a.s.s.SolrIndexSearcher Opening [Searcher@14abc5fc[collection1] realtime]
   [junit4]   2> 600527 INFO  (qtp462059887-12577) [    x:collection1] o.a.s.u.IndexFingerprint IndexFingerprint millis:2.0 result:{maxVersionSpecified=9223372036854775807, maxVersionEncountered=1, maxInHash=1, versionsHash=-5451962507482445012, numVersions=1, numDocs=1, maxDoc=1}
   [junit4]   2> 600527 INFO  (qtp462059887-12577) [    x:collection1] o.a.s.c.S.Request [collection1]  webapp= path=/get params={distrib=false&qt=/get&getFingerprint=9223372036854775807&wt=javabin&version=2} status=0 QTime=2
   [junit4]   2> 600527 INFO  (qtp1113024006-12599) [    x:collection1] o.a.s.u.IndexFingerprint IndexFingerprint millis:0.0 result:{maxVersionSpecified=9223372036854775807, maxVersionEncountered=0, maxInHash=0, versionsHash=0, numVersions=0, numDocs=0, maxDoc=0}
   [junit4]   2> 600527 INFO  (qtp1113024006-12599) [    x:collection1] o.a.s.u.PeerSync PeerSync: core=collection1 url= DONE.  We have no versions.  sync failed.
   [junit4]   2> 600528 INFO  (qtp462059887-12578) [    x:collection1] o.a.s.u.IndexFingerprint IndexFingerprint millis:0.0 result:{maxVersionSpecified=9223372036854775807, maxVersionEncountered=1, maxInHash=1, versionsHash=-5451962507482445012, numVersions=1, numDocs=1, maxDoc=1}
   [junit4]   2> 600528 INFO  (qtp462059887-12578) [    x:collection1] o.a.s.c.S.Request [collection1]  webapp= path=/get params={distrib=false&qt=/get&fingerprint=true&getVersions=100&wt=javabin&version=2} status=0 QTime=0
   [junit4]   2> 600528 INFO  (qtp1113024006-12599) [    x:collection1] o.a.s.c.S.Request [collection1]  webapp= path=/get params={qt=/get&getVersions=100&sync=http://127.0.0.1:40955/collection1&wt=javabin&version=2} status=0 QTime=8
   [junit4]   2> 600529 INFO  (qtp1113024006-12600) [    x:collection1] o.a.s.u.p.LogUpdateProcessorFactory [collection1]  webapp= path=/update params={update.distrib=FROMLEADER&wt=javabin&version=2}{add=[1 (1)]} 0 0
   [junit4]   2> 600530 INFO  (qtp1113024006-12598) [    x:collection1] o.a.s.u.PeerSync PeerSync: core=collection1 url= START replicas=[http://127.0.0.1:40955/collection1] nUpdates=100
   [junit4]   2> 600530 INFO  (qtp462059887-12579) [    x:collection1] o.a.s.u.IndexFingerprint IndexFingerprint millis:0.0 result:{maxVersionSpecified=9223372036854775807, maxVersionEncountered=1, maxInHash=1, versionsHash=-5451962507482445012, numVersions=1, numDocs=1, maxDoc=1}
   [junit4]   2> 600530 INFO  (qtp462059887-12579) [    x:collection1] o.a.s.c.S.Request [collection1]  webapp= path=/get params={distrib=false&qt=/get&getFingerprint=9223372036854775807&wt=javabin&version=2} status=0 QTime=0
   [junit4]   2> 600532 INFO  (qtp1113024006-12598) [    x:collection1] o.a.s.s.SolrIndexSearcher Opening [Searcher@580c37b6[collection1] realtime]
   [junit4]   2> 600532 INFO  (qtp1113024006-12598) [    x:collection1] o.a.s.u.IndexFingerprint IndexFingerprint millis:1.0 result:{maxVersionSpecified=9223372036854775807, maxVersionEncountered=1, maxInHash=1, versionsHash=-5451962507482445012, numVersions=1, numDocs=1, maxDoc=1}
   [junit4]   2> 600532 INFO  (qtp1113024006-12598) [    x:collection1] o.a.s.u.PeerSync We are already in sync. No need to do a PeerSync 
   [junit4]   2> 600532 INFO  (qtp1113024006-12598) [    x:collection1] o.a.s.c.S.Request [collection1]  webapp= path=/get params={qt=/get&getVersions=100&sync=http://127.0.0.1:40955/collection1&wt=javabin&version=2} status=0 QTime=2
   [junit4]   2> 600533 INFO  (qtp462059887-12577) [    x:collection1] o.a.s.u.DirectUpdateHandler2 start commit{_version_=1632370108695314432,optimize=false,openSearcher=true,waitSearcher=true,expungeDeletes=false,softCommit=false,prepareCommit=false}
   [junit4]   2> 600533 INFO  (qtp462059887-12577) [    x:collection1] o.a.s.u.SolrIndexWriter Calling setCommitData with IW:org.apache.solr.update.SolrIndexWriter@4bab367e commitCommandVersion:1632370108695314432
   [junit4]   2> 600534 INFO  (qtp462059887-12577) [    x:collection1] o.a.s.s.SolrIndexSearcher Opening [Searcher@6722c2c0[collection1] main]
   [junit4]   2> 600534 INFO  (qtp462059887-12577) [    x:collection1] o.a.s.u.DirectUpdateHandler2 end_commit_flush
   [junit4]   2> 600535 INFO  (searcherExecutor-3552-thread-1-processing-x:collection1) [    x:collection1] o.a.s.c.SolrCore [collection1] Registered new searcher Searcher@6722c2c0[collection1] main{ExitableDirectoryReader(UninvertingDirectoryReader(Uninverting(_0(8.2.0):c1:[diagnostics={os=Linux, java.vendor=Oracle Corporation, java.version=13-ea, java.vm.version=13-ea+18, lucene.version=8.2.0, os.arch=amd64, java.runtime.version=13-ea+18, source=flush, os.version=4.18.0-17-generic, timestamp=1556749447525}]:[attributes={Lucene50StoredFieldsFormat.mode=BEST_SPEED}])))}
   [junit4]   2> 600535 INFO  (qtp462059887-12577) [    x:collection1] o.a.s.u.p.LogUpdateProcessorFactory [collection1]  webapp= path=/update params={waitSearcher=true&commit=true&softCommit=false&wt=javabin&version=2}{commit=} 0 2
   [junit4]   2> 600535 INFO  (qtp1113024006-12599) [    x:collection1] o.a.s.u.DirectUpdateHandler2 start commit{_version_=1632370108697411584,optimize=false,openSearcher=true,waitSearcher=true,expungeDeletes=false,softCommit=false,prepareCommit=false}
   [junit4]   2> 600535 INFO  (qtp1113024006-12599) [    x:collection1] o.a.s.u.SolrIndexWriter Calling setCommitData with IW:org.apache.solr.update.SolrIndexWriter@567d3631 commitCommandVersion:1632370108697411584
   [junit4]   2> 600537 INFO  (qtp1113024006-12599) [    x:collection1] o.a.s.s.SolrIndexSearcher Opening [Searcher@c66880e[collection1] main]
   [junit4]   2> 600537 INFO  (qtp1113024006-12599) [    x:collection1] o.a.s.u.DirectUpdateHandler2 end_commit_flush
   [junit4]   2> 600538 INFO  (searcherExecutor-3566-thread-1-processing-x:collection1) [    x:collection1] o.a.s.c.SolrCore [collection1] Registered new searcher Searcher@c66880e[collection1] main{ExitableDirectoryReader(UninvertingDirectoryReader(Uninverting(_0(8.2.0):c1:[diagnostics={os=Linux, java.vendor=Oracle Corporation, java.version=13-ea, java.vm.version=13-ea+18, lucene.version=8.2.0, os.arch=amd64, java.runtime.version=13-ea+18, source=flush, os.version=4.18.0-17-generic, timestamp=1556749447530}]:[attributes={Lucene50StoredFieldsFormat.mode=BEST_SPEED}])))}
   [junit4]   2> 600538 INFO  (qtp1113024006-12599) [    x:collection1] o.a.s.u.p.LogUpdateProcessorFactory [collection1]  webapp= path=/update params={waitSearcher=true&commit=true&softCommit=false&wt=javabin&version=2}{commit=} 0 2
   [junit4]   2> 600539 INFO  (qtp462059887-12578) [    x:collection1] o.a.s.c.S.Request [collection1]  webapp= path=/select params={q=*:*&wt=javabin&version=2} hits=1 status=0 QTime=0
   [junit4]   2> 600540 INFO  (qtp1113024006-12600) [    x:collection1] o.a.s.c.S.Request [collection1]  webapp= path=/select params={q=*:*&wt=javabin&version=2} hits=1 status=0 QTime=0
   [junit4]   2> 600542 INFO  (qtp462059887-12579) [    x:collection1] o.a.s.u.p.LogUpdateProcessorFactory [collection1]  webapp= path=/update params={update.distrib=FROMLEADER&wt=javabin&version=2}{add=[2 (2)]} 0 1
   [junit4]   2> 600543 INFO  (qtp1113024006-12598) [    x:collection1] o.a.s.u.PeerSync PeerSync: core=collection1 url= START replicas=[http://127.0.0.1:40955/collection1] nUpdates=100
   [junit4]   2> 600544 INFO  (qtp462059887-12577) [    x:collection1] o.a.s.s.SolrIndexSearcher Opening [Searcher@52a6de96[collection1] realtime]
   [junit4]   2> 600544 INFO  (qtp462059887-12577) [    x:collection1] o.a.s.u.IndexFingerprint IndexFingerprint millis:1.0 result:{maxVersionSpecified=9223372036854775807, maxVersionEncountered=2, maxInHash=2, versionsHash=-1218814014108643565, numVersions=2, numDocs=2, maxDoc=1}
   [junit4]   2> 600544 INFO  (qtp462059887-12577) [    x:collection1] o.a.s.c.S.Request [collection1]  webapp= path=/get params={distrib=false&qt=/get&getFingerprint=9223372036854775807&wt=javabin&version=2} status=0 QTime=1
   [junit4]   2> 600545 INFO  (qtp1113024006-12598) [    x:collection1] o.a.s.u.IndexFingerprint IndexFingerprint millis:0.0 result:{maxVersionSpecified=9223372036854775807, maxVersionEncountered=1, maxInHash=1, versionsHash=-5451962507482445012, numVersions=1, numDocs=1, maxDoc=1}
   [junit4]   2> 600545 INFO  (qtp462059887-12578) [    x:collection1] o.a.s.u.IndexFingerprint IndexFingerprint millis:0.0 result:{maxVersionSpecified=9223372036854775807, maxVersionEncountered=2, maxInHash=2, versionsHash=-1218814014108643565, numVersions=2, numDocs=2, maxDoc=1}
   [junit4]   2> 600545 INFO  (qtp462059887-12578) [    x:collection1] o.a.s.c.S.Request [collection1]  webapp= path=/get params={distrib=false&qt=/get&fingerprint=true&getVersions=100&wt=javabin&version=2} status=0 QTime=0
   [junit4]   2> 600545 INFO  (qtp1113024006-12598) [    x:collection1] o.a.s.u.PeerSync PeerSync: core=collection1 url=  Received 2 versions from http://127.0.0.1:40955/collection1 fingerprint:{maxVersionSpecified=9223372036854775807, maxVersionEncountered=2, maxInHash=2, versionsHash=-1218814014108643565, numVersions=2, numDocs=2, maxDoc=1}
   [junit4]   2> 600546 INFO  (qtp1113024006-12598) [    x:collection1] o.a.s.u.PeerSync PeerSync: core=collection1 url= Requesting updates from http://127.0.0.1:40955/collection1n=1 versions=2
   [junit4]   2> 600547 INFO  (qtp462059887-12579) [    x:collection1] o.a.s.u.IndexFingerprint IndexFingerprint millis:0.0 result:{maxVersionSpecified=2, maxVersionEncountered=2, maxInHash=2, versionsHash=-1218814014108643565, numVersions=2, numDocs=2, maxDoc=1}
   [junit4]   2> 600547 INFO  (qtp462059887-12579) [    x:collection1] o.a.s.c.S.Request [collection1]  webapp= path=/get params={getUpdates=2&distrib=false&qt=/get&fingerprint=true&onlyIfActive=false&wt=javabin&version=2} status=0 QTime=0
   [junit4]   2> 600548 INFO  (qtp1113024006-12598) [    x:collection1] o.a.s.u.p.LogUpdateProcessorFactory [collection1] {add=[2 (2)]} 0 1
   [junit4]   2> 600550 INFO  (qtp1113024006-12598) [    x:collection1] o.a.s.s.SolrIndexSearcher Opening [Searcher@33cfc9f0[collection1] realtime]
   [junit4]   2> 600550 INFO  (qtp1113024006-12598) [    x:collection1] o.a.s.u.IndexFingerprint IndexFingerprint millis:1.0 result:{maxVersionSpecified=2, maxVersionEncountered=2, maxInHash=2, versionsHash=-1218814014108643565, numVersions=2, numDocs=2, maxDoc=1}
   [junit4]   2> 600550 INFO  (qtp1113024006-12598) [    x:collection1] o.a.s.u.PeerSync Fingerprint comparison: 0
   [junit4]   2> 600550 INFO  (qtp1113024006-12598) [    x:collection1] o.a.s.u.PeerSync PeerSync: core=collection1 url= DONE. sync succeeded
   [junit4]   2> 600550 INFO  (qtp1113024006-12598) [    x:collection1] o.a.s.c.S.Request [collection1]  webapp= path=/get params={qt=/get&getVersions=100&sync=http://127.0.0.1:40955/collection1&wt=javabin&version=2} status=0 QTime=7
   [junit4]   2> 600550 INFO  (qtp462059887-12577) [    x:collection1] o.a.s.u.DirectUpdateHandler2 start commit{_version_=1632370108713140224,optimize=false,openSearcher=true,waitSearcher=true,expungeDeletes=false,softCommit=false,prepareCommit=false}
   [junit4]   2> 600551 INFO  (qtp462059887-12577) [    x:collection1] o.a.s.u.SolrIndexWriter Calling setCommitData with IW:org.apache.solr.update.SolrIndexWriter@4bab367e commitCommandVersion:1632370108713140224
   [junit4]   2> 600551 INFO  (qtp462059887-12577) [    x:collection1] o.a.s.s.SolrIndexSearcher Opening [Searcher@4b6f6b23[collection1] main]
   [junit4]   2> 600551 INFO  (qtp462059887-12577) [    x:collection1] o.a.s.u.DirectUpdateHandler2 end_commit_flush
   [junit4]   2> 600552 INFO  (searcherExecutor-3552-thread-1-processing-x:collection1) [    x:collection1] o.a.s.c.SolrCore [collection1] Registered new searcher Searcher@4b6f6b23[collection1] main{ExitableDirectoryReader(UninvertingDirectoryReader(Uninverting(_0(8.2.0):c1:[diagnostics={os=Linux, java.vendor=Oracle Corporation, java.version=13-ea, java.vm.version=13-ea+18, lucene.version=8.2.0, os.arch=amd64, java.runtime.version=13-ea+18, source=flush, os.version=4.18.0-17-generic, timestamp=1556749447525}]:[attributes={Lucene50StoredFieldsFormat.mode=BEST_SPEED}]) Uninverting(_1(8.2.0):c1:[diagnostics={os=Linux, java.vendor=Oracle Corporation, java.version=13-ea, java.vm.version=13-ea+18, lucene.version=8.2.0, os.arch=amd64, java.runtime.version=13-ea+18, source=flush, os.version=4.18.0-17-generic, timestamp=1556749447543}]:[attributes={Lucene50StoredFieldsFormat.mode=BEST_SPEED}])))}
   [junit4]   2> 600552 INFO  (qtp462059887-12577) [    x:collection1] o.a.s.u.p.LogUpdateProcessorFactory [collection1]  webapp= path=/update params={waitSearcher=true&commit=true&softCommit=false&wt=javabin&version=2}{commit=} 0 1
   [junit4]   2> 600553 INFO  (qtp1113024006-12599) [    x:collection1] o.a.s.u.DirectUpdateHandler2 start commit{_version_=1632370108716285952,optimize=false,openSearcher=true,waitSearcher=true,expungeDeletes=false,softCommit=false,prepareCommit=false}
   [junit4]   2> 600553 INFO  (qtp1113024006-12599) [    x:collection1] o.a.s.u.SolrIndexWriter Calling setCommitData with IW:org.apache.solr.update.SolrIndexWriter@567d3631 commitCommandVersion:1632370108716285952
   [junit4]   2> 600553 INFO  (qtp1113024006-12599) [    x:collection1] o.a.s.s.SolrIndexSearcher Opening [Searcher@7e1c0a39[collection1] main]
   [junit4]   2> 600553 INFO  (qtp1113024006-12599) [    x:collection1] o.a.s.u.DirectUpdateHandler2 end_commit_flush
   [junit4]   2> 600555 INFO  (searcherExecutor-3566-thread-1-processing-x:collection1) [    x:collection1] o.a.s.c.SolrCore [collection1] Registered new searcher Searcher@7e1c0a39[collection1] main{ExitableDirectoryReader(UninvertingDirectoryReader(Uninverting(_0(8.2.0):c1:[diagnostics={os=Linux, java.vendor=Oracle Corporation, java.version=13-ea, java.vm.version=13-ea+18, lucene.version=8.2.0, os.arch=amd64, java.runtime.version=13-ea+18, source=flush, os.version=4.18.0-17-generic, timestamp=1556749447530}]:[attributes={Lucene50StoredFieldsFormat.mode=BEST_SPEED}]) Uninverting(_1(8.2.0):c1:[diagnostics={os=Linux, java.vendor=Oracle Corporation, java.version=13-ea, java.vm.version=13-ea+18, lucene.version=8.2.0, os.arch=amd64, java.runtime.version=13-ea+18, source=flush, os.version=4.18.0-17-generic, timestamp=1556749447548}]:[attributes={Lucene50StoredFieldsFormat.mode=BEST_SPEED}])))}
   [junit4]   2> 600555 INFO  (qtp1113024006-12599) [    x:collection1] o.a.s.u.p.LogUpdateProcessorFactory [collection1]  webapp= path=/update params={waitSearcher=true&commit=true&softCommit=false&wt=javabin&version=2}{commit=} 0 2
   [junit4]   2> 600555 INFO  (qtp462059887-12578) [    x:collection1] o.a.s.c.S.Request [collection1]  webapp= path=/select params={q=*:*&wt=javabin&version=2} hits=2 status=0 QTime=0
   [junit4]   2> 600556 INFO  (qtp1113024006-12600) [    x:collection1] o.a.s.c.S.Request [collection1]  webapp= path=/select params={q=*:*&wt=javabin&version=2} hits=2 status=0 QTime=0
   [junit4]   2> 600558 INFO  (qtp462059887-12579) [    x:collection1] o.a.s.u.p.LogUpdateProcessorFactory [collection1]  webapp= path=/update params={update.distrib=FROMLEADER&wt=javabin&version=2}{add=[3 (3)]} 0 1
   [junit4]   2> 600559 INFO  (qtp462059887-12577) [    x:collection1] o.a.s.u.p.LogUpdateProcessorFactory [collection1]  webapp= path=/update params={update.distrib=FROMLEADER&wt=javabin&version=2}{add=[4 (4)]} 0 0
   [junit4]   2> 600560 INFO  (qtp462059887-12578) [    x:collection1] o.a.s.u.p.LogUpdateProcessorFactory [collection1]  webapp= path=/update params={update.distrib=FROMLEADER&wt=javabin&version=2}{add=[5 (5)]} 0 0
   [junit4]   2> 600561 INFO  (qtp462059887-12579) [    x:collection1] o.a.s.u.p.LogUpdateProcessorFactory [collection1]  webapp= path=/update params={update.distrib=FROMLEADER&wt=javabin&version=2}{add=[6 (6)]} 0 0
   [junit4]   2> 600561 INFO  (qtp462059887-12577) [    x:collection1] o.a.s.u.p.LogUpdateProcessorFactory [collection1]  webapp= path=/update params={update.distrib=FROMLEADER&wt=javabin&version=2}{add=[7 (7)]} 0 0
   [junit4]   2> 600562 INFO  (qtp462059887-12578) [    x:collection1] o.a.s.u.p.LogUpdateProcessorFactory [collection1]  webapp= path=/update params={update.distrib=FROMLEADER&wt=javabin&version=2}{add=[8 (8)]} 0 0
   [junit4]   2> 600563 INFO  (qtp462059887-12579) [    x:collection1] o.a.s.u.p.LogUpdateProcessorFactory [collection1]  webapp= path=/update params={update.distrib=FROMLEADER&wt=javabin&version=2}{add=[9 (9)]} 0 0
   [junit4]   2> 600564 INFO  (qtp462059887-12577) [    x:collection1] o.a.s.u.p.LogUpdateProcessorFactory [collection1]  webapp= path=/update params={update.distrib=FROMLEADER&wt=javabin&version=2}{add=[10 (10)]} 0 0
   [junit4]   2> 600564 INFO  (qtp1113024006-12598) [    x:collection1] o.a.s.u.PeerSync PeerSync: core=collection1 url= START replicas=[http://127.0.0.1:40955/collection1] nUpdates=100
   [junit4]   2> 600567 INFO  (qtp462059887-12578) [    x:collection1] o.a.s.s.SolrIndexSearcher Opening [Searcher@76cf66ce[collection1] realtime]
   [junit4]   2> 600568 INFO  (qtp462059887-12578) [    x:collection1] o.a.s.u.IndexFingerprint IndexFingerprint millis:3.0 result:{maxVersionSpecified=9223372036854775807, maxVersionEncountered=10, maxInHash=10, versionsHash=-5671163287542876028, numVersions=10, numDocs=10, maxDoc=8}
   [junit4]   2> 600568 INFO  (qtp462059887-12578) [    x:collection1] o.a.s.c.S.Request [collection1]  webapp= path=/get params={distrib=false&qt=/get&getFingerprint=9223372036854775807&wt=javabin&version=2} status=0 QTime=3
   [junit4]   2> 600568 INFO  (qtp1113024006-12598) [    x:collection1] o.a.s.u.IndexFingerprint IndexFingerprint millis:0.0 result:{maxVersionSpecified=9223372036854775807, maxVersionEncountered=2, maxInHash=2, versionsHash=-1218814014108643565, numVersions=2, numDocs=2, maxDoc=1}
   [junit4]   2> 600569 INFO  (qtp462059887-12579) [    x:collection1] o.a.s.u.IndexFingerprint IndexFingerprint millis:0.0 result:{maxVersionSpecified=9223372036854775807, maxVersionEncountered=10, maxInHash=10, versionsHash=-5671163287542876028, numVersions=10, numDocs=10, maxDoc=8}
   [junit4]   2> 600569 INFO  (qtp462059887-12579) [    x:collection1] o.a.s.c.S.Request [collection1]  webapp= path=/get params={distrib=false&qt=/get&fingerprint=true&getVersions=100&wt=javabin&version=2} status=0 QTime=0
   [junit4]   2> 600569 INFO  (qtp1113024006-12598) [    x:collection1] o.a.s.u.PeerSync PeerSync: core=collection1 url=  Received 10 versions from http://127.0.0.1:40955/collection1 fingerprint:{maxVersionSpecified=9223372036854775807, maxVersionEncountered=10, maxInHash=10, versionsHash=-5671163287542876028, numVersions=10, numDocs=10, maxDoc=8}
   [junit4]   2> 600569 INFO  (qtp1113024006-12598) [    x:collection1] o.a.s.u.PeerSync PeerSync: core=collection1 url= Requesting updates from http://127.0.0.1:40955/collection1n=8 versions=10,9,8,7,6,5,4,3
   [junit4]   2> 600569 INFO  (qtp462059887-12577) [    x:collection1] o.a.s.u.IndexFingerprint IndexFingerprint millis:0.0 result:{maxVersionSpecified=10, maxVersionEncountered=10, maxInHash=10, versionsHash=-5671163287542876028, numVersions=10, numDocs=10, maxDoc=8}
   [junit4]   2> 600570 INFO  (qtp462059887-12577) [    x:collection1] o.a.s.c.S.Request [collection1]  webapp= path=/get params={getUpdates=10,9,8,7,6,5,4,3&distrib=false&qt=/get&fingerprint=true&onlyIfActive=false&wt=javabin&version=2} status=0 QTime=0
   [junit4]   2> 600573 INFO  (qtp1113024006-12598) [    x:collection1] o.a.s.u.p.LogUpdateProcessorFactory [collection1] {add=[3 (3), 4 (4), 5 (5), 6 (6), 7 (7), 8 (8), 9 (9), 10 (10)]} 0 3
   [junit4]   2> 600575 INFO  (qtp1113024006-12598) [    x:collection1] o.a.s.s.SolrIndexSearcher Opening [Searcher@1dc65dd7[collection1] realtime]
   [junit4]   2> 600576 INFO  (qtp1113024006-12598) [    x:collection1] o.a.s.u.IndexFingerprint IndexFingerprint millis:2.0 result:{maxVersionSpecified=10, maxVersionEncountered=10, maxInHash=10, versionsHash=-5671163287542876028, numVersions=10, numDocs=10, maxDoc=8}
   [junit4]   2> 600576 INFO  (qtp1113024006-12598) [    x:collection1] o.a.s.u.PeerSync Fingerprint comparison: 0
   [junit4]   2> 600576 INFO  (qtp1113024006-12598) [    x:collection1] o.a.s.u.PeerSync PeerSync: core=collection1 url= DONE. sync succeeded
   [junit4]   2> 600576 INFO  (qtp1113024006-12598) [    x:collection1] o.a.s.c.S.Request [collection1]  webapp= path=/get params={qt=/get&getVersions=100&sync=http://127.0.0.1:40955/collection1&wt=javabin&version=2} status=0 QTime=11
   [junit4]   2> 600576 INFO  (qtp462059887-12578) [    x:collection1] o.a.s.u.DirectUpdateHandler2 start commit{_version_=1632370108740403200,optimize=false,openSearcher=true,waitSearcher=true,expungeDeletes=false,softCommit=false,prepareCommit=false}
   [junit4]   2> 600577 INFO  (qtp462059887-12578) [    x:collection1] o.a.s.u.SolrIndexWriter Calling setCommitData with IW:org.apache.solr.update.SolrIndexWriter@4bab367e commitCommandVersion:1632370108740403200
   [junit4]   2> 600577 INFO  (qtp462059887-12578) [    x:collection1]

[...truncated too long message...]

    ] o.a.s.m.r.SolrJmxReporter Closing reporter [org.apache.solr.metrics.reporters.SolrJmxReporter@d75e031: rootName = null, domain = solr.node, service url = null, agent id = null] for registry solr.node / com.codahale.metrics.MetricRegistry@2b1ac867
   [junit4]   2> 2243132 INFO  (SUITE-PeerSyncWithLeaderTest-seed#[210E5D84D603E444]-worker) [    ] o.a.s.m.SolrMetricManager Closing metric reporters for registry=solr.jvm, tag=null
   [junit4]   2> 2243132 INFO  (SUITE-PeerSyncWithLeaderTest-seed#[210E5D84D603E444]-worker) [    ] o.a.s.m.r.SolrJmxReporter Closing reporter [org.apache.solr.metrics.reporters.SolrJmxReporter@57cade68: rootName = null, domain = solr.jvm, service url = null, agent id = null] for registry solr.jvm / com.codahale.metrics.MetricRegistry@606a4bdf
   [junit4]   2> 2243133 INFO  (SUITE-PeerSyncWithLeaderTest-seed#[210E5D84D603E444]-worker) [    ] o.a.s.m.SolrMetricManager Closing metric reporters for registry=solr.jetty, tag=null
   [junit4]   2> 2243133 INFO  (SUITE-PeerSyncWithLeaderTest-seed#[210E5D84D603E444]-worker) [    ] o.a.s.m.r.SolrJmxReporter Closing reporter [org.apache.solr.metrics.reporters.SolrJmxReporter@1ac7c414: rootName = null, domain = solr.jetty, service url = null, agent id = null] for registry solr.jetty / com.codahale.metrics.MetricRegistry@790d0a62
   [junit4]   2> NOTE: leaving temporary files on disk at: /home/jenkins/workspace/Lucene-Solr-8.x-Linux/solr/build/solr-core/test/J0/temp/solr.update.PeerSyncWithLeaderTest_210E5D84D603E444-001
   [junit4]   2> NOTE: test params are: codec=Asserting(Lucene80), sim=Asserting(org.apache.lucene.search.similarities.AssertingSimilarity@5d6e252a), locale=pa-Arab, timezone=CET
   [junit4]   2> NOTE: Linux 4.18.0-17-generic amd64/Oracle Corporation 13-ea (64-bit)/cpus=8,threads=1,free=201527408,total=405798912
   [junit4]   2> NOTE: All tests run in this JVM: [TestPrepRecovery, BufferStoreTest, MetricTriggerTest, SubstringBytesRefFilterTest, TestSafeXMLParsing, ReturnFieldsTest, TestQuerySenderListener, ChaosMonkeySafeLeaderWithPullReplicasTest, TestCustomSort, TestStressLucene, TestExportWriter, CollectionReloadTest, CdcrOpsAndBoundariesTest, TestUpdate, DataDrivenBlockJoinTest, DistributedUpdateProcessorTest, SearchHandlerTest, TlogReplayBufferedWhileIndexingTest, TestJettySolrRunner, CachingDirectoryFactoryTest, TestCloudNestedDocsSort, PreAnalyzedFieldManagedSchemaCloudTest, HttpPartitionOnCommitTest, TestManagedSchemaThreadSafety, TestRandomDVFaceting, SampleTest, ForceLeaderWithTlogReplicasTest, AtomicUpdateProcessorFactoryTest, TestLockTree, HighlighterConfigTest, TestSolrConfigHandlerCloud, RollingRestartTest, EchoParamsTest, TestSolrCloudSnapshots, TestImpersonationWithHadoopAuth, TestRandomFlRTGCloud, TestHashPartitioner, AddReplicaTest, LeaderVoteWaitTimeoutTest, UpdateParamsTest, TestXmlQParserPlugin, NodeMutatorTest, AnalysisAfterCoreReloadTest, IndexBasedSpellCheckerTest, BlobRepositoryCloudTest, BooleanFieldTest, BaseCdcrDistributedZkTest, RequestLoggingTest, TestHalfAndHalfDocValues, QueryEqualityTest, XsltUpdateRequestHandlerTest, TestSolrQueryParser, DateMathParserTest, RuleEngineTest, DeleteLastCustomShardedReplicaTest, PathHierarchyTokenizerFactoryTest, TestManagedResourceStorage, TestTrieFacet, UUIDUpdateProcessorFallbackTest, TestCloudPivotFacet, TestDistributedMap, TestAnalyzedSuggestions, TestFreeTextSuggestions, TestTestInjection, TestFilteredDocIdSet, TimeRoutedAliasUpdateProcessorTest, TestCrossCoreJoin, DocValuesMissingTest, ExplicitHLLTest, TestBinaryField, ShardRoutingCustomTest, TestCopyFieldCollectionResource, ShowFileRequestHandlerTest, ZkSolrClientTest, TestRestoreCore, TestMacros, LeaderFailoverAfterPartitionTest, TestDynamicLoading, QueryElevationComponentTest, TestInPlaceUpdatesStandalone, TestCloudSchemaless, MultiSolrCloudTestCaseTest, AutoAddReplicasIntegrationTest, WordBreakSolrSpellCheckerTest, TestLazyCores, TestReRankQParserPlugin, TestRequestForwarding, TestPseudoReturnFields, MaxSizeAutoCommitTest, TestUnInvertedFieldException, SolrSlf4jReporterTest, TestBinaryResponseWriter, ClassificationUpdateProcessorTest, TestJsonFacetRefinement, TestConfigSets, IndexSchemaTest, DistributedFacetPivotLargeTest, FacetPivotSmallTest, TestTlogReplica, TestAtomicUpdateErrorCases, DistributedDebugComponentTest, HdfsWriteToMultipleCollectionsTest, ComputePlanActionTest, CollectionsAPIDistributedZkTest, TestDFISimilarityFactory, ConjunctionSolrSpellCheckerTest, CSVRequestHandlerTest, SpatialHeatmapFacetsTest, TestSubQueryTransformerCrossCore, TestJsonFacetsWithNestedObjects, NumericFieldsTest, AddBlockUpdateTest, HdfsCollectionsAPIDistributedZkTest, TestCoreBackup, TestLRUStatsCache, BigEndianAscendingWordDeserializerTest, TestShortCircuitedRequests, SolrCoreCheckLockOnStartupTest, TestMaxTokenLenTokenizer, HdfsChaosMonkeySafeLeaderTest, TestExtendedDismaxParser, TestSimNodeLostTrigger, TestRawTransformer, HdfsThreadLeakTest, RequestHandlersTest, SimplePostToolTest, TestInitQParser, TestSolrDeletionPolicy1, ReindexCollectionTest, TestLegacyNumericRangeQueryBuilder, TestLocalFSCloudBackupRestore, TestInPlaceUpdateWithRouteField, TestDocBasedVersionConstraints, TestDocTermOrds, TestLegacyTerms, BlockJoinFacetRandomTest, TestMinMaxOnMultiValuedField, TestSimGenericDistributedQueue, RestoreTriggerStateTest, AuthToolTest, TestFieldTypeResource, DistributedSpellCheckComponentTest, TestDocumentBuilder, TestGroupingSearch, TestHighlightDedupGrouping, TestJoin, TestSolrCoreProperties, TestTolerantSearch, TestTrie, TestDeprecatedFilters, TestLuceneMatchVersion, TestWordDelimiterFilterFactory, TestEmbeddedSolrServerAdminHandler, TestEmbeddedSolrServerConstructors, TestEmbeddedSolrServerSchemaAPI, BasicDistributedZk2Test, BasicZkTest, ChaosMonkeyNothingIsSafeTest, ChaosMonkeyNothingIsSafeWithPullReplicasTest, CloudExitableDirectoryReaderTest, CollectionPropsTest, ConcurrentCreateRoutedAliasTest, ConfigSetsAPITest, ConnectionManagerTest, CreateCollectionCleanupTest, CreateRoutedAliasTest, DeleteInactiveReplicaTest, DeleteShardTest, DeleteStatusTest, DistribCursorPagingTest, DistributedVersionInfoTest, MetricsHistoryWithAuthIntegrationTest, MigrateRouteKeyTest, OverseerTest, PeerSyncReplicationTest, SyncSliceTest, TestCloudSearcherWarming, TestStressInPlaceUpdates, TestUtilizeNode, VMParamsZkACLAndCredentialsProvidersTest, ZkCLITest, TestCollectionsAPIViaSolrCloudCluster, IndexSizeTriggerTest, MetricTriggerIntegrationTest, TestPolicyCloud, TestSimClusterStateProvider, TestSimComputePlanAction, TestSimDistribStateManager, TestSimDistributedQueue, CdcrWithNodesRestartsTest, HDFSCollectionsAPITest, TestCustomStream, MoreLikeThisHandlerTest, PingRequestHandlerTest, TestReplicationHandlerBackup, TestReqParamsAPI, CoreAdminHandlerTest, LukeRequestHandlerTest, MetricsHandlerTest, MetricsHistoryHandlerTest, CustomTermsComponentTest, DistributedMLTComponentTest, DistributedQueryElevationComponentTest, StatsComponentTest, TermVectorComponentDistributedTest, Tagger2Test, TaggingAttributeTest, FastVectorHighlighterTest, UninvertDocValuesMergePolicyTest, TestLegacyField, TestLegacyNumericUtils, TestNumericTokenStream, TestLogWatcher, JvmMetricsTest, MetricsConfigTest, SolrCoreMetricManagerTest, SolrMetricManagerTest, SolrMetricReporterTest, SolrGraphiteReporterTest, SolrRrdBackendFactoryTest, RegexBytesRefFilterTest, SimpleFacetsTest, TestRemoteStreaming, TestStreamBody, TestGeoJSONResponseWriter, TestGraphMLResponseWriter, TestJavabinTupleStreamParser, TestPHPSerializedResponseWriter, TestPushWriter, TestRawResponseWriter, TestChildDocTransformer, TestChildDocTransformerHierarchy, TestSubQueryTransformer, TestFieldCollectionResource, TestFieldTypeCollectionResource, TestSchemaVersionResource, TestManagedStopFilterFactory, BadCopyFieldTest, BadIndexSchemaTest, EnumFieldTest, IndexSchemaRuntimeFieldTest, SchemaApiFailureTest, SynonymTokenizerTest, TestSchemaManager, TestSchemalessBufferedUpdates, TestSortableTextField, TestUseDocValuesAsStored, TestPayloadScoreQParserPlugin, TestRecoveryHdfs, TestSimpleQParserPlugin, TestSolr4Spatial, DistanceFunctionTest, TestScoreJoinQPScore, CloudMLTQParserTest, MultiDestinationAuditLoggerTest, PKIAuthenticationIntegrationTest, TestRuleBasedAuthorizationPlugin, TestDelegationWithHadoopAuth, NoCacheHeaderTest, ResponseHeaderTest, SolrRequestParserTest, SpellPossibilityIteratorTest, SpellingQueryConverterTest, TestSuggestSpellingConverter, SuggesterWFSTTest, BlockCacheTest, TestFieldCacheSortRandom, TestFieldCacheWithThreads, TestLegacyFieldCache, TestNumericTerms32, TestUninvertingReader, PeerSyncWithLeaderAndIndexFingerprintCachingTest, PeerSyncWithLeaderTest]
   [junit4] Completed [855/855 (2!)] on J0 in 138.30s, 1 test, 1 failure <<< FAILURES!

[...truncated 8986 lines...]
BUILD FAILED
/home/jenkins/workspace/Lucene-Solr-8.x-Linux/build.xml:634: The following error occurred while executing this line:
/home/jenkins/workspace/Lucene-Solr-8.x-Linux/build.xml:128: Found 1 violations in source files (File uses Mockito but has no assumeWorkingMockito() call).

Total time: 80 minutes 31 seconds
Build step 'Invoke Ant' marked build as failure
Archiving artifacts
Setting ANT_1_8_2_HOME=/home/jenkins/tools/hudson.tasks.Ant_AntInstallation/ANT_1.8.2
[WARNINGS] Skipping publisher since build result is FAILURE
Recording test results
Setting ANT_1_8_2_HOME=/home/jenkins/tools/hudson.tasks.Ant_AntInstallation/ANT_1.8.2
Email was triggered for: Failure - Any
Sending email for trigger: Failure - Any
Setting ANT_1_8_2_HOME=/home/jenkins/tools/hudson.tasks.Ant_AntInstallation/ANT_1.8.2
Setting ANT_1_8_2_HOME=/home/jenkins/tools/hudson.tasks.Ant_AntInstallation/ANT_1.8.2
Setting ANT_1_8_2_HOME=/home/jenkins/tools/hudson.tasks.Ant_AntInstallation/ANT_1.8.2
Setting ANT_1_8_2_HOME=/home/jenkins/tools/hudson.tasks.Ant_AntInstallation/ANT_1.8.2
Setting ANT_1_8_2_HOME=/home/jenkins/tools/hudson.tasks.Ant_AntInstallation/ANT_1.8.2
Setting ANT_1_8_2_HOME=/home/jenkins/tools/hudson.tasks.Ant_AntInstallation/ANT_1.8.2

Mime
View raw message