lucene-dev mailing list archives

Site index · List index
Message view « Date » · « Thread »
Top « Date » · « Thread »
From Policeman Jenkins Server <jenk...@thetaphi.de>
Subject [JENKINS-EA] Lucene-Solr-master-Windows (64bit/jdk-13-ea+18) - Build # 7924 - Unstable!
Date Fri, 03 May 2019 12:19:17 GMT
Build: https://jenkins.thetaphi.de/job/Lucene-Solr-master-Windows/7924/
Java: 64bit/jdk-13-ea+18 -XX:-UseCompressedOops -XX:+UseConcMarkSweepGC

12 tests failed.
FAILED:  junit.framework.TestSuite.org.apache.solr.update.processor.DistributedUpdateProcessorTest

Error Message:
SOLR-11606: ByteBuddy used by Mockito is not working with this JVM version.

Stack Trace:
org.junit.AssumptionViolatedException: SOLR-11606: ByteBuddy used by Mockito is not working with this JVM version.
	at __randomizedtesting.SeedInfo.seed([30181438F713F982]:0)
	at com.carrotsearch.randomizedtesting.RandomizedTest.assumeNoException(RandomizedTest.java:742)
	at org.apache.solr.SolrTestCaseJ4.assumeWorkingMockito(SolrTestCaseJ4.java:374)
	at org.apache.solr.update.processor.DistributedUpdateProcessorTest.beforeClass(DistributedUpdateProcessorTest.java:60)
	at java.base/jdk.internal.reflect.NativeMethodAccessorImpl.invoke0(Native Method)
	at java.base/jdk.internal.reflect.NativeMethodAccessorImpl.invoke(NativeMethodAccessorImpl.java:62)
	at java.base/jdk.internal.reflect.DelegatingMethodAccessorImpl.invoke(DelegatingMethodAccessorImpl.java:43)
	at java.base/java.lang.reflect.Method.invoke(Method.java:567)
	at com.carrotsearch.randomizedtesting.RandomizedRunner.invoke(RandomizedRunner.java:1750)
	at com.carrotsearch.randomizedtesting.RandomizedRunner$6.evaluate(RandomizedRunner.java:878)
	at com.carrotsearch.randomizedtesting.RandomizedRunner$7.evaluate(RandomizedRunner.java:894)
	at com.carrotsearch.randomizedtesting.rules.StatementAdapter.evaluate(StatementAdapter.java:36)
	at com.carrotsearch.randomizedtesting.rules.SystemPropertiesRestoreRule$1.evaluate(SystemPropertiesRestoreRule.java:57)
	at org.apache.lucene.util.AbstractBeforeAfterRule$1.evaluate(AbstractBeforeAfterRule.java:45)
	at com.carrotsearch.randomizedtesting.rules.StatementAdapter.evaluate(StatementAdapter.java:36)
	at org.apache.lucene.util.TestRuleStoreClassName$1.evaluate(TestRuleStoreClassName.java:41)
	at com.carrotsearch.randomizedtesting.rules.NoShadowingOrOverridesOnMethodsRule$1.evaluate(NoShadowingOrOverridesOnMethodsRule.java:40)
	at com.carrotsearch.randomizedtesting.rules.NoShadowingOrOverridesOnMethodsRule$1.evaluate(NoShadowingOrOverridesOnMethodsRule.java:40)
	at com.carrotsearch.randomizedtesting.rules.StatementAdapter.evaluate(StatementAdapter.java:36)
	at com.carrotsearch.randomizedtesting.rules.StatementAdapter.evaluate(StatementAdapter.java:36)
	at org.apache.lucene.util.TestRuleAssertionsRequired$1.evaluate(TestRuleAssertionsRequired.java:53)
	at org.apache.lucene.util.TestRuleMarkFailure$1.evaluate(TestRuleMarkFailure.java:47)
	at org.apache.lucene.util.TestRuleIgnoreAfterMaxFailures$1.evaluate(TestRuleIgnoreAfterMaxFailures.java:64)
	at org.apache.lucene.util.TestRuleIgnoreTestSuites$1.evaluate(TestRuleIgnoreTestSuites.java:54)
	at com.carrotsearch.randomizedtesting.rules.StatementAdapter.evaluate(StatementAdapter.java:36)
	at com.carrotsearch.randomizedtesting.ThreadLeakControl$StatementRunner.run(ThreadLeakControl.java:368)
	at java.base/java.lang.Thread.run(Thread.java:835)
Caused by: java.lang.IllegalArgumentException: Unknown Java version: 13
	at net.bytebuddy.ClassFileVersion.ofJavaVersion(ClassFileVersion.java:210)
	at net.bytebuddy.ClassFileVersion$VersionLocator$ForJava9CapableVm.locate(ClassFileVersion.java:462)
	at net.bytebuddy.ClassFileVersion.ofThisVm(ClassFileVersion.java:223)
	at java.base/jdk.internal.reflect.NativeMethodAccessorImpl.invoke0(Native Method)
	at java.base/jdk.internal.reflect.NativeMethodAccessorImpl.invoke(NativeMethodAccessorImpl.java:62)
	at java.base/jdk.internal.reflect.DelegatingMethodAccessorImpl.invoke(DelegatingMethodAccessorImpl.java:43)
	at java.base/java.lang.reflect.Method.invoke(Method.java:567)
	at org.apache.solr.SolrTestCaseJ4.assumeWorkingMockito(SolrTestCaseJ4.java:372)
	... 24 more


FAILED:  junit.framework.TestSuite.org.apache.solr.update.processor.DistributedUpdateProcessorTest

Error Message:


Stack Trace:
java.lang.NullPointerException
	at __randomizedtesting.SeedInfo.seed([30181438F713F982]:0)
	at org.apache.solr.update.processor.DistributedUpdateProcessorTest.AfterClass(DistributedUpdateProcessorTest.java:67)
	at java.base/jdk.internal.reflect.NativeMethodAccessorImpl.invoke0(Native Method)
	at java.base/jdk.internal.reflect.NativeMethodAccessorImpl.invoke(NativeMethodAccessorImpl.java:62)
	at java.base/jdk.internal.reflect.DelegatingMethodAccessorImpl.invoke(DelegatingMethodAccessorImpl.java:43)
	at java.base/java.lang.reflect.Method.invoke(Method.java:567)
	at com.carrotsearch.randomizedtesting.RandomizedRunner.invoke(RandomizedRunner.java:1750)
	at com.carrotsearch.randomizedtesting.RandomizedRunner$7.evaluate(RandomizedRunner.java:901)
	at com.carrotsearch.randomizedtesting.rules.StatementAdapter.evaluate(StatementAdapter.java:36)
	at com.carrotsearch.randomizedtesting.rules.SystemPropertiesRestoreRule$1.evaluate(SystemPropertiesRestoreRule.java:57)
	at org.apache.lucene.util.AbstractBeforeAfterRule$1.evaluate(AbstractBeforeAfterRule.java:45)
	at com.carrotsearch.randomizedtesting.rules.StatementAdapter.evaluate(StatementAdapter.java:36)
	at org.apache.lucene.util.TestRuleStoreClassName$1.evaluate(TestRuleStoreClassName.java:41)
	at com.carrotsearch.randomizedtesting.rules.NoShadowingOrOverridesOnMethodsRule$1.evaluate(NoShadowingOrOverridesOnMethodsRule.java:40)
	at com.carrotsearch.randomizedtesting.rules.NoShadowingOrOverridesOnMethodsRule$1.evaluate(NoShadowingOrOverridesOnMethodsRule.java:40)
	at com.carrotsearch.randomizedtesting.rules.StatementAdapter.evaluate(StatementAdapter.java:36)
	at com.carrotsearch.randomizedtesting.rules.StatementAdapter.evaluate(StatementAdapter.java:36)
	at org.apache.lucene.util.TestRuleAssertionsRequired$1.evaluate(TestRuleAssertionsRequired.java:53)
	at org.apache.lucene.util.TestRuleMarkFailure$1.evaluate(TestRuleMarkFailure.java:47)
	at org.apache.lucene.util.TestRuleIgnoreAfterMaxFailures$1.evaluate(TestRuleIgnoreAfterMaxFailures.java:64)
	at org.apache.lucene.util.TestRuleIgnoreTestSuites$1.evaluate(TestRuleIgnoreTestSuites.java:54)
	at com.carrotsearch.randomizedtesting.rules.StatementAdapter.evaluate(StatementAdapter.java:36)
	at com.carrotsearch.randomizedtesting.ThreadLeakControl$StatementRunner.run(ThreadLeakControl.java:368)
	at java.base/java.lang.Thread.run(Thread.java:835)


FAILED:  junit.framework.TestSuite.org.apache.solr.update.processor.DistributedUpdateProcessorTest

Error Message:
SOLR-11606: ByteBuddy used by Mockito is not working with this JVM version.

Stack Trace:
org.junit.AssumptionViolatedException: SOLR-11606: ByteBuddy used by Mockito is not working with this JVM version.
	at __randomizedtesting.SeedInfo.seed([30181438F713F982]:0)
	at com.carrotsearch.randomizedtesting.RandomizedTest.assumeNoException(RandomizedTest.java:742)
	at org.apache.solr.SolrTestCaseJ4.assumeWorkingMockito(SolrTestCaseJ4.java:374)
	at org.apache.solr.update.processor.DistributedUpdateProcessorTest.beforeClass(DistributedUpdateProcessorTest.java:60)
	at java.base/jdk.internal.reflect.NativeMethodAccessorImpl.invoke0(Native Method)
	at java.base/jdk.internal.reflect.NativeMethodAccessorImpl.invoke(NativeMethodAccessorImpl.java:62)
	at java.base/jdk.internal.reflect.DelegatingMethodAccessorImpl.invoke(DelegatingMethodAccessorImpl.java:43)
	at java.base/java.lang.reflect.Method.invoke(Method.java:567)
	at com.carrotsearch.randomizedtesting.RandomizedRunner.invoke(RandomizedRunner.java:1750)
	at com.carrotsearch.randomizedtesting.RandomizedRunner$6.evaluate(RandomizedRunner.java:878)
	at com.carrotsearch.randomizedtesting.RandomizedRunner$7.evaluate(RandomizedRunner.java:894)
	at com.carrotsearch.randomizedtesting.rules.StatementAdapter.evaluate(StatementAdapter.java:36)
	at com.carrotsearch.randomizedtesting.rules.SystemPropertiesRestoreRule$1.evaluate(SystemPropertiesRestoreRule.java:57)
	at org.apache.lucene.util.AbstractBeforeAfterRule$1.evaluate(AbstractBeforeAfterRule.java:45)
	at com.carrotsearch.randomizedtesting.rules.StatementAdapter.evaluate(StatementAdapter.java:36)
	at org.apache.lucene.util.TestRuleStoreClassName$1.evaluate(TestRuleStoreClassName.java:41)
	at com.carrotsearch.randomizedtesting.rules.NoShadowingOrOverridesOnMethodsRule$1.evaluate(NoShadowingOrOverridesOnMethodsRule.java:40)
	at com.carrotsearch.randomizedtesting.rules.NoShadowingOrOverridesOnMethodsRule$1.evaluate(NoShadowingOrOverridesOnMethodsRule.java:40)
	at com.carrotsearch.randomizedtesting.rules.StatementAdapter.evaluate(StatementAdapter.java:36)
	at com.carrotsearch.randomizedtesting.rules.StatementAdapter.evaluate(StatementAdapter.java:36)
	at org.apache.lucene.util.TestRuleAssertionsRequired$1.evaluate(TestRuleAssertionsRequired.java:53)
	at org.apache.lucene.util.TestRuleMarkFailure$1.evaluate(TestRuleMarkFailure.java:47)
	at org.apache.lucene.util.TestRuleIgnoreAfterMaxFailures$1.evaluate(TestRuleIgnoreAfterMaxFailures.java:64)
	at org.apache.lucene.util.TestRuleIgnoreTestSuites$1.evaluate(TestRuleIgnoreTestSuites.java:54)
	at com.carrotsearch.randomizedtesting.rules.StatementAdapter.evaluate(StatementAdapter.java:36)
	at com.carrotsearch.randomizedtesting.ThreadLeakControl$StatementRunner.run(ThreadLeakControl.java:368)
	at java.base/java.lang.Thread.run(Thread.java:835)
Caused by: java.lang.IllegalArgumentException: Unknown Java version: 13
	at net.bytebuddy.ClassFileVersion.ofJavaVersion(ClassFileVersion.java:210)
	at net.bytebuddy.ClassFileVersion$VersionLocator$ForJava9CapableVm.locate(ClassFileVersion.java:462)
	at net.bytebuddy.ClassFileVersion.ofThisVm(ClassFileVersion.java:223)
	at java.base/jdk.internal.reflect.NativeMethodAccessorImpl.invoke0(Native Method)
	at java.base/jdk.internal.reflect.NativeMethodAccessorImpl.invoke(NativeMethodAccessorImpl.java:62)
	at java.base/jdk.internal.reflect.DelegatingMethodAccessorImpl.invoke(DelegatingMethodAccessorImpl.java:43)
	at java.base/java.lang.reflect.Method.invoke(Method.java:567)
	at org.apache.solr.SolrTestCaseJ4.assumeWorkingMockito(SolrTestCaseJ4.java:372)
	... 24 more


FAILED:  junit.framework.TestSuite.org.apache.solr.update.processor.DistributedUpdateProcessorTest

Error Message:


Stack Trace:
java.lang.NullPointerException
	at __randomizedtesting.SeedInfo.seed([30181438F713F982]:0)
	at org.apache.solr.update.processor.DistributedUpdateProcessorTest.AfterClass(DistributedUpdateProcessorTest.java:67)
	at java.base/jdk.internal.reflect.NativeMethodAccessorImpl.invoke0(Native Method)
	at java.base/jdk.internal.reflect.NativeMethodAccessorImpl.invoke(NativeMethodAccessorImpl.java:62)
	at java.base/jdk.internal.reflect.DelegatingMethodAccessorImpl.invoke(DelegatingMethodAccessorImpl.java:43)
	at java.base/java.lang.reflect.Method.invoke(Method.java:567)
	at com.carrotsearch.randomizedtesting.RandomizedRunner.invoke(RandomizedRunner.java:1750)
	at com.carrotsearch.randomizedtesting.RandomizedRunner$7.evaluate(RandomizedRunner.java:901)
	at com.carrotsearch.randomizedtesting.rules.StatementAdapter.evaluate(StatementAdapter.java:36)
	at com.carrotsearch.randomizedtesting.rules.SystemPropertiesRestoreRule$1.evaluate(SystemPropertiesRestoreRule.java:57)
	at org.apache.lucene.util.AbstractBeforeAfterRule$1.evaluate(AbstractBeforeAfterRule.java:45)
	at com.carrotsearch.randomizedtesting.rules.StatementAdapter.evaluate(StatementAdapter.java:36)
	at org.apache.lucene.util.TestRuleStoreClassName$1.evaluate(TestRuleStoreClassName.java:41)
	at com.carrotsearch.randomizedtesting.rules.NoShadowingOrOverridesOnMethodsRule$1.evaluate(NoShadowingOrOverridesOnMethodsRule.java:40)
	at com.carrotsearch.randomizedtesting.rules.NoShadowingOrOverridesOnMethodsRule$1.evaluate(NoShadowingOrOverridesOnMethodsRule.java:40)
	at com.carrotsearch.randomizedtesting.rules.StatementAdapter.evaluate(StatementAdapter.java:36)
	at com.carrotsearch.randomizedtesting.rules.StatementAdapter.evaluate(StatementAdapter.java:36)
	at org.apache.lucene.util.TestRuleAssertionsRequired$1.evaluate(TestRuleAssertionsRequired.java:53)
	at org.apache.lucene.util.TestRuleMarkFailure$1.evaluate(TestRuleMarkFailure.java:47)
	at org.apache.lucene.util.TestRuleIgnoreAfterMaxFailures$1.evaluate(TestRuleIgnoreAfterMaxFailures.java:64)
	at org.apache.lucene.util.TestRuleIgnoreTestSuites$1.evaluate(TestRuleIgnoreTestSuites.java:54)
	at com.carrotsearch.randomizedtesting.rules.StatementAdapter.evaluate(StatementAdapter.java:36)
	at com.carrotsearch.randomizedtesting.ThreadLeakControl$StatementRunner.run(ThreadLeakControl.java:368)
	at java.base/java.lang.Thread.run(Thread.java:835)


FAILED:  junit.framework.TestSuite.org.apache.solr.update.processor.DistributedUpdateProcessorTest

Error Message:
SOLR-11606: ByteBuddy used by Mockito is not working with this JVM version.

Stack Trace:
org.junit.AssumptionViolatedException: SOLR-11606: ByteBuddy used by Mockito is not working with this JVM version.
	at __randomizedtesting.SeedInfo.seed([30181438F713F982]:0)
	at com.carrotsearch.randomizedtesting.RandomizedTest.assumeNoException(RandomizedTest.java:742)
	at org.apache.solr.SolrTestCaseJ4.assumeWorkingMockito(SolrTestCaseJ4.java:374)
	at org.apache.solr.update.processor.DistributedUpdateProcessorTest.beforeClass(DistributedUpdateProcessorTest.java:60)
	at java.base/jdk.internal.reflect.NativeMethodAccessorImpl.invoke0(Native Method)
	at java.base/jdk.internal.reflect.NativeMethodAccessorImpl.invoke(NativeMethodAccessorImpl.java:62)
	at java.base/jdk.internal.reflect.DelegatingMethodAccessorImpl.invoke(DelegatingMethodAccessorImpl.java:43)
	at java.base/java.lang.reflect.Method.invoke(Method.java:567)
	at com.carrotsearch.randomizedtesting.RandomizedRunner.invoke(RandomizedRunner.java:1750)
	at com.carrotsearch.randomizedtesting.RandomizedRunner$6.evaluate(RandomizedRunner.java:878)
	at com.carrotsearch.randomizedtesting.RandomizedRunner$7.evaluate(RandomizedRunner.java:894)
	at com.carrotsearch.randomizedtesting.rules.StatementAdapter.evaluate(StatementAdapter.java:36)
	at com.carrotsearch.randomizedtesting.rules.SystemPropertiesRestoreRule$1.evaluate(SystemPropertiesRestoreRule.java:57)
	at org.apache.lucene.util.AbstractBeforeAfterRule$1.evaluate(AbstractBeforeAfterRule.java:45)
	at com.carrotsearch.randomizedtesting.rules.StatementAdapter.evaluate(StatementAdapter.java:36)
	at org.apache.lucene.util.TestRuleStoreClassName$1.evaluate(TestRuleStoreClassName.java:41)
	at com.carrotsearch.randomizedtesting.rules.NoShadowingOrOverridesOnMethodsRule$1.evaluate(NoShadowingOrOverridesOnMethodsRule.java:40)
	at com.carrotsearch.randomizedtesting.rules.NoShadowingOrOverridesOnMethodsRule$1.evaluate(NoShadowingOrOverridesOnMethodsRule.java:40)
	at com.carrotsearch.randomizedtesting.rules.StatementAdapter.evaluate(StatementAdapter.java:36)
	at com.carrotsearch.randomizedtesting.rules.StatementAdapter.evaluate(StatementAdapter.java:36)
	at org.apache.lucene.util.TestRuleAssertionsRequired$1.evaluate(TestRuleAssertionsRequired.java:53)
	at org.apache.lucene.util.TestRuleMarkFailure$1.evaluate(TestRuleMarkFailure.java:47)
	at org.apache.lucene.util.TestRuleIgnoreAfterMaxFailures$1.evaluate(TestRuleIgnoreAfterMaxFailures.java:64)
	at org.apache.lucene.util.TestRuleIgnoreTestSuites$1.evaluate(TestRuleIgnoreTestSuites.java:54)
	at com.carrotsearch.randomizedtesting.rules.StatementAdapter.evaluate(StatementAdapter.java:36)
	at com.carrotsearch.randomizedtesting.ThreadLeakControl$StatementRunner.run(ThreadLeakControl.java:368)
	at java.base/java.lang.Thread.run(Thread.java:835)
Caused by: java.lang.IllegalArgumentException: Unknown Java version: 13
	at net.bytebuddy.ClassFileVersion.ofJavaVersion(ClassFileVersion.java:210)
	at net.bytebuddy.ClassFileVersion$VersionLocator$ForJava9CapableVm.locate(ClassFileVersion.java:462)
	at net.bytebuddy.ClassFileVersion.ofThisVm(ClassFileVersion.java:223)
	at java.base/jdk.internal.reflect.NativeMethodAccessorImpl.invoke0(Native Method)
	at java.base/jdk.internal.reflect.NativeMethodAccessorImpl.invoke(NativeMethodAccessorImpl.java:62)
	at java.base/jdk.internal.reflect.DelegatingMethodAccessorImpl.invoke(DelegatingMethodAccessorImpl.java:43)
	at java.base/java.lang.reflect.Method.invoke(Method.java:567)
	at org.apache.solr.SolrTestCaseJ4.assumeWorkingMockito(SolrTestCaseJ4.java:372)
	... 24 more


FAILED:  junit.framework.TestSuite.org.apache.solr.update.processor.DistributedUpdateProcessorTest

Error Message:


Stack Trace:
java.lang.NullPointerException
	at __randomizedtesting.SeedInfo.seed([30181438F713F982]:0)
	at org.apache.solr.update.processor.DistributedUpdateProcessorTest.AfterClass(DistributedUpdateProcessorTest.java:67)
	at java.base/jdk.internal.reflect.NativeMethodAccessorImpl.invoke0(Native Method)
	at java.base/jdk.internal.reflect.NativeMethodAccessorImpl.invoke(NativeMethodAccessorImpl.java:62)
	at java.base/jdk.internal.reflect.DelegatingMethodAccessorImpl.invoke(DelegatingMethodAccessorImpl.java:43)
	at java.base/java.lang.reflect.Method.invoke(Method.java:567)
	at com.carrotsearch.randomizedtesting.RandomizedRunner.invoke(RandomizedRunner.java:1750)
	at com.carrotsearch.randomizedtesting.RandomizedRunner$7.evaluate(RandomizedRunner.java:901)
	at com.carrotsearch.randomizedtesting.rules.StatementAdapter.evaluate(StatementAdapter.java:36)
	at com.carrotsearch.randomizedtesting.rules.SystemPropertiesRestoreRule$1.evaluate(SystemPropertiesRestoreRule.java:57)
	at org.apache.lucene.util.AbstractBeforeAfterRule$1.evaluate(AbstractBeforeAfterRule.java:45)
	at com.carrotsearch.randomizedtesting.rules.StatementAdapter.evaluate(StatementAdapter.java:36)
	at org.apache.lucene.util.TestRuleStoreClassName$1.evaluate(TestRuleStoreClassName.java:41)
	at com.carrotsearch.randomizedtesting.rules.NoShadowingOrOverridesOnMethodsRule$1.evaluate(NoShadowingOrOverridesOnMethodsRule.java:40)
	at com.carrotsearch.randomizedtesting.rules.NoShadowingOrOverridesOnMethodsRule$1.evaluate(NoShadowingOrOverridesOnMethodsRule.java:40)
	at com.carrotsearch.randomizedtesting.rules.StatementAdapter.evaluate(StatementAdapter.java:36)
	at com.carrotsearch.randomizedtesting.rules.StatementAdapter.evaluate(StatementAdapter.java:36)
	at org.apache.lucene.util.TestRuleAssertionsRequired$1.evaluate(TestRuleAssertionsRequired.java:53)
	at org.apache.lucene.util.TestRuleMarkFailure$1.evaluate(TestRuleMarkFailure.java:47)
	at org.apache.lucene.util.TestRuleIgnoreAfterMaxFailures$1.evaluate(TestRuleIgnoreAfterMaxFailures.java:64)
	at org.apache.lucene.util.TestRuleIgnoreTestSuites$1.evaluate(TestRuleIgnoreTestSuites.java:54)
	at com.carrotsearch.randomizedtesting.rules.StatementAdapter.evaluate(StatementAdapter.java:36)
	at com.carrotsearch.randomizedtesting.ThreadLeakControl$StatementRunner.run(ThreadLeakControl.java:368)
	at java.base/java.lang.Thread.run(Thread.java:835)


FAILED:  junit.framework.TestSuite.org.apache.solr.update.processor.DistributedUpdateProcessorTest

Error Message:
SOLR-11606: ByteBuddy used by Mockito is not working with this JVM version.

Stack Trace:
org.junit.AssumptionViolatedException: SOLR-11606: ByteBuddy used by Mockito is not working with this JVM version.
	at __randomizedtesting.SeedInfo.seed([30181438F713F982]:0)
	at com.carrotsearch.randomizedtesting.RandomizedTest.assumeNoException(RandomizedTest.java:742)
	at org.apache.solr.SolrTestCaseJ4.assumeWorkingMockito(SolrTestCaseJ4.java:374)
	at org.apache.solr.update.processor.DistributedUpdateProcessorTest.beforeClass(DistributedUpdateProcessorTest.java:60)
	at java.base/jdk.internal.reflect.NativeMethodAccessorImpl.invoke0(Native Method)
	at java.base/jdk.internal.reflect.NativeMethodAccessorImpl.invoke(NativeMethodAccessorImpl.java:62)
	at java.base/jdk.internal.reflect.DelegatingMethodAccessorImpl.invoke(DelegatingMethodAccessorImpl.java:43)
	at java.base/java.lang.reflect.Method.invoke(Method.java:567)
	at com.carrotsearch.randomizedtesting.RandomizedRunner.invoke(RandomizedRunner.java:1750)
	at com.carrotsearch.randomizedtesting.RandomizedRunner$6.evaluate(RandomizedRunner.java:878)
	at com.carrotsearch.randomizedtesting.RandomizedRunner$7.evaluate(RandomizedRunner.java:894)
	at com.carrotsearch.randomizedtesting.rules.StatementAdapter.evaluate(StatementAdapter.java:36)
	at com.carrotsearch.randomizedtesting.rules.SystemPropertiesRestoreRule$1.evaluate(SystemPropertiesRestoreRule.java:57)
	at org.apache.lucene.util.AbstractBeforeAfterRule$1.evaluate(AbstractBeforeAfterRule.java:45)
	at com.carrotsearch.randomizedtesting.rules.StatementAdapter.evaluate(StatementAdapter.java:36)
	at org.apache.lucene.util.TestRuleStoreClassName$1.evaluate(TestRuleStoreClassName.java:41)
	at com.carrotsearch.randomizedtesting.rules.NoShadowingOrOverridesOnMethodsRule$1.evaluate(NoShadowingOrOverridesOnMethodsRule.java:40)
	at com.carrotsearch.randomizedtesting.rules.NoShadowingOrOverridesOnMethodsRule$1.evaluate(NoShadowingOrOverridesOnMethodsRule.java:40)
	at com.carrotsearch.randomizedtesting.rules.StatementAdapter.evaluate(StatementAdapter.java:36)
	at com.carrotsearch.randomizedtesting.rules.StatementAdapter.evaluate(StatementAdapter.java:36)
	at org.apache.lucene.util.TestRuleAssertionsRequired$1.evaluate(TestRuleAssertionsRequired.java:53)
	at org.apache.lucene.util.TestRuleMarkFailure$1.evaluate(TestRuleMarkFailure.java:47)
	at org.apache.lucene.util.TestRuleIgnoreAfterMaxFailures$1.evaluate(TestRuleIgnoreAfterMaxFailures.java:64)
	at org.apache.lucene.util.TestRuleIgnoreTestSuites$1.evaluate(TestRuleIgnoreTestSuites.java:54)
	at com.carrotsearch.randomizedtesting.rules.StatementAdapter.evaluate(StatementAdapter.java:36)
	at com.carrotsearch.randomizedtesting.ThreadLeakControl$StatementRunner.run(ThreadLeakControl.java:368)
	at java.base/java.lang.Thread.run(Thread.java:835)
Caused by: java.lang.IllegalArgumentException: Unknown Java version: 13
	at net.bytebuddy.ClassFileVersion.ofJavaVersion(ClassFileVersion.java:210)
	at net.bytebuddy.ClassFileVersion$VersionLocator$ForJava9CapableVm.locate(ClassFileVersion.java:462)
	at net.bytebuddy.ClassFileVersion.ofThisVm(ClassFileVersion.java:223)
	at java.base/jdk.internal.reflect.NativeMethodAccessorImpl.invoke0(Native Method)
	at java.base/jdk.internal.reflect.NativeMethodAccessorImpl.invoke(NativeMethodAccessorImpl.java:62)
	at java.base/jdk.internal.reflect.DelegatingMethodAccessorImpl.invoke(DelegatingMethodAccessorImpl.java:43)
	at java.base/java.lang.reflect.Method.invoke(Method.java:567)
	at org.apache.solr.SolrTestCaseJ4.assumeWorkingMockito(SolrTestCaseJ4.java:372)
	... 24 more


FAILED:  junit.framework.TestSuite.org.apache.solr.update.processor.DistributedUpdateProcessorTest

Error Message:


Stack Trace:
java.lang.NullPointerException
	at __randomizedtesting.SeedInfo.seed([30181438F713F982]:0)
	at org.apache.solr.update.processor.DistributedUpdateProcessorTest.AfterClass(DistributedUpdateProcessorTest.java:67)
	at java.base/jdk.internal.reflect.NativeMethodAccessorImpl.invoke0(Native Method)
	at java.base/jdk.internal.reflect.NativeMethodAccessorImpl.invoke(NativeMethodAccessorImpl.java:62)
	at java.base/jdk.internal.reflect.DelegatingMethodAccessorImpl.invoke(DelegatingMethodAccessorImpl.java:43)
	at java.base/java.lang.reflect.Method.invoke(Method.java:567)
	at com.carrotsearch.randomizedtesting.RandomizedRunner.invoke(RandomizedRunner.java:1750)
	at com.carrotsearch.randomizedtesting.RandomizedRunner$7.evaluate(RandomizedRunner.java:901)
	at com.carrotsearch.randomizedtesting.rules.StatementAdapter.evaluate(StatementAdapter.java:36)
	at com.carrotsearch.randomizedtesting.rules.SystemPropertiesRestoreRule$1.evaluate(SystemPropertiesRestoreRule.java:57)
	at org.apache.lucene.util.AbstractBeforeAfterRule$1.evaluate(AbstractBeforeAfterRule.java:45)
	at com.carrotsearch.randomizedtesting.rules.StatementAdapter.evaluate(StatementAdapter.java:36)
	at org.apache.lucene.util.TestRuleStoreClassName$1.evaluate(TestRuleStoreClassName.java:41)
	at com.carrotsearch.randomizedtesting.rules.NoShadowingOrOverridesOnMethodsRule$1.evaluate(NoShadowingOrOverridesOnMethodsRule.java:40)
	at com.carrotsearch.randomizedtesting.rules.NoShadowingOrOverridesOnMethodsRule$1.evaluate(NoShadowingOrOverridesOnMethodsRule.java:40)
	at com.carrotsearch.randomizedtesting.rules.StatementAdapter.evaluate(StatementAdapter.java:36)
	at com.carrotsearch.randomizedtesting.rules.StatementAdapter.evaluate(StatementAdapter.java:36)
	at org.apache.lucene.util.TestRuleAssertionsRequired$1.evaluate(TestRuleAssertionsRequired.java:53)
	at org.apache.lucene.util.TestRuleMarkFailure$1.evaluate(TestRuleMarkFailure.java:47)
	at org.apache.lucene.util.TestRuleIgnoreAfterMaxFailures$1.evaluate(TestRuleIgnoreAfterMaxFailures.java:64)
	at org.apache.lucene.util.TestRuleIgnoreTestSuites$1.evaluate(TestRuleIgnoreTestSuites.java:54)
	at com.carrotsearch.randomizedtesting.rules.StatementAdapter.evaluate(StatementAdapter.java:36)
	at com.carrotsearch.randomizedtesting.ThreadLeakControl$StatementRunner.run(ThreadLeakControl.java:368)
	at java.base/java.lang.Thread.run(Thread.java:835)


FAILED:  junit.framework.TestSuite.org.apache.solr.update.processor.DistributedUpdateProcessorTest

Error Message:
SOLR-11606: ByteBuddy used by Mockito is not working with this JVM version.

Stack Trace:
org.junit.AssumptionViolatedException: SOLR-11606: ByteBuddy used by Mockito is not working with this JVM version.
	at __randomizedtesting.SeedInfo.seed([30181438F713F982]:0)
	at com.carrotsearch.randomizedtesting.RandomizedTest.assumeNoException(RandomizedTest.java:742)
	at org.apache.solr.SolrTestCaseJ4.assumeWorkingMockito(SolrTestCaseJ4.java:374)
	at org.apache.solr.update.processor.DistributedUpdateProcessorTest.beforeClass(DistributedUpdateProcessorTest.java:60)
	at java.base/jdk.internal.reflect.NativeMethodAccessorImpl.invoke0(Native Method)
	at java.base/jdk.internal.reflect.NativeMethodAccessorImpl.invoke(NativeMethodAccessorImpl.java:62)
	at java.base/jdk.internal.reflect.DelegatingMethodAccessorImpl.invoke(DelegatingMethodAccessorImpl.java:43)
	at java.base/java.lang.reflect.Method.invoke(Method.java:567)
	at com.carrotsearch.randomizedtesting.RandomizedRunner.invoke(RandomizedRunner.java:1750)
	at com.carrotsearch.randomizedtesting.RandomizedRunner$6.evaluate(RandomizedRunner.java:878)
	at com.carrotsearch.randomizedtesting.RandomizedRunner$7.evaluate(RandomizedRunner.java:894)
	at com.carrotsearch.randomizedtesting.rules.StatementAdapter.evaluate(StatementAdapter.java:36)
	at com.carrotsearch.randomizedtesting.rules.SystemPropertiesRestoreRule$1.evaluate(SystemPropertiesRestoreRule.java:57)
	at org.apache.lucene.util.AbstractBeforeAfterRule$1.evaluate(AbstractBeforeAfterRule.java:45)
	at com.carrotsearch.randomizedtesting.rules.StatementAdapter.evaluate(StatementAdapter.java:36)
	at org.apache.lucene.util.TestRuleStoreClassName$1.evaluate(TestRuleStoreClassName.java:41)
	at com.carrotsearch.randomizedtesting.rules.NoShadowingOrOverridesOnMethodsRule$1.evaluate(NoShadowingOrOverridesOnMethodsRule.java:40)
	at com.carrotsearch.randomizedtesting.rules.NoShadowingOrOverridesOnMethodsRule$1.evaluate(NoShadowingOrOverridesOnMethodsRule.java:40)
	at com.carrotsearch.randomizedtesting.rules.StatementAdapter.evaluate(StatementAdapter.java:36)
	at com.carrotsearch.randomizedtesting.rules.StatementAdapter.evaluate(StatementAdapter.java:36)
	at org.apache.lucene.util.TestRuleAssertionsRequired$1.evaluate(TestRuleAssertionsRequired.java:53)
	at org.apache.lucene.util.TestRuleMarkFailure$1.evaluate(TestRuleMarkFailure.java:47)
	at org.apache.lucene.util.TestRuleIgnoreAfterMaxFailures$1.evaluate(TestRuleIgnoreAfterMaxFailures.java:64)
	at org.apache.lucene.util.TestRuleIgnoreTestSuites$1.evaluate(TestRuleIgnoreTestSuites.java:54)
	at com.carrotsearch.randomizedtesting.rules.StatementAdapter.evaluate(StatementAdapter.java:36)
	at com.carrotsearch.randomizedtesting.ThreadLeakControl$StatementRunner.run(ThreadLeakControl.java:368)
	at java.base/java.lang.Thread.run(Thread.java:835)
Caused by: java.lang.IllegalArgumentException: Unknown Java version: 13
	at net.bytebuddy.ClassFileVersion.ofJavaVersion(ClassFileVersion.java:210)
	at net.bytebuddy.ClassFileVersion$VersionLocator$ForJava9CapableVm.locate(ClassFileVersion.java:462)
	at net.bytebuddy.ClassFileVersion.ofThisVm(ClassFileVersion.java:223)
	at java.base/jdk.internal.reflect.NativeMethodAccessorImpl.invoke0(Native Method)
	at java.base/jdk.internal.reflect.NativeMethodAccessorImpl.invoke(NativeMethodAccessorImpl.java:62)
	at java.base/jdk.internal.reflect.DelegatingMethodAccessorImpl.invoke(DelegatingMethodAccessorImpl.java:43)
	at java.base/java.lang.reflect.Method.invoke(Method.java:567)
	at org.apache.solr.SolrTestCaseJ4.assumeWorkingMockito(SolrTestCaseJ4.java:372)
	... 24 more


FAILED:  junit.framework.TestSuite.org.apache.solr.update.processor.DistributedUpdateProcessorTest

Error Message:


Stack Trace:
java.lang.NullPointerException
	at __randomizedtesting.SeedInfo.seed([30181438F713F982]:0)
	at org.apache.solr.update.processor.DistributedUpdateProcessorTest.AfterClass(DistributedUpdateProcessorTest.java:67)
	at java.base/jdk.internal.reflect.NativeMethodAccessorImpl.invoke0(Native Method)
	at java.base/jdk.internal.reflect.NativeMethodAccessorImpl.invoke(NativeMethodAccessorImpl.java:62)
	at java.base/jdk.internal.reflect.DelegatingMethodAccessorImpl.invoke(DelegatingMethodAccessorImpl.java:43)
	at java.base/java.lang.reflect.Method.invoke(Method.java:567)
	at com.carrotsearch.randomizedtesting.RandomizedRunner.invoke(RandomizedRunner.java:1750)
	at com.carrotsearch.randomizedtesting.RandomizedRunner$7.evaluate(RandomizedRunner.java:901)
	at com.carrotsearch.randomizedtesting.rules.StatementAdapter.evaluate(StatementAdapter.java:36)
	at com.carrotsearch.randomizedtesting.rules.SystemPropertiesRestoreRule$1.evaluate(SystemPropertiesRestoreRule.java:57)
	at org.apache.lucene.util.AbstractBeforeAfterRule$1.evaluate(AbstractBeforeAfterRule.java:45)
	at com.carrotsearch.randomizedtesting.rules.StatementAdapter.evaluate(StatementAdapter.java:36)
	at org.apache.lucene.util.TestRuleStoreClassName$1.evaluate(TestRuleStoreClassName.java:41)
	at com.carrotsearch.randomizedtesting.rules.NoShadowingOrOverridesOnMethodsRule$1.evaluate(NoShadowingOrOverridesOnMethodsRule.java:40)
	at com.carrotsearch.randomizedtesting.rules.NoShadowingOrOverridesOnMethodsRule$1.evaluate(NoShadowingOrOverridesOnMethodsRule.java:40)
	at com.carrotsearch.randomizedtesting.rules.StatementAdapter.evaluate(StatementAdapter.java:36)
	at com.carrotsearch.randomizedtesting.rules.StatementAdapter.evaluate(StatementAdapter.java:36)
	at org.apache.lucene.util.TestRuleAssertionsRequired$1.evaluate(TestRuleAssertionsRequired.java:53)
	at org.apache.lucene.util.TestRuleMarkFailure$1.evaluate(TestRuleMarkFailure.java:47)
	at org.apache.lucene.util.TestRuleIgnoreAfterMaxFailures$1.evaluate(TestRuleIgnoreAfterMaxFailures.java:64)
	at org.apache.lucene.util.TestRuleIgnoreTestSuites$1.evaluate(TestRuleIgnoreTestSuites.java:54)
	at com.carrotsearch.randomizedtesting.rules.StatementAdapter.evaluate(StatementAdapter.java:36)
	at com.carrotsearch.randomizedtesting.ThreadLeakControl$StatementRunner.run(ThreadLeakControl.java:368)
	at java.base/java.lang.Thread.run(Thread.java:835)


FAILED:  junit.framework.TestSuite.org.apache.solr.update.processor.DistributedUpdateProcessorTest

Error Message:
SOLR-11606: ByteBuddy used by Mockito is not working with this JVM version.

Stack Trace:
org.junit.AssumptionViolatedException: SOLR-11606: ByteBuddy used by Mockito is not working with this JVM version.
	at __randomizedtesting.SeedInfo.seed([30181438F713F982]:0)
	at com.carrotsearch.randomizedtesting.RandomizedTest.assumeNoException(RandomizedTest.java:742)
	at org.apache.solr.SolrTestCaseJ4.assumeWorkingMockito(SolrTestCaseJ4.java:374)
	at org.apache.solr.update.processor.DistributedUpdateProcessorTest.beforeClass(DistributedUpdateProcessorTest.java:60)
	at java.base/jdk.internal.reflect.NativeMethodAccessorImpl.invoke0(Native Method)
	at java.base/jdk.internal.reflect.NativeMethodAccessorImpl.invoke(NativeMethodAccessorImpl.java:62)
	at java.base/jdk.internal.reflect.DelegatingMethodAccessorImpl.invoke(DelegatingMethodAccessorImpl.java:43)
	at java.base/java.lang.reflect.Method.invoke(Method.java:567)
	at com.carrotsearch.randomizedtesting.RandomizedRunner.invoke(RandomizedRunner.java:1750)
	at com.carrotsearch.randomizedtesting.RandomizedRunner$6.evaluate(RandomizedRunner.java:878)
	at com.carrotsearch.randomizedtesting.RandomizedRunner$7.evaluate(RandomizedRunner.java:894)
	at com.carrotsearch.randomizedtesting.rules.StatementAdapter.evaluate(StatementAdapter.java:36)
	at com.carrotsearch.randomizedtesting.rules.SystemPropertiesRestoreRule$1.evaluate(SystemPropertiesRestoreRule.java:57)
	at org.apache.lucene.util.AbstractBeforeAfterRule$1.evaluate(AbstractBeforeAfterRule.java:45)
	at com.carrotsearch.randomizedtesting.rules.StatementAdapter.evaluate(StatementAdapter.java:36)
	at org.apache.lucene.util.TestRuleStoreClassName$1.evaluate(TestRuleStoreClassName.java:41)
	at com.carrotsearch.randomizedtesting.rules.NoShadowingOrOverridesOnMethodsRule$1.evaluate(NoShadowingOrOverridesOnMethodsRule.java:40)
	at com.carrotsearch.randomizedtesting.rules.NoShadowingOrOverridesOnMethodsRule$1.evaluate(NoShadowingOrOverridesOnMethodsRule.java:40)
	at com.carrotsearch.randomizedtesting.rules.StatementAdapter.evaluate(StatementAdapter.java:36)
	at com.carrotsearch.randomizedtesting.rules.StatementAdapter.evaluate(StatementAdapter.java:36)
	at org.apache.lucene.util.TestRuleAssertionsRequired$1.evaluate(TestRuleAssertionsRequired.java:53)
	at org.apache.lucene.util.TestRuleMarkFailure$1.evaluate(TestRuleMarkFailure.java:47)
	at org.apache.lucene.util.TestRuleIgnoreAfterMaxFailures$1.evaluate(TestRuleIgnoreAfterMaxFailures.java:64)
	at org.apache.lucene.util.TestRuleIgnoreTestSuites$1.evaluate(TestRuleIgnoreTestSuites.java:54)
	at com.carrotsearch.randomizedtesting.rules.StatementAdapter.evaluate(StatementAdapter.java:36)
	at com.carrotsearch.randomizedtesting.ThreadLeakControl$StatementRunner.run(ThreadLeakControl.java:368)
	at java.base/java.lang.Thread.run(Thread.java:835)
Caused by: java.lang.IllegalArgumentException: Unknown Java version: 13
	at net.bytebuddy.ClassFileVersion.ofJavaVersion(ClassFileVersion.java:210)
	at net.bytebuddy.ClassFileVersion$VersionLocator$ForJava9CapableVm.locate(ClassFileVersion.java:462)
	at net.bytebuddy.ClassFileVersion.ofThisVm(ClassFileVersion.java:223)
	at java.base/jdk.internal.reflect.NativeMethodAccessorImpl.invoke0(Native Method)
	at java.base/jdk.internal.reflect.NativeMethodAccessorImpl.invoke(NativeMethodAccessorImpl.java:62)
	at java.base/jdk.internal.reflect.DelegatingMethodAccessorImpl.invoke(DelegatingMethodAccessorImpl.java:43)
	at java.base/java.lang.reflect.Method.invoke(Method.java:567)
	at org.apache.solr.SolrTestCaseJ4.assumeWorkingMockito(SolrTestCaseJ4.java:372)
	... 24 more


FAILED:  junit.framework.TestSuite.org.apache.solr.update.processor.DistributedUpdateProcessorTest

Error Message:


Stack Trace:
java.lang.NullPointerException
	at __randomizedtesting.SeedInfo.seed([30181438F713F982]:0)
	at org.apache.solr.update.processor.DistributedUpdateProcessorTest.AfterClass(DistributedUpdateProcessorTest.java:67)
	at java.base/jdk.internal.reflect.NativeMethodAccessorImpl.invoke0(Native Method)
	at java.base/jdk.internal.reflect.NativeMethodAccessorImpl.invoke(NativeMethodAccessorImpl.java:62)
	at java.base/jdk.internal.reflect.DelegatingMethodAccessorImpl.invoke(DelegatingMethodAccessorImpl.java:43)
	at java.base/java.lang.reflect.Method.invoke(Method.java:567)
	at com.carrotsearch.randomizedtesting.RandomizedRunner.invoke(RandomizedRunner.java:1750)
	at com.carrotsearch.randomizedtesting.RandomizedRunner$7.evaluate(RandomizedRunner.java:901)
	at com.carrotsearch.randomizedtesting.rules.StatementAdapter.evaluate(StatementAdapter.java:36)
	at com.carrotsearch.randomizedtesting.rules.SystemPropertiesRestoreRule$1.evaluate(SystemPropertiesRestoreRule.java:57)
	at org.apache.lucene.util.AbstractBeforeAfterRule$1.evaluate(AbstractBeforeAfterRule.java:45)
	at com.carrotsearch.randomizedtesting.rules.StatementAdapter.evaluate(StatementAdapter.java:36)
	at org.apache.lucene.util.TestRuleStoreClassName$1.evaluate(TestRuleStoreClassName.java:41)
	at com.carrotsearch.randomizedtesting.rules.NoShadowingOrOverridesOnMethodsRule$1.evaluate(NoShadowingOrOverridesOnMethodsRule.java:40)
	at com.carrotsearch.randomizedtesting.rules.NoShadowingOrOverridesOnMethodsRule$1.evaluate(NoShadowingOrOverridesOnMethodsRule.java:40)
	at com.carrotsearch.randomizedtesting.rules.StatementAdapter.evaluate(StatementAdapter.java:36)
	at com.carrotsearch.randomizedtesting.rules.StatementAdapter.evaluate(StatementAdapter.java:36)
	at org.apache.lucene.util.TestRuleAssertionsRequired$1.evaluate(TestRuleAssertionsRequired.java:53)
	at org.apache.lucene.util.TestRuleMarkFailure$1.evaluate(TestRuleMarkFailure.java:47)
	at org.apache.lucene.util.TestRuleIgnoreAfterMaxFailures$1.evaluate(TestRuleIgnoreAfterMaxFailures.java:64)
	at org.apache.lucene.util.TestRuleIgnoreTestSuites$1.evaluate(TestRuleIgnoreTestSuites.java:54)
	at com.carrotsearch.randomizedtesting.rules.StatementAdapter.evaluate(StatementAdapter.java:36)
	at com.carrotsearch.randomizedtesting.ThreadLeakControl$StatementRunner.run(ThreadLeakControl.java:368)
	at java.base/java.lang.Thread.run(Thread.java:835)




Build Log:
[...truncated 2027 lines...]
   [junit4] JVM J1: stderr was not empty, see: C:\Users\jenkins\workspace\Lucene-Solr-master-Windows\lucene\build\core\test\temp\junit4-J1-20190503_101051_6781684644456727121905.syserr
   [junit4] >>> JVM J1 emitted unexpected output (verbatim) ----
   [junit4] OpenJDK 64-Bit Server VM warning: Option UseConcMarkSweepGC was deprecated in version 9.0 and will likely be removed in a future release.
   [junit4] <<< JVM J1: EOF ----

[...truncated 5 lines...]
   [junit4] JVM J0: stderr was not empty, see: C:\Users\jenkins\workspace\Lucene-Solr-master-Windows\lucene\build\core\test\temp\junit4-J0-20190503_101051_6746098681831249911984.syserr
   [junit4] >>> JVM J0 emitted unexpected output (verbatim) ----
   [junit4] OpenJDK 64-Bit Server VM warning: Option UseConcMarkSweepGC was deprecated in version 9.0 and will likely be removed in a future release.
   [junit4] <<< JVM J0: EOF ----

[...truncated 316 lines...]
   [junit4] JVM J1: stderr was not empty, see: C:\Users\jenkins\workspace\Lucene-Solr-master-Windows\lucene\build\test-framework\test\temp\junit4-J1-20190503_102033_43015237975836967999278.syserr
   [junit4] >>> JVM J1 emitted unexpected output (verbatim) ----
   [junit4] OpenJDK 64-Bit Server VM warning: Option UseConcMarkSweepGC was deprecated in version 9.0 and will likely be removed in a future release.
   [junit4] <<< JVM J1: EOF ----

[...truncated 3 lines...]
   [junit4] JVM J0: stderr was not empty, see: C:\Users\jenkins\workspace\Lucene-Solr-master-Windows\lucene\build\test-framework\test\temp\junit4-J0-20190503_102033_4284415594826284630110.syserr
   [junit4] >>> JVM J0 emitted unexpected output (verbatim) ----
   [junit4] OpenJDK 64-Bit Server VM warning: Option UseConcMarkSweepGC was deprecated in version 9.0 and will likely be removed in a future release.
   [junit4] <<< JVM J0: EOF ----

[...truncated 1077 lines...]
   [junit4] JVM J0: stderr was not empty, see: C:\Users\jenkins\workspace\Lucene-Solr-master-Windows\lucene\build\analysis\common\test\temp\junit4-J0-20190503_102329_71217884945963065599462.syserr
   [junit4] >>> JVM J0 emitted unexpected output (verbatim) ----
   [junit4] OpenJDK 64-Bit Server VM warning: Option UseConcMarkSweepGC was deprecated in version 9.0 and will likely be removed in a future release.
   [junit4] <<< JVM J0: EOF ----

[...truncated 3 lines...]
   [junit4] JVM J1: stderr was not empty, see: C:\Users\jenkins\workspace\Lucene-Solr-master-Windows\lucene\build\analysis\common\test\temp\junit4-J1-20190503_102329_7117276661042523600873.syserr
   [junit4] >>> JVM J1 emitted unexpected output (verbatim) ----
   [junit4] OpenJDK 64-Bit Server VM warning: Option UseConcMarkSweepGC was deprecated in version 9.0 and will likely be removed in a future release.
   [junit4] <<< JVM J1: EOF ----

[...truncated 243 lines...]
   [junit4] JVM J1: stderr was not empty, see: C:\Users\jenkins\workspace\Lucene-Solr-master-Windows\lucene\build\analysis\icu\test\temp\junit4-J1-20190503_102809_54310423111914744203556.syserr
   [junit4] >>> JVM J1 emitted unexpected output (verbatim) ----
   [junit4] OpenJDK 64-Bit Server VM warning: Option UseConcMarkSweepGC was deprecated in version 9.0 and will likely be removed in a future release.
   [junit4] <<< JVM J1: EOF ----

[...truncated 3 lines...]
   [junit4] JVM J0: stderr was not empty, see: C:\Users\jenkins\workspace\Lucene-Solr-master-Windows\lucene\build\analysis\icu\test\temp\junit4-J0-20190503_102809_54411660952169704775737.syserr
   [junit4] >>> JVM J0 emitted unexpected output (verbatim) ----
   [junit4] OpenJDK 64-Bit Server VM warning: Option UseConcMarkSweepGC was deprecated in version 9.0 and will likely be removed in a future release.
   [junit4] <<< JVM J0: EOF ----

[...truncated 238 lines...]
   [junit4] JVM J1: stderr was not empty, see: C:\Users\jenkins\workspace\Lucene-Solr-master-Windows\lucene\build\analysis\kuromoji\test\temp\junit4-J1-20190503_102829_06817160614040615186165.syserr
   [junit4] >>> JVM J1 emitted unexpected output (verbatim) ----
   [junit4] OpenJDK 64-Bit Server VM warning: Option UseConcMarkSweepGC was deprecated in version 9.0 and will likely be removed in a future release.
   [junit4] <<< JVM J1: EOF ----

[...truncated 15 lines...]
   [junit4] JVM J0: stderr was not empty, see: C:\Users\jenkins\workspace\Lucene-Solr-master-Windows\lucene\build\analysis\kuromoji\test\temp\junit4-J0-20190503_102829_0706343976317636685350.syserr
   [junit4] >>> JVM J0 emitted unexpected output (verbatim) ----
   [junit4] OpenJDK 64-Bit Server VM warning: Option UseConcMarkSweepGC was deprecated in version 9.0 and will likely be removed in a future release.
   [junit4] <<< JVM J0: EOF ----

[...truncated 155 lines...]
   [junit4] JVM J0: stderr was not empty, see: C:\Users\jenkins\workspace\Lucene-Solr-master-Windows\lucene\build\analysis\morfologik\test\temp\junit4-J0-20190503_102925_02212150318588200835214.syserr
   [junit4] >>> JVM J0 emitted unexpected output (verbatim) ----
   [junit4] OpenJDK 64-Bit Server VM warning: Option UseConcMarkSweepGC was deprecated in version 9.0 and will likely be removed in a future release.
   [junit4] <<< JVM J0: EOF ----

[...truncated 3 lines...]
   [junit4] JVM J1: stderr was not empty, see: C:\Users\jenkins\workspace\Lucene-Solr-master-Windows\lucene\build\analysis\morfologik\test\temp\junit4-J1-20190503_102925_02211293883398805947419.syserr
   [junit4] >>> JVM J1 emitted unexpected output (verbatim) ----
   [junit4] OpenJDK 64-Bit Server VM warning: Option UseConcMarkSweepGC was deprecated in version 9.0 and will likely be removed in a future release.
   [junit4] <<< JVM J1: EOF ----

[...truncated 201 lines...]
   [junit4] JVM J1: stderr was not empty, see: C:\Users\jenkins\workspace\Lucene-Solr-master-Windows\lucene\build\analysis\nori\test\temp\junit4-J1-20190503_102938_4381199406805009847699.syserr
   [junit4] >>> JVM J1 emitted unexpected output (verbatim) ----
   [junit4] OpenJDK 64-Bit Server VM warning: Option UseConcMarkSweepGC was deprecated in version 9.0 and will likely be removed in a future release.
   [junit4] <<< JVM J1: EOF ----

[...truncated 6 lines...]
   [junit4] JVM J0: stderr was not empty, see: C:\Users\jenkins\workspace\Lucene-Solr-master-Windows\lucene\build\analysis\nori\test\temp\junit4-J0-20190503_102938_4361592301992031094928.syserr
   [junit4] >>> JVM J0 emitted unexpected output (verbatim) ----
   [junit4] OpenJDK 64-Bit Server VM warning: Option UseConcMarkSweepGC was deprecated in version 9.0 and will likely be removed in a future release.
   [junit4] <<< JVM J0: EOF ----

[...truncated 161 lines...]
   [junit4] JVM J1: stderr was not empty, see: C:\Users\jenkins\workspace\Lucene-Solr-master-Windows\lucene\build\analysis\opennlp\test\temp\junit4-J1-20190503_102956_53411882948418173749573.syserr
   [junit4] >>> JVM J1 emitted unexpected output (verbatim) ----
   [junit4] OpenJDK 64-Bit Server VM warning: Option UseConcMarkSweepGC was deprecated in version 9.0 and will likely be removed in a future release.
   [junit4] <<< JVM J1: EOF ----

[...truncated 3 lines...]
   [junit4] JVM J0: stderr was not empty, see: C:\Users\jenkins\workspace\Lucene-Solr-master-Windows\lucene\build\analysis\opennlp\test\temp\junit4-J0-20190503_102956_5343561607425570673686.syserr
   [junit4] >>> JVM J0 emitted unexpected output (verbatim) ----
   [junit4] OpenJDK 64-Bit Server VM warning: Option UseConcMarkSweepGC was deprecated in version 9.0 and will likely be removed in a future release.
   [junit4] <<< JVM J0: EOF ----

[...truncated 172 lines...]
   [junit4] JVM J0: stderr was not empty, see: C:\Users\jenkins\workspace\Lucene-Solr-master-Windows\lucene\build\analysis\phonetic\test\temp\junit4-J0-20190503_103002_0984400689545726489631.syserr
   [junit4] >>> JVM J0 emitted unexpected output (verbatim) ----
   [junit4] OpenJDK 64-Bit Server VM warning: Option UseConcMarkSweepGC was deprecated in version 9.0 and will likely be removed in a future release.
   [junit4] <<< JVM J0: EOF ----

   [junit4] JVM J1: stderr was not empty, see: C:\Users\jenkins\workspace\Lucene-Solr-master-Windows\lucene\build\analysis\phonetic\test\temp\junit4-J1-20190503_103002_09812294673447574268108.syserr
   [junit4] >>> JVM J1 emitted unexpected output (verbatim) ----
   [junit4] OpenJDK 64-Bit Server VM warning: Option UseConcMarkSweepGC was deprecated in version 9.0 and will likely be removed in a future release.
   [junit4] <<< JVM J1: EOF ----

[...truncated 152 lines...]
   [junit4] JVM J0: stderr was not empty, see: C:\Users\jenkins\workspace\Lucene-Solr-master-Windows\lucene\build\analysis\smartcn\test\temp\junit4-J0-20190503_103022_766398763651254405345.syserr
   [junit4] >>> JVM J0 emitted unexpected output (verbatim) ----
   [junit4] OpenJDK 64-Bit Server VM warning: Option UseConcMarkSweepGC was deprecated in version 9.0 and will likely be removed in a future release.
   [junit4] <<< JVM J0: EOF ----

[...truncated 3 lines...]
   [junit4] JVM J1: stderr was not empty, see: C:\Users\jenkins\workspace\Lucene-Solr-master-Windows\lucene\build\analysis\smartcn\test\temp\junit4-J1-20190503_103022_7666288017504158611104.syserr
   [junit4] >>> JVM J1 emitted unexpected output (verbatim) ----
   [junit4] OpenJDK 64-Bit Server VM warning: Option UseConcMarkSweepGC was deprecated in version 9.0 and will likely be removed in a future release.
   [junit4] <<< JVM J1: EOF ----

[...truncated 157 lines...]
   [junit4] JVM J1: stderr was not empty, see: C:\Users\jenkins\workspace\Lucene-Solr-master-Windows\lucene\build\analysis\stempel\test\temp\junit4-J1-20190503_103031_8524600060781859453156.syserr
   [junit4] >>> JVM J1 emitted unexpected output (verbatim) ----
   [junit4] OpenJDK 64-Bit Server VM warning: Option UseConcMarkSweepGC was deprecated in version 9.0 and will likely be removed in a future release.
   [junit4] <<< JVM J1: EOF ----

[...truncated 3 lines...]
   [junit4] JVM J0: stderr was not empty, see: C:\Users\jenkins\workspace\Lucene-Solr-master-Windows\lucene\build\analysis\stempel\test\temp\junit4-J0-20190503_103031_85214245767385469551229.syserr
   [junit4] >>> JVM J0 emitted unexpected output (verbatim) ----
   [junit4] OpenJDK 64-Bit Server VM warning: Option UseConcMarkSweepGC was deprecated in version 9.0 and will likely be removed in a future release.
   [junit4] <<< JVM J0: EOF ----

[...truncated 185 lines...]
   [junit4] JVM J0: stderr was not empty, see: C:\Users\jenkins\workspace\Lucene-Solr-master-Windows\lucene\build\backward-codecs\test\temp\junit4-J0-20190503_103041_5255621013789852548166.syserr
   [junit4] >>> JVM J0 emitted unexpected output (verbatim) ----
   [junit4] OpenJDK 64-Bit Server VM warning: Option UseConcMarkSweepGC was deprecated in version 9.0 and will likely be removed in a future release.
   [junit4] <<< JVM J0: EOF ----

[...truncated 9 lines...]
   [junit4] JVM J1: stderr was not empty, see: C:\Users\jenkins\workspace\Lucene-Solr-master-Windows\lucene\build\backward-codecs\test\temp\junit4-J1-20190503_103041_52516674778020533979154.syserr
   [junit4] >>> JVM J1 emitted unexpected output (verbatim) ----
   [junit4] OpenJDK 64-Bit Server VM warning: Option UseConcMarkSweepGC was deprecated in version 9.0 and will likely be removed in a future release.
   [junit4] <<< JVM J1: EOF ----

[...truncated 1449 lines...]
   [junit4] JVM J0: stderr was not empty, see: C:\Users\jenkins\workspace\Lucene-Solr-master-Windows\lucene\build\benchmark\test\temp\junit4-J0-20190503_103300_4893770515321409528002.syserr
   [junit4] >>> JVM J0 emitted unexpected output (verbatim) ----
   [junit4] OpenJDK 64-Bit Server VM warning: Option UseConcMarkSweepGC was deprecated in version 9.0 and will likely be removed in a future release.
   [junit4] <<< JVM J0: EOF ----

[...truncated 3 lines...]
   [junit4] JVM J1: stderr was not empty, see: C:\Users\jenkins\workspace\Lucene-Solr-master-Windows\lucene\build\benchmark\test\temp\junit4-J1-20190503_103300_48914946807354409043484.syserr
   [junit4] >>> JVM J1 emitted unexpected output (verbatim) ----
   [junit4] OpenJDK 64-Bit Server VM warning: Option UseConcMarkSweepGC was deprecated in version 9.0 and will likely be removed in a future release.
   [junit4] <<< JVM J1: EOF ----

[...truncated 237 lines...]
   [junit4] JVM J1: stderr was not empty, see: C:\Users\jenkins\workspace\Lucene-Solr-master-Windows\lucene\build\classification\test\temp\junit4-J1-20190503_103315_9499952473218947173054.syserr
   [junit4] >>> JVM J1 emitted unexpected output (verbatim) ----
   [junit4] OpenJDK 64-Bit Server VM warning: Option UseConcMarkSweepGC was deprecated in version 9.0 and will likely be removed in a future release.
   [junit4] <<< JVM J1: EOF ----

[...truncated 3 lines...]
   [junit4] JVM J0: stderr was not empty, see: C:\Users\jenkins\workspace\Lucene-Solr-master-Windows\lucene\build\classification\test\temp\junit4-J0-20190503_103315_94913301671171873803302.syserr
   [junit4] >>> JVM J0 emitted unexpected output (verbatim) ----
   [junit4] OpenJDK 64-Bit Server VM warning: Option UseConcMarkSweepGC was deprecated in version 9.0 and will likely be removed in a future release.
   [junit4] <<< JVM J0: EOF ----

[...truncated 255 lines...]
   [junit4] JVM J0: stderr was not empty, see: C:\Users\jenkins\workspace\Lucene-Solr-master-Windows\lucene\build\codecs\test\temp\junit4-J0-20190503_103342_52111421416878030015306.syserr
   [junit4] >>> JVM J0 emitted unexpected output (verbatim) ----
   [junit4] OpenJDK 64-Bit Server VM warning: Option UseConcMarkSweepGC was deprecated in version 9.0 and will likely be removed in a future release.
   [junit4] <<< JVM J0: EOF ----

[...truncated 7 lines...]
   [junit4] JVM J1: stderr was not empty, see: C:\Users\jenkins\workspace\Lucene-Solr-master-Windows\lucene\build\codecs\test\temp\junit4-J1-20190503_103342_52215535889404006290538.syserr
   [junit4] >>> JVM J1 emitted unexpected output (verbatim) ----
   [junit4] OpenJDK 64-Bit Server VM warning: Option UseConcMarkSweepGC was deprecated in version 9.0 and will likely be removed in a future release.
   [junit4] <<< JVM J1: EOF ----

[...truncated 208 lines...]
   [junit4] JVM J1: stderr was not empty, see: C:\Users\jenkins\workspace\Lucene-Solr-master-Windows\lucene\build\demo\test\temp\junit4-J1-20190503_103648_5094792231774034405890.syserr
   [junit4] >>> JVM J1 emitted unexpected output (verbatim) ----
   [junit4] OpenJDK 64-Bit Server VM warning: Option UseConcMarkSweepGC was deprecated in version 9.0 and will likely be removed in a future release.
   [junit4] <<< JVM J1: EOF ----

[...truncated 3 lines...]
   [junit4] JVM J0: stderr was not empty, see: C:\Users\jenkins\workspace\Lucene-Solr-master-Windows\lucene\build\demo\test\temp\junit4-J0-20190503_103648_5099375743897523331791.syserr
   [junit4] >>> JVM J0 emitted unexpected output (verbatim) ----
   [junit4] OpenJDK 64-Bit Server VM warning: Option UseConcMarkSweepGC was deprecated in version 9.0 and will likely be removed in a future release.
   [junit4] <<< JVM J0: EOF ----

[...truncated 168 lines...]
   [junit4] JVM J0: stderr was not empty, see: C:\Users\jenkins\workspace\Lucene-Solr-master-Windows\lucene\build\expressions\test\temp\junit4-J0-20190503_103659_32316759361085347365242.syserr
   [junit4] >>> JVM J0 emitted unexpected output (verbatim) ----
   [junit4] OpenJDK 64-Bit Server VM warning: Option UseConcMarkSweepGC was deprecated in version 9.0 and will likely be removed in a future release.
   [junit4] <<< JVM J0: EOF ----

[...truncated 6 lines...]
   [junit4] JVM J1: stderr was not empty, see: C:\Users\jenkins\workspace\Lucene-Solr-master-Windows\lucene\build\expressions\test\temp\junit4-J1-20190503_103659_323984307843150322989.syserr
   [junit4] >>> JVM J1 emitted unexpected output (verbatim) ----
   [junit4] OpenJDK 64-Bit Server VM warning: Option UseConcMarkSweepGC was deprecated in version 9.0 and will likely be removed in a future release.
   [junit4] <<< JVM J1: EOF ----

[...truncated 227 lines...]
   [junit4] JVM J1: stderr was not empty, see: C:\Users\jenkins\workspace\Lucene-Solr-master-Windows\lucene\build\facet\test\temp\junit4-J1-20190503_103715_2189087326668996893558.syserr
   [junit4] >>> JVM J1 emitted unexpected output (verbatim) ----
   [junit4] OpenJDK 64-Bit Server VM warning: Option UseConcMarkSweepGC was deprecated in version 9.0 and will likely be removed in a future release.
   [junit4] <<< JVM J1: EOF ----

[...truncated 3 lines...]
   [junit4] JVM J0: stderr was not empty, see: C:\Users\jenkins\workspace\Lucene-Solr-master-Windows\lucene\build\facet\test\temp\junit4-J0-20190503_103715_21812669704120822306589.syserr
   [junit4] >>> JVM J0 emitted unexpected output (verbatim) ----
   [junit4] OpenJDK 64-Bit Server VM warning: Option UseConcMarkSweepGC was deprecated in version 9.0 and will likely be removed in a future release.
   [junit4] <<< JVM J0: EOF ----

[...truncated 180 lines...]
   [junit4] JVM J0: stderr was not empty, see: C:\Users\jenkins\workspace\Lucene-Solr-master-Windows\lucene\build\grouping\test\temp\junit4-J0-20190503_103809_15411165407430295887285.syserr
   [junit4] >>> JVM J0 emitted unexpected output (verbatim) ----
   [junit4] OpenJDK 64-Bit Server VM warning: Option UseConcMarkSweepGC was deprecated in version 9.0 and will likely be removed in a future release.
   [junit4] <<< JVM J0: EOF ----

[...truncated 3 lines...]
   [junit4] JVM J1: stderr was not empty, see: C:\Users\jenkins\workspace\Lucene-Solr-master-Windows\lucene\build\grouping\test\temp\junit4-J1-20190503_103809_1553829033373888165709.syserr
   [junit4] >>> JVM J1 emitted unexpected output (verbatim) ----
   [junit4] OpenJDK 64-Bit Server VM warning: Option UseConcMarkSweepGC was deprecated in version 9.0 and will likely be removed in a future release.
   [junit4] <<< JVM J1: EOF ----

[...truncated 247 lines...]
   [junit4] JVM J1: stderr was not empty, see: C:\Users\jenkins\workspace\Lucene-Solr-master-Windows\lucene\build\highlighter\test\temp\junit4-J1-20190503_103829_65417426772536868604053.syserr
   [junit4] >>> JVM J1 emitted unexpected output (verbatim) ----
   [junit4] OpenJDK 64-Bit Server VM warning: Option UseConcMarkSweepGC was deprecated in version 9.0 and will likely be removed in a future release.
   [junit4] <<< JVM J1: EOF ----

   [junit4] JVM J0: stderr was not empty, see: C:\Users\jenkins\workspace\Lucene-Solr-master-Windows\lucene\build\highlighter\test\temp\junit4-J0-20190503_103829_6531947598099571759668.syserr
   [junit4] >>> JVM J0 emitted unexpected output (verbatim) ----
   [junit4] OpenJDK 64-Bit Server VM warning: Option UseConcMarkSweepGC was deprecated in version 9.0 and will likely be removed in a future release.
   [junit4] <<< JVM J0: EOF ----

[...truncated 167 lines...]
   [junit4] JVM J0: stderr was not empty, see: C:\Users\jenkins\workspace\Lucene-Solr-master-Windows\lucene\build\join\test\temp\junit4-J0-20190503_103924_3737961548027514944671.syserr
   [junit4] >>> JVM J0 emitted unexpected output (verbatim) ----
   [junit4] OpenJDK 64-Bit Server VM warning: Option UseConcMarkSweepGC was deprecated in version 9.0 and will likely be removed in a future release.
   [junit4] <<< JVM J0: EOF ----

[...truncated 3 lines...]
   [junit4] JVM J1: stderr was not empty, see: C:\Users\jenkins\workspace\Lucene-Solr-master-Windows\lucene\build\join\test\temp\junit4-J1-20190503_103924_3739234922672869745013.syserr
   [junit4] >>> JVM J1 emitted unexpected output (verbatim) ----
   [junit4] OpenJDK 64-Bit Server VM warning: Option UseConcMarkSweepGC was deprecated in version 9.0 and will likely be removed in a future release.
   [junit4] <<< JVM J1: EOF ----

[...truncated 271 lines...]
   [junit4] JVM J0: stderr was not empty, see: C:\Users\jenkins\workspace\Lucene-Solr-master-Windows\lucene\build\luke\test\temp\junit4-J0-20190503_103957_2947956935709760997739.syserr
   [junit4] >>> JVM J0 emitted unexpected output (verbatim) ----
   [junit4] OpenJDK 64-Bit Server VM warning: Option UseConcMarkSweepGC was deprecated in version 9.0 and will likely be removed in a future release.
   [junit4] <<< JVM J0: EOF ----

[...truncated 3 lines...]
   [junit4] JVM J1: stderr was not empty, see: C:\Users\jenkins\workspace\Lucene-Solr-master-Windows\lucene\build\luke\test\temp\junit4-J1-20190503_103957_2948095379768405227359.syserr
   [junit4] >>> JVM J1 emitted unexpected output (verbatim) ----
   [junit4] OpenJDK 64-Bit Server VM warning: Option UseConcMarkSweepGC was deprecated in version 9.0 and will likely be removed in a future release.
   [junit4] <<< JVM J1: EOF ----

[...truncated 148 lines...]
   [junit4] JVM J0: stderr was not empty, see: C:\Users\jenkins\workspace\Lucene-Solr-master-Windows\lucene\build\memory\test\temp\junit4-J0-20190503_104010_94814778716521162577484.syserr
   [junit4] >>> JVM J0 emitted unexpected output (verbatim) ----
   [junit4] OpenJDK 64-Bit Server VM warning: Option UseConcMarkSweepGC was deprecated in version 9.0 and will likely be removed in a future release.
   [junit4] <<< JVM J0: EOF ----

[...truncated 3 lines...]
   [junit4] JVM J1: stderr was not empty, see: C:\Users\jenkins\workspace\Lucene-Solr-master-Windows\lucene\build\memory\test\temp\junit4-J1-20190503_104010_94812381216508073438642.syserr
   [junit4] >>> JVM J1 emitted unexpected output (verbatim) ----
   [junit4] OpenJDK 64-Bit Server VM warning: Option UseConcMarkSweepGC was deprecated in version 9.0 and will likely be removed in a future release.
   [junit4] <<< JVM J1: EOF ----

[...truncated 187 lines...]
   [junit4] JVM J1: stderr was not empty, see: C:\Users\jenkins\workspace\Lucene-Solr-master-Windows\lucene\build\misc\test\temp\junit4-J1-20190503_104020_03812932126069669705447.syserr
   [junit4] >>> JVM J1 emitted unexpected output (verbatim) ----
   [junit4] OpenJDK 64-Bit Server VM warning: Option UseConcMarkSweepGC was deprecated in version 9.0 and will likely be removed in a future release.
   [junit4] <<< JVM J1: EOF ----

[...truncated 5 lines...]
   [junit4] JVM J0: stderr was not empty, see: C:\Users\jenkins\workspace\Lucene-Solr-master-Windows\lucene\build\misc\test\temp\junit4-J0-20190503_104020_0388853881260233904655.syserr
   [junit4] >>> JVM J0 emitted unexpected output (verbatim) ----
   [junit4] OpenJDK 64-Bit Server VM warning: Option UseConcMarkSweepGC was deprecated in version 9.0 and will likely be removed in a future release.
   [junit4] <<< JVM J0: EOF ----

[...truncated 302 lines...]
   [junit4] JVM J0: stderr was not empty, see: C:\Users\jenkins\workspace\Lucene-Solr-master-Windows\lucene\build\queries\test\temp\junit4-J0-20190503_104116_26911843583629050319439.syserr
   [junit4] >>> JVM J0 emitted unexpected output (verbatim) ----
   [junit4] OpenJDK 64-Bit Server VM warning: Option UseConcMarkSweepGC was deprecated in version 9.0 and will likely be removed in a future release.
   [junit4] <<< JVM J0: EOF ----

   [junit4] JVM J1: stderr was not empty, see: C:\Users\jenkins\workspace\Lucene-Solr-master-Windows\lucene\build\queries\test\temp\junit4-J1-20190503_104116_2691503305155728132833.syserr
   [junit4] >>> JVM J1 emitted unexpected output (verbatim) ----
   [junit4] OpenJDK 64-Bit Server VM warning: Option UseConcMarkSweepGC was deprecated in version 9.0 and will likely be removed in a future release.
   [junit4] <<< JVM J1: EOF ----

[...truncated 224 lines...]
   [junit4] JVM J1: stderr was not empty, see: C:\Users\jenkins\workspace\Lucene-Solr-master-Windows\lucene\build\queryparser\test\temp\junit4-J1-20190503_104131_6485425269544216207101.syserr
   [junit4] >>> JVM J1 emitted unexpected output (verbatim) ----
   [junit4] OpenJDK 64-Bit Server VM warning: Option UseConcMarkSweepGC was deprecated in version 9.0 and will likely be removed in a future release.
   [junit4] <<< JVM J1: EOF ----

[...truncated 3 lines...]
   [junit4] JVM J0: stderr was not empty, see: C:\Users\jenkins\workspace\Lucene-Solr-master-Windows\lucene\build\queryparser\test\temp\junit4-J0-20190503_104131_64812166073981750013498.syserr
   [junit4] >>> JVM J0 emitted unexpected output (verbatim) ----
   [junit4] OpenJDK 64-Bit Server VM warning: Option UseConcMarkSweepGC was deprecated in version 9.0 and will likely be removed in a future release.
   [junit4] <<< JVM J0: EOF ----

[...truncated 208 lines...]
   [junit4] JVM J0: stderr was not empty, see: C:\Users\jenkins\workspace\Lucene-Solr-master-Windows\lucene\build\replicator\test\temp\junit4-J0-20190503_104147_73012649911296299049380.syserr
   [junit4] >>> JVM J0 emitted unexpected output (verbatim) ----
   [junit4] OpenJDK 64-Bit Server VM warning: Option UseConcMarkSweepGC was deprecated in version 9.0 and will likely be removed in a future release.
   [junit4] <<< JVM J0: EOF ----

[...truncated 3 lines...]
   [junit4] JVM J1: stderr was not empty, see: C:\Users\jenkins\workspace\Lucene-Solr-master-Windows\lucene\build\replicator\test\temp\junit4-J1-20190503_104147_73010169132554855159256.syserr
   [junit4] >>> JVM J1 emitted unexpected output (verbatim) ----
   [junit4] OpenJDK 64-Bit Server VM warning: Option UseConcMarkSweepGC was deprecated in version 9.0 and will likely be removed in a future release.
   [junit4] <<< JVM J1: EOF ----

[...truncated 248 lines...]
   [junit4] JVM J0: stderr was not empty, see: C:\Users\jenkins\workspace\Lucene-Solr-master-Windows\lucene\build\sandbox\test\temp\junit4-J0-20190503_104219_26217986116471044143229.syserr
   [junit4] >>> JVM J0 emitted unexpected output (verbatim) ----
   [junit4] OpenJDK 64-Bit Server VM warning: Option UseConcMarkSweepGC was deprecated in version 9.0 and will likely be removed in a future release.
   [junit4] <<< JVM J0: EOF ----

[...truncated 3 lines...]
   [junit4] JVM J1: stderr was not empty, see: C:\Users\jenkins\workspace\Lucene-Solr-master-Windows\lucene\build\sandbox\test\temp\junit4-J1-20190503_104219_26117312222403745509382.syserr
   [junit4] >>> JVM J1 emitted unexpected output (verbatim) ----
   [junit4] OpenJDK 64-Bit Server VM warning: Option UseConcMarkSweepGC was deprecated in version 9.0 and will likely be removed in a future release.
   [junit4] <<< JVM J1: EOF ----

[...truncated 298 lines...]
   [junit4] JVM J1: stderr was not empty, see: C:\Users\jenkins\workspace\Lucene-Solr-master-Windows\lucene\build\spatial-extras\test\temp\junit4-J1-20190503_104253_10814519912239026400769.syserr
   [junit4] >>> JVM J1 emitted unexpected output (verbatim) ----
   [junit4] OpenJDK 64-Bit Server VM warning: Option UseConcMarkSweepGC was deprecated in version 9.0 and will likely be removed in a future release.
   [junit4] <<< JVM J1: EOF ----

[...truncated 3 lines...]
   [junit4] JVM J0: stderr was not empty, see: C:\Users\jenkins\workspace\Lucene-Solr-master-Windows\lucene\build\spatial-extras\test\temp\junit4-J0-20190503_104253_10810459866279612299950.syserr
   [junit4] >>> JVM J0 emitted unexpected output (verbatim) ----
   [junit4] OpenJDK 64-Bit Server VM warning: Option UseConcMarkSweepGC was deprecated in version 9.0 and will likely be removed in a future release.
   [junit4] <<< JVM J0: EOF ----

[...truncated 178 lines...]
   [junit4] JVM J0: stderr was not empty, see: C:\Users\jenkins\workspace\Lucene-Solr-master-Windows\lucene\build\spatial3d\test\temp\junit4-J0-20190503_104357_65410716221532795387519.syserr
   [junit4] >>> JVM J0 emitted unexpected output (verbatim) ----
   [junit4] OpenJDK 64-Bit Server VM warning: Option UseConcMarkSweepGC was deprecated in version 9.0 and will likely be removed in a future release.
   [junit4] <<< JVM J0: EOF ----

[...truncated 17 lines...]
   [junit4] JVM J1: stderr was not empty, see: C:\Users\jenkins\workspace\Lucene-Solr-master-Windows\lucene\build\spatial3d\test\temp\junit4-J1-20190503_104357_65011521396851877828476.syserr
   [junit4] >>> JVM J1 emitted unexpected output (verbatim) ----
   [junit4] OpenJDK 64-Bit Server VM warning: Option UseConcMarkSweepGC was deprecated in version 9.0 and will likely be removed in a future release.
   [junit4] <<< JVM J1: EOF ----

[...truncated 147 lines...]
   [junit4] JVM J0: stderr was not empty, see: C:\Users\jenkins\workspace\Lucene-Solr-master-Windows\lucene\build\spatial\test\temp\junit4-J0-20190503_104431_38418188955651018658928.syserr
   [junit4] >>> JVM J0 emitted unexpected output (verbatim) ----
   [junit4] OpenJDK 64-Bit Server VM warning: Option UseConcMarkSweepGC was deprecated in version 9.0 and will likely be removed in a future release.
   [junit4] <<< JVM J0: EOF ----

[...truncated 246 lines...]
   [junit4] JVM J0: stderr was not empty, see: C:\Users\jenkins\workspace\Lucene-Solr-master-Windows\lucene\build\suggest\test\temp\junit4-J0-20190503_104441_2386267317680781963797.syserr
   [junit4] >>> JVM J0 emitted unexpected output (verbatim) ----
   [junit4] OpenJDK 64-Bit Server VM warning: Option UseConcMarkSweepGC was deprecated in version 9.0 and will likely be removed in a future release.
   [junit4] <<< JVM J0: EOF ----

[...truncated 3 lines...]
   [junit4] JVM J1: stderr was not empty, see: C:\Users\jenkins\workspace\Lucene-Solr-master-Windows\lucene\build\suggest\test\temp\junit4-J1-20190503_104441_2395837403992505812806.syserr
   [junit4] >>> JVM J1 emitted unexpected output (verbatim) ----
   [junit4] OpenJDK 64-Bit Server VM warning: Option UseConcMarkSweepGC was deprecated in version 9.0 and will likely be removed in a future release.
   [junit4] <<< JVM J1: EOF ----

[...truncated 4558 lines...]
   [junit4] Suite: org.apache.solr.update.processor.DistributedUpdateProcessorTest
   [junit4]   2> Creating dataDir: C:\Users\jenkins\workspace\Lucene-Solr-master-Windows\solr\build\solr-core\test\J0\temp\solr.update.processor.DistributedUpdateProcessorTest_30181438F713F982-001\init-core-data-001
   [junit4]   2> NOTE: test params are: codec=CheapBastard, sim=Asserting(org.apache.lucene.search.similarities.AssertingSimilarity@4127745c), locale=ml-IN, timezone=Chile/Continental
   [junit4]   2> NOTE: Windows 10 10.0 amd64/Oracle Corporation 13-ea (64-bit)/cpus=3,threads=1,free=206947984,total=518979584
   [junit4]   2> NOTE: All tests run in this JVM: [ResponseLogComponentTest, LeaderElectionTest, TestSafeXMLParsing, SecurityConfHandlerTest, TestMissingGroups, TestSlowCompositeReaderWrapper, Tagger2Test, TestDocBasedVersionConstraints, QueryEqualityTest, TestCrossCoreJoin, TestHalfAndHalfDocValues, TermVectorComponentDistributedTest, BigEndianAscendingWordDeserializerTest, DataDrivenBlockJoinTest, SuggesterTest, MoveReplicaHDFSFailoverTest, TestCloudSearcherWarming, TestDocTermOrdsUninvertLimit, DistributedMLTComponentTest, TestElisionMultitermQuery, TestSolrDeletionPolicy1, SuggesterFSTTest, TestStressCloudBlindAtomicUpdates, OrderedExecutorTest, TolerantUpdateProcessorTest, SliceStateTest, HdfsLockFactoryTest, TestLegacyField, TestPayloadCheckQParserPlugin, SpatialFilterTest, EmbeddedSolrNoSerializeTest, TestSimLargeCluster, SystemCollectionCompatTest, TestLeaderElectionWithEmptyReplica, ZkStateWriterTest, TestTolerantUpdateProcessorCloud, TestSimTriggerIntegration, ConnectionReuseTest, TestSolrCloudSnapshots, TestExactSharedStatsCache, MetricTriggerIntegrationTest, ClassificationUpdateProcessorFactoryTest, TestMultiValuedNumericRangeQuery, JsonLoaderTest, IndexSchemaRuntimeFieldTest, TriggerEventQueueTest, ResourceLoaderTest, OverriddenZkACLAndCredentialsProvidersTest, TestDistributedMap, TestSolrCoreParser, ResponseBuilderTest, InfixSuggestersTest, TestBackupRepositoryFactory, TestDynamicURP, TestObjectReleaseTracker, TestDirectoryFactory, MetricsHistoryIntegrationTest, ShardsWhitelistTest, TestJsonFacetsWithNestedObjects, SchemaVersionSpecificBehaviorTest, CustomTermsComponentTest, ScheduledTriggerTest, TestQuerySenderListener, TestManagedSchemaAPI, HttpTriggerListenerTest, DistributedQueryComponentOptimizationTest, TestSimComputePlanAction, TestSolrJ, DeleteReplicaTest, UtilsToolTest, DistributedFacetExistsSmallTest, TestCoreContainer, NodeAddedTriggerIntegrationTest, LeaderFailureAfterFreshStartTest, AsyncCallRequestStatusResponseTest, TestFreeTextSuggestions, TestManagedResourceStorage, TestUpdate, TestJmxIntegration, TestClassicSimilarityFactory, TestSchemaSimilarityResource, ShardRoutingTest, TestFilteredDocIdSet, TestManagedSynonymGraphFilterFactory, AnalyticsMergeStrategyTest, ResponseHeaderTest, CacheHeaderTest, TestComplexPhraseQParserPlugin, TestBulkSchemaAPI, BasicDistributedZkTest, TestDelegationWithHadoopAuth, TestSubQueryTransformerDistrib, DateMathParserTest, ConnectionManagerTest, TestConfigSetsAPI, WrapperMergePolicyFactoryTest, BlockJoinFacetDistribTest, BadComponentTest, HdfsChaosMonkeyNothingIsSafeTest, TestSystemCollAutoCreate, TestFunctionQuery, TestCollectionAPIs, TestFastLRUCache, TestLRUStatsCache, TestXmlQParser, TestSimDistributedQueue, TestExportWriter, TestCustomSort, TestXIncludeConfig, ReplaceNodeNoTargetTest, AutoAddReplicasIntegrationTest, TestUseDocValuesAsStored2, TestCloudManagedSchema, ForceLeaderWithTlogReplicasTest, TestReloadAndDeleteDocs, ShowFileRequestHandlerTest, HttpPartitionTest, TestHighFrequencyDictionaryFactory, TestFieldTypeCollectionResource, ReindexCollectionTest, DistributedFacetPivotSmallTest, SolrMetricsIntegrationTest, TestScoreJoinQPNoScore, TestSearchPerf, CdcrOpsAndBoundariesTest, ChangedSchemaMergeTest, TestCustomDocTransformer, LargeFieldTest, TestSweetSpotSimilarityFactory, SuggestComponentContextFilterQueryTest, CustomCollectionTest, HealthCheckHandlerTest, BinaryUpdateRequestHandlerTest, SoftAutoCommitTest, MetricUtilsTest, TestPivotHelperCode, TestSolrCloudWithKerberosAlt, TestNumericTerms32, HdfsBasicDistributedZk2Test, FullHLLTest, SaslZkACLProviderTest, TestClusterStateMutator, TestConfigSetProperties, ZkNodePropsTest, TestFoldingMultitermQuery, TestSolr4Spatial, TestFieldCacheReopen, TestCloudNestedDocsSort, TestRandomCollapseQParserPlugin, TestSuggestSpellingConverter, TestSubQueryTransformer, JWTAuthPluginTest, TestFieldCacheWithThreads, SpellCheckCollatorTest, DistributedFacetPivotLongTailTest, TestPullReplica, TestOnReconnectListenerSupport, ConjunctionSolrSpellCheckerTest, TestExpandComponent, TestSort, ExecutePlanActionTest, TestSimpleTextCodec, TestBlendedInfixSuggestions, CoreSorterTest, BasicAuthStandaloneTest, TokenizerChainTest, TestInPlaceUpdateWithRouteField, CollectionsAPIDistributedZkTest, TestChildDocTransformer, BlockJoinFacetSimpleTest, TestRandomFlRTGCloud, TestPartialUpdateDeduplication, DeleteLastCustomShardedReplicaTest, TestSchemaNameResource, TestReversedWildcardFilterFactory, HighlighterMaxOffsetTest, QueryElevationComponentTest, HttpSolrCallGetCoreTest, CoreAdminHandlerTest, TestOmitPositions, DateRangeFieldTest, FastVectorHighlighterTest, SpatialHeatmapFacetsTest, DocumentBuilderTest, TestPseudoReturnFields, TestReplicaProperties, TaggingAttributeTest, SolrSlf4jReporterTest, DistributedTermsComponentTest, SolrIndexConfigTest, SearchRateTriggerTest, TestExclusionRuleCollectionAccess, CollectionStateFormat2Test, TestReRankQParserPlugin, TriLevelCompositeIdRoutingTest, TestGroupingSearch, AddReplicaTest, TestRawResponseWriter, TestOrdValues, TestExceedMaxTermLength, SolrJmxReporterCloudTest, TestCloudPivotFacet, FileBasedSpellCheckerTest, NodeMutatorTest, ZkSolrClientTest, TestRandomFaceting, DocValuesNotIndexedTest, SpatialRPTFieldTypeTest, TestReqParamsAPI, HdfsSyncSliceTest, AnalysisAfterCoreReloadTest, BasicFunctionalityTest, ConvertedLegacyTest, DisMaxRequestHandlerTest, DistributedIntervalFacetingTest, EchoParamsTest, OutputWriterTest, SolrInfoBeanTest, TestCursorMarkWithoutUniqueKey, TestDistributedGrouping, TestDistributedMissingSort, TestDistributedSearch, TestSolrCoreProperties, TestTrie, ProtectedTermFilterFactoryTest, TestDeprecatedFilters, TestLuceneIndexBackCompat, ActionThrottleTest, BasicZkTest, ChaosMonkeyNothingIsSafeTest, CloudExitableDirectoryReaderTest, ConcurrentCreateRoutedAliasTest, CreateRoutedAliasTest, DeleteNodeTest, DeleteStatusTest, DistribCursorPagingTest, DistribDocExpirationUpdateProcessorTest, DistribJoinFromCollectionTest, FullSolrCloudDistribCmdsTest, LeaderElectionContextKeyTest, LeaderElectionIntegrationTest, LeaderTragicEventTest, LeaderVoteWaitTimeoutTest, MissingSegmentRecoveryTest, MoveReplicaHDFSTest, MoveReplicaTest, RecoveryZkTest, RemoteQueryErrorTest, RollingRestartTest, SharedFSAutoReplicaFailoverTest, SolrCloudExampleTest, SolrXmlInZkTest, SplitShardTest, SyncSliceTest, TestCloudInspectUtil, TestCloudPhrasesIdentificationComponent, TestCloudRecovery, TestCloudRecovery2, TestDeleteCollectionOnDownNodes, TestDistribDocBasedVersion, TestPullReplicaErrorHandling, TestRebalanceLeaders, TestSizeLimitedDistributedMap, TestSolrCloudWithDelegationTokens, TestStressLiveNodes, TestTlogReplica, TestTolerantUpdateProcessorRandomCloud, TestZkChroot, ZkControllerTest, AssignTest, CollectionReloadTest, CollectionTooManyReplicasTest, SimpleCollectionCreateDeleteTest, TestCollectionAPI, TestCollectionsAPIViaSolrCloudCluster, TestHdfsCloudBackupRestore, TestRequestStatusCollectionAPI, AutoAddReplicasPlanActionTest, AutoScalingHandlerTest, ComputePlanActionTest, HdfsAutoAddReplicasIntegrationTest, NodeLostTriggerIntegrationTest, NodeMarkersRegistrationTest, RestoreTriggerStateTest, ScheduledTriggerIntegrationTest, TestPolicyCloud, TriggerSetPropertiesIntegrationTest, TestSimClusterStateProvider, TestSimExecutePlanAction, TestSimExtremeIndexing, TestSimNodeAddedTrigger, TestSimNodeLostTrigger, TestSimPolicyCloud, BaseCdcrDistributedZkTest, CdcrBidirectionalTest, CdcrRequestHandlerTest, CdcrWithNodesRestartsTest, HdfsBasicDistributedZkTest, HdfsChaosMonkeySafeLeaderTest, HdfsNNFailoverTest, HdfsRecoverLeaseTest, HdfsRecoveryZkTest, HdfsTlogReplayBufferedWhileIndexingTest, HdfsWriteToMultipleCollectionsTest, RuleEngineTest, RulesTest, AlternateDirectoryTest, CachingDirectoryFactoryTest, RAMDirectoryFactoryTest, SolrCoreCheckLockOnStartupTest, TestCodecSupport, TestConfig, TestConfigOverlay, TestConfigSetImmutable, TestCoreDiscovery, TestInfoStreamLogging, TestInitParams, TestLazyCores, TestMergePolicyConfig, TestNRTOpen, TestShardHandlerFactory, TestSolrConfigHandler, TestConfigReload, TestSQLHandler, TestSolrConfigHandlerConcurrent, V2ApiIntegrationTest, V2StandaloneTest, XsltUpdateRequestHandlerTest, AdminHandlersProxyTest, CoreAdminOperationTest, CoreAdminRequestStatusTest, CoreMergeIndexesAdminHandlerTest, DaemonStreamApiTest, LoggingHandlerTest, LukeRequestHandlerTest, MBeansHandlerTest, PropertiesRequestHandlerTest, SystemInfoHandlerTest, TestApiFramework, TestConfigsApi, TestCoreAdminApis, CustomHighlightComponentTest, DistributedFacetPivotLargeTest, DistributedSpellCheckComponentTest, StatsComponentTest, TestLegacyNumericUtils, TestLogWatcher, MetricsConfigTest, SolrCoreMetricManagerTest, SolrCloudReportersTest, RegexBytesRefFilterTest, SimpleFacetsTest, SubstringBytesRefFilterTest, TestFacetMethods, TestFaceting, TestRemoteStreaming, TestUnInvertedFieldException, TestMacroExpander, TestMacros, JSONWriterTest, SmileWriterTest, TestBinaryResponseWriter, TestCSVResponseWriter, TestGraphMLResponseWriter, TestJavabinTupleStreamParser, TestPHPSerializedResponseWriter, TestPushWriter, TestRawTransformer, TestRetrieveFieldsOptimizer, TestChildDocTransformerHierarchy, TestSubQueryTransformerCrossCore, TestRestManager, TestDynamicFieldCollectionResource, TestFieldCollectionResource, TestFieldResource, TestSerializedLuceneMatchVersion, TestUniqueKeyFieldResource, TestManagedSynonymFilterFactory, BadIndexSchemaTest, DocValuesMissingTest, ManagedSchemaRoundRobinCloudTest, PreAnalyzedFieldTest, RequiredFieldsTest, SchemaApiFailureTest, TestCollationField, TestManagedSchemaThreadSafety, TestSchemaManager, TestSchemalessBufferedUpdates, TestSortableTextField, AnalyticsQueryTest, CurrencyRangeFacetCloudTest, RankQueryTest, SignificantTermsQParserPluginTest, TestAddFieldRealTimeGet, TestCollapseQParserPlugin, TestComplexPhraseLeadingWildcard, TestDocSet, TestExtendedDismaxParser, TestFiltering, TestGraphTermsQParserPlugin, TestHashQParserPlugin, TestIndexSearcher, TestLFUCache, TestRecoveryHdfs, TestReload, TestSearcherReuse, TestSimpleQParserPlugin, TestSolrFieldCacheBean, TestSolrQueryParser, TestStressLucene, TestStressReorder, TestStressVersions, TestTrieFacet, TestXmlQParserPlugin, DistributedFacetSimpleRefinementLongTailTest, TestCloudJSONFacetSKG, TestJsonFacetsStatsParsing, SortByFunctionTest, DistanceFunctionTest, BJQParserTest, BlockJoinFacetRandomTest, TestScoreJoinQPScore, TestJsonRequest, SimpleMLTQParserTest, TestBM25SimilarityFactory, TestDFISimilarityFactory, TestDFRSimilarityFactory, TestLMDirichletSimilarityFactory, TestLegacyBM25SimilarityFactory, TestNonDefinedSimilarityFactory, TestPerFieldSimilarity, TestPerFieldSimilarityWithDefaultOverride, TestDefaultStatsCache, AuditLoggerPluginTest, BasicAuthIntegrationTest, PKIAuthenticationIntegrationTest, SolrLogAuditLoggerPluginTest, TestAuthorizationFramework, TestPKIAuthenticationPlugin, TestRuleBasedAuthorizationPlugin, TestImpersonationWithHadoopAuth, TestSolrCloudWithHadoopAuthPlugin, TestZkAclsWithHadoopAuth, DirectSolrConnectionTest, SolrRequestParserTest, DirectSolrSpellCheckerTest, SpellCheckCollatorWithCollapseTest, SpellPossibilityIteratorTest, SpellingQueryConverterTest, SuggesterTSTTest, TestAnalyzeInfixSuggestions, TestFuzzyAnalyzedSuggestions, BlockCacheTest, BlockDirectoryTest, BufferStoreTest, TestDocTermOrds, TestFieldCache, TestFieldCacheSortRandom, TestLegacyFieldCache, TestUninvertingReader, AddBlockUpdateTest, AnalysisErrorHandlingTest, CdcrUpdateLogTest, DirectUpdateHandlerTest, PeerSyncTest, PeerSyncWithIndexFingerprintCachingTest, PeerSyncWithLeaderAndIndexFingerprintCachingTest, PeerSyncWithLeaderTest, SolrCmdDistributorTest, SolrIndexMetricsTest, SolrIndexSplitterTest, TestAtomicUpdateErrorCases, TestInPlaceUpdatesStandalone, AtomicUpdateRemovalJavabinTest, ClassificationUpdateProcessorIntegrationTest, ClassificationUpdateProcessorTest, CloneFieldUpdateProcessorFactoryTest, DefaultValueUpdateProcessorTest, DistributedUpdateProcessorTest]
   [junit4]   2> NOTE: reproduce with: ant test  -Dtestcase=DistributedUpdateProcessorTest -Dtests.seed=30181438F713F982 -Dtests.slow=true -Dtests.locale=ml-IN -Dtests.timezone=Chile/Continental -Dtests.asserts=true -Dtests.file.encoding=UTF-8
   [junit4] ERROR   0.00s J0 | DistributedUpdateProcessorTest (suite) <<<
   [junit4]    > Assumption #1: SOLR-11606: ByteBuddy used by Mockito is not working with this JVM version.Throwable #2: java.lang.NullPointerException
   [junit4]    > 	at __randomizedtesting.SeedInfo.seed([30181438F713F982]:0)
   [junit4]    > 	at org.apache.solr.update.processor.DistributedUpdateProcessorTest.AfterClass(DistributedUpdateProcessorTest.java:67)
   [junit4]    > 	at java.base/jdk.internal.reflect.NativeMethodAccessorImpl.invoke0(Native Method)
   [junit4]    > 	at java.base/jdk.internal.reflect.NativeMethodAccessorImpl.invoke(NativeMethodAccessorImpl.java:62)
   [junit4]    > 	at java.base/jdk.internal.reflect.DelegatingMethodAccessorImpl.invoke(DelegatingMethodAccessorImpl.java:43)
   [junit4]    > 	at java.base/java.lang.reflect.Method.invoke(Method.java:567)
   [junit4]    > 	at java.base/java.lang.Thread.run(Thread.java:835)
   [junit4] Completed [820/855 (1!)] on J0 in 0.26s, 0 tests, 1 error <<< FAILURES!

[...truncated 122 lines...]
   [junit4] JVM J1: stderr was not empty, see: C:\Users\jenkins\workspace\Lucene-Solr-master-Windows\solr\build\solr-core\test\temp\junit4-J1-20190503_104645_4886506267805885147375.syserr
   [junit4] >>> JVM J1 emitted unexpected output (verbatim) ----
   [junit4] OpenJDK 64-Bit Server VM warning: Option UseConcMarkSweepGC was deprecated in version 9.0 and will likely be removed in a future release.
   [junit4] <<< JVM J1: EOF ----

[...truncated 3 lines...]
   [junit4] JVM J0: stderr was not empty, see: C:\Users\jenkins\workspace\Lucene-Solr-master-Windows\solr\build\solr-core\test\temp\junit4-J0-20190503_104645_4883441677126004244160.syserr
   [junit4] >>> JVM J0 emitted unexpected output (verbatim) ----
   [junit4] OpenJDK 64-Bit Server VM warning: Option UseConcMarkSweepGC was deprecated in version 9.0 and will likely be removed in a future release.
   [junit4] <<< JVM J0: EOF ----

[...truncated 1065 lines...]
   [junit4] JVM J0: stderr was not empty, see: C:\Users\jenkins\workspace\Lucene-Solr-master-Windows\solr\build\solr-solrj\test\temp\junit4-J0-20190503_115155_84517248972653331386685.syserr
   [junit4] >>> JVM J0 emitted unexpected output (verbatim) ----
   [junit4] OpenJDK 64-Bit Server VM warning: Option UseConcMarkSweepGC was deprecated in version 9.0 and will likely be removed in a future release.
   [junit4] <<< JVM J0: EOF ----

[...truncated 5 lines...]
   [junit4] JVM J1: stderr was not empty, see: C:\Users\jenkins\workspace\Lucene-Solr-master-Windows\solr\build\solr-solrj\test\temp\junit4-J1-20190503_115155_8558833541997353268539.syserr
   [junit4] >>> JVM J1 emitted unexpected output (verbatim) ----
   [junit4] OpenJDK 64-Bit Server VM warning: Option UseConcMarkSweepGC was deprecated in version 9.0 and will likely be removed in a future release.
   [junit4] <<< JVM J1: EOF ----

[...truncated 1512 lines...]
   [junit4] JVM J0: stderr was not empty, see: C:\Users\jenkins\workspace\Lucene-Solr-master-Windows\solr\build\contrib\solr-analysis-extras\test\temp\junit4-J0-20190503_120103_8245187072347517269141.syserr
   [junit4] >>> JVM J0 emitted unexpected output (verbatim) ----
   [junit4] OpenJDK 64-Bit Server VM warning: Option UseConcMarkSweepGC was deprecated in version 9.0 and will likely be removed in a future release.
   [junit4] <<< JVM J0: EOF ----

[...truncated 3 lines...]
   [junit4] JVM J1: stderr was not empty, see: C:\Users\jenkins\workspace\Lucene-Solr-master-Windows\solr\build\contrib\solr-analysis-extras\test\temp\junit4-J1-20190503_120103_8241379515583179650038.syserr
   [junit4] >>> JVM J1 emitted unexpected output (verbatim) ----
   [junit4] OpenJDK 64-Bit Server VM warning: Option UseConcMarkSweepGC was deprecated in version 9.0 and will likely be removed in a future release.
   [junit4] <<< JVM J1: EOF ----

[...truncated 803 lines...]
   [junit4] JVM J0: stderr was not empty, see: C:\Users\jenkins\workspace\Lucene-Solr-master-Windows\solr\build\contrib\solr-analytics\test\temp\junit4-J0-20190503_120149_1955083902568540229531.syserr
   [junit4] >>> JVM J0 emitted unexpected output (verbatim) ----
   [junit4] OpenJDK 64-Bit Server VM warning: Option UseConcMarkSweepGC was deprecated in version 9.0 and will likely be removed in a future release.
   [junit4] <<< JVM J0: EOF ----

   [junit4] JVM J1: stderr was not empty, see: C:\Users\jenkins\workspace\Lucene-Solr-master-Windows\solr\build\contrib\solr-analytics\test\temp\junit4-J1-20190503_120149_1969945089465958705742.syserr
   [junit4] >>> JVM J1 emitted unexpected output (verbatim) ----
   [junit4] OpenJDK 64-Bit Server VM warning: Option UseConcMarkSweepGC was deprecated in version 9.0 and will likely be removed in a future release.
   [junit4] <<< JVM J1: EOF ----

[...truncated 571 lines...]
   [junit4] JVM J0: stderr was not empty, see: C:\Users\jenkins\workspace\Lucene-Solr-master-Windows\solr\build\contrib\solr-clustering\test\temp\junit4-J0-20190503_120446_5893376516437521997814.syserr
   [junit4] >>> JVM J0 emitted unexpected output (verbatim) ----
   [junit4] OpenJDK 64-Bit Server VM warning: Option UseConcMarkSweepGC was deprecated in version 9.0 and will likely be removed in a future release.
   [junit4] <<< JVM J0: EOF ----

[...truncated 3 lines...]
   [junit4] JVM J1: stderr was not empty, see: C:\Users\jenkins\workspace\Lucene-Solr-master-Windows\solr\build\contrib\solr-clustering\test\temp\junit4-J1-20190503_120446_5891821769081759509491.syserr
   [junit4] >>> JVM J1 emitted unexpected output (verbatim) ----
   [junit4] OpenJDK 64-Bit Server VM warning: Option UseConcMarkSweepGC was deprecated in version 9.0 and will likely be removed in a future release.
   [junit4] <<< JVM J1: EOF ----

[...truncated 1300 lines...]
   [junit4] JVM J0: stderr was not empty, see: C:\Users\jenkins\workspace\Lucene-Solr-master-Windows\solr\build\contrib\solr-dataimporthandler-extras\test\temp\junit4-J0-20190503_120548_92110817926047312407594.syserr
   [junit4] >>> JVM J0 emitted unexpected output (verbatim) ----
   [junit4] OpenJDK 64-Bit Server VM warning: Option UseConcMarkSweepGC was deprecated in version 9.0 and will likely be removed in a future release.
   [junit4] <<< JVM J0: EOF ----

[...truncated 3 lines...]
   [junit4] JVM J1: stderr was not empty, see: C:\Users\jenkins\workspace\Lucene-Solr-master-Windows\solr\build\contrib\solr-dataimporthandler-extras\test\temp\junit4-J1-20190503_120548_9209356027315898231792.syserr
   [junit4] >>> JVM J1 emitted unexpected output (verbatim) ----
   [junit4] OpenJDK 64-Bit Server VM warning: Option UseConcMarkSweepGC was deprecated in version 9.0 and will likely be removed in a future release.
   [junit4] <<< JVM J1: EOF ----

[...truncated 666 lines...]
   [junit4] JVM J0: stderr was not empty, see: C:\Users\jenkins\workspace\Lucene-Solr-master-Windows\solr\build\contrib\solr-dataimporthandler\test\temp\junit4-J0-20190503_120620_7681574930467606587218.syserr
   [junit4] >>> JVM J0 emitted unexpected output (verbatim) ----
   [junit4] OpenJDK 64-Bit Server VM warning: Option UseConcMarkSweepGC was deprecated in version 9.0 and will likely be removed in a future release.
   [junit4] <<< JVM J0: EOF ----

[...truncated 3 lines...]
   [junit4] JVM J1: stderr was not empty, see: C:\Users\jenkins\workspace\Lucene-Solr-master-Windows\solr\build\contrib\solr-dataimporthandler\test\temp\junit4-J1-20190503_120620_76817487295702725966580.syserr
   [junit4] >>> JVM J1 emitted unexpected output (verbatim) ----
   [junit4] OpenJDK 64-Bit Server VM warning: Option UseConcMarkSweepGC was deprecated in version 9.0 and will likely be removed in a future release.
   [junit4] <<< JVM J1: EOF ----

[...truncated 573 lines...]
   [junit4] JVM J1: stderr was not empty, see: C:\Users\jenkins\workspace\Lucene-Solr-master-Windows\solr\build\contrib\solr-cell\test\temp\junit4-J1-20190503_120737_546322618383438869781.syserr
   [junit4] >>> JVM J1 emitted unexpected output (verbatim) ----
   [junit4] OpenJDK 64-Bit Server VM warning: Option UseConcMarkSweepGC was deprecated in version 9.0 and will likely be removed in a future release.
   [junit4] <<< JVM J1: EOF ----

[...truncated 3 lines...]
   [junit4] JVM J0: stderr was not empty, see: C:\Users\jenkins\workspace\Lucene-Solr-master-Windows\solr\build\contrib\solr-cell\test\temp\junit4-J0-20190503_120737_5461692934903737855366.syserr
   [junit4] >>> JVM J0 emitted unexpected output (verbatim) ----
   [junit4] OpenJDK 64-Bit Server VM warning: Option UseConcMarkSweepGC was deprecated in version 9.0 and will likely be removed in a future release.
   [junit4] <<< JVM J0: EOF ----

[...truncated 581 lines...]
   [junit4] JVM J1: stderr was not empty, see: C:\Users\jenkins\workspace\Lucene-Solr-master-Windows\solr\build\contrib\solr-langid\test\temp\junit4-J1-20190503_120828_4161848871302144519993.syserr
   [junit4] >>> JVM J1 emitted unexpected output (verbatim) ----
   [junit4] OpenJDK 64-Bit Server VM warning: Option UseConcMarkSweepGC was deprecated in version 9.0 and will likely be removed in a future release.
   [junit4] <<< JVM J1: EOF ----

[...truncated 3 lines...]
   [junit4] JVM J0: stderr was not empty, see: C:\Users\jenkins\workspace\Lucene-Solr-master-Windows\solr\build\contrib\solr-langid\test\temp\junit4-J0-20190503_120828_4152225427987031512827.syserr
   [junit4] >>> JVM J0 emitted unexpected output (verbatim) ----
   [junit4] OpenJDK 64-Bit Server VM warning: Option UseConcMarkSweepGC was deprecated in version 9.0 and will likely be removed in a future release.
   [junit4] <<< JVM J0: EOF ----

[...truncated 684 lines...]
   [junit4] JVM J1: stderr was not empty, see: C:\Users\jenkins\workspace\Lucene-Solr-master-Windows\solr\build\contrib\solr-ltr\test\temp\junit4-J1-20190503_120908_41218058502228578712711.syserr
   [junit4] >>> JVM J1 emitted unexpected output (verbatim) ----
   [junit4] OpenJDK 64-Bit Server VM warning: Option UseConcMarkSweepGC was deprecated in version 9.0 and w

[...truncated too long message...]

.java:62)
   [junit4]    > 	at java.base/jdk.internal.reflect.DelegatingMethodAccessorImpl.invoke(DelegatingMethodAccessorImpl.java:43)
   [junit4]    > 	at java.base/java.lang.reflect.Method.invoke(Method.java:567)
   [junit4]    > 	at java.base/java.lang.Thread.run(Thread.java:835)
   [junit4] Completed [3/5 (3!)] on J1 in 0.34s, 0 tests, 1 error <<< FAILURES!

[...truncated 1 lines...]
   [junit4] Suite: org.apache.solr.update.processor.DistributedUpdateProcessorTest
   [junit4]   2> 15345 INFO  (SUITE-DistributedUpdateProcessorTest-seed#[30181438F713F982]-worker) [    ] o.a.s.SolrTestCaseJ4 SecureRandom sanity checks: test.solr.allowed.securerandom=null & java.security.egd=file:/dev/./urandom
   [junit4]   2> Creating dataDir: C:\Users\jenkins\workspace\Lucene-Solr-master-Windows\solr\build\solr-core\test\J0\temp\solr.update.processor.DistributedUpdateProcessorTest_30181438F713F982-001\init-core-data-001
   [junit4]   2> 15386 INFO  (SUITE-DistributedUpdateProcessorTest-seed#[30181438F713F982]-worker) [    ] o.a.s.SolrTestCaseJ4 Using TrieFields (NUMERIC_POINTS_SYSPROP=false) w/NUMERIC_DOCVALUES_SYSPROP=true
   [junit4]   2> 15386 INFO  (SUITE-DistributedUpdateProcessorTest-seed#[30181438F713F982]-worker) [    ] o.a.s.SolrTestCaseJ4 Randomized ssl (false) and clientAuth (true) via: @org.apache.solr.util.RandomizeSSL(reason="", value=0.0/0.0, ssl=0.0/0.0, clientAuth=0.0/0.0)
   [junit4]   2> 15386 INFO  (SUITE-DistributedUpdateProcessorTest-seed#[30181438F713F982]-worker) [    ] o.a.s.SolrTestCaseJ4 ------------------------------------------------------- Done waiting for tracked resources to be released
   [junit4]   2> NOTE: test params are: codec=CheapBastard, sim=Asserting(org.apache.lucene.search.similarities.AssertingSimilarity@599ba4f5), locale=ml-IN, timezone=Chile/Continental
   [junit4]   2> NOTE: Windows 10 10.0 amd64/Oracle Corporation 13-ea (64-bit)/cpus=3,threads=1,free=59624352,total=97320960
   [junit4]   2> NOTE: All tests run in this JVM: [DistributedUpdateProcessorTest, DistributedUpdateProcessorTest]
   [junit4]   2> NOTE: reproduce with: ant test  -Dtestcase=DistributedUpdateProcessorTest -Dtests.seed=30181438F713F982 -Dtests.slow=true -Dtests.badapples=true -Dtests.locale=ml-IN -Dtests.timezone=Chile/Continental -Dtests.asserts=true -Dtests.file.encoding=UTF-8
   [junit4] ERROR   0.00s J0 | DistributedUpdateProcessorTest (suite) <<<
   [junit4]    > Assumption #1: SOLR-11606: ByteBuddy used by Mockito is not working with this JVM version.Throwable #2: java.lang.NullPointerException
   [junit4]    > 	at __randomizedtesting.SeedInfo.seed([30181438F713F982]:0)
   [junit4]    > 	at org.apache.solr.update.processor.DistributedUpdateProcessorTest.AfterClass(DistributedUpdateProcessorTest.java:67)
   [junit4]    > 	at java.base/jdk.internal.reflect.NativeMethodAccessorImpl.invoke0(Native Method)
   [junit4]    > 	at java.base/jdk.internal.reflect.NativeMethodAccessorImpl.invoke(NativeMethodAccessorImpl.java:62)
   [junit4]    > 	at java.base/jdk.internal.reflect.DelegatingMethodAccessorImpl.invoke(DelegatingMethodAccessorImpl.java:43)
   [junit4]    > 	at java.base/java.lang.reflect.Method.invoke(Method.java:567)
   [junit4]    > 	at java.base/java.lang.Thread.run(Thread.java:835)
   [junit4] Completed [4/5 (4!)] on J0 in 0.29s, 0 tests, 1 error <<< FAILURES!

[...truncated 1 lines...]
   [junit4] JVM J0: stderr was not empty, see: C:\Users\jenkins\workspace\Lucene-Solr-master-Windows\solr\build\solr-core\test\temp\junit4-J0-20190503_121800_60318410622206630167512.syserr
   [junit4] >>> JVM J0 emitted unexpected output (verbatim) ----
   [junit4] OpenJDK 64-Bit Server VM warning: Option UseConcMarkSweepGC was deprecated in version 9.0 and will likely be removed in a future release.
   [junit4] <<< JVM J0: EOF ----

   [junit4] Suite: org.apache.solr.update.processor.DistributedUpdateProcessorTest
   [junit4]   2> Creating dataDir: C:\Users\jenkins\workspace\Lucene-Solr-master-Windows\solr\build\solr-core\test\J1\temp\solr.update.processor.DistributedUpdateProcessorTest_30181438F713F982-001\init-core-data-001
   [junit4]   2> 15724 INFO  (SUITE-DistributedUpdateProcessorTest-seed#[30181438F713F982]-worker) [    ] o.a.s.SolrTestCaseJ4 SecureRandom sanity checks: test.solr.allowed.securerandom=null & java.security.egd=file:/dev/./urandom
   [junit4]   2> 15724 INFO  (SUITE-DistributedUpdateProcessorTest-seed#[30181438F713F982]-worker) [    ] o.a.s.SolrTestCaseJ4 Using TrieFields (NUMERIC_POINTS_SYSPROP=false) w/NUMERIC_DOCVALUES_SYSPROP=true
   [junit4]   2> 15727 INFO  (SUITE-DistributedUpdateProcessorTest-seed#[30181438F713F982]-worker) [    ] o.a.s.SolrTestCaseJ4 Randomized ssl (false) and clientAuth (true) via: @org.apache.solr.util.RandomizeSSL(reason="", value=0.0/0.0, ssl=0.0/0.0, clientAuth=0.0/0.0)
   [junit4]   2> 15728 INFO  (SUITE-DistributedUpdateProcessorTest-seed#[30181438F713F982]-worker) [    ] o.a.s.SolrTestCaseJ4 ------------------------------------------------------- Done waiting for tracked resources to be released
   [junit4]   2> NOTE: test params are: codec=CheapBastard, sim=Asserting(org.apache.lucene.search.similarities.AssertingSimilarity@28e77b3f), locale=ml-IN, timezone=Chile/Continental
   [junit4]   2> NOTE: Windows 10 10.0 amd64/Oracle Corporation 13-ea (64-bit)/cpus=3,threads=1,free=56788712,total=97320960
   [junit4]   2> NOTE: All tests run in this JVM: [DistributedUpdateProcessorTest, DistributedUpdateProcessorTest, DistributedUpdateProcessorTest]
   [junit4]   2> NOTE: reproduce with: ant test  -Dtestcase=DistributedUpdateProcessorTest -Dtests.seed=30181438F713F982 -Dtests.slow=true -Dtests.badapples=true -Dtests.locale=ml-IN -Dtests.timezone=Chile/Continental -Dtests.asserts=true -Dtests.file.encoding=UTF-8
   [junit4] ERROR   0.00s J1 | DistributedUpdateProcessorTest (suite) <<<
   [junit4]    > Assumption #1: SOLR-11606: ByteBuddy used by Mockito is not working with this JVM version.Throwable #2: java.lang.NullPointerException
   [junit4]    > 	at __randomizedtesting.SeedInfo.seed([30181438F713F982]:0)
   [junit4]    > 	at org.apache.solr.update.processor.DistributedUpdateProcessorTest.AfterClass(DistributedUpdateProcessorTest.java:67)
   [junit4]    > 	at java.base/jdk.internal.reflect.NativeMethodAccessorImpl.invoke0(Native Method)
   [junit4]    > 	at java.base/jdk.internal.reflect.NativeMethodAccessorImpl.invoke(NativeMethodAccessorImpl.java:62)
   [junit4]    > 	at java.base/jdk.internal.reflect.DelegatingMethodAccessorImpl.invoke(DelegatingMethodAccessorImpl.java:43)
   [junit4]    > 	at java.base/java.lang.reflect.Method.invoke(Method.java:567)
   [junit4]    > 	at java.base/java.lang.Thread.run(Thread.java:835)
   [junit4] Completed [5/5 (5!)] on J1 in 0.30s, 0 tests, 1 error <<< FAILURES!

[...truncated 1 lines...]
   [junit4] JVM J1: stderr was not empty, see: C:\Users\jenkins\workspace\Lucene-Solr-master-Windows\solr\build\solr-core\test\temp\junit4-J1-20190503_121800_6027017617030405435149.syserr
   [junit4] >>> JVM J1 emitted unexpected output (verbatim) ----
   [junit4] OpenJDK 64-Bit Server VM warning: Option UseConcMarkSweepGC was deprecated in version 9.0 and will likely be removed in a future release.
   [junit4] <<< JVM J1: EOF ----

[...truncated 13 lines...]
BUILD FAILED
C:\Users\jenkins\workspace\Lucene-Solr-master-Windows\lucene\common-build.xml:1493: The following error occurred while executing this line:
C:\Users\jenkins\workspace\Lucene-Solr-master-Windows\lucene\common-build.xml:1020: There were test failures: 5 suites, 0 tests, 10 suite-level errors [seed: 30181438F713F982]

Total time: 19 seconds

[repro] Setting last failure code to 1

[repro] Failures:
[repro]   5/5 failed: org.apache.solr.update.processor.DistributedUpdateProcessorTest
[repro] Exiting with code 1

C:\Users\jenkins\workspace\Lucene-Solr-master-Windows>IF EXIST lucene\build move /y lucene\build lucene\build.repro 
        1 dir(s) moved.

C:\Users\jenkins\workspace\Lucene-Solr-master-Windows>IF EXIST solr\build move /y solr\build solr\build.repro 
        1 dir(s) moved.

C:\Users\jenkins\workspace\Lucene-Solr-master-Windows>IF EXIST lucene\build.orig move /y lucene\build.orig lucene\build 
        1 dir(s) moved.

C:\Users\jenkins\workspace\Lucene-Solr-master-Windows>IF EXIST solr\build.orig move /y solr\build.orig solr\build 
        1 dir(s) moved.

C:\Users\jenkins\workspace\Lucene-Solr-master-Windows>exit 0 
Archiving artifacts
Setting ANT_1_8_2_HOME=C:\Users\jenkins\tools\hudson.tasks.Ant_AntInstallation\ANT_1.8.2
[WARNINGS] Parsing warnings in console log with parser Java Compiler (javac)
Setting ANT_1_8_2_HOME=C:\Users\jenkins\tools\hudson.tasks.Ant_AntInstallation\ANT_1.8.2
No credentials specified
Setting ANT_1_8_2_HOME=C:\Users\jenkins\tools\hudson.tasks.Ant_AntInstallation\ANT_1.8.2
<Git Blamer> Using GitBlamer to create author and commit information for all warnings.
<Git Blamer> GIT_COMMIT=cdd130ccb69e4483ca4fa488c3e9f0b88631cfcb, workspace=C:\Users\jenkins\workspace\Lucene-Solr-master-Windows
[WARNINGS] Computing warning deltas based on reference build #7923
Recording test results
Setting ANT_1_8_2_HOME=C:\Users\jenkins\tools\hudson.tasks.Ant_AntInstallation\ANT_1.8.2
Build step 'Publish JUnit test result report' changed build result to UNSTABLE
Email was triggered for: Unstable (Test Failures)
Sending email for trigger: Unstable (Test Failures)
Setting ANT_1_8_2_HOME=C:\Users\jenkins\tools\hudson.tasks.Ant_AntInstallation\ANT_1.8.2
Setting ANT_1_8_2_HOME=C:\Users\jenkins\tools\hudson.tasks.Ant_AntInstallation\ANT_1.8.2
Setting ANT_1_8_2_HOME=C:\Users\jenkins\tools\hudson.tasks.Ant_AntInstallation\ANT_1.8.2
Setting ANT_1_8_2_HOME=C:\Users\jenkins\tools\hudson.tasks.Ant_AntInstallation\ANT_1.8.2
Setting ANT_1_8_2_HOME=C:\Users\jenkins\tools\hudson.tasks.Ant_AntInstallation\ANT_1.8.2
Setting ANT_1_8_2_HOME=C:\Users\jenkins\tools\hudson.tasks.Ant_AntInstallation\ANT_1.8.2

Mime
View raw message