lucene-dev mailing list archives

Site index · List index
Message view « Date » · « Thread »
Top « Date » · « Thread »
From Apache Jenkins Server <jenk...@builds.apache.org>
Subject [JENKINS] Lucene-Solr-Tests-master - Build # 3322 - Still Failing
Date Wed, 01 May 2019 13:29:37 GMT
Build: https://builds.apache.org/job/Lucene-Solr-Tests-master/3322/

3 tests failed.
FAILED:  org.apache.solr.update.PeerSyncTest.test

Error Message:
Unexpected exception type, expected SolrException but got org.apache.solr.client.solrj.SolrServerException: Timeout occurred while waiting response from server at: http://127.0.0.1:41042/collection1

Stack Trace:
junit.framework.AssertionFailedError: Unexpected exception type, expected SolrException but got org.apache.solr.client.solrj.SolrServerException: Timeout occurred while waiting response from server at: http://127.0.0.1:41042/collection1
	at __randomizedtesting.SeedInfo.seed([4C8CA59F47223283:C4D89A45E9DE5F7B]:0)
	at org.apache.lucene.util.LuceneTestCase.expectThrows(LuceneTestCase.java:2699)
	at org.apache.lucene.util.LuceneTestCase.expectThrows(LuceneTestCase.java:2688)
	at org.apache.solr.update.PeerSyncTest.test(PeerSyncTest.java:279)
	at java.base/jdk.internal.reflect.NativeMethodAccessorImpl.invoke0(Native Method)
	at java.base/jdk.internal.reflect.NativeMethodAccessorImpl.invoke(NativeMethodAccessorImpl.java:62)
	at java.base/jdk.internal.reflect.DelegatingMethodAccessorImpl.invoke(DelegatingMethodAccessorImpl.java:43)
	at java.base/java.lang.reflect.Method.invoke(Method.java:566)
	at com.carrotsearch.randomizedtesting.RandomizedRunner.invoke(RandomizedRunner.java:1750)
	at com.carrotsearch.randomizedtesting.RandomizedRunner$8.evaluate(RandomizedRunner.java:938)
	at com.carrotsearch.randomizedtesting.RandomizedRunner$9.evaluate(RandomizedRunner.java:974)
	at com.carrotsearch.randomizedtesting.RandomizedRunner$10.evaluate(RandomizedRunner.java:988)
	at org.apache.solr.BaseDistributedSearchTestCase$ShardsRepeatRule$ShardsFixedStatement.callStatement(BaseDistributedSearchTestCase.java:1082)
	at org.apache.solr.BaseDistributedSearchTestCase$ShardsRepeatRule$ShardsStatement.evaluate(BaseDistributedSearchTestCase.java:1054)
	at com.carrotsearch.randomizedtesting.rules.SystemPropertiesRestoreRule$1.evaluate(SystemPropertiesRestoreRule.java:57)
	at org.apache.lucene.util.TestRuleSetupTeardownChained$1.evaluate(TestRuleSetupTeardownChained.java:49)
	at org.apache.lucene.util.AbstractBeforeAfterRule$1.evaluate(AbstractBeforeAfterRule.java:45)
	at org.apache.lucene.util.TestRuleThreadAndTestName$1.evaluate(TestRuleThreadAndTestName.java:48)
	at org.apache.lucene.util.TestRuleIgnoreAfterMaxFailures$1.evaluate(TestRuleIgnoreAfterMaxFailures.java:64)
	at org.apache.lucene.util.TestRuleMarkFailure$1.evaluate(TestRuleMarkFailure.java:47)
	at com.carrotsearch.randomizedtesting.rules.StatementAdapter.evaluate(StatementAdapter.java:36)
	at com.carrotsearch.randomizedtesting.ThreadLeakControl$StatementRunner.run(ThreadLeakControl.java:368)
	at com.carrotsearch.randomizedtesting.ThreadLeakControl.forkTimeoutingTask(ThreadLeakControl.java:817)
	at com.carrotsearch.randomizedtesting.ThreadLeakControl$3.evaluate(ThreadLeakControl.java:468)
	at com.carrotsearch.randomizedtesting.RandomizedRunner.runSingleTest(RandomizedRunner.java:947)
	at com.carrotsearch.randomizedtesting.RandomizedRunner$5.evaluate(RandomizedRunner.java:832)
	at com.carrotsearch.randomizedtesting.RandomizedRunner$6.evaluate(RandomizedRunner.java:883)
	at com.carrotsearch.randomizedtesting.RandomizedRunner$7.evaluate(RandomizedRunner.java:894)
	at com.carrotsearch.randomizedtesting.rules.StatementAdapter.evaluate(StatementAdapter.java:36)
	at com.carrotsearch.randomizedtesting.rules.SystemPropertiesRestoreRule$1.evaluate(SystemPropertiesRestoreRule.java:57)
	at org.apache.lucene.util.AbstractBeforeAfterRule$1.evaluate(AbstractBeforeAfterRule.java:45)
	at com.carrotsearch.randomizedtesting.rules.StatementAdapter.evaluate(StatementAdapter.java:36)
	at org.apache.lucene.util.TestRuleStoreClassName$1.evaluate(TestRuleStoreClassName.java:41)
	at com.carrotsearch.randomizedtesting.rules.NoShadowingOrOverridesOnMethodsRule$1.evaluate(NoShadowingOrOverridesOnMethodsRule.java:40)
	at com.carrotsearch.randomizedtesting.rules.NoShadowingOrOverridesOnMethodsRule$1.evaluate(NoShadowingOrOverridesOnMethodsRule.java:40)
	at com.carrotsearch.randomizedtesting.rules.StatementAdapter.evaluate(StatementAdapter.java:36)
	at com.carrotsearch.randomizedtesting.rules.StatementAdapter.evaluate(StatementAdapter.java:36)
	at org.apache.lucene.util.TestRuleAssertionsRequired$1.evaluate(TestRuleAssertionsRequired.java:53)
	at org.apache.lucene.util.TestRuleMarkFailure$1.evaluate(TestRuleMarkFailure.java:47)
	at org.apache.lucene.util.TestRuleIgnoreAfterMaxFailures$1.evaluate(TestRuleIgnoreAfterMaxFailures.java:64)
	at org.apache.lucene.util.TestRuleIgnoreTestSuites$1.evaluate(TestRuleIgnoreTestSuites.java:54)
	at com.carrotsearch.randomizedtesting.rules.StatementAdapter.evaluate(StatementAdapter.java:36)
	at com.carrotsearch.randomizedtesting.ThreadLeakControl$StatementRunner.run(ThreadLeakControl.java:368)
	at java.base/java.lang.Thread.run(Thread.java:834)
Caused by: org.apache.solr.client.solrj.SolrServerException: Timeout occurred while waiting response from server at: http://127.0.0.1:41042/collection1
	at org.apache.solr.client.solrj.impl.HttpSolrClient.executeMethod(HttpSolrClient.java:660)
	at org.apache.solr.client.solrj.impl.HttpSolrClient.request(HttpSolrClient.java:255)
	at org.apache.solr.client.solrj.impl.HttpSolrClient.request(HttpSolrClient.java:244)
	at org.apache.solr.client.solrj.SolrRequest.process(SolrRequest.java:207)
	at org.apache.solr.client.solrj.SolrRequest.process(SolrRequest.java:224)
	at org.apache.solr.BaseDistributedSearchTestCase.add(BaseDistributedSearchTestCase.java:576)
	at org.apache.solr.update.PeerSyncTest.lambda$test$0(PeerSyncTest.java:281)
	at org.apache.lucene.util.LuceneTestCase.expectThrows(LuceneTestCase.java:2694)
	... 42 more
Caused by: java.net.SocketTimeoutException: Read timed out
	at java.base/java.net.SocketInputStream.socketRead0(Native Method)
	at java.base/java.net.SocketInputStream.socketRead(SocketInputStream.java:115)
	at java.base/java.net.SocketInputStream.read(SocketInputStream.java:168)
	at java.base/java.net.SocketInputStream.read(SocketInputStream.java:140)
	at org.apache.http.impl.io.SessionInputBufferImpl.streamRead(SessionInputBufferImpl.java:137)
	at org.apache.http.impl.io.SessionInputBufferImpl.fillBuffer(SessionInputBufferImpl.java:153)
	at org.apache.http.impl.io.SessionInputBufferImpl.readLine(SessionInputBufferImpl.java:282)
	at org.apache.http.impl.conn.DefaultHttpResponseParser.parseHead(DefaultHttpResponseParser.java:138)
	at org.apache.http.impl.conn.DefaultHttpResponseParser.parseHead(DefaultHttpResponseParser.java:56)
	at org.apache.http.impl.io.AbstractMessageParser.parse(AbstractMessageParser.java:259)
	at org.apache.http.impl.DefaultBHttpClientConnection.receiveResponseHeader(DefaultBHttpClientConnection.java:163)
	at org.apache.http.impl.conn.CPoolProxy.receiveResponseHeader(CPoolProxy.java:165)
	at org.apache.http.protocol.HttpRequestExecutor.doReceiveResponse(HttpRequestExecutor.java:273)
	at org.apache.http.protocol.HttpRequestExecutor.execute(HttpRequestExecutor.java:125)
	at org.apache.http.impl.execchain.MainClientExec.execute(MainClientExec.java:272)
	at org.apache.http.impl.execchain.ProtocolExec.execute(ProtocolExec.java:185)
	at org.apache.http.impl.execchain.RetryExec.execute(RetryExec.java:89)
	at org.apache.http.impl.execchain.RedirectExec.execute(RedirectExec.java:110)
	at org.apache.http.impl.client.InternalHttpClient.doExecute(InternalHttpClient.java:185)
	at org.apache.http.impl.client.CloseableHttpClient.execute(CloseableHttpClient.java:83)
	at org.apache.http.impl.client.CloseableHttpClient.execute(CloseableHttpClient.java:56)
	at org.apache.solr.client.solrj.impl.HttpSolrClient.executeMethod(HttpSolrClient.java:548)
	... 49 more


FAILED:  org.apache.solr.update.PeerSyncWithLeaderTest.test

Error Message:
Unexpected exception type, expected SolrException but got org.apache.solr.client.solrj.SolrServerException: Timeout occurred while waiting response from server at: http://127.0.0.1:36632/_ofo/c/collection1

Stack Trace:
junit.framework.AssertionFailedError: Unexpected exception type, expected SolrException but got org.apache.solr.client.solrj.SolrServerException: Timeout occurred while waiting response from server at: http://127.0.0.1:36632/_ofo/c/collection1
	at __randomizedtesting.SeedInfo.seed([4C8CA59F47223283:C4D89A45E9DE5F7B]:0)
	at org.apache.lucene.util.LuceneTestCase.expectThrows(LuceneTestCase.java:2699)
	at org.apache.lucene.util.LuceneTestCase.expectThrows(LuceneTestCase.java:2688)
	at org.apache.solr.update.PeerSyncTest.test(PeerSyncTest.java:279)
	at java.base/jdk.internal.reflect.NativeMethodAccessorImpl.invoke0(Native Method)
	at java.base/jdk.internal.reflect.NativeMethodAccessorImpl.invoke(NativeMethodAccessorImpl.java:62)
	at java.base/jdk.internal.reflect.DelegatingMethodAccessorImpl.invoke(DelegatingMethodAccessorImpl.java:43)
	at java.base/java.lang.reflect.Method.invoke(Method.java:566)
	at com.carrotsearch.randomizedtesting.RandomizedRunner.invoke(RandomizedRunner.java:1750)
	at com.carrotsearch.randomizedtesting.RandomizedRunner$8.evaluate(RandomizedRunner.java:938)
	at com.carrotsearch.randomizedtesting.RandomizedRunner$9.evaluate(RandomizedRunner.java:974)
	at com.carrotsearch.randomizedtesting.RandomizedRunner$10.evaluate(RandomizedRunner.java:988)
	at org.apache.solr.BaseDistributedSearchTestCase$ShardsRepeatRule$ShardsFixedStatement.callStatement(BaseDistributedSearchTestCase.java:1082)
	at org.apache.solr.BaseDistributedSearchTestCase$ShardsRepeatRule$ShardsStatement.evaluate(BaseDistributedSearchTestCase.java:1054)
	at com.carrotsearch.randomizedtesting.rules.SystemPropertiesRestoreRule$1.evaluate(SystemPropertiesRestoreRule.java:57)
	at org.apache.lucene.util.TestRuleSetupTeardownChained$1.evaluate(TestRuleSetupTeardownChained.java:49)
	at org.apache.lucene.util.AbstractBeforeAfterRule$1.evaluate(AbstractBeforeAfterRule.java:45)
	at org.apache.lucene.util.TestRuleThreadAndTestName$1.evaluate(TestRuleThreadAndTestName.java:48)
	at org.apache.lucene.util.TestRuleIgnoreAfterMaxFailures$1.evaluate(TestRuleIgnoreAfterMaxFailures.java:64)
	at org.apache.lucene.util.TestRuleMarkFailure$1.evaluate(TestRuleMarkFailure.java:47)
	at com.carrotsearch.randomizedtesting.rules.StatementAdapter.evaluate(StatementAdapter.java:36)
	at com.carrotsearch.randomizedtesting.ThreadLeakControl$StatementRunner.run(ThreadLeakControl.java:368)
	at com.carrotsearch.randomizedtesting.ThreadLeakControl.forkTimeoutingTask(ThreadLeakControl.java:817)
	at com.carrotsearch.randomizedtesting.ThreadLeakControl$3.evaluate(ThreadLeakControl.java:468)
	at com.carrotsearch.randomizedtesting.RandomizedRunner.runSingleTest(RandomizedRunner.java:947)
	at com.carrotsearch.randomizedtesting.RandomizedRunner$5.evaluate(RandomizedRunner.java:832)
	at com.carrotsearch.randomizedtesting.RandomizedRunner$6.evaluate(RandomizedRunner.java:883)
	at com.carrotsearch.randomizedtesting.RandomizedRunner$7.evaluate(RandomizedRunner.java:894)
	at com.carrotsearch.randomizedtesting.rules.StatementAdapter.evaluate(StatementAdapter.java:36)
	at com.carrotsearch.randomizedtesting.rules.SystemPropertiesRestoreRule$1.evaluate(SystemPropertiesRestoreRule.java:57)
	at org.apache.lucene.util.AbstractBeforeAfterRule$1.evaluate(AbstractBeforeAfterRule.java:45)
	at com.carrotsearch.randomizedtesting.rules.StatementAdapter.evaluate(StatementAdapter.java:36)
	at org.apache.lucene.util.TestRuleStoreClassName$1.evaluate(TestRuleStoreClassName.java:41)
	at com.carrotsearch.randomizedtesting.rules.NoShadowingOrOverridesOnMethodsRule$1.evaluate(NoShadowingOrOverridesOnMethodsRule.java:40)
	at com.carrotsearch.randomizedtesting.rules.NoShadowingOrOverridesOnMethodsRule$1.evaluate(NoShadowingOrOverridesOnMethodsRule.java:40)
	at com.carrotsearch.randomizedtesting.rules.StatementAdapter.evaluate(StatementAdapter.java:36)
	at com.carrotsearch.randomizedtesting.rules.StatementAdapter.evaluate(StatementAdapter.java:36)
	at org.apache.lucene.util.TestRuleAssertionsRequired$1.evaluate(TestRuleAssertionsRequired.java:53)
	at org.apache.lucene.util.TestRuleMarkFailure$1.evaluate(TestRuleMarkFailure.java:47)
	at org.apache.lucene.util.TestRuleIgnoreAfterMaxFailures$1.evaluate(TestRuleIgnoreAfterMaxFailures.java:64)
	at org.apache.lucene.util.TestRuleIgnoreTestSuites$1.evaluate(TestRuleIgnoreTestSuites.java:54)
	at com.carrotsearch.randomizedtesting.rules.StatementAdapter.evaluate(StatementAdapter.java:36)
	at com.carrotsearch.randomizedtesting.ThreadLeakControl$StatementRunner.run(ThreadLeakControl.java:368)
	at java.base/java.lang.Thread.run(Thread.java:834)
Caused by: org.apache.solr.client.solrj.SolrServerException: Timeout occurred while waiting response from server at: http://127.0.0.1:36632/_ofo/c/collection1
	at org.apache.solr.client.solrj.impl.HttpSolrClient.executeMethod(HttpSolrClient.java:660)
	at org.apache.solr.client.solrj.impl.HttpSolrClient.request(HttpSolrClient.java:255)
	at org.apache.solr.client.solrj.impl.HttpSolrClient.request(HttpSolrClient.java:244)
	at org.apache.solr.client.solrj.SolrRequest.process(SolrRequest.java:207)
	at org.apache.solr.client.solrj.SolrRequest.process(SolrRequest.java:224)
	at org.apache.solr.BaseDistributedSearchTestCase.add(BaseDistributedSearchTestCase.java:576)
	at org.apache.solr.update.PeerSyncTest.lambda$test$0(PeerSyncTest.java:281)
	at org.apache.lucene.util.LuceneTestCase.expectThrows(LuceneTestCase.java:2694)
	... 42 more
Caused by: java.net.SocketTimeoutException: Read timed out
	at java.base/java.net.SocketInputStream.socketRead0(Native Method)
	at java.base/java.net.SocketInputStream.socketRead(SocketInputStream.java:115)
	at java.base/java.net.SocketInputStream.read(SocketInputStream.java:168)
	at java.base/java.net.SocketInputStream.read(SocketInputStream.java:140)
	at org.apache.http.impl.io.SessionInputBufferImpl.streamRead(SessionInputBufferImpl.java:137)
	at org.apache.http.impl.io.SessionInputBufferImpl.fillBuffer(SessionInputBufferImpl.java:153)
	at org.apache.http.impl.io.SessionInputBufferImpl.readLine(SessionInputBufferImpl.java:282)
	at org.apache.http.impl.conn.DefaultHttpResponseParser.parseHead(DefaultHttpResponseParser.java:138)
	at org.apache.http.impl.conn.DefaultHttpResponseParser.parseHead(DefaultHttpResponseParser.java:56)
	at org.apache.http.impl.io.AbstractMessageParser.parse(AbstractMessageParser.java:259)
	at org.apache.http.impl.DefaultBHttpClientConnection.receiveResponseHeader(DefaultBHttpClientConnection.java:163)
	at org.apache.http.impl.conn.CPoolProxy.receiveResponseHeader(CPoolProxy.java:165)
	at org.apache.http.protocol.HttpRequestExecutor.doReceiveResponse(HttpRequestExecutor.java:273)
	at org.apache.http.protocol.HttpRequestExecutor.execute(HttpRequestExecutor.java:125)
	at org.apache.http.impl.execchain.MainClientExec.execute(MainClientExec.java:272)
	at org.apache.http.impl.execchain.ProtocolExec.execute(ProtocolExec.java:185)
	at org.apache.http.impl.execchain.RetryExec.execute(RetryExec.java:89)
	at org.apache.http.impl.execchain.RedirectExec.execute(RedirectExec.java:110)
	at org.apache.http.impl.client.InternalHttpClient.doExecute(InternalHttpClient.java:185)
	at org.apache.http.impl.client.CloseableHttpClient.execute(CloseableHttpClient.java:83)
	at org.apache.http.impl.client.CloseableHttpClient.execute(CloseableHttpClient.java:56)
	at org.apache.solr.client.solrj.impl.HttpSolrClient.executeMethod(HttpSolrClient.java:548)
	... 49 more


FAILED:  org.apache.solr.update.TestInPlaceUpdatesDistrib.test

Error Message:
Thread pool didn't terminate within 15 secs

Stack Trace:
java.lang.AssertionError: Thread pool didn't terminate within 15 secs
	at __randomizedtesting.SeedInfo.seed([4C8CA59F47223283:C4D89A45E9DE5F7B]:0)
	at org.junit.Assert.fail(Assert.java:88)
	at org.junit.Assert.assertTrue(Assert.java:41)
	at org.apache.solr.update.TestInPlaceUpdatesDistrib.reorderedDBQsResurrectionTest(TestInPlaceUpdatesDistrib.java:852)
	at org.apache.solr.update.TestInPlaceUpdatesDistrib.test(TestInPlaceUpdatesDistrib.java:179)
	at java.base/jdk.internal.reflect.NativeMethodAccessorImpl.invoke0(Native Method)
	at java.base/jdk.internal.reflect.NativeMethodAccessorImpl.invoke(NativeMethodAccessorImpl.java:62)
	at java.base/jdk.internal.reflect.DelegatingMethodAccessorImpl.invoke(DelegatingMethodAccessorImpl.java:43)
	at java.base/java.lang.reflect.Method.invoke(Method.java:566)
	at com.carrotsearch.randomizedtesting.RandomizedRunner.invoke(RandomizedRunner.java:1750)
	at com.carrotsearch.randomizedtesting.RandomizedRunner$8.evaluate(RandomizedRunner.java:938)
	at com.carrotsearch.randomizedtesting.RandomizedRunner$9.evaluate(RandomizedRunner.java:974)
	at com.carrotsearch.randomizedtesting.RandomizedRunner$10.evaluate(RandomizedRunner.java:988)
	at org.apache.solr.BaseDistributedSearchTestCase$ShardsRepeatRule$ShardsFixedStatement.callStatement(BaseDistributedSearchTestCase.java:1082)
	at org.apache.solr.BaseDistributedSearchTestCase$ShardsRepeatRule$ShardsStatement.evaluate(BaseDistributedSearchTestCase.java:1054)
	at com.carrotsearch.randomizedtesting.rules.SystemPropertiesRestoreRule$1.evaluate(SystemPropertiesRestoreRule.java:57)
	at org.apache.lucene.util.TestRuleSetupTeardownChained$1.evaluate(TestRuleSetupTeardownChained.java:49)
	at org.apache.lucene.util.AbstractBeforeAfterRule$1.evaluate(AbstractBeforeAfterRule.java:45)
	at org.apache.lucene.util.TestRuleThreadAndTestName$1.evaluate(TestRuleThreadAndTestName.java:48)
	at org.apache.lucene.util.TestRuleIgnoreAfterMaxFailures$1.evaluate(TestRuleIgnoreAfterMaxFailures.java:64)
	at org.apache.lucene.util.TestRuleMarkFailure$1.evaluate(TestRuleMarkFailure.java:47)
	at com.carrotsearch.randomizedtesting.rules.StatementAdapter.evaluate(StatementAdapter.java:36)
	at com.carrotsearch.randomizedtesting.ThreadLeakControl$StatementRunner.run(ThreadLeakControl.java:368)
	at com.carrotsearch.randomizedtesting.ThreadLeakControl.forkTimeoutingTask(ThreadLeakControl.java:817)
	at com.carrotsearch.randomizedtesting.ThreadLeakControl$3.evaluate(ThreadLeakControl.java:468)
	at com.carrotsearch.randomizedtesting.RandomizedRunner.runSingleTest(RandomizedRunner.java:947)
	at com.carrotsearch.randomizedtesting.RandomizedRunner$5.evaluate(RandomizedRunner.java:832)
	at com.carrotsearch.randomizedtesting.RandomizedRunner$6.evaluate(RandomizedRunner.java:883)
	at com.carrotsearch.randomizedtesting.RandomizedRunner$7.evaluate(RandomizedRunner.java:894)
	at com.carrotsearch.randomizedtesting.rules.StatementAdapter.evaluate(StatementAdapter.java:36)
	at com.carrotsearch.randomizedtesting.rules.SystemPropertiesRestoreRule$1.evaluate(SystemPropertiesRestoreRule.java:57)
	at org.apache.lucene.util.AbstractBeforeAfterRule$1.evaluate(AbstractBeforeAfterRule.java:45)
	at com.carrotsearch.randomizedtesting.rules.StatementAdapter.evaluate(StatementAdapter.java:36)
	at org.apache.lucene.util.TestRuleStoreClassName$1.evaluate(TestRuleStoreClassName.java:41)
	at com.carrotsearch.randomizedtesting.rules.NoShadowingOrOverridesOnMethodsRule$1.evaluate(NoShadowingOrOverridesOnMethodsRule.java:40)
	at com.carrotsearch.randomizedtesting.rules.NoShadowingOrOverridesOnMethodsRule$1.evaluate(NoShadowingOrOverridesOnMethodsRule.java:40)
	at com.carrotsearch.randomizedtesting.rules.StatementAdapter.evaluate(StatementAdapter.java:36)
	at com.carrotsearch.randomizedtesting.rules.StatementAdapter.evaluate(StatementAdapter.java:36)
	at org.apache.lucene.util.TestRuleAssertionsRequired$1.evaluate(TestRuleAssertionsRequired.java:53)
	at org.apache.lucene.util.TestRuleMarkFailure$1.evaluate(TestRuleMarkFailure.java:47)
	at org.apache.lucene.util.TestRuleIgnoreAfterMaxFailures$1.evaluate(TestRuleIgnoreAfterMaxFailures.java:64)
	at org.apache.lucene.util.TestRuleIgnoreTestSuites$1.evaluate(TestRuleIgnoreTestSuites.java:54)
	at com.carrotsearch.randomizedtesting.rules.StatementAdapter.evaluate(StatementAdapter.java:36)
	at com.carrotsearch.randomizedtesting.ThreadLeakControl$StatementRunner.run(ThreadLeakControl.java:368)
	at java.base/java.lang.Thread.run(Thread.java:834)




Build Log:
[...truncated 13220 lines...]
   [junit4] Suite: org.apache.solr.update.PeerSyncTest
   [junit4]   2> Creating dataDir: /x1/jenkins/jenkins-slave/workspace/Lucene-Solr-Tests-master/solr/build/solr-core/test/J1/temp/solr.update.PeerSyncTest_4C8CA59F47223283-001/init-core-data-001
   [junit4]   2> 703348 WARN  (SUITE-PeerSyncTest-seed#[4C8CA59F47223283]-worker) [    ] o.a.s.SolrTestCaseJ4 startTrackingSearchers: numOpens=1158 numCloses=1158
   [junit4]   2> 703348 INFO  (SUITE-PeerSyncTest-seed#[4C8CA59F47223283]-worker) [    ] o.a.s.SolrTestCaseJ4 Using PointFields (NUMERIC_POINTS_SYSPROP=true) w/NUMERIC_DOCVALUES_SYSPROP=true
   [junit4]   2> 703349 INFO  (SUITE-PeerSyncTest-seed#[4C8CA59F47223283]-worker) [    ] o.a.s.SolrTestCaseJ4 Randomized ssl (false) and clientAuth (false) via: @org.apache.solr.SolrTestCaseJ4$SuppressSSL(bugUrl="https://issues.apache.org/jira/browse/SOLR-5776")
   [junit4]   2> 703352 INFO  (SUITE-PeerSyncTest-seed#[4C8CA59F47223283]-worker) [    ] o.a.s.SolrTestCaseJ4 SecureRandom sanity checks: test.solr.allowed.securerandom=null & java.security.egd=file:/dev/./urandom
   [junit4]   2> 703352 INFO  (SUITE-PeerSyncTest-seed#[4C8CA59F47223283]-worker) [    ] o.a.s.BaseDistributedSearchTestCase Setting hostContext system property: /
   [junit4]   2> 703353 INFO  (TEST-PeerSyncTest.test-seed#[4C8CA59F47223283]) [    ] o.a.s.SolrTestCaseJ4 ####initCore
   [junit4]   2> 703353 INFO  (TEST-PeerSyncTest.test-seed#[4C8CA59F47223283]) [    ] o.a.s.c.SolrResourceLoader [null] Added 2 libs to classloader, from paths: [/x1/jenkins/jenkins-slave/workspace/Lucene-Solr-Tests-master/solr/core/src/test-files/solr/collection1/lib, /x1/jenkins/jenkins-slave/workspace/Lucene-Solr-Tests-master/solr/core/src/test-files/solr/collection1/lib/classes]
   [junit4]   2> 703463 INFO  (TEST-PeerSyncTest.test-seed#[4C8CA59F47223283]) [    ] o.a.s.c.SolrConfig Using Lucene MatchVersion: 9.0.0
   [junit4]   2> 703485 INFO  (TEST-PeerSyncTest.test-seed#[4C8CA59F47223283]) [    ] o.a.s.s.IndexSchema [null] Schema name=test
   [junit4]   2> 703705 INFO  (TEST-PeerSyncTest.test-seed#[4C8CA59F47223283]) [    ] o.a.s.s.IndexSchema Loaded schema test/1.0 with uniqueid field id
   [junit4]   2> 704210 INFO  (TEST-PeerSyncTest.test-seed#[4C8CA59F47223283]) [    ] o.a.s.h.c.HttpShardHandlerFactory Host whitelist initialized: WhitelistHostChecker [whitelistHosts=null, whitelistHostCheckingEnabled=false]
   [junit4]   2> 704215 WARN  (TEST-PeerSyncTest.test-seed#[4C8CA59F47223283]) [    ] o.e.j.u.s.S.config No Client EndPointIdentificationAlgorithm configured for SslContextFactory@4c9fd853[provider=null,keyStore=null,trustStore=null]
   [junit4]   2> 704219 WARN  (TEST-PeerSyncTest.test-seed#[4C8CA59F47223283]) [    ] o.e.j.u.s.S.config No Client EndPointIdentificationAlgorithm configured for SslContextFactory@1c563163[provider=null,keyStore=null,trustStore=null]
   [junit4]   2> 704237 INFO  (TEST-PeerSyncTest.test-seed#[4C8CA59F47223283]) [    ] o.a.s.c.TransientSolrCoreCacheDefault Allocating transient cache for 2147483647 transient cores
   [junit4]   2> 704237 INFO  (TEST-PeerSyncTest.test-seed#[4C8CA59F47223283]) [    ] o.a.s.h.a.MetricsHistoryHandler No .system collection, keeping metrics history in memory.
   [junit4]   2> 704262 INFO  (TEST-PeerSyncTest.test-seed#[4C8CA59F47223283]) [    ] o.a.s.m.r.SolrJmxReporter JMX monitoring for 'solr.node' (registry 'solr.node') enabled at server: com.sun.jmx.mbeanserver.JmxMBeanServer@44c8da19
   [junit4]   2> 704278 INFO  (TEST-PeerSyncTest.test-seed#[4C8CA59F47223283]) [    ] o.a.s.m.r.SolrJmxReporter JMX monitoring for 'solr.jvm' (registry 'solr.jvm') enabled at server: com.sun.jmx.mbeanserver.JmxMBeanServer@44c8da19
   [junit4]   2> 704278 INFO  (TEST-PeerSyncTest.test-seed#[4C8CA59F47223283]) [    ] o.a.s.m.r.SolrJmxReporter JMX monitoring for 'solr.jetty' (registry 'solr.jetty') enabled at server: com.sun.jmx.mbeanserver.JmxMBeanServer@44c8da19
   [junit4]   2> 704281 INFO  (coreLoadExecutor-2280-thread-1) [    x:collection1] o.a.s.c.SolrResourceLoader [null] Added 2 libs to classloader, from paths: [/x1/jenkins/jenkins-slave/workspace/Lucene-Solr-Tests-master/solr/core/src/test-files/solr/collection1/lib, /x1/jenkins/jenkins-slave/workspace/Lucene-Solr-Tests-master/solr/core/src/test-files/solr/collection1/lib/classes]
   [junit4]   2> 704305 INFO  (coreLoadExecutor-2280-thread-1) [    x:collection1] o.a.s.c.SolrConfig Using Lucene MatchVersion: 9.0.0
   [junit4]   2> 704325 INFO  (coreLoadExecutor-2280-thread-1) [    x:collection1] o.a.s.s.IndexSchema [collection1] Schema name=test
   [junit4]   2> 704445 INFO  (coreLoadExecutor-2280-thread-1) [    x:collection1] o.a.s.s.IndexSchema Loaded schema test/1.0 with uniqueid field id
   [junit4]   2> 704456 INFO  (coreLoadExecutor-2280-thread-1) [    x:collection1] o.a.s.c.CoreContainer Creating SolrCore 'collection1' using configuration from instancedir /x1/jenkins/jenkins-slave/workspace/Lucene-Solr-Tests-master/solr/core/src/test-files/solr/collection1, trusted=true
   [junit4]   2> 704456 INFO  (coreLoadExecutor-2280-thread-1) [    x:collection1] o.a.s.m.r.SolrJmxReporter JMX monitoring for 'solr.core.collection1' (registry 'solr.core.collection1') enabled at server: com.sun.jmx.mbeanserver.JmxMBeanServer@44c8da19
   [junit4]   2> 704456 INFO  (coreLoadExecutor-2280-thread-1) [    x:collection1] o.a.s.c.SolrCore [[collection1] ] Opening new SolrCore at [/x1/jenkins/jenkins-slave/workspace/Lucene-Solr-Tests-master/solr/core/src/test-files/solr/collection1], dataDir=[/x1/jenkins/jenkins-slave/workspace/Lucene-Solr-Tests-master/solr/build/solr-core/test/J1/temp/solr.update.PeerSyncTest_4C8CA59F47223283-001/init-core-data-001/]
   [junit4]   2> 704459 INFO  (coreLoadExecutor-2280-thread-1) [    x:collection1] o.a.s.u.RandomMergePolicy RandomMergePolicy wrapping class org.apache.lucene.index.TieredMergePolicy: [TieredMergePolicy: maxMergeAtOnce=16, maxMergeAtOnceExplicit=12, maxMergedSegmentMB=55.1142578125, floorSegmentMB=0.8564453125, forceMergeDeletesPctAllowed=14.352225393945815, segmentsPerTier=29.0, maxCFSSegmentSizeMB=8.796093022207999E12, noCFSRatio=0.8419052995235371, deletesPctAllowed=49.921869403423955
   [junit4]   2> 704461 WARN  (coreLoadExecutor-2280-thread-1) [    x:collection1] o.a.s.c.RequestHandlers INVALID paramSet a in requestHandler {type = requestHandler,name = /dump,class = DumpRequestHandler,attributes = {initParams=a, name=/dump, class=DumpRequestHandler},args = {defaults={a=A,b=B}}}
   [junit4]   2> 704514 INFO  (coreLoadExecutor-2280-thread-1) [    x:collection1] o.a.s.u.UpdateHandler Using UpdateLog implementation: org.apache.solr.update.UpdateLog
   [junit4]   2> 704514 INFO  (coreLoadExecutor-2280-thread-1) [    x:collection1] o.a.s.u.UpdateLog Initializing UpdateLog: dataDir= defaultSyncLevel=FLUSH numRecordsToKeep=100 maxNumLogsToKeep=10 numVersionBuckets=65536
   [junit4]   2> 704516 INFO  (coreLoadExecutor-2280-thread-1) [    x:collection1] o.a.s.u.CommitTracker Hard AutoCommit: disabled
   [junit4]   2> 704516 INFO  (coreLoadExecutor-2280-thread-1) [    x:collection1] o.a.s.u.CommitTracker Soft AutoCommit: disabled
   [junit4]   2> 704517 INFO  (coreLoadExecutor-2280-thread-1) [    x:collection1] o.a.s.u.RandomMergePolicy RandomMergePolicy wrapping class org.apache.lucene.index.TieredMergePolicy: [TieredMergePolicy: maxMergeAtOnce=24, maxMergeAtOnceExplicit=12, maxMergedSegmentMB=64.466796875, floorSegmentMB=0.279296875, forceMergeDeletesPctAllowed=29.685748769158387, segmentsPerTier=15.0, maxCFSSegmentSizeMB=8.796093022207999E12, noCFSRatio=0.7326874206233095, deletesPctAllowed=46.96989159882985
   [junit4]   2> 704518 INFO  (coreLoadExecutor-2280-thread-1) [    x:collection1] o.a.s.s.SolrIndexSearcher Opening [Searcher@60b186c[collection1] main]
   [junit4]   2> 704519 WARN  (coreLoadExecutor-2280-thread-1) [    x:collection1] o.a.s.r.ManagedResourceStorage Cannot write to config directory /x1/jenkins/jenkins-slave/workspace/Lucene-Solr-Tests-master/solr/core/src/test-files/solr/collection1/conf; switching to use InMemory storage instead.
   [junit4]   2> 704519 INFO  (coreLoadExecutor-2280-thread-1) [    x:collection1] o.a.s.h.ReplicationHandler Commits will be reserved for 10000ms.
   [junit4]   2> 704520 INFO  (coreLoadExecutor-2280-thread-1) [    x:collection1] o.a.s.u.UpdateLog Could not find max version in index or recent updates, using new clock 1632333310496604160
   [junit4]   2> 704524 INFO  (searcherExecutor-2281-thread-1-processing-x:collection1) [    x:collection1] o.a.s.c.SolrCore [collection1] Registered new searcher Searcher@60b186c[collection1] main{ExitableDirectoryReader(UninvertingDirectoryReader())}
   [junit4]   2> 704525 INFO  (TEST-PeerSyncTest.test-seed#[4C8CA59F47223283]) [    ] o.a.s.SolrTestCaseJ4 ####initCore end
   [junit4]   2> 704687 INFO  (TEST-PeerSyncTest.test-seed#[4C8CA59F47223283]) [    ] o.a.s.SolrTestCaseJ4 Writing core.properties file to /x1/jenkins/jenkins-slave/workspace/Lucene-Solr-Tests-master/solr/build/solr-core/test/J1/temp/solr.update.PeerSyncTest_4C8CA59F47223283-001/tempDir-001/control/cores/collection1
   [junit4]   2> 704688 WARN  (TEST-PeerSyncTest.test-seed#[4C8CA59F47223283]) [    ] o.e.j.s.AbstractConnector Ignoring deprecated socket close linger time
   [junit4]   2> 704689 INFO  (TEST-PeerSyncTest.test-seed#[4C8CA59F47223283]) [    ] o.a.s.c.s.e.JettySolrRunner Start Jetty (original configured port=0)
   [junit4]   2> 704689 INFO  (TEST-PeerSyncTest.test-seed#[4C8CA59F47223283]) [    ] o.a.s.c.s.e.JettySolrRunner Trying to start Jetty on port 0 try number 1 ...
   [junit4]   2> 704689 INFO  (TEST-PeerSyncTest.test-seed#[4C8CA59F47223283]) [    ] o.e.j.s.Server jetty-9.4.14.v20181114; built: 2018-11-14T21:20:31.478Z; git: c4550056e785fb5665914545889f21dc136ad9e6; jvm 11.0.1+13-LTS
   [junit4]   2> 704706 INFO  (TEST-PeerSyncTest.test-seed#[4C8CA59F47223283]) [    ] o.e.j.s.session DefaultSessionIdManager workerName=node0
   [junit4]   2> 704706 INFO  (TEST-PeerSyncTest.test-seed#[4C8CA59F47223283]) [    ] o.e.j.s.session No SessionScavenger set, using defaults
   [junit4]   2> 704706 INFO  (TEST-PeerSyncTest.test-seed#[4C8CA59F47223283]) [    ] o.e.j.s.session node0 Scavenging every 600000ms
   [junit4]   2> 704706 INFO  (TEST-PeerSyncTest.test-seed#[4C8CA59F47223283]) [    ] o.e.j.s.h.ContextHandler Started o.e.j.s.ServletContextHandler@242cabf3{/,null,AVAILABLE}
   [junit4]   2> 704707 INFO  (TEST-PeerSyncTest.test-seed#[4C8CA59F47223283]) [    ] o.e.j.s.AbstractConnector Started ServerConnector@41774a8b{HTTP/1.1,[http/1.1, h2c]}{127.0.0.1:45540}
   [junit4]   2> 704707 INFO  (TEST-PeerSyncTest.test-seed#[4C8CA59F47223283]) [    ] o.e.j.s.Server Started @704758ms
   [junit4]   2> 704707 INFO  (TEST-PeerSyncTest.test-seed#[4C8CA59F47223283]) [    ] o.a.s.c.s.e.JettySolrRunner Jetty properties: {schema=schema.xml, hostContext=/, solrconfig=solrconfig-tlog.xml, hostPort=45540, coreRootDirectory=/x1/jenkins/jenkins-slave/workspace/Lucene-Solr-Tests-master/solr/build/solr-core/test/J1/temp/solr.update.PeerSyncTest_4C8CA59F47223283-001/tempDir-001/control/cores}
   [junit4]   2> 704708 ERROR (TEST-PeerSyncTest.test-seed#[4C8CA59F47223283]) [    ] o.a.s.u.StartupLoggingUtils Missing Java Option solr.log.dir. Logging may be missing or incomplete.
   [junit4]   2> 704708 INFO  (TEST-PeerSyncTest.test-seed#[4C8CA59F47223283]) [    ] o.a.s.s.SolrDispatchFilter Using logger factory org.apache.logging.slf4j.Log4jLoggerFactory
   [junit4]   2> 704708 INFO  (TEST-PeerSyncTest.test-seed#[4C8CA59F47223283]) [    ] o.a.s.s.SolrDispatchFilter  ___      _       Welcome to Apache Solr? version 9.0.0
   [junit4]   2> 704708 INFO  (TEST-PeerSyncTest.test-seed#[4C8CA59F47223283]) [    ] o.a.s.s.SolrDispatchFilter / __| ___| |_ _   Starting in standalone mode on port null
   [junit4]   2> 704708 INFO  (TEST-PeerSyncTest.test-seed#[4C8CA59F47223283]) [    ] o.a.s.s.SolrDispatchFilter \__ \/ _ \ | '_|  Install dir: null
   [junit4]   2> 704708 INFO  (TEST-PeerSyncTest.test-seed#[4C8CA59F47223283]) [    ] o.a.s.s.SolrDispatchFilter |___/\___/_|_|    Start time: 2019-05-01T12:39:14.223468Z
   [junit4]   2> 704708 INFO  (TEST-PeerSyncTest.test-seed#[4C8CA59F47223283]) [    ] o.a.s.c.SolrXmlConfig Loading container configuration from /x1/jenkins/jenkins-slave/workspace/Lucene-Solr-Tests-master/solr/build/solr-core/test/J1/temp/solr.update.PeerSyncTest_4C8CA59F47223283-001/tempDir-001/control/solr.xml
   [junit4]   2> 704712 INFO  (TEST-PeerSyncTest.test-seed#[4C8CA59F47223283]) [    ] o.a.s.c.SolrXmlConfig Configuration parameter autoReplicaFailoverWorkLoopDelay is ignored
   [junit4]   2> 704712 INFO  (TEST-PeerSyncTest.test-seed#[4C8CA59F47223283]) [    ] o.a.s.c.SolrXmlConfig Configuration parameter autoReplicaFailoverBadNodeExpiration is ignored
   [junit4]   2> 704810 INFO  (TEST-PeerSyncTest.test-seed#[4C8CA59F47223283]) [    ] o.a.s.c.SolrXmlConfig MBean server found: com.sun.jmx.mbeanserver.JmxMBeanServer@44c8da19, but no JMX reporters were configured - adding default JMX reporter.
   [junit4]   2> 705003 INFO  (TEST-PeerSyncTest.test-seed#[4C8CA59F47223283]) [    ] o.a.s.h.c.HttpShardHandlerFactory Host whitelist initialized: WhitelistHostChecker [whitelistHosts=null, whitelistHostCheckingEnabled=false]
   [junit4]   2> 705004 WARN  (TEST-PeerSyncTest.test-seed#[4C8CA59F47223283]) [    ] o.e.j.u.s.S.config No Client EndPointIdentificationAlgorithm configured for SslContextFactory@2fc25137[provider=null,keyStore=null,trustStore=null]
   [junit4]   2> 705009 WARN  (TEST-PeerSyncTest.test-seed#[4C8CA59F47223283]) [    ] o.e.j.u.s.S.config No Client EndPointIdentificationAlgorithm configured for SslContextFactory@56dfa198[provider=null,keyStore=null,trustStore=null]
   [junit4]   2> 705029 INFO  (TEST-PeerSyncTest.test-seed#[4C8CA59F47223283]) [    ] o.a.s.c.TransientSolrCoreCacheDefault Allocating transient cache for 4 transient cores
   [junit4]   2> 705029 INFO  (TEST-PeerSyncTest.test-seed#[4C8CA59F47223283]) [    ] o.a.s.h.a.MetricsHistoryHandler No .system collection, keeping metrics history in memory.
   [junit4]   2> 705062 INFO  (TEST-PeerSyncTest.test-seed#[4C8CA59F47223283]) [    ] o.a.s.m.r.SolrJmxReporter JMX monitoring for 'solr.node' (registry 'solr.node') enabled at server: com.sun.jmx.mbeanserver.JmxMBeanServer@44c8da19
   [junit4]   2> 705103 INFO  (TEST-PeerSyncTest.test-seed#[4C8CA59F47223283]) [    ] o.a.s.m.r.SolrJmxReporter JMX monitoring for 'solr.jvm' (registry 'solr.jvm') enabled at server: com.sun.jmx.mbeanserver.JmxMBeanServer@44c8da19
   [junit4]   2> 705104 INFO  (TEST-PeerSyncTest.test-seed#[4C8CA59F47223283]) [    ] o.a.s.m.r.SolrJmxReporter JMX monitoring for 'solr.jetty' (registry 'solr.jetty') enabled at server: com.sun.jmx.mbeanserver.JmxMBeanServer@44c8da19
   [junit4]   2> 705107 INFO  (TEST-PeerSyncTest.test-seed#[4C8CA59F47223283]) [    ] o.a.s.c.CorePropertiesLocator Found 1 core definitions underneath /x1/jenkins/jenkins-slave/workspace/Lucene-Solr-Tests-master/solr/build/solr-core/test/J1/temp/solr.update.PeerSyncTest_4C8CA59F47223283-001/tempDir-001/control/cores
   [junit4]   2> 705107 INFO  (TEST-PeerSyncTest.test-seed#[4C8CA59F47223283]) [    ] o.a.s.c.CorePropertiesLocator Cores are: [collection1]
   [junit4]   2> 705108 INFO  (coreLoadExecutor-2294-thread-1) [    x:collection1] o.a.s.c.SolrResourceLoader [null] Added 2 libs to classloader, from paths: [/x1/jenkins/jenkins-slave/workspace/Lucene-Solr-Tests-master/solr/core/src/test-files/solr/collection1/lib, /x1/jenkins/jenkins-slave/workspace/Lucene-Solr-Tests-master/solr/core/src/test-files/solr/collection1/lib/classes]
   [junit4]   2> 705167 INFO  (coreLoadExecutor-2294-thread-1) [    x:collection1] o.a.s.c.SolrConfig Using Lucene MatchVersion: 9.0.0
   [junit4]   2> 705189 INFO  (coreLoadExecutor-2294-thread-1) [    x:collection1] o.a.s.s.IndexSchema [collection1] Schema name=test
   [junit4]   2> 705318 INFO  (coreLoadExecutor-2294-thread-1) [    x:collection1] o.a.s.s.IndexSchema Loaded schema test/1.0 with uniqueid field id
   [junit4]   2> 705361 INFO  (coreLoadExecutor-2294-thread-1) [    x:collection1] o.a.s.c.CoreContainer Creating SolrCore 'collection1' using configuration from configset /x1/jenkins/jenkins-slave/workspace/Lucene-Solr-Tests-master/solr/core/src/test-files/solr/collection1, trusted=true
   [junit4]   2> 705361 INFO  (coreLoadExecutor-2294-thread-1) [    x:collection1] o.a.s.m.r.SolrJmxReporter JMX monitoring for 'solr.core.collection1' (registry 'solr.core.collection1') enabled at server: com.sun.jmx.mbeanserver.JmxMBeanServer@44c8da19
   [junit4]   2> 705361 INFO  (coreLoadExecutor-2294-thread-1) [    x:collection1] o.a.s.c.SolrCore [[collection1] ] Opening new SolrCore at [/x1/jenkins/jenkins-slave/workspace/Lucene-Solr-Tests-master/solr/core/src/test-files/solr/collection1], dataDir=[/x1/jenkins/jenkins-slave/workspace/Lucene-Solr-Tests-master/solr/build/solr-core/test/J1/temp/solr.update.PeerSyncTest_4C8CA59F47223283-001/tempDir-001/control/cores/collection1/data/]
   [junit4]   2> 705364 INFO  (coreLoadExecutor-2294-thread-1) [    x:collection1] o.a.s.u.RandomMergePolicy RandomMergePolicy wrapping class org.apache.lucene.index.TieredMergePolicy: [TieredMergePolicy: maxMergeAtOnce=16, maxMergeAtOnceExplicit=12, maxMergedSegmentMB=55.1142578125, floorSegmentMB=0.8564453125, forceMergeDeletesPctAllowed=14.352225393945815, segmentsPerTier=29.0, maxCFSSegmentSizeMB=8.796093022207999E12, noCFSRatio=0.8419052995235371, deletesPctAllowed=49.921869403423955
   [junit4]   2> 705385 WARN  (coreLoadExecutor-2294-thread-1) [    x:collection1] o.a.s.c.RequestHandlers INVALID paramSet a in requestHandler {type = requestHandler,name = /dump,class = DumpRequestHandler,attributes = {initParams=a, name=/dump, class=DumpRequestHandler},args = {defaults={a=A,b=B}}}
   [junit4]   2> 705523 INFO  (coreLoadExecutor-2294-thread-1) [    x:collection1] o.a.s.u.UpdateHandler Using UpdateLog implementation: org.apache.solr.update.UpdateLog
   [junit4]   2> 705523 INFO  (coreLoadExecutor-2294-thread-1) [    x:collection1] o.a.s.u.UpdateLog Initializing UpdateLog: dataDir= defaultSyncLevel=FLUSH numRecordsToKeep=100 maxNumLogsToKeep=10 numVersionBuckets=65536
   [junit4]   2> 705528 INFO  (coreLoadExecutor-2294-thread-1) [    x:collection1] o.a.s.u.CommitTracker Hard AutoCommit: disabled
   [junit4]   2> 705528 INFO  (coreLoadExecutor-2294-thread-1) [    x:collection1] o.a.s.u.CommitTracker Soft AutoCommit: disabled
   [junit4]   2> 705537 INFO  (coreLoadExecutor-2294-thread-1) [    x:collection1] o.a.s.u.RandomMergePolicy RandomMergePolicy wrapping class org.apache.lucene.index.TieredMergePolicy: [TieredMergePolicy: maxMergeAtOnce=24, maxMergeAtOnceExplicit=12, maxMergedSegmentMB=64.466796875, floorSegmentMB=0.279296875, forceMergeDeletesPctAllowed=29.685748769158387, segmentsPerTier=15.0, maxCFSSegmentSizeMB=8.796093022207999E12, noCFSRatio=0.7326874206233095, deletesPctAllowed=46.96989159882985
   [junit4]   2> 705538 INFO  (coreLoadExecutor-2294-thread-1) [    x:collection1] o.a.s.s.SolrIndexSearcher Opening [Searcher@5083c6e4[collection1] main]
   [junit4]   2> 705539 WARN  (coreLoadExecutor-2294-thread-1) [    x:collection1] o.a.s.r.ManagedResourceStorage Cannot write to config directory /x1/jenkins/jenkins-slave/workspace/Lucene-Solr-Tests-master/solr/core/src/test-files/solr/collection1/conf; switching to use InMemory storage instead.
   [junit4]   2> 705540 INFO  (coreLoadExecutor-2294-thread-1) [    x:collection1] o.a.s.h.ReplicationHandler Commits will be reserved for 10000ms.
   [junit4]   2> 705540 INFO  (coreLoadExecutor-2294-thread-1) [    x:collection1] o.a.s.u.UpdateLog Could not find max version in index or recent updates, using new clock 1632333311566151680
   [junit4]   2> 705545 INFO  (searcherExecutor-2295-thread-1-processing-x:collection1) [    x:collection1] o.a.s.c.SolrCore [collection1] Registered new searcher Searcher@5083c6e4[collection1] main{ExitableDirectoryReader(UninvertingDirectoryReader())}
   [junit4]   2> 705837 INFO  (TEST-PeerSyncTest.test-seed#[4C8CA59F47223283]) [    ] o.a.s.SolrTestCaseJ4 Writing core.properties file to /x1/jenkins/jenkins-slave/workspace/Lucene-Solr-Tests-master/solr/build/solr-core/test/J1/temp/solr.update.PeerSyncTest_4C8CA59F47223283-001/tempDir-001/shard0/cores/collection1
   [junit4]   2> 705870 WARN  (TEST-PeerSyncTest.test-seed#[4C8CA59F47223283]) [    ] o.e.j.s.AbstractConnector Ignoring deprecated socket close linger time
   [junit4]   2> 705870 INFO  (TEST-PeerSyncTest.test-seed#[4C8CA59F47223283]) [    ] o.a.s.c.s.e.JettySolrRunner Start Jetty (original configured port=0)
   [junit4]   2> 705870 INFO  (TEST-PeerSyncTest.test-seed#[4C8CA59F47223283]) [    ] o.a.s.c.s.e.JettySolrRunner Trying to start Jetty on port 0 try number 1 ...
   [junit4]   2> 705870 INFO  (TEST-PeerSyncTest.test-seed#[4C8CA59F47223283]) [    ] o.e.j.s.Server jetty-9.4.14.v20181114; built: 2018-11-14T21:20:31.478Z; git: c4550056e785fb5665914545889f21dc136ad9e6; jvm 11.0.1+13-LTS
   [junit4]   2> 705901 INFO  (TEST-PeerSyncTest.test-seed#[4C8CA59F47223283]) [    ] o.e.j.s.session DefaultSessionIdManager workerName=node0
   [junit4]   2> 705901 INFO  (TEST-PeerSyncTest.test-seed#[4C8CA59F47223283]) [    ] o.e.j.s.session No SessionScavenger set, using defaults
   [junit4]   2> 705901 INFO  (TEST-PeerSyncTest.test-seed#[4C8CA59F47223283]) [    ] o.e.j.s.session node0 Scavenging every 660000ms
   [junit4]   2> 705903 INFO  (TEST-PeerSyncTest.test-seed#[4C8CA59F47223283]) [    ] o.e.j.s.h.ContextHandler Started o.e.j.s.ServletContextHandler@7a5b388a{/,null,AVAILABLE}
   [junit4]   2> 705906 INFO  (TEST-PeerSyncTest.test-seed#[4C8CA59F47223283]) [    ] o.e.j.s.AbstractConnector Started ServerConnector@373981cc{HTTP/1.1,[http/1.1, h2c]}{127.0.0.1:41042}
   [junit4]   2> 705906 INFO  (TEST-PeerSyncTest.test-seed#[4C8CA59F47223283]) [    ] o.e.j.s.Server Started @705957ms
   [junit4]   2> 705906 INFO  (TEST-PeerSyncTest.test-seed#[4C8CA59F47223283]) [    ] o.a.s.c.s.e.JettySolrRunner Jetty properties: {schema=schema.xml, hostContext=/, solrconfig=solrconfig-tlog.xml, hostPort=41042, coreRootDirectory=/x1/jenkins/jenkins-slave/workspace/Lucene-Solr-Tests-master/solr/build/solr-core/test/J1/temp/solr.update.PeerSyncTest_4C8CA59F47223283-001/tempDir-001/shard0/cores}
   [junit4]   2> 705906 ERROR (TEST-PeerSyncTest.test-seed#[4C8CA59F47223283]) [    ] o.a.s.u.StartupLoggingUtils Missing Java Option solr.log.dir. Logging may be missing or incomplete.
   [junit4]   2> 705906 INFO  (TEST-PeerSyncTest.test-seed#[4C8CA59F47223283]) [    ] o.a.s.s.SolrDispatchFilter Using logger factory org.apache.logging.slf4j.Log4jLoggerFactory
   [junit4]   2> 705906 INFO  (TEST-PeerSyncTest.test-seed#[4C8CA59F47223283]) [    ] o.a.s.s.SolrDispatchFilter  ___      _       Welcome to Apache Solr? version 9.0.0
   [junit4]   2> 705907 INFO  (TEST-PeerSyncTest.test-seed#[4C8CA59F47223283]) [    ] o.a.s.s.SolrDispatchFilter / __| ___| |_ _   Starting in standalone mode on port null
   [junit4]   2> 705907 INFO  (TEST-PeerSyncTest.test-seed#[4C8CA59F47223283]) [    ] o.a.s.s.SolrDispatchFilter \__ \/ _ \ | '_|  Install dir: null
   [junit4]   2> 705907 INFO  (TEST-PeerSyncTest.test-seed#[4C8CA59F47223283]) [    ] o.a.s.s.SolrDispatchFilter |___/\___/_|_|    Start time: 2019-05-01T12:39:15.422057Z
   [junit4]   2> 705907 INFO  (TEST-PeerSyncTest.test-seed#[4C8CA59F47223283]) [    ] o.a.s.c.SolrXmlConfig Loading container configuration from /x1/jenkins/jenkins-slave/workspace/Lucene-Solr-Tests-master/solr/build/solr-core/test/J1/temp/solr.update.PeerSyncTest_4C8CA59F47223283-001/tempDir-001/shard0/solr.xml
   [junit4]   2> 705912 INFO  (TEST-PeerSyncTest.test-seed#[4C8CA59F47223283]) [    ] o.a.s.c.SolrXmlConfig Configuration parameter autoReplicaFailoverWorkLoopDelay is ignored
   [junit4]   2> 705912 INFO  (TEST-PeerSyncTest.test-seed#[4C8CA59F47223283]) [    ] o.a.s.c.SolrXmlConfig Configuration parameter autoReplicaFailoverBadNodeExpiration is ignored
   [junit4]   2> 705915 INFO  (TEST-PeerSyncTest.test-seed#[4C8CA59F47223283]) [    ] o.a.s.c.SolrXmlConfig MBean server found: com.sun.jmx.mbeanserver.JmxMBeanServer@44c8da19, but no JMX reporters were configured - adding default JMX reporter.
   [junit4]   2> 706066 INFO  (TEST-PeerSyncTest.test-seed#[4C8CA59F47223283]) [    ] o.a.s.h.c.HttpShardHandlerFactory Host whitelist initialized: WhitelistHostChecker [whitelistHosts=null, whitelistHostCheckingEnabled=false]
   [junit4]   2> 706067 WARN  (TEST-PeerSyncTest.test-seed#[4C8CA59F47223283]) [    ] o.e.j.u.s.S.config No Client EndPointIdentificationAlgorithm configured for SslContextFactory@54d972d3[provider=null,keyStore=null,trustStore=null]
   [junit4]   2> 706071 WARN  (TEST-PeerSyncTest.test-seed#[4C8CA59F47223283]) [    ] o.e.j.u.s.S.config No Client EndPointIdentificationAlgorithm configured for SslContextFactory@5ee61a82[provider=null,keyStore=null,trustStore=null]
   [junit4]   2> 706126 INFO  (TEST-PeerSyncTest.test-seed#[4C8CA59F47223283]) [    ] o.a.s.c.TransientSolrCoreCacheDefault Allocating transient cache for 4 transient cores
   [junit4]   2> 706126 INFO  (TEST-PeerSyncTest.test-seed#[4C8CA59F47223283]) [    ] o.a.s.h.a.MetricsHistoryHandler No .system collection, keeping metrics history in memory.
   [junit4]   2> 706159 INFO  (TEST-PeerSyncTest.test-seed#[4C8CA59F47223283]) [    ] o.a.s.m.r.SolrJmxReporter JMX monitoring for 'solr.node' (registry 'solr.node') enabled at server: com.sun.jmx.mbeanserver.JmxMBeanServer@44c8da19
   [junit4]   2> 706184 INFO  (TEST-PeerSyncTest.test-seed#[4C8CA59F47223283]) [    ] o.a.s.m.r.SolrJmxReporter JMX monitoring for 'solr.jvm' (registry 'solr.jvm') enabled at server: com.sun.jmx.mbeanserver.JmxMBeanServer@44c8da19
   [junit4]   2> 706185 INFO  (TEST-PeerSyncTest.test-seed#[4C8CA59F47223283]) [    ] o.a.s.m.r.SolrJmxReporter JMX monitoring for 'solr.jetty' (registry 'solr.jetty') enabled at server: com.sun.jmx.mbeanserver.JmxMBeanServer@44c8da19
   [junit4]   2> 706188 INFO  (TEST-PeerSyncTest.test-seed#[4C8CA59F47223283]) [    ] o.a.s.c.CorePropertiesLocator Found 1 core definitions underneath /x1/jenkins/jenkins-slave/workspace/Lucene-Solr-Tests-master/solr/build/solr-core/test/J1/temp/solr.update.PeerSyncTest_4C8CA59F47223283-001/tempDir-001/shard0/cores
   [junit4]   2> 706188 INFO  (TEST-PeerSyncTest.test-seed#[4C8CA59F47223283]) [    ] o.a.s.c.CorePropertiesLocator Cores are: [collection1]
   [junit4]   2> 706189 INFO  (coreLoadExecutor-2308-thread-1) [    x:collection1] o.a.s.c.SolrResourceLoader [null] Added 2 libs to classloader, from paths: [/x1/jenkins/jenkins-slave/workspace/Lucene-Solr-Tests-master/solr/core/src/test-files/solr/collection1/lib, /x1/jenkins/jenkins-slave/workspace/Lucene-Solr-Tests-master/solr/core/src/test-files/solr/collection1/lib/classes]
   [junit4]   2> 706259 INFO  (coreLoadExecutor-2308-thread-1) [    x:collection1] o.a.s.c.SolrConfig Using Lucene MatchVersion: 9.0.0
   [junit4]   2> 706352 INFO  (coreLoadExecutor-2308-thread-1) [    x:collection1] o.a.s.s.IndexSchema [collection1] Schema name=test
   [junit4]   2> 706577 INFO  (coreLoadExecutor-2308-thread-1) [    x:collection1] o.a.s.s.IndexSchema Loaded schema test/1.0 with uniqueid field id
   [junit4]   2> 706592 INFO  (coreLoadExecutor-2308-thread-1) [    x:collection1] o.a.s.c.CoreContainer Creating SolrCore 'collection1' using configuration from configset /x1/jenkins/jenkins-slave/workspace/Lucene-Solr-Tests-master/solr/core/src/test-files/solr/collection1, trusted=true
   [junit4]   2> 706593 INFO  (coreLoadExecutor-2308-thread-1) [    x:collection1] o.a.s.m.r.SolrJmxReporter JMX monitoring for 'solr.core.collection1' (registry 'solr.core.collection1') enabled at server: com.sun.jmx.mbeanserver.JmxMBeanServer@44c8da19
   [junit4]   2> 706593 INFO  (coreLoadExecutor-2308-thread-1) [    x:collection1] o.a.s.c.SolrCore [[collection1] ] Opening new SolrCore at [/x1/jenkins/jenkins-slave/workspace/Lucene-Solr-Tests-master/solr/core/src/test-files/solr/collection1], dataDir=[/x1/jenkins/jenkins-slave/workspace/Lucene-Solr-Tests-master/solr/build/solr-core/test/J1/temp/solr.update.PeerSyncTest_4C8CA59F47223283-001/tempDir-001/shard0/cores/collection1/data/]
   [junit4]   2> 706597 INFO  (coreLoadExecutor-2308-thread-1) [    x:collection1] o.a.s.u.RandomMergePolicy RandomMergePolicy wrapping class org.apache.lucene.index.TieredMergePolicy: [TieredMergePolicy: maxMergeAtOnce=16, maxMergeAtOnceExplicit=12, maxMergedSegmentMB=55.1142578125, floorSegmentMB=0.8564453125, forceMergeDeletesPctAllowed=14.352225393945815, segmentsPerTier=29.0, maxCFSSegmentSizeMB=8.796093022207999E12, noCFSRatio=0.8419052995235371, deletesPctAllowed=49.921869403423955
   [junit4]   2> 706600 WARN  (coreLoadExecutor-2308-thread-1) [    x:collection1] o.a.s.c.RequestHandlers INVALID paramSet a in requestHandler {type = requestHandler,name = /dump,class = DumpRequestHandler,attributes = {initParams=a, name=/dump, class=DumpRequestHandler},args = {defaults={a=A,b=B}}}
   [junit4]   2> 706679 INFO  (coreLoadExecutor-2308-thread-1) [    x:collection1] o.a.s.u.UpdateHandler Using UpdateLog implementation: org.apache.solr.update.UpdateLog
   [junit4]   2> 706679 INFO  (coreLoadExecutor-2308-thread-1) [    x:collection1] o.a.s.u.UpdateLog Initializing UpdateLog: dataDir= defaultSyncLevel=FLUSH numRecordsToKeep=100 maxNumLogsToKeep=10 numVersionBuckets=65536
   [junit4]   2> 706681 INFO  (coreLoadExecutor-2308-thread-1) [    x:collection1] o.a.s.u.CommitTracker Hard AutoCommit: disabled
   [junit4]   2> 706681 INFO  (coreLoadExecutor-2308-thread-1) [    x:collection1] o.a.s.u.CommitTracker Soft AutoCommit: disabled
   [junit4]   2> 706683 INFO  (coreLoadExecutor-2308-thread-1) [    x:collection1] o.a.s.u.RandomMergePolicy RandomMergePolicy wrapping class org.apache.lucene.index.TieredMergePolicy: [TieredMergePolicy: maxMergeAtOnce=24, maxMergeAtOnceExplicit=12, maxMergedSegmentMB=64.466796875, floorSegmentMB=0.279296875, forceMergeDeletesPctAllowed=29.685748769158387, segmentsPerTier=15.0, maxCFSSegmentSizeMB=8.796093022207999E12, noCFSRatio=0.7326874206233095, deletesPctAllowed=46.96989159882985
   [junit4]   2> 706684 INFO  (coreLoadExecutor-2308-thread-1) [    x:collection1] o.a.s.s.SolrIndexSearcher Opening [Searcher@704f4dcf[collection1] main]
   [junit4]   2> 706684 WARN  (coreLoadExecutor-2308-thread-1) [    x:collection1] o.a.s.r.ManagedResourceStorage Cannot write to config directory /x1/jenkins/jenkins-slave/workspace/Lucene-Solr-Tests-master/solr/core/src/test-files/solr/collection1/conf; switching to use InMemory storage instead.
   [junit4]   2> 706686 INFO  (coreLoadExecutor-2308-thread-1) [    x:collection1] o.a.s.h.ReplicationHandler Commits will be reserved for 10000ms.
   [junit4]   2> 706686 INFO  (coreLoadExecutor-2308-thread-1) [    x:collection1] o.a.s.u.UpdateLog Could not find max version in index or recent updates, using new clock 1632333312767819776
   [junit4]   2> 706695 INFO  (searcherExecutor-2309-thread-1-processing-x:collection1) [    x:collection1] o.a.s.c.SolrCore [collection1] Registered new searcher Searcher@704f4dcf[collection1] main{ExitableDirectoryReader(UninvertingDirectoryReader())}
   [junit4]   2> 707472 INFO  (TEST-PeerSyncTest.test-seed#[4C8CA59F47223283]) [    ] o.a.s.SolrTestCaseJ4 Writing core.properties file to /x1/jenkins/jenkins-slave/workspace/Lucene-Solr-Tests-master/solr/build/solr-core/test/J1/temp/solr.update.PeerSyncTest_4C8CA59F47223283-001/tempDir-001/shard1/cores/collection1
   [junit4]   2> 707473 WARN  (TEST-PeerSyncTest.test-seed#[4C8CA59F47223283]) [    ] o.e.j.s.AbstractConnector Ignoring deprecated socket close linger time
   [junit4]   2> 707474 INFO  (TEST-PeerSyncTest.test-seed#[4C8CA59F47223283]) [    ] o.a.s.c.s.e.JettySolrRunner Start Jetty (original configured port=0)
   [junit4]   2> 707474 INFO  (TEST-PeerSyncTest.test-seed#[4C8CA59F47223283]) [    ] o.a.s.c.s.e.JettySolrRunner Trying to start Jetty on port 0 try number 1 ...
   [junit4]   2> 707474 INFO  (TEST-PeerSyncTest.test-seed#[4C8CA59F47223283]) [    ] o.e.j.s.Server jetty-9.4.14.v20181114; built: 2018-11-14T21:20:31.478Z; git: c4550056e785fb5665914545889f21dc136ad9e6; jvm 11.0.1+13-LTS
   [junit4]   2> 707475 INFO  (TEST-PeerSyncTest.test-seed#[4C8CA59F47223283]) [    ] o.e.j.s.session DefaultSessionIdManager workerName=node0
   [junit4]   2> 707475 INFO  (TEST-PeerSyncTest.test-seed#[4C8CA59F47223283]) [    ] o.e.j.s.session No SessionScavenger set, using defaults
   [junit4]   2> 707475 INFO  (TEST-PeerSyncTest.test-seed#[4C8CA59F47223283]) [    ] o.e.j.s.session node0 Scavenging every 660000ms
   [junit4]   2> 707476 INFO  (TEST-PeerSyncTest.test-seed#[4C8CA59F47223283]) [    ] o.e.j.s.h.ContextHandler Started o.e.j.s.ServletContextHandler@5b51205e{/,null,AVAILABLE}
   [junit4]   2> 707476 INFO  (TEST-PeerSyncTest.test-seed#[4C8CA59F47223283]) [    ] o.e.j.s.AbstractConnector Started ServerConnector@6a0ae441{HTTP/1.1,[http/1.1, h2c]}{127.0.0.1:44767}
   [junit4]   2> 707477 INFO  (TEST-PeerSyncTest.test-seed#[4C8CA59F47223283]) [    ] o.e.j.s.Server Started @707528ms
   [junit4]   2> 707477 INFO  (TEST-PeerSyncTest.test-seed#[4C8CA59F47223283]) [    ] o.a.s.c.s.e.JettySolrRunner Jetty properties: {schema=schema.xml, hostContext=/, solrconfig=solrconfig-tlog.xml, hostPort=44767, coreRootDirectory=/x1/jenkins/jenkins-slave/workspace/Lucene-Solr-Tests-master/solr/build/solr-core/test/J1/temp/solr.update.PeerSyncTest_4C8CA59F47223283-001/tempDir-001/shard1/cores}
   [junit4]   2> 707477 ERROR (TEST-PeerSyncTest.test-seed#[4C8CA59F47223283]) [    ] o.a.s.u.StartupLoggingUtils Missing Java Option solr.log.dir. Logging may be missing or incomplete.
   [junit4]   2> 707477 INFO  (TEST-PeerSyncTest.test-seed#[4C8CA59F47223283]) [    ] o.a.s.s.SolrDispatchFilter Using logger factory org.apache.logging.slf4j.Log4jLoggerFactory
   [junit4]   2> 707477 INFO  (TEST-PeerSyncTest.test-seed#[4C8CA59F47223283]) [    ] o.a.s.s.SolrDispatchFilter  ___      _       Welcome to Apache Solr? version 9.0.0
   [junit4]   2> 707477 INFO  (TEST-PeerSyncTest.test-seed#[4C8CA59F47223283]) [    ] o.a.s.s.SolrDispatchFilter / __| ___| |_ _   Starting in standalone mode on port null
   [junit4]   2> 707477 INFO  (TEST-PeerSyncTest.test-seed#[4C8CA59F47223283]) [    ] o.a.s.s.SolrDispatchFilter \__ \/ _ \ | '_|  Install dir: null
   [junit4]   2> 707477 INFO  (TEST-PeerSyncTest.test-seed#[4C8CA59F47223283]) [    ] o.a.s.s.SolrDispatchFilter |___/\___/_|_|    Start time: 2019-05-01T12:39:16.992830Z
   [junit4]   2> 707478 INFO  (TEST-PeerSyncTest.test-seed#[4C8CA59F47223283]) [    ] o.a.s.c.SolrXmlConfig Loading container configuration from /x1/jenkins/jenkins-slave/workspace/Lucene-Solr-Tests-master/solr/build/solr-core/test/J1/temp/solr.update.PeerSyncTest_4C8CA59F47223283-001/tempDir-001/shard1/solr.xml
   [junit4]   2> 707482 INFO  (TEST-PeerSyncTest.test-seed#[4C8CA59F47223283]) [    ] o.a.s.c.SolrXmlConfig Configuration parameter autoReplicaFailoverWorkLoopDelay is ignored
   [junit4]   2> 707482 INFO  (TEST-PeerSyncTest.test-seed#[4C8CA59F47223283]) [    ] o.a.s.c.SolrXmlConfig Configuration parameter autoReplicaFailoverBadNodeExpiration is ignored
   [junit4]   2> 707483 INFO  (TEST-PeerSyncTest.test-seed#[4C8CA59F47223283]) [    ] o.a.s.c.SolrXmlConfig MBean server found: com.sun.jmx.mbeanserver.JmxMBeanServer@44c8da19, but no JMX reporters were configured - adding default JMX reporter.
   [junit4]   2> 707570 INFO  (TEST-PeerSyncTest.test-seed#[4C8CA59F47223283]) [    ] o.a.s.h.c.HttpShardHandlerFactory Host whitelist initialized: WhitelistHostChecker [whitelistHosts=null, whitelistHostCheckingEnabled=false]
   [junit4]   2> 707572 WARN  (TEST-PeerSyncTest.test-seed#[4C8CA59F47223283]) [    ] o.e.j.u.s.S.config No Client EndPointIdentificationAlgorithm configured for SslContextFactory@5bd68f77[provider=null,keyStore=null,trustStore=null]
   [junit4]   2> 707580 WARN  (TEST-PeerSyncTest.test-seed#[4C8CA59F47223283]) [    ] o.e.j.u.s.S.config No Client EndPointIdentificationAlgorithm configured for SslContextFactory@61ca66d7[provider=null,keyStore=null,trustStore=null]
   [junit4]   2> 707598 INFO  (TEST-PeerSyncTest.test-seed#[4C8CA59F47223283]) [    ] o.a.s.c.TransientSolrCoreCacheDefault Allocating transient cache for 4 transient cores
   [junit4]   2> 707598 INFO  (TEST-PeerSyncTest.test-seed#[4C8CA59F47223283]) [    ] o.a.s.h.a.MetricsHistoryHandler No .system collection, keeping metrics history in memory.
   [junit4]   2> 707632 INFO  (TEST-PeerSyncTest.test-seed#[4C8CA59F47223283]) [    ] o.a.s.m.r.SolrJmxReporter JMX monitoring for 'solr.node' (registry 'solr.node') enabled at server: com.sun.jmx.mbeanserver.JmxMBeanServer@44c8da19
   [junit4]   2> 707657 INFO  (TEST-PeerSyncTest.test-seed#[4C8CA59F47223283]) [    ] o.a.s.m.r.SolrJmxReporter JMX monitoring for 'solr.jvm' (registry 'solr.jvm') enabled at server: com.sun.jmx.mbeanserver.JmxMBeanServer@44c8da19
   [junit4]   2> 707657 INFO  (TEST-PeerSyncTest.test-seed#[4C8CA59F47223283]) [    ] o.a.s.m.r.SolrJmxReporter JMX monitoring for 'solr.jetty' (registry 'solr.jetty') enabled at server: com.sun.jmx.mbeanserver.JmxMBeanServer@44c8da19
   [junit4]   2> 707660 INFO  (TEST-PeerSyncTest.test-seed#[4C8CA59F47223283]) [    ] o.a.s.c.CorePropertiesLocator Found 1 core definitions underneath /x1/jenkins/jenkins-slave/workspace/Lucene-Solr-Tests-master/solr/build/solr-core/test/J1/temp/solr.update.PeerSyncTest_4C8CA59F47223283-001/tempDir-001/shard1/cores
   [junit4]   2> 707660 INFO  (TEST-PeerSyncTest.test-seed#[4C8CA59F47223283]) [    ] o.a.s.c.CorePropertiesLocator Cores are: [collection1]
   [junit4]   2> 707661 INFO  (coreLoadExecutor-2322-thread-1) [    x:collection1] o.a.s.c.SolrResourceLoader [null] Added 2 libs to classloader, from paths: [/x1/jenkins/jenkins-slave/workspace/Lucene-Solr-Tests-master/solr/core/src/test-files/solr/collection1/lib, /x1/jenkins/jenkins-slave/workspace/Lucene-Solr-Tests-master/solr/core/src/test-files/solr/collection1/lib/classes]
   [junit4]   2> 707725 INFO  (coreLoadExecutor-2322-thread-1) [    x:collection1] o.a.s.c.SolrConfig Using Lucene MatchVersion: 9.0.0
   [junit4]   2> 707789 INFO  (coreLoadExecutor-2322-thread-1) [    x:collection1] o.a.s.s.IndexSchema [collection1] Schema name=test
   [junit4]   2> 707991 INFO  (coreLoadExecutor-2322-thread-1) [    x:collection1] o.a.s.s.IndexSchema Loaded schema test/1.0 with uniqueid field id
   [junit4]   2> 708002 INFO  (coreLoadExecutor-2322-thread-1) [    x:collection1] o.a.s.c.CoreContainer Creating SolrCore 'collection1' using configuration from configset /x1/jenkins/jenkins-slave/workspace/Lucene-Solr-Tests-master/solr/core/src/test-files/solr/collection1, trusted=true
   [junit4]   2> 708003 INFO  (coreLoadExecutor-2322-thread-1) [    x:collection1] o.a.s.m.r.SolrJmxReporter JMX monitoring for 'solr.core.collection1' (registry 'solr.core.collection1') enabled at server: com.sun.jmx.mbeanserver.JmxMBeanServer@44c8da19
   [junit4]   2> 708003 INFO  (coreLoadExecutor-2322-thread-1) [    x:collection1] o.a.s.c.SolrCore [[collection1] ] Opening new SolrCore at [/x1/jenkins/jenkins-slave/workspace/Lucene-Solr-Tests-master/solr/core/src/test-files/solr/collection1], dataDir=[/x1/jenkins/jenkins-slave/workspace/Lucene-Solr-Tests-master/solr/build/solr-core/test/J1/temp/solr.update.PeerSyncTest_4C8CA59F47223283-001/tempDir-001/shard1/cores/collection1/data/]
   [junit4]   2> 708006 INFO  (coreLoadExecutor-2322-thread-1) [    x:collection1] o.a.s.u.RandomMergePolicy RandomMergePolicy wrapping class org.apache.lucene.index.TieredMergePolicy: [TieredMergePolicy: maxMergeAtOnce=16, maxMergeAtOnceExplicit=12, maxMergedSegmentMB=55.1142578125, floorSegmentMB=0.8564453125, forceMergeDeletesPctAllowed=14.352225393945815, segmentsPerTier=29.0, maxCFSSegmentSizeMB=8.796093022207999E12, noCFSRatio=0.8419052995235371, deletesPctAllowed=49.921869403423955
   [junit4]   2> 708009 WARN  (coreLoadExecutor-2322-thread-1) [    x:collection1] o.a.s.c.RequestHandlers INVALID paramSet a in requestHandler {type = requestHandler,name = /dump,class = DumpRequestHandler,attributes = {initParams=a, name=/dump, class=DumpRequestHandler},args = {defaults={a=A,b=B}}}
   [junit4]   2> 708241 INFO  (coreLoadExecutor-2322-thread-1) [    x:collection1] o.a.s.u.UpdateHandler Using UpdateLog implementation: org.apache.solr.update.UpdateLog
   [junit4]   2> 708241 INFO  (coreLoadExecutor-2322-thread-1) [    x:collection1] o.a.s.u.UpdateLog Initializing UpdateLog: dataDir= defaultSyncLevel=FLUSH numRecordsToKeep=100 maxNumLogsToKeep=10 numVersionBuckets=65536
   [junit4]   2> 708243 INFO  (coreLoadExecutor-2322-thread-1) [    x:collection1] o.a.s.u.CommitTracker Hard AutoCommit: disabled
   [junit4]   2> 708243 INFO  (coreLoadExecutor-2322-thread-1) [    x:collection1] o.a.s.u.CommitTracker Soft AutoCommit: disabled
   [junit4]   2> 708245 INFO  (coreLoadExecutor-2322-thread-1) [    x:collection1] o.a.s.u.RandomMergePolicy RandomMergePolicy wrapping class org.apache.lucene.index.TieredMergePolicy: [TieredMergePolicy: maxMergeAtOnce=24, maxMergeAtOnceExplicit=12, maxMergedSegmentMB=64.466796875, floorSegmentMB=0.279296875, forceMergeDeletesPctAllowed=29.685748769158387, segmentsPerTier=15.0, maxCFSSegmentSizeMB=8.796093022207999E12, noCFSRatio=0.7326874206233095, deletesPctAllowed=46.96989159882985
   [junit4]   2> 708246 INFO  (coreLoadExecutor-2322-thread-1) [    x:collection1] o.a.s.s.SolrIndexSearcher Opening [Searcher@4c914477[collection1] main]
   [junit4]   2> 708246 WARN  (coreLoadExecutor-2322-thread-1) [    x:collection1] o.a.s.r.ManagedResourceStorage Cannot write to config directory /x1/jenkins/jenkins-slave/workspace/Lucene-Solr-Tests-master/solr/core/src/test-files/solr/collection1/conf; switching to use InMemory storage instead.
   [junit4]   2> 708247 INFO  (coreLoadExecutor-2322-thread-1) [    x:collection1] o.a.s.h.ReplicationHandler Commits will be reserved for 10000ms.
   [junit4]   2> 708247 INFO  (coreLoadExecutor-2322-thread-1) [    x:collection1] o.a.s.u.UpdateLog Could not find max version in index or recent updates, using new clock 1632333314404646912
   [junit4]   2> 708259 INFO  (searcherExecutor-2323-thread-1-processing-x:collection1) [    x:collection1] o.a.s.c.SolrCore [collection1] Registered new searcher Searcher@4c914477[collection1] main{ExitableDirectoryReader(UninvertingDirectoryReader())}
   [junit4]   2> 709326 INFO  (TEST-PeerSyncTest.test-seed#[4C8CA59F47223283]) [    ] o.a.s.SolrTestCaseJ4 Writing core.properties file to /x1/jenkins/jenkins-slave/workspace/Lucene-Solr-Tests-master/solr/build/solr-core/test/J1/temp/solr.update.PeerSyncTest_4C8CA59F47223283-001/tempDir-001/shard2/cores/collection1
   [junit4]   2> 709327 WARN  (TEST-PeerSyncTest.test-seed#[4C8CA59F47223283]) [    ] o.e.j.s.AbstractConnector Ignoring deprecated socket close linger time
   [junit4]   2> 709327 INFO  (TEST-PeerSyncTest.test-seed#[4C8CA59F47223283]) [    ] o.a.s.c.s.e.JettySolrRunner Start Jetty (original configured port=0)
   [junit4]   2> 709327 INFO  (TEST-PeerSyncTest.test-seed#[4C8CA59F47223283]) [    ] o.a.s.c.s.e.JettySolrRunner Trying to start Jetty on port 0 try number 1 ...
   [junit4]   2> 709327 INFO  (TEST-PeerSyncTest.test-seed#[4C8CA59F47223283]) [    ] o.e.j.s.Server jetty-9.4.14.v20181114; built: 2018-11-14T21:20:31.478Z; git: c4550056e785fb5665914545889f21dc136ad9e6; jvm 11.0.1+13-LTS
   [junit4]   2> 709329 INFO  (TEST-PeerSyncTest.test-seed#[4C8CA59F47223283]) [    ] o.e.j.s.session DefaultSessionIdManager workerName=node0
   [junit4]   2> 709329 INFO  (TEST-PeerSyncTest.test-seed#[4C8CA59F47223283]) [    ] o.e.j.s.session No SessionScavenger set, using defaults
   [junit4]   2> 709329 INFO  (TEST-PeerSyncTest.test-seed#[4C8CA59F47223283]) [    ] o.e.j.s.session node0 Scavenging every 660000ms
   [junit4]   2> 709329 INFO  (TEST-PeerSyncTest.test-seed#[4C8CA59F47223283]) [    ] o.e.j.s.h.ContextHandler Started o.e.j.s.ServletContextHandler@544d62dc{/,null,AVAILABLE}
   [junit4]   2> 709330 INFO  (TEST-PeerSyncTest.test-seed#[4C8CA59F47223283]) [    ] o.e.j.s.AbstractConnector Started ServerConnector@2c0db042{HTTP/1.1,[http/1.1, h2c]}{127.0.0.1:43237}
   [junit4]   2> 709330 INFO  (TEST-PeerSyncTest.test-seed#[4C8CA59F47223283]) [    ] o.e.j.s.Server Started @709381ms
   [junit4]   2> 709330 INFO  (TEST-PeerSyncTest.test-seed#[4C8CA59F47223283]) [    ] o.a.s.c.s.e.JettySolrRunner Jetty properties: {schema=schema.xml, hostContext=/, solrconfig=solrconfig-tlog.xml, hostPort=43237, coreRootDirectory=/x1/jenkins/jenkins-slave/workspace/Lucene-Solr-Tests-master/solr/build/solr-core/test/J1/temp/solr.update.PeerSyncTest_4C8CA59F47223283-001/tempDir-001/shard2/cores}
   [junit4]   2> 709331 ERROR (TEST-PeerSyncTest.test-seed#[4C8CA59F47223283]) [    ] o.a.s.u.StartupLoggingUtils Missing Java Option solr.log.dir. Logging may be missing or incomplete.
   [junit4]   2> 709331 INFO  (TEST-PeerSyncTest.test-seed#[4C8CA59F47223283]) [    ] o.a.s.s.SolrDispatchFilter Using logger factory org.apache.logging.slf4j.Log4jLoggerFactory
   [junit4]   2> 709331 INFO  (TEST-PeerSyncTest.test-seed#[4C8CA59F47223283]) [    ] o.a.s.s.SolrDispatchFilter  ___      _       Welcome to Apache Solr? version 9.0.0
   [junit4]   2> 709331 INFO  (TEST-PeerSyncTest.test-seed#[4C8CA59F47223283]) [    ] o.a.s.s.SolrDispatchFilter / __| ___| |_ _   Starting in standalone mode on port null
   [junit4]   2> 709331 INFO  (TEST-PeerSyncTest.test-seed#[4C8CA59F47223283]) [    ] o.a.s.s.SolrDispatchFilter \__ \/ _ \ | '_|  Install dir: null
   [junit4]   2> 709331 INFO  (TEST-PeerSyncTest.test-seed#[4C8CA59F47223283]) [    ] o.a.s.s.SolrDispatchFilter |___/\___/_|_|    Start time: 2019-05-01T12:39:18.846631Z
   [junit4]   2> 709332 INFO  (TEST-PeerSyncTest.test-seed#[4C8CA59F47223283]) [    ] o.a.s.c.SolrXmlConfig Loading container configuration from /x1/jenkins/jenkins-slave/workspace/Lucene-Solr-Tests-master/solr/build/solr-core/test/J1/temp/solr.update.PeerSyncTest_4C8CA59F47223283-001/tempDir-001/shard2/solr.xml
   [junit4]   2> 709335 INFO  (TEST-PeerSyncTest.test-seed#[4C8CA59F47223283]) [    ] o.a.s.c.SolrXmlConfig Configuration parameter autoReplicaFailoverWorkLoopDelay is ignored
   [junit4]   2> 709335 INFO  (TEST-PeerSyncTest.test-seed#[4C8CA59F47223283]) [    ] o.a.s.c.SolrXmlConfig Configuration parameter autoReplicaFailoverBadNodeExpiration is ignored
   [junit4]   2> 709337 INFO  (TEST-PeerSyncTest.test-seed#[4C8CA59F47223283]) [    ] o.a.s.c.SolrXmlConfig MBean server found: com.sun.jmx.mbeanserver.JmxMBeanServer@44c8da19, but no JMX reporters were configured - adding default JMX reporter.
   [junit4]   2> 709566 INFO  (TEST-PeerSyncTest.test-seed#[4C8CA59F47223283]) [    ] o.a.s.h.c.HttpShardHandlerFactory Host whitelist initialized: WhitelistHostChecker [whitelistHosts=null, whitelistHostCheckingEnabled=false]
   [junit4]   2> 709568 WARN  (TEST-PeerSyncTest.test-seed#[4C8CA59F47223283]) [    ] o.e.j.u.s.S.config No Client EndPointIdentificationAlgorithm configured for SslContextFactory@360b77e7[provider=null,keyStore=null,trustStore=null]
   [junit4]   2> 709572 WARN  (TEST-PeerSyncTest.test-seed#[4C8CA59F47223283]) [    ] o.e.j.u.s.S.config No Client EndPointIdentificationAlgorithm configured for SslContextFactory@45bc62d7[provider=null,keyStore=null,trustStore=null]
   [junit4]   2> 709590 INFO  (TEST-PeerSyncTest.test-seed#[4C8CA59F47223283]) [    ] o.a.s.c.TransientSolrCoreCacheDefault Allocating transient cache for 4 transient cores
   [junit4]   2> 709591 INFO  (TEST-PeerSyncTest.test-seed#[4C8CA59F47223283]) [    ] o.a.s.h.a.MetricsHistoryHandler No .system collection, keeping metrics history in memory.
   [junit4]   2> 709622 INFO  (TEST-PeerSyncTest.test-seed#[4C8CA59F47223283]) [    ] o.a.s.m.r.SolrJmxReporter JMX monitoring for 'solr.node' (registry 'solr.node') enabled at server: com.sun.jmx.mbeanserver.JmxMBeanServer@44c8da19
   [junit4]   2> 709646 INFO  (TEST-PeerSyncTest.test-seed#[4C8CA59F47223283]) [    ] o.a.s.m.r.SolrJmxReporter JMX monitoring for 'solr.jvm' (registry 'solr.jvm') enabled at server: com.sun.jmx.mbeanserver.JmxMBeanServer@44c8da19
   [junit4]   2> 709646 INFO  (TEST-PeerSyncTest.test-seed#[4C8CA59F47223283]) [    ] o.a.s.m.r.SolrJmxReporter JMX monitoring for 'solr.jetty' (registry 'solr.jetty') enabled at server: com.sun.jmx.mbeanserver.JmxMBeanServer@44c8da19
   [junit4]   2> 709649 INFO  (TEST-PeerSyncTest.test-seed#[4C8CA59F47223283]) [    ] o.a.s.c.CorePropertiesLocator Found 1 core definitions underneath /x1/jenkins/jenkins-slave/workspace/Lucene-Solr-Tests-master/solr/build/solr-core/test/J1/temp/solr.update.PeerSyncTest_4C8CA59F47223283-001/tempDir-001/shard2/cores
   [junit4]   2> 709649 INFO  (TEST-PeerSyncTest.test-seed#[4C8CA59F47223283]) [    ] o.a.s.c.CorePropertiesLocator Cores are: [collection1]
   [junit4]   2> 709650 INFO  (coreLoadExecutor-2336-thread-1) [    x:collection1] o.a.s.c.SolrResourceLoader [null] Added 2 libs to classloader, from paths: [/x1/jenkins/jenkins-slave/workspace/Lucene-Solr-Tests-master/solr/core/src/test-files/solr/collection1/lib, /x1/jenkins/jenkins-slave/workspace/Lucene-Solr-Tests-master/solr/core/src/test-files/solr/collection1/lib/classes]
   [junit4]   2> 709695 INFO  (coreLoadExecutor-2336-thread-1) [    x:collection1] o.a.s.c.SolrConfig Using Lucene MatchVersion: 9.0.0
   [junit4]   2> 709785 INFO  (coreLoadExecutor-2336-thread-1) [    x:collection1] o.a.s.s.IndexSchema [collection1] Schema name=test
   [junit4]   2> 709894 INFO  (coreLoadExecutor-2336-thread-1) [    x:collection1] o.a.s.s.IndexSchema Loaded schema test/1.0 with uniqueid field id
   [junit4]   2> 709905 INFO  (coreLoadExecutor-2336-thread-1) [    x:collection1] o.a.s.c.CoreContainer Creating SolrCore 'collection1' using configuration from configset /x1/jenkins/jenkins-slave/workspace/Lucene-Solr-Tests-master/solr/core/src/test-files/solr/collection1, trusted=true
   [junit4]   2> 709918 INFO  (coreLoadExecutor-2336-thread-1) [    x:collection1] o.a.s.m.r.SolrJmxReporter JMX monitoring for 'solr.core.collection1' (registry 'solr.core.collection1') enabled at server: com.sun.jmx.mbeanserver.JmxMBeanServer@44c8da19
   [junit4]   2> 709918 INFO  (coreLoadExecutor-2336-thread-1) [    x:collection1] o.a.s.c.SolrCore [[collection1] ] Opening new SolrCore at [/x1/jenkins/jenkins-slave/workspace/Lucene-Solr-Tests-master/solr/core/src/test-files/solr/collection1], dataDir=[/x1/jenkins/jenkins-slave/workspace/Lucene-Solr-Tests-master/solr/build/solr-core/test/J1/temp/solr.update.PeerSyncTest_4C8CA59F47223283-001/tempDir-001/shard2/cores/collection1/data/]
   [junit4]   2> 709929 INFO  (coreLoadExecutor-2336-thread-1) [    x:collection1] o.a.s.u.RandomMergePolicy RandomMergePolicy wrapping class org.apache.lucene.index.TieredMergePolicy: [TieredMergePolicy: maxMergeAtOnce=16, maxMergeAtOnceExplicit=12, maxMergedSegmentMB=55.1142578125, floorSegmentMB=0.8564453125, forceMergeDeletesPctAllowed=14.352225393945815, segmentsPerTier=29.0, maxCFSSegmentSizeMB=8.796093022207999E12, noCFSRatio=0.8419052995235371, deletesPctAllowed=49.921869403423955
   [junit4]   2> 709931 WARN  (coreLoadExecutor-2336-thread-1) [    x:collection1] o.a.s.c.RequestHandlers INVALID paramSet a in requestHandler {type = requestHandler,name = /dump,class = DumpRequestHandler,attributes = {initParams=a, name=/dump, class=DumpRequestHandler},args = {defaults={a=A,b=B}}}
   [junit4]   2> 710049 INFO  (coreLoadExecutor-2336-thread-1) [    x:collection1] o.a.s.u.UpdateHandler Using UpdateLog implementation: org.apache.solr.update.UpdateLog
   [junit4]   2> 710049 INFO  (coreLoadExecutor-2336-thread-1) [    x:collection1] o.a.s.u.UpdateLog Initializing UpdateLog: dataDir= defaultSyncLevel=FLUSH numRecordsToKeep=100 maxNumLogsToKeep=10 numVersionBuckets=65536
   [junit4]   2> 710051 INFO  (coreLoadExecutor-2336-thread-1) [    x:collection1] o.a.s.u.CommitTracker Hard AutoCommit: disabled
   [junit4]   2> 710051 INFO  (coreLoadExecutor-2336-thread-1) [    x:collection1] o.a.s.u.CommitTracker Soft AutoCommit: disabled
   [junit4]   2> 710052 INFO  (coreLoadExecutor-2336-thread-1) [    x:collection1] o.a.s.u.RandomMergePolicy RandomMergePolicy wrapping class org.apache.lucene.index.TieredMergePolicy: [TieredMergePolicy: maxMergeAtOnce=24, maxMergeAtOnceExplicit=12, maxMergedSegmentMB=64.466796875, floorSegmentMB=0.279296875, forceMergeDeletesPctAllowed=29.685748769158387, segmentsPerTier=15.0, maxCFSSegmentSizeMB=8.796093022207999E12, noCFSRatio=0.7326874206233095, deletesPctAllowed=46.96989159882985
   [junit4]   2> 710053 INFO  (coreLoadExecutor-2336-thread-1) [    x:collection1] o.a.s.s.SolrIndexSearcher Opening [Searcher@4980908c[collection1] main]
   [junit4]   2> 710053 WARN  (coreLoadExecutor-2336-thread-1) [    x:collection1] o.a.s.r.ManagedResourceStorage Cannot write to config directory /x1/jenkins/jenkins-slave/workspace/Lucene-Solr-Tests-master/solr/core/src/test-files/solr/collection1/conf; switching to use InMemory storage instead.
   [junit4]   2> 710054 INFO  (coreLoadExecutor-2336-thread-1) [    x:collection1] o.a.s.h.ReplicationHandler Commits will be reserved for 10000ms.
   [junit4]   2> 710054 INFO  (coreLoadExecutor-2336-thread-1) [    x:collection1] o.a.s.u.UpdateLog Could not find max version in index or recent updates, using new clock 1632333316299423744
   [junit4]   2> 710058 INFO  (searcherExecutor-2337-thread-1-processing-x:collection1) [    x:collection1] o.a.s.c.SolrCore [collection1] Registered new searcher Searcher@4980908c[collection1] main{ExitableDirectoryReader(UninvertingDirectoryReader())}
   [junit4]   2> 710058 INFO  (TEST-PeerSyncTest.test-seed#[4C8CA59F47223283]) [    ] o.a.s.SolrTestCaseJ4 ###Starting test
   [junit4]   2> 710067 INFO  (qtp550414066-6711) [    x:collection1] o.a.s.u.p.LogUpdateProcessorFactory [collection1]  webapp= path=/update params={update.distrib=FROMLEADER&wt=javabin&version=2}{add=[1 (1)]} 0 3
   [junit4]   2> 710078 INFO  (qtp1042126487-6732) [    x:collection1] o.a.s.u.PeerSync PeerSync: core=collection1 url= START replicas=[http://127.0.0.1:41042/collection1] nUpdates=100
   [junit4]   2> 710096 INFO  (qtp550414066-6713) [    x:collection1] o.a.s.s.SolrIndexSearcher Opening [Searcher@523bfa05[collection1] realtime]
   [junit4]   2> 710096 INFO  (qtp550414066-6713) [    x:collection1] o.a.s.u.IndexFingerprint IndexFingerprint millis:10.0 result:{maxVersionSpecified=9223372036854775807, maxVersionEncountered=1, maxInHash=1, versionsHash=-5451962507482445012, numVersions=1, numDocs=1, maxDoc=1}
   [junit4]   2> 710097 INFO  (qtp550414066-6713) [    x:collection1] o.a.s.c.S.Request [collection1]  webapp= path=/get params={distrib=false&qt=/get&getFingerprint=9223372036854775807&wt=javabin&version=2} status=0 QTime=10
   [junit4]   2> 710098 INFO  (qtp1042126487-6732) [    x:collection1] o.a.s.u.IndexFingerprint IndexFingerprint millis:0.0 result:{maxVersionSpecified=9223372036854775807, maxVersionEncountered=0, maxInHash=0, versionsHash=0, numVersions=0, numDocs=0, maxDoc=0}
   [junit4]   2> 710109 INFO  (qtp1042126487-6732) [    x:collection1] o.a.s.u.PeerSync PeerSync: core=collection1 url= DONE.  We have no versions.  sync failed.
   [junit4]   2> 710110 INFO  (qtp550414066-6714) [    x:collection1] o.a.s.u.IndexFingerprint IndexFingerprint millis:0.0 result:{maxVersionSpecified=9223372036854775807, maxVersionEncountered=1, maxInHash=1, versionsHash=-5451962507482445012, numVersions=1, numDocs=1, maxDoc=1}
   [junit4]   2> 710111 INFO  (qtp550414066-6714) [    x:collection1] o.a.s.c.S.Request [collection1]  webapp= path=/get params={distrib=false&qt=/get&fingerprint=true&getVersions=100&wt=javabin&version=2} status=0 QTime=0
   [junit4]   2> 710111 INFO  (qtp1042126487-6732) [    x:collection1] o.a.s.c.S.Request [collection1]  webapp= path=/get params={qt=/get&getVersions=100&sync=http://127.0.0.1:41042/collection1&wt=javabin&version=2} status=0 QTime=33
   [junit4]   2> 710113 INFO  (qtp1042126487-6733) [    x:collection1] o.a.s.u.p.LogUpdateProcessorFactory [collection1]  webapp= path=/update params={update.distrib=FROMLEADER&wt=javabin&version=2}{add=[1 (1)]} 0 1
   [junit4]   2> 710115 INFO  (qtp1042126487-6734) [    x:collection1] o.a.s.u.PeerSync PeerSync: core=collection1 url= START replicas=[http://127.0.0.1:41042/collection1] nUpdates=100
   [junit4]   2> 710116 INFO  (qtp550414066-6708) [    x:collection1] o.a.s.u.IndexFingerprint IndexFingerprint millis:0.0 result:{maxVersionSpecified=9223372036854775807, maxVersionEncountered=1, maxInHash=1, versionsHash=-5451962507482445012, numVersions=1, numDocs=1, maxDoc=1}
   [junit4]   2> 710116 INFO  (qtp550414066-6708) [    x:collection1] o.a.s.c.S.Request [collection1]  webapp= path=/get params={distrib=false&qt=/get&getFingerprint=9223372036854775807&wt=javabin&version=2} status=0 QTime=0
   [junit4]   2> 710119 INFO  (qtp1042126487-6734) [    x:collection1] o.a.s.s.SolrIndexSearcher Opening [Searcher@5afd699[collection1] realtime]
   [junit4]   2> 710120 INFO  (qtp1042126487-6734) [    x:collection1] o.a.s.u.IndexFingerprint IndexFingerprint millis:3.0 result:{maxVersionSpecified=9223372036854775807, maxVersionEncountered=1, maxInHash=1, versionsHash=-5451962507482445012, numVersions=1, numDocs=1, maxDoc=1}
   [junit4]   2> 710120 INFO  (qtp1042126487-6734) [    x:collection1] o.a.s.u.PeerSync We are already in sync. No need to do a PeerSync 
   [junit4]   2> 710120 INFO  (qtp1042126487-6734) [    x:collection1] o.a.s.c.S.Request [collection1]  webapp= path=/get params={qt=/get&getVersions=100&sync=http://127.0.0.1:41042/collection1&wt=javabin&version=2} status=0 QTime=5
   [junit4]   2> 710121 INFO  (qtp550414066-6711) [    x:collection1] o.a.s.u.DirectUpdateHandler2 start commit{_version_=1632333316369678336,optimize=false,openSearcher=true,waitSearcher=true,expungeDeletes=false,softCommit=false,prepareCommit=false}
   [junit4]   2> 710121 INFO  (qtp550414066-6711) [    x:collection1] o.a.s.u.SolrIndexWriter Calling setCommitData with IW:org.apache.solr.update.SolrIndexWriter@6bd7eea6 commitCommandVersion:1632333316369678336
   [junit4]   2> 710122 INFO  (qtp550414066-6711) [    x:collection1] o.a.s.s.SolrIndexSearcher Opening [Searcher@63b18b4e[collection1] main]
   [junit4]   2> 710123 INFO  (qtp550414066-6711) [    x:collection1] o.a.s.u.DirectUpdateHandler2 end_commit_flush
   [junit4]   2> 710126 INFO  (searcherExecutor-2309-thread-1-processing-x:collection1) [    x:collection1] o.a.s.c.SolrCore [collection1] Registered new searcher Searcher@63b18b4e[collection1] main{ExitableDirectoryReader(UninvertingDirectoryReader(Uninverting(_0(9.0.0):C1:[diagnostics={os.arch=amd64, source=flush, lucene.version=9.0.0, java.vm.version=11.0.1+13-LTS, java.version=11.0.1, timestamp=1556714359609, java.vendor=Oracle Corporation, os=Linux, os.version=4.4.0-137-generic, java.runtime.version=11.0.1+13-LTS}]:[attributes={Lucene50StoredFieldsFormat.mode=BEST_SPEED}])))}
   [junit4]   2> 710126 INFO  (qtp550414066-6711) [    x:collection1] o.a.s.u.p.LogUpdateProcessorFactory [collection1]  webapp= path=/update params={waitSearcher=true&commit=true&softCommit=false&wt=javabin&version=2}{commit=} 0 5
   [junit4]   2> 710127 INFO  (qtp1042126487-6734) [    x:collection1] o.a.s.u.DirectUpdateHandler2 start commit{_version_=1632333316375969792,optimize=false,openSearcher=true,waitSearcher=true,expungeDeletes=false,softCommit=false,prepareCommit=false}
   [junit4]   2> 710127 INFO  (qtp1042126487-6734) [    x:collection1] o.a.s.u.SolrIndexWriter Calling setCommitData with IW:org.apache.solr.update.SolrIndexWriter@5c2bd869 commitCommandVersion:1632333316375969792
   [junit4]   2> 710128 INFO  (qtp1042126487-6734) [    x:collection1] o.a.s.s.SolrIndexSearcher Opening [Searcher@16b22c70[collection1] main]
   [junit4]   2> 710131 INFO  (searcherExecutor-2323-thread-1-processing-x:collection1) [    x:collection1] o.a.s.c.SolrCore [collection1] Registered new searcher Searcher@16b22c70[collection1] main{ExitableDirectoryReader(UninvertingDirectoryReader(Uninverting(_0(9.0.0):C1:[diagnostics={os.arch=amd64, source=flush, lucene.version=9.0.0, java.vm.version=11.0.1+13-LTS, java.version=11.0.1, timestamp=1556714359633, java.vendor=Oracle Corporation, os=Linux, os.version=4.4.0-137-generic, java.runtime.version=11.0.1+13-LTS}]:[attributes={Lucene50StoredFieldsFormat.mode=BEST_SPEED}])))}
   [junit4]   2> 710131 INFO  (qtp1042126487-6734) [    x:collection1] o.a.s.u.DirectUpdateHandler2 end_commit_flush
   [junit4]   2> 710131 INFO  (qtp1042126487-6734) [    x:collection1] o.a.s.u.p.LogUpdateProcessorFactory [collection1]  webapp= path=/update params={waitSearcher=true&commit=true&softCommit=false&wt=javabin&version=2}{commit=} 0 5
   [junit4]   2> 710132 INFO  (qtp550414066-6712) [    x:collection1] o.a.s.c.S.Request [collection1]  webapp= path=/select params={q=*:*&wt=javabin&version=2} hits=1 status=0 QTime=0
   [junit4]   2> 710133 INFO  (qtp1042126487-6734) [    x:collection1] o.a.s.c.S.Request [collection1]  webapp= path=/select params={q=*:*&wt=javabin&version=2} hits=1 status=0 QTime=0
   [junit4]   2> 710137 INFO  (qtp550414066-6713) [    x:collection1] o.a.s.u.p.LogUpdateProcessorFactory [collection1]  webapp= path=/update params={update.distrib=FROMLEADER&wt=javabin&version=2}{add=[2 (2)]} 0 2
   [junit4]   2> 710137 INFO  (qtp1042126487-6734) [    x:collection1] o.a.s.u.PeerSync PeerSync: core=collection1 url= START replicas=[http://127.0.0.1:41042/collection1] nUpdates=100
   [junit4]   2> 710143 INFO  (qtp550414066-6714) [    x:collection1] o.a.s.s.SolrIndexSearcher Opening [Searcher@d935513[collection1] realtime]
   [junit4]   2> 710143 INFO  (qtp550414066-6714) [    x:collection1] o.a.s.u.IndexFingerprint IndexFingerprint millis:5.0 result:{maxVersionSpecified=9223372036854775807, maxVersionEncountered=2, maxInHash=2, versionsHash=-1218814014108643565, numVersions=2, numDocs=2, maxDoc=1}
   [junit4]   2> 710144 INFO  (qtp550414066-6714) [    x:collection1] o.a.s.c.S.Request [collection1]  webapp= path=/get params={distrib=false&qt=/get&getFingerprint=9223372036854775807&wt=javabin&version=2} status=0 QTime=5
   [junit4]   2> 710144 INFO  (qtp1042126487-6734) [    x:collection1] o.a.s.u.IndexFingerprint IndexFingerprint millis:0.0 result:{maxVersionSpecified=9223372036854775807, maxVersionEncountered=1, maxInHash=1, versionsHash=-5451962507482445012, numVersions=1, numDocs=1, maxDoc=1}
   [junit4]   2> 710145 INFO  (qtp550414066-6708) [    x:collection1] o.a.s.u.IndexFingerprint IndexFingerprint millis:0.0 result:{maxVersionSpecified=9223372036854775807, maxVersionEncountered=2, maxInHash=2, versionsHash=-1218814014108643565, numVersions=2, numDocs=2, maxDoc=1}
   [junit4]   2> 710145 INFO  (qtp550414066-6708) [    x:collection1] o.a.s.c.S.Request [collection1]  webapp= path=/get params={distrib=false&qt=/get&fingerprint=true&getVersions=100&wt=javabin&version=2} status=0 QTime=0
   [junit4]   2> 710146 INFO  (qtp1042126487-6734) [    x:collection1] o.a.s.u.PeerSync PeerSync: core=collection1 url=  Received 2 versions from http://127.0.0.1:41042/collection1 fingerprint:{maxVersionSpecified=9223372036854775807, maxVersionEncountered=2, maxInHash=2, versionsHash=-1218814014108643565, numVersions=2, numDocs=2, maxDoc=1}
   [junit4]   2> 710147 INFO  (qtp550414066-6711) [    x:collection1] o.a.s.c.S.Request [collection1]  webapp= path=/get params={distrib=false&qt=/get&checkCanHandleVersionRanges=false&wt=javabin&version=2} status=0 QTime=0
   [junit4]   2> 710184 INFO  (qtp1042126487-6734) [    x:collection1] o.a.s.u.PeerSync PeerSync: core=collection1 url= Requesting updates from http://127.0.0.1:41042/collection1n=1 versions=2...2
   [junit4]   2> 710189 INFO  (qtp550414066-6712) [    x:collection1] o.a.s.u.IndexFingerprint IndexFingerprint millis:0.0 result:{maxVersionSpecified=2, maxVersionEncountered=2, maxInHash=2, versionsHash=-1218814014108643565, numVersions=2, numDocs=2, maxDoc=1}
   [junit4]   2> 710190 INFO  (qtp550414066-6712) [    x:collection1] o.a.s.c.S.Request [collection1]  webapp= path=/get params={getUpdates=2...2&distrib=false&qt=/get&fingerprint=true&onlyIfActive=false&wt=javabin&version=2} status=0 QTime=5
   [junit4]   2> 710193 INFO  (qtp1042126487-6734) [    x:collection1] o.a.s.u.p.LogUpdateProcessorFactory [collection1] {add=[2 (2)]} 0 2
   [junit4]   2> 710207 INFO  (qtp1042126487-6734) [    x:collection1] o.a.s.s.SolrIndexSearcher Opening [Searcher@222e1f05[collection1] realtime]
   [junit4]   2> 710207 INFO  (qtp1042126487-6734) [    x:collection1] o.a.s.u.IndexFingerprint IndexFingerprint millis:13.0 result:{maxVersionSpecified=2, maxVersionEncountered=2, maxInHash=2, versionsHash=-1218814014108643565, numVersions=2, numDocs=2, maxDoc=1}
   [junit4]   2> 710207 INFO  (qtp1042126487-6734) [    x:collection1] o.a.s.u.PeerSync Fingerprint comparison: 0
   [junit4]   2> 710207 INFO  (qtp1042126487-6734) [    x:collection1] o.a.s.u.PeerSync PeerSync: core=collection1 url= DONE. sync succeeded
   [junit4]   2> 710208 INFO  (qtp1042126487-6734) [    x:collection1] o.a.s.c.S.Request [collection1]  webapp= path=/get params={qt=/get&getVersions=100&sync=http://127.0.0.1:41042/collection1&wt=javabin&version=2} status=0 QTime=70
   [junit4]   2> 710209 INFO  (qtp550414066-6713) [    x:collection1] o.a.s.u.DirectUpdateHandler2 start commit{_version_=1632333316461953024,optimize=false,openSearcher=true,waitSearcher=true,expungeDeletes=false,softCommit=false,prepareCommit=false}
   [junit4]   2> 710209 INFO  (qtp550414066-6713) [    x:collection1] o.a.s.u.SolrIndexWriter Calling setCommitData with IW:org.apache.solr.update.SolrIndexWriter@6bd7eea6 commitCommandVersion:1632333316461953024
   [junit4]   2> 710210 INFO  (qtp550414066-6713) [    x:collection1] o.a.s.s.SolrIndexSearcher Opening [Searcher@6dab4df9[collection1] main]
   [junit4]   2> 710210 INFO  (qtp550414066-6713) [    x:collection1] o.a.s.u.DirectUpdateHandler2 end_commit_flush
   [junit4]   2> 710213 INFO  (searcherExecutor-2309-thread-1-processing-x:collection1) [    x:collection1] o.a.s.c.SolrCore [collection1] Registered new searcher Searcher@6dab4df9[collection1] main{ExitableDirectoryReader(UninvertingDirectoryReader(Uninverting(_0(9.0.0):C1:[diagnostics={os.arch=amd64, source=flush, lucene.version=9.0.0, java.vm.version=11.0.1+13-LTS, java.version=11.0.1, timestamp=1556714359609, java.vendor=Oracle Corporation, os=Linux, os.version=4.4.0-137-generic, java.runtime.version=11.0.1+13-LTS}]:[attributes={Lucene50StoredFieldsFormat.mode=BEST_SPEED}]) Uninverting(_1(9.0.0):C1:[diagnostics={os.arch=amd64, source=flush, lucene.version=9.0.0, java.vm.version=11.0.1+13-LTS, java.version=11.0.1, timestamp=1556714359656, java.vendor=Oracle Corporation, os=Linux, os.version=4.4.0-137-generic, java.runtime.version=11.0.1+13-LTS}]:[attributes={Lucene50StoredFieldsFormat.mode=BEST_SPEED}])))}
   [junit4]   2> 710214 INFO  (qtp550414066-6713) [    x:collection1] o.a.s.u.p.LogUpdateProcessorFactory [collection1]  webapp= path=/update params={waitSearcher=true&commit=true&softCommit=false&wt=javabin&version=2}{commit=} 0 5
   [junit4]   2> 710215 INFO  (qtp1042126487-6735) [    x:collection1] o.a.s.u.DirectUpdateHandler2 start commit{_version_=1632333316468244480,optimize=false,openSearcher=true,waitSearcher=true,expungeDeletes=false,softCommit=false,prepareCommit=false}
   [junit4]   2> 710215 INFO  (qtp1042126487-6735) [    x:collection1] o.a.s.u.SolrIndexWriter Calling setCommitData with IW:org.apache.solr.update.SolrIndexWriter@5c2bd869 commitCommandVersion:1632333316468244480
   [junit4]   2> 710216 INFO  (qtp1042126487-6735) [    x:collection1] o.a.s.s.SolrIndexSearcher Opening [Searcher@444b9992[collection1] main]
   [junit4]   2> 710220 INFO  (searcherExecutor-2323-thread-1-processing-x:collection1) [    x:collection1] o.a.s.c.SolrCore [collection1] Registered new searcher Searcher@444b9992[collection1] main{ExitableDirectoryReader(UninvertingDirectoryReader(Uninverting(_0(9.0.0):C1:[diagnostics={os.arch=amd64, source=flush, lucene.version=9.0.0, java.vm.version=11.0.1+13-LTS, java.version=11.0.1, timestamp=1556714359633, java.vendor=Oracle Corporation, os=Linux, os.version=4.4.0-137-generic, java.runtime.version=11.0.1+13-LTS}]:[attributes={Lucene50StoredFieldsFormat.mode=BEST_SPEED}]) Uninverting(_1(9.0.0):C1:[diagnostics={os.arch=amd64, source=flush, lucene.version=9.0.0, java.vm.version=11.0.1+13-LTS, java.version=11.0.1, timestamp=1556714359720, java.vendor=Oracle Corporation, os=Linux, os.version=4.4.0-137-generic, java.runtime.version=11.0.1+13-LTS}]:[attributes={Lucene50StoredFieldsFormat.mode=BEST_SPEED}])))}
   [junit4]   2> 710220 INFO  (qtp1042126487-6735) [    x:collection1] o.a.s.u.DirectUpdateHandler2 end_commit_flush
   [junit4]   2> 710221 INFO  (qtp1042126487-6735) [    x:collection1] o.a.s.u.p.LogUpdateProcessorFactory [collection1]  webapp= path=/update params={waitSearcher=true&commit=true&softCommit=false&wt=javabin&version=2}{commit=} 0 6
   [junit4]   2> 710222 INFO  (qtp550414066-6714) [    x:collection1] o.a.s.c.S.Request [collection1]  webapp= path=/select params={q=*:*&wt=javabin&version=2} hits=2 status=0 QTime=0
   [junit4]   2> 710241 INFO  (qtp1042126487-6731) [    x:collection1] o.a.s.c.S.Request [collection1]  webapp= path=/select params={q=*:*&wt=javabin&version=2} hits=2 status=0 QTime=0
   [junit4]   2> 710244 INFO  (qtp550414066-6708) [    x:collection1] o.a.s.u.p.LogUpdateProcessorFactory [collection1]  webapp= path=/update params={update.distrib=FROMLEADER&wt=javabin&version=2}{add=[3 (3)]} 0 1
   [junit4]   2> 710248 INFO  (qtp550414066-6711) [    x:collection1] o.a.s.u.p.LogUpdateProcessorFactory [collection1]  webapp= path=/update p

[...truncated too long message...]

le_stemmed=PostingsFormat(name=MockRandom), multiDefault=PostingsFormat(name=LuceneVarGapDocFreqInterval), _root_=PostingsFormat(name=MockRandom), id=TestBloomFilteredLucenePostings(BloomFilteringPostingsFormat(Lucene50(blocksize=128))), text=PostingsFormat(name=Direct), title=PostingsFormat(name=MockRandom), title_lettertok=TestBloomFilteredLucenePostings(BloomFilteringPostingsFormat(Lucene50(blocksize=128)))}, docValues:{range_facet_l_dv=DocValuesFormat(name=Direct), _version_=DocValuesFormat(name=Lucene80), val_i_dvo=DocValuesFormat(name=Asserting), range_facet_i_dv=DocValuesFormat(name=Lucene80), intDvoDefault=DocValuesFormat(name=Direct), timestamp=DocValuesFormat(name=Lucene80)}, maxPointsInLeafNode=1643, maxMBSortInHeap=6.275876791338384, sim=Asserting(org.apache.lucene.search.similarities.AssertingSimilarity@221e500a), locale=fr-RE, timezone=Australia/Eucla
   [junit4]   2> NOTE: Linux 4.4.0-137-generic amd64/Oracle Corporation 11.0.1 (64-bit)/cpus=4,threads=1,free=320079544,total=536870912
   [junit4]   2> NOTE: All tests run in this JVM: [TestInitQParser, CoreAdminCreateDiscoverTest, TestCloudNestedDocsSort, TestConfigSetsAPI, TestGroupingSearch, TestImpersonationWithHadoopAuth, DeleteLastCustomShardedReplicaTest, SpellCheckComponentTest, SolrSlf4jReporterTest, TestFieldCacheReopen, IndexSchemaTest, HdfsRecoveryZkTest, TestUseDocValuesAsStored, TestSafeXMLParsing, ZkFailoverTest, TestTrieFacet, DistributedUpdateProcessorTest, TestHashPartitioner, TestCustomSort, ForceLeaderWithTlogReplicasTest, TestDistributedMissingSort, RequiredFieldsTest, TestExportWriter, TestDocBasedVersionConstraints, BooleanFieldTest, TestDynamicLoading, TestExtendedDismaxParser, TestLMDirichletSimilarityFactory, DistributedFacetPivotSmallTest, TestNumericTerms32, MetricsHistoryWithAuthIntegrationTest, PropertiesRequestHandlerTest, TestFieldCollectionResource, TestRequestForwarding, TlogReplayBufferedWhileIndexingTest, TestSimDistributedQueue, SolrGraphiteReporterTest, TestLegacyTerms, TestNumericRangeQuery64, TestInfoStreamLogging, TestSolrQueryParser, V2ApiIntegrationTest, EnumFieldTest, IgnoreCommitOptimizeUpdateProcessorFactoryTest, SliceStateTest, IndexBasedSpellCheckerTest, AutoAddReplicasIntegrationTest, QueryElevationComponentTest, TaggingAttributeTest, TestSolrXml, TestLegacyField, TestDocTermOrds, CustomHighlightComponentTest, AuthToolTest, ConjunctionSolrSpellCheckerTest, WordBreakSolrSpellCheckerTest, SolrCoreCheckLockOnStartupTest, TestBadConfig, VMParamsZkACLAndCredentialsProvidersTest, ChaosMonkeyNothingIsSafeTest, TestStressCloudBlindAtomicUpdates, MaxSizeAutoCommitTest, DistributedSpellCheckComponentTest, MBeansHandlerTest, JWTAuthPluginTest, CategoryRoutedAliasUpdateProcessorTest, SpellPossibilityIteratorTest, CollectionsAPIDistributedZkTest, HdfsChaosMonkeySafeLeaderTest, TestSolrCloudWithDelegationTokens, TestPostingsSolrHighlighter, TestStressUserVersions, CreateCollectionCleanupTest, TestSchemaManager, UtilsToolTest, SolrRrdBackendFactoryTest, DistributedVersionInfoTest, DateMathParserTest, SolrXmlInZkTest, TestMissingGroups, CoreAdminRequestStatusTest, TestRawTransformer, TestManagedResourceStorage, SimpleMLTQParserTest, DistanceFunctionTest, TestSimNodeLostTrigger, EchoParamsTest, TimeRoutedAliasUpdateProcessorTest, SearchHandlerTest, MultiSolrCloudTestCaseTest, PathHierarchyTokenizerFactoryTest, TestPrepRecovery, TestApiFramework, TestConfigOverlay, DistributedQueryComponentCustomSortTest, CursorPagingTest, TestCrossCoreJoin, SpatialHeatmapFacetsTest, UUIDUpdateProcessorFallbackTest, TestRuleBasedAuthorizationPlugin, SolrMetricManagerTest, QueryEqualityTest, BasicAuthIntegrationTest, BlockJoinFacetRandomTest, TestLockTree, ClassificationUpdateProcessorTest, SolrIndexConfigTest, TestConfigSets, HdfsThreadLeakTest, TestChildDocTransformer, ComputePlanActionTest, TestSchemaSimilarityResource, CurrencyFieldTypeTest, ZkSolrClientTest, TestUniqueKeyFieldResource, TestAtomicUpdateErrorCases, ReturnFieldsTest, DistributedDebugComponentTest, ChaosMonkeySafeLeaderWithPullReplicasTest, TestPhraseSuggestions, BasicDistributedZk2Test, TestCloudPivotFacet, TestReplicationHandlerBackup, TestInPlaceUpdatesStandalone, CdcrVersionReplicationTest, BigEndianAscendingWordDeserializerTest, OverseerCollectionConfigSetProcessorTest, TestQuerySenderListener, MetricTriggerTest, SimplePostToolTest, CollectionReloadTest, SolrLogAuditLoggerPluginTest, BufferStoreTest, AnalysisAfterCoreReloadTest, TestAnalyzedSuggestions, HttpTriggerListenerTest, TestDistributedMap, HdfsCollectionsAPIDistributedZkTest, UninvertDocValuesMergePolicyTest, SuggestComponentTest, TestBinaryField, InfoHandlerTest, AssignBackwardCompatibilityTest, CollectionStateFormat2Test, CollectionsAPISolrJTest, DistribJoinFromCollectionTest, HttpPartitionOnCommitTest, LeaderElectionContextKeyTest, LeaderElectionIntegrationTest, LeaderFailoverAfterPartitionTest, MetricsHistoryIntegrationTest, MoveReplicaHDFSTest, NodeMutatorTest, OutOfBoxZkACLAndCredentialsProvidersTest, OverriddenZkACLAndCredentialsProvidersTest, OverseerStatusTest, OverseerTest, RecoveryAfterSoftCommitTest, RemoteQueryErrorTest, ReplaceNodeNoTargetTest, ReplaceNodeTest, ReplicationFactorTest, TestAuthenticationFramework, TestCloudInspectUtil, TestCloudPhrasesIdentificationComponent, TestCloudSearcherWarming, TestRebalanceLeaders, TestWithCollection, ScheduledMaintenanceTriggerTest, TestPolicyCloud, TriggerSetPropertiesIntegrationTest, TestSimLargeCluster, CdcrOpsAndBoundariesTest, CdcrReplicationHandlerTest, CdcrRequestHandlerTest, HdfsBasicDistributedZk2Test, HdfsBasicDistributedZkTest, HdfsChaosMonkeyNothingIsSafeTest, HdfsWriteToMultipleCollectionsTest, StressHdfsTest, TestClusterStateMutator, ZkStateReaderTest, ImplicitSnitchTest, RuleEngineTest, RulesTest, RequestHandlersTest, TestCustomStream, TestSolrDeletionPolicy1, TestSolrIndexConfig, TestSolrCoreSnapshots, BinaryUpdateRequestHandlerTest, CSVRequestHandlerTest, FieldAnalysisRequestHandlerTest, MoreLikeThisHandlerTest, PingRequestHandlerTest, TestCoreBackup, TestHdfsBackupRestoreCore, TestSQLHandler, TestSolrConfigHandlerConcurrent, TestSystemCollAutoCreate, ShowFileRequestHandlerTest, StatsReloadRaceTest, SystemInfoHandlerTest, TestCoreAdminApis, ZookeeperStatusHandlerTest, BadComponentTest, DistributedFacetPivotLargeTest, DistributedFacetPivotSmallAdvancedTest, PhrasesIdentificationComponentTest, TestDistributedStatsComponentCardinality, TestExpandComponent, TestHttpShardHandlerFactory, TestPivotHelperCode, TestTrackingShardHandlerFactory, TestFaceting, TestStreamBody, TestMacroExpander, TestMacros, SmileWriterTest, TestCSVResponseWriter, TestGeoJSONResponseWriter, TestJavabinTupleStreamParser, TestPHPSerializedResponseWriter, TestRawResponseWriter, TestSubQueryTransformerDistrib, BadCopyFieldTest, BadIndexSchemaTest, DocValuesTest, SynonymTokenizerTest, TestCollationField, TestCollationFieldDocValues, TestHalfAndHalfDocValues, TestManagedSchema, TestManagedSchemaAPI, TestManagedSchemaThreadSafety, TestOmitPositions, TestPointFields, TestFilteredDocIdSet, TestFiltering, TestReRankQParserPlugin, TestRealTimeGet, TestRecovery, TestReload, TestReloadDeadlock, TestSearchPerf, TestSearcherReuse, TestSimpleQParserPlugin, TestSmileRequest, TestSolr4Spatial, TestSolr4Spatial2, TestSolrCoreParser, TestSolrFieldCacheBean, TestSolrJ, TestStressLucene, TestStressRecovery, TestStressReorder, TestJsonFacetRefinement, TestJsonFacetsStatsParsing, TestJsonFacetsWithNestedObjects, SortByFunctionTest, TestMinMaxOnMultiValuedField, CloudMLTQParserTest, TestExactStatsCache, AuditLoggerIntegrationTest, DirectSolrConnectionTest, NoCacheHeaderTest, ResponseHeaderTest, SolrRequestParserTest, SuggesterWFSTTest, TestFreeTextSuggestions, TestHighFrequencyDictionaryFactory, TestFieldCacheWithThreads, TestLegacyFieldCache, AddBlockUpdateTest, AnalysisErrorHandlingTest, CdcrUpdateLogTest, DataDrivenBlockJoinTest, DirectUpdateHandlerTest, PeerSyncWithIndexFingerprintCachingTest, PeerSyncWithLeaderTest]
   [junit4] Completed [824/855 (3!)] on J0 in 143.09s, 1 test, 1 failure <<< FAILURES!

[...truncated 19992 lines...]
-check-forbidden-all:
[forbidden-apis] Reading bundled API signatures: jdk-unsafe-11
[forbidden-apis] Reading bundled API signatures: jdk-deprecated-11
[forbidden-apis] Reading bundled API signatures: jdk-non-portable
[forbidden-apis] Reading bundled API signatures: jdk-reflection
[forbidden-apis] Reading API signatures: /x1/jenkins/jenkins-slave/workspace/Lucene-Solr-Tests-master/lucene/tools/forbiddenApis/base.txt
[forbidden-apis] Reading API signatures: /x1/jenkins/jenkins-slave/workspace/Lucene-Solr-Tests-master/lucene/tools/forbiddenApis/lucene.txt
[forbidden-apis] Loading classes to check...
[forbidden-apis] Scanning classes for violations...
[forbidden-apis] Forbidden method invocation: java.lang.String#format(java.lang.String,java.lang.Object[]) [Uses default locale]
[forbidden-apis]   in org.apache.lucene.queries.mlt.TestMoreLikeThis (TestMoreLikeThis.java:497)
[forbidden-apis] Scanned 239 class file(s) for forbidden API invocations (in 0.16s), 1 error(s).

BUILD FAILED
/x1/jenkins/jenkins-slave/workspace/Lucene-Solr-Tests-master/build.xml:634: The following error occurred while executing this line:
/x1/jenkins/jenkins-slave/workspace/Lucene-Solr-Tests-master/build.xml:117: The following error occurred while executing this line:
/x1/jenkins/jenkins-slave/workspace/Lucene-Solr-Tests-master/lucene/build.xml:119: The following error occurred while executing this line:
/x1/jenkins/jenkins-slave/workspace/Lucene-Solr-Tests-master/lucene/common-build.xml:2180: The following error occurred while executing this line:
/x1/jenkins/jenkins-slave/workspace/Lucene-Solr-Tests-master/lucene/common-build.xml:2355: Check for forbidden API calls failed, see log.

Total time: 113 minutes 53 seconds
Build step 'Invoke Ant' marked build as failure
Archiving artifacts
Recording test results
Email was triggered for: Failure - Any
Sending email for trigger: Failure - Any

Mime
View raw message