lucene-dev mailing list archives

Site index · List index
Message view « Date » · « Thread »
Top « Date » · « Thread »
From Apache Jenkins Server <jenk...@builds.apache.org>
Subject [JENKINS] Lucene-Solr-Tests-8.x - Build # 179 - Still Failing
Date Wed, 01 May 2019 03:15:15 GMT
Build: https://builds.apache.org/job/Lucene-Solr-Tests-8.x/179/

1 tests failed.
FAILED:  org.apache.solr.cloud.LegacyCloudClusterPropTest.testCreateCollectionSwitchLegacyCloud

Error Message:
Error from server at http://127.0.0.1:46236/solr: Underlying core creation failed while creating collection: legacyFalse

Stack Trace:
org.apache.solr.client.solrj.impl.HttpSolrClient$RemoteSolrException: Error from server at http://127.0.0.1:46236/solr: Underlying core creation failed while creating collection: legacyFalse
	at __randomizedtesting.SeedInfo.seed([E2BBEC610F60BF22:33BC1EE4AB6F3410]:0)
	at org.apache.solr.client.solrj.impl.HttpSolrClient.executeMethod(HttpSolrClient.java:649)
	at org.apache.solr.client.solrj.impl.HttpSolrClient.request(HttpSolrClient.java:255)
	at org.apache.solr.client.solrj.impl.HttpSolrClient.request(HttpSolrClient.java:244)
	at org.apache.solr.client.solrj.impl.LBSolrClient.doRequest(LBSolrClient.java:368)
	at org.apache.solr.client.solrj.impl.LBSolrClient.request(LBSolrClient.java:296)
	at org.apache.solr.client.solrj.impl.BaseCloudSolrClient.sendRequest(BaseCloudSolrClient.java:1068)
	at org.apache.solr.client.solrj.impl.BaseCloudSolrClient.requestWithRetryOnStaleState(BaseCloudSolrClient.java:837)
	at org.apache.solr.client.solrj.impl.BaseCloudSolrClient.request(BaseCloudSolrClient.java:769)
	at org.apache.solr.client.solrj.SolrRequest.process(SolrRequest.java:207)
	at org.apache.solr.client.solrj.SolrRequest.process(SolrRequest.java:224)
	at org.apache.solr.cloud.LegacyCloudClusterPropTest.createAndTest(LegacyCloudClusterPropTest.java:95)
	at org.apache.solr.cloud.LegacyCloudClusterPropTest.testCreateCollectionSwitchLegacyCloud(LegacyCloudClusterPropTest.java:79)
	at sun.reflect.NativeMethodAccessorImpl.invoke0(Native Method)
	at sun.reflect.NativeMethodAccessorImpl.invoke(NativeMethodAccessorImpl.java:62)
	at sun.reflect.DelegatingMethodAccessorImpl.invoke(DelegatingMethodAccessorImpl.java:43)
	at java.lang.reflect.Method.invoke(Method.java:498)
	at com.carrotsearch.randomizedtesting.RandomizedRunner.invoke(RandomizedRunner.java:1750)
	at com.carrotsearch.randomizedtesting.RandomizedRunner$8.evaluate(RandomizedRunner.java:938)
	at com.carrotsearch.randomizedtesting.RandomizedRunner$9.evaluate(RandomizedRunner.java:974)
	at com.carrotsearch.randomizedtesting.RandomizedRunner$10.evaluate(RandomizedRunner.java:988)
	at com.carrotsearch.randomizedtesting.rules.SystemPropertiesRestoreRule$1.evaluate(SystemPropertiesRestoreRule.java:57)
	at org.apache.lucene.util.TestRuleSetupTeardownChained$1.evaluate(TestRuleSetupTeardownChained.java:49)
	at org.apache.lucene.util.AbstractBeforeAfterRule$1.evaluate(AbstractBeforeAfterRule.java:45)
	at org.apache.lucene.util.TestRuleThreadAndTestName$1.evaluate(TestRuleThreadAndTestName.java:48)
	at org.apache.lucene.util.TestRuleIgnoreAfterMaxFailures$1.evaluate(TestRuleIgnoreAfterMaxFailures.java:64)
	at org.apache.lucene.util.TestRuleMarkFailure$1.evaluate(TestRuleMarkFailure.java:47)
	at com.carrotsearch.randomizedtesting.rules.StatementAdapter.evaluate(StatementAdapter.java:36)
	at com.carrotsearch.randomizedtesting.ThreadLeakControl$StatementRunner.run(ThreadLeakControl.java:368)
	at com.carrotsearch.randomizedtesting.ThreadLeakControl.forkTimeoutingTask(ThreadLeakControl.java:817)
	at com.carrotsearch.randomizedtesting.ThreadLeakControl$3.evaluate(ThreadLeakControl.java:468)
	at com.carrotsearch.randomizedtesting.RandomizedRunner.runSingleTest(RandomizedRunner.java:947)
	at com.carrotsearch.randomizedtesting.RandomizedRunner$5.evaluate(RandomizedRunner.java:832)
	at com.carrotsearch.randomizedtesting.RandomizedRunner$6.evaluate(RandomizedRunner.java:883)
	at com.carrotsearch.randomizedtesting.RandomizedRunner$7.evaluate(RandomizedRunner.java:894)
	at com.carrotsearch.randomizedtesting.rules.StatementAdapter.evaluate(StatementAdapter.java:36)
	at com.carrotsearch.randomizedtesting.rules.SystemPropertiesRestoreRule$1.evaluate(SystemPropertiesRestoreRule.java:57)
	at org.apache.lucene.util.AbstractBeforeAfterRule$1.evaluate(AbstractBeforeAfterRule.java:45)
	at com.carrotsearch.randomizedtesting.rules.StatementAdapter.evaluate(StatementAdapter.java:36)
	at org.apache.lucene.util.TestRuleStoreClassName$1.evaluate(TestRuleStoreClassName.java:41)
	at com.carrotsearch.randomizedtesting.rules.NoShadowingOrOverridesOnMethodsRule$1.evaluate(NoShadowingOrOverridesOnMethodsRule.java:40)
	at com.carrotsearch.randomizedtesting.rules.NoShadowingOrOverridesOnMethodsRule$1.evaluate(NoShadowingOrOverridesOnMethodsRule.java:40)
	at com.carrotsearch.randomizedtesting.rules.StatementAdapter.evaluate(StatementAdapter.java:36)
	at com.carrotsearch.randomizedtesting.rules.StatementAdapter.evaluate(StatementAdapter.java:36)
	at com.carrotsearch.randomizedtesting.rules.StatementAdapter.evaluate(StatementAdapter.java:36)
	at org.apache.lucene.util.TestRuleAssertionsRequired$1.evaluate(TestRuleAssertionsRequired.java:53)
	at org.apache.lucene.util.TestRuleMarkFailure$1.evaluate(TestRuleMarkFailure.java:47)
	at org.apache.lucene.util.TestRuleIgnoreAfterMaxFailures$1.evaluate(TestRuleIgnoreAfterMaxFailures.java:64)
	at org.apache.lucene.util.TestRuleIgnoreTestSuites$1.evaluate(TestRuleIgnoreTestSuites.java:54)
	at com.carrotsearch.randomizedtesting.rules.StatementAdapter.evaluate(StatementAdapter.java:36)
	at com.carrotsearch.randomizedtesting.ThreadLeakControl$StatementRunner.run(ThreadLeakControl.java:368)
	at java.lang.Thread.run(Thread.java:748)




Build Log:
[...truncated 14615 lines...]
   [junit4] Suite: org.apache.solr.cloud.LegacyCloudClusterPropTest
   [junit4]   2> Creating dataDir: /home/jenkins/jenkins-slave/workspace/Lucene-Solr-Tests-8.x/solr/build/solr-core/test/J0/temp/solr.cloud.LegacyCloudClusterPropTest_E2BBEC610F60BF22-001/init-core-data-001
   [junit4]   2> 3265796 WARN  (SUITE-LegacyCloudClusterPropTest-seed#[E2BBEC610F60BF22]-worker) [    ] o.a.s.SolrTestCaseJ4 startTrackingSearchers: numOpens=18 numCloses=18
   [junit4]   2> 3265796 INFO  (SUITE-LegacyCloudClusterPropTest-seed#[E2BBEC610F60BF22]-worker) [    ] o.a.s.SolrTestCaseJ4 Using PointFields (NUMERIC_POINTS_SYSPROP=true) w/NUMERIC_DOCVALUES_SYSPROP=false
   [junit4]   2> 3265806 INFO  (SUITE-LegacyCloudClusterPropTest-seed#[E2BBEC610F60BF22]-worker) [    ] o.a.s.SolrTestCaseJ4 Randomized ssl (false) and clientAuth (true) via: @org.apache.solr.util.RandomizeSSL(reason=, ssl=NaN, value=NaN, clientAuth=NaN)
   [junit4]   2> 3265806 INFO  (SUITE-LegacyCloudClusterPropTest-seed#[E2BBEC610F60BF22]-worker) [    ] o.a.s.SolrTestCaseJ4 SecureRandom sanity checks: test.solr.allowed.securerandom=null & java.security.egd=file:/dev/./urandom
   [junit4]   2> 3265806 INFO  (SUITE-LegacyCloudClusterPropTest-seed#[E2BBEC610F60BF22]-worker) [    ] o.a.s.c.MiniSolrCloudCluster Starting cluster of 1 servers in /home/jenkins/jenkins-slave/workspace/Lucene-Solr-Tests-8.x/solr/build/solr-core/test/J0/temp/solr.cloud.LegacyCloudClusterPropTest_E2BBEC610F60BF22-001/tempDir-001
   [junit4]   2> 3265807 INFO  (SUITE-LegacyCloudClusterPropTest-seed#[E2BBEC610F60BF22]-worker) [    ] o.a.s.c.ZkTestServer STARTING ZK TEST SERVER
   [junit4]   2> 3265807 INFO  (ZkTestServer Run Thread) [    ] o.a.s.c.ZkTestServer client port:0.0.0.0/0.0.0.0:0
   [junit4]   2> 3265807 INFO  (ZkTestServer Run Thread) [    ] o.a.s.c.ZkTestServer Starting server
   [junit4]   2> 3265907 INFO  (SUITE-LegacyCloudClusterPropTest-seed#[E2BBEC610F60BF22]-worker) [    ] o.a.s.c.ZkTestServer start zk server on port:42786
   [junit4]   2> 3265907 INFO  (SUITE-LegacyCloudClusterPropTest-seed#[E2BBEC610F60BF22]-worker) [    ] o.a.s.c.ZkTestServer parse host and port list: 127.0.0.1:42786
   [junit4]   2> 3265907 INFO  (SUITE-LegacyCloudClusterPropTest-seed#[E2BBEC610F60BF22]-worker) [    ] o.a.s.c.ZkTestServer connecting to 127.0.0.1 42786
   [junit4]   2> 3265910 INFO  (zkConnectionManagerCallback-6539-thread-1) [    ] o.a.s.c.c.ConnectionManager zkClient has connected
   [junit4]   2> 3265912 INFO  (zkConnectionManagerCallback-6541-thread-1) [    ] o.a.s.c.c.ConnectionManager zkClient has connected
   [junit4]   2> 3265914 INFO  (zkConnectionManagerCallback-6543-thread-1) [    ] o.a.s.c.c.ConnectionManager zkClient has connected
   [junit4]   2> 3265928 WARN  (jetty-launcher-6544-thread-1) [    ] o.e.j.s.AbstractConnector Ignoring deprecated socket close linger time
   [junit4]   2> 3265928 INFO  (jetty-launcher-6544-thread-1) [    ] o.a.s.c.s.e.JettySolrRunner Start Jetty (original configured port=0)
   [junit4]   2> 3265928 INFO  (jetty-launcher-6544-thread-1) [    ] o.a.s.c.s.e.JettySolrRunner Trying to start Jetty on port 0 try number 1 ...
   [junit4]   2> 3265928 INFO  (jetty-launcher-6544-thread-1) [    ] o.e.j.s.Server jetty-9.4.14.v20181114; built: 2018-11-14T21:20:31.478Z; git: c4550056e785fb5665914545889f21dc136ad9e6; jvm 1.8.0_191-b12
   [junit4]   2> 3265943 INFO  (jetty-launcher-6544-thread-1) [    ] o.e.j.s.session DefaultSessionIdManager workerName=node0
   [junit4]   2> 3265943 INFO  (jetty-launcher-6544-thread-1) [    ] o.e.j.s.session No SessionScavenger set, using defaults
   [junit4]   2> 3265943 INFO  (jetty-launcher-6544-thread-1) [    ] o.e.j.s.session node0 Scavenging every 660000ms
   [junit4]   2> 3265944 INFO  (jetty-launcher-6544-thread-1) [    ] o.e.j.s.h.ContextHandler Started o.e.j.s.ServletContextHandler@12380de0{/solr,null,AVAILABLE}
   [junit4]   2> 3265945 INFO  (jetty-launcher-6544-thread-1) [    ] o.e.j.s.AbstractConnector Started ServerConnector@5fd028ff{HTTP/1.1,[http/1.1, h2c]}{127.0.0.1:46236}
   [junit4]   2> 3265945 INFO  (jetty-launcher-6544-thread-1) [    ] o.e.j.s.Server Started @3266145ms
   [junit4]   2> 3265945 INFO  (jetty-launcher-6544-thread-1) [    ] o.a.s.c.s.e.JettySolrRunner Jetty properties: {hostContext=/solr, hostPort=46236}
   [junit4]   2> 3265945 ERROR (jetty-launcher-6544-thread-1) [    ] o.a.s.u.StartupLoggingUtils Missing Java Option solr.log.dir. Logging may be missing or incomplete.
   [junit4]   2> 3265945 INFO  (jetty-launcher-6544-thread-1) [    ] o.a.s.s.SolrDispatchFilter Using logger factory org.apache.logging.slf4j.Log4jLoggerFactory
   [junit4]   2> 3265945 INFO  (jetty-launcher-6544-thread-1) [    ] o.a.s.s.SolrDispatchFilter  ___      _       Welcome to Apache Solr™ version 8.1.0
   [junit4]   2> 3265945 INFO  (jetty-launcher-6544-thread-1) [    ] o.a.s.s.SolrDispatchFilter / __| ___| |_ _   Starting in cloud mode on port null
   [junit4]   2> 3265945 INFO  (jetty-launcher-6544-thread-1) [    ] o.a.s.s.SolrDispatchFilter \__ \/ _ \ | '_|  Install dir: null
   [junit4]   2> 3265945 INFO  (jetty-launcher-6544-thread-1) [    ] o.a.s.s.SolrDispatchFilter |___/\___/_|_|    Start time: 2019-05-01T02:17:02.890Z
   [junit4]   2> 3265991 INFO  (zkConnectionManagerCallback-6546-thread-1) [    ] o.a.s.c.c.ConnectionManager zkClient has connected
   [junit4]   2> 3265992 INFO  (jetty-launcher-6544-thread-1) [    ] o.a.s.s.SolrDispatchFilter solr.xml found in ZooKeeper. Loading...
   [junit4]   2> 3266407 INFO  (jetty-launcher-6544-thread-1) [    ] o.a.s.h.c.HttpShardHandlerFactory Host whitelist initialized: WhitelistHostChecker [whitelistHosts=null, whitelistHostCheckingEnabled=true]
   [junit4]   2> 3266409 WARN  (jetty-launcher-6544-thread-1) [    ] o.e.j.u.s.S.config No Client EndPointIdentificationAlgorithm configured for SslContextFactory@1aa1b22c[provider=null,keyStore=null,trustStore=null]
   [junit4]   2> 3266412 WARN  (jetty-launcher-6544-thread-1) [    ] o.e.j.u.s.S.config No Client EndPointIdentificationAlgorithm configured for SslContextFactory@5ad0d349[provider=null,keyStore=null,trustStore=null]
   [junit4]   2> 3266413 INFO  (jetty-launcher-6544-thread-1) [    ] o.a.s.c.ZkContainer Zookeeper client=127.0.0.1:42786/solr
   [junit4]   2> 3266430 INFO  (zkConnectionManagerCallback-6553-thread-1) [    ] o.a.s.c.c.ConnectionManager zkClient has connected
   [junit4]   2> 3266432 INFO  (zkConnectionManagerCallback-6555-thread-1) [    ] o.a.s.c.c.ConnectionManager zkClient has connected
   [junit4]   2> 3266553 INFO  (jetty-launcher-6544-thread-1) [n:127.0.0.1:46236_solr    ] o.a.s.c.OverseerElectionContext I am going to be the leader 127.0.0.1:46236_solr
   [junit4]   2> 3266554 INFO  (jetty-launcher-6544-thread-1) [n:127.0.0.1:46236_solr    ] o.a.s.c.Overseer Overseer (id=74614443308875781-127.0.0.1:46236_solr-n_0000000000) starting
   [junit4]   2> 3266558 INFO  (zkConnectionManagerCallback-6562-thread-1) [    ] o.a.s.c.c.ConnectionManager zkClient has connected
   [junit4]   2> 3266568 INFO  (jetty-launcher-6544-thread-1) [n:127.0.0.1:46236_solr    ] o.a.s.c.s.i.ZkClientClusterStateProvider Cluster at 127.0.0.1:42786/solr ready
   [junit4]   2> 3266569 INFO  (OverseerStateUpdate-74614443308875781-127.0.0.1:46236_solr-n_0000000000) [n:127.0.0.1:46236_solr    ] o.a.s.c.Overseer Starting to work on the main queue : 127.0.0.1:46236_solr
   [junit4]   2> 3266569 INFO  (jetty-launcher-6544-thread-1) [n:127.0.0.1:46236_solr    ] o.a.s.c.ZkController Register node as live in ZooKeeper:/live_nodes/127.0.0.1:46236_solr
   [junit4]   2> 3266579 INFO  (zkCallback-6554-thread-1) [    ] o.a.s.c.c.ZkStateReader Updated live nodes from ZooKeeper... (0) -> (1)
   [junit4]   2> 3266579 INFO  (zkCallback-6561-thread-1) [    ] o.a.s.c.c.ZkStateReader Updated live nodes from ZooKeeper... (0) -> (1)
   [junit4]   2> 3266634 INFO  (jetty-launcher-6544-thread-1) [n:127.0.0.1:46236_solr    ] o.a.s.h.a.MetricsHistoryHandler No .system collection, keeping metrics history in memory.
   [junit4]   2> 3266693 INFO  (jetty-launcher-6544-thread-1) [n:127.0.0.1:46236_solr    ] o.a.s.m.r.SolrJmxReporter JMX monitoring for 'solr_46236.solr.node' (registry 'solr.node') enabled at server: com.sun.jmx.mbeanserver.JmxMBeanServer@241afb14
   [junit4]   2> 3266711 INFO  (jetty-launcher-6544-thread-1) [n:127.0.0.1:46236_solr    ] o.a.s.m.r.SolrJmxReporter JMX monitoring for 'solr_46236.solr.jvm' (registry 'solr.jvm') enabled at server: com.sun.jmx.mbeanserver.JmxMBeanServer@241afb14
   [junit4]   2> 3266712 INFO  (jetty-launcher-6544-thread-1) [n:127.0.0.1:46236_solr    ] o.a.s.m.r.SolrJmxReporter JMX monitoring for 'solr_46236.solr.jetty' (registry 'solr.jetty') enabled at server: com.sun.jmx.mbeanserver.JmxMBeanServer@241afb14
   [junit4]   2> 3266712 INFO  (jetty-launcher-6544-thread-1) [n:127.0.0.1:46236_solr    ] o.a.s.c.CorePropertiesLocator Found 0 core definitions underneath /home/jenkins/jenkins-slave/workspace/Lucene-Solr-Tests-8.x/solr/build/solr-core/test/J0/temp/solr.cloud.LegacyCloudClusterPropTest_E2BBEC610F60BF22-001/tempDir-001/node1/.
   [junit4]   2> 3266753 INFO  (zkConnectionManagerCallback-6568-thread-1) [    ] o.a.s.c.c.ConnectionManager zkClient has connected
   [junit4]   2> 3266762 INFO  (SUITE-LegacyCloudClusterPropTest-seed#[E2BBEC610F60BF22]-worker) [    ] o.a.s.c.c.ZkStateReader Updated live nodes from ZooKeeper... (0) -> (1)
   [junit4]   2> 3266763 INFO  (SUITE-LegacyCloudClusterPropTest-seed#[E2BBEC610F60BF22]-worker) [    ] o.a.s.c.s.i.ZkClientClusterStateProvider Cluster at 127.0.0.1:42786/solr ready
   [junit4]   2> 3266796 INFO  (TEST-LegacyCloudClusterPropTest.testCreateCollectionSwitchLegacyCloud-seed#[E2BBEC610F60BF22]) [    ] o.a.s.SolrTestCaseJ4 ###Starting testCreateCollectionSwitchLegacyCloud
   [junit4]   2> 3266807 INFO  (qtp1643175394-19168) [n:127.0.0.1:46236_solr    ] o.a.s.h.a.CollectionsHandler Invoked Collection Action :clusterprop with params val=true&name=legacyCloud&action=CLUSTERPROP&wt=javabin&version=2 and sendToOCPQueue=true
   [junit4]   2> 3266808 INFO  (qtp1643175394-19168) [n:127.0.0.1:46236_solr    ] o.a.s.s.HttpSolrCall [admin] webapp=null path=/admin/collections params={val=true&name=legacyCloud&action=CLUSTERPROP&wt=javabin&version=2} status=0 QTime=0
   [junit4]   2> 3266809 INFO  (qtp1643175394-19169) [n:127.0.0.1:46236_solr    ] o.a.s.h.a.CollectionsHandler Invoked Collection Action :create with params collection.configName=conf&maxShardsPerNode=1&name=legacyTrue&nrtReplicas=1&action=CREATE&numShards=1&wt=javabin&version=2 and sendToOCPQueue=true
   [junit4]   2> 3266824 INFO  (OverseerThreadFactory-6365-thread-1-processing-n:127.0.0.1:46236_solr) [n:127.0.0.1:46236_solr    ] o.a.s.c.a.c.CreateCollectionCmd Create collection legacyTrue
   [junit4]   2> 3266930 INFO  (qtp1643175394-19171) [n:127.0.0.1:46236_solr    x:legacyTrue_shard1_replica_n1] o.a.s.h.a.CoreAdminOperation core create command qt=/admin/cores&collection.configName=conf&newCollection=true&name=legacyTrue_shard1_replica_n1&action=CREATE&numShards=1&collection=legacyTrue&shard=shard1&wt=javabin&version=2&replicaType=NRT
   [junit4]   2> 3266930 INFO  (qtp1643175394-19171) [n:127.0.0.1:46236_solr    x:legacyTrue_shard1_replica_n1] o.a.s.c.TransientSolrCoreCacheDefault Allocating transient cache for 2147483647 transient cores
   [junit4]   2> 3268031 INFO  (qtp1643175394-19171) [n:127.0.0.1:46236_solr c:legacyTrue s:shard1  x:legacyTrue_shard1_replica_n1] o.a.s.c.SolrConfig Using Lucene MatchVersion: 8.1.0
   [junit4]   2> 3268060 INFO  (qtp1643175394-19171) [n:127.0.0.1:46236_solr c:legacyTrue s:shard1  x:legacyTrue_shard1_replica_n1] o.a.s.s.IndexSchema [legacyTrue_shard1_replica_n1] Schema name=minimal
   [junit4]   2> 3268079 INFO  (qtp1643175394-19171) [n:127.0.0.1:46236_solr c:legacyTrue s:shard1  x:legacyTrue_shard1_replica_n1] o.a.s.s.IndexSchema Loaded schema minimal/1.1 with uniqueid field id
   [junit4]   2> 3268079 INFO  (qtp1643175394-19171) [n:127.0.0.1:46236_solr c:legacyTrue s:shard1  x:legacyTrue_shard1_replica_n1] o.a.s.c.CoreContainer Creating SolrCore 'legacyTrue_shard1_replica_n1' using configuration from collection legacyTrue, trusted=true
   [junit4]   2> 3268080 INFO  (qtp1643175394-19171) [n:127.0.0.1:46236_solr c:legacyTrue s:shard1  x:legacyTrue_shard1_replica_n1] o.a.s.m.r.SolrJmxReporter JMX monitoring for 'solr_46236.solr.core.legacyTrue.shard1.replica_n1' (registry 'solr.core.legacyTrue.shard1.replica_n1') enabled at server: com.sun.jmx.mbeanserver.JmxMBeanServer@241afb14
   [junit4]   2> 3268080 INFO  (qtp1643175394-19171) [n:127.0.0.1:46236_solr c:legacyTrue s:shard1  x:legacyTrue_shard1_replica_n1] o.a.s.c.SolrCore [[legacyTrue_shard1_replica_n1] ] Opening new SolrCore at [/home/jenkins/jenkins-slave/workspace/Lucene-Solr-Tests-8.x/solr/build/solr-core/test/J0/temp/solr.cloud.LegacyCloudClusterPropTest_E2BBEC610F60BF22-001/tempDir-001/node1/legacyTrue_shard1_replica_n1], dataDir=[/home/jenkins/jenkins-slave/workspace/Lucene-Solr-Tests-8.x/solr/build/solr-core/test/J0/temp/solr.cloud.LegacyCloudClusterPropTest_E2BBEC610F60BF22-001/tempDir-001/node1/./legacyTrue_shard1_replica_n1/data/]
   [junit4]   2> 3268284 INFO  (qtp1643175394-19171) [n:127.0.0.1:46236_solr c:legacyTrue s:shard1  x:legacyTrue_shard1_replica_n1] o.a.s.u.UpdateHandler Using UpdateLog implementation: org.apache.solr.update.UpdateLog
   [junit4]   2> 3268284 INFO  (qtp1643175394-19171) [n:127.0.0.1:46236_solr c:legacyTrue s:shard1  x:legacyTrue_shard1_replica_n1] o.a.s.u.UpdateLog Initializing UpdateLog: dataDir=null defaultSyncLevel=FLUSH numRecordsToKeep=100 maxNumLogsToKeep=10 numVersionBuckets=65536
   [junit4]   2> 3268285 INFO  (qtp1643175394-19171) [n:127.0.0.1:46236_solr c:legacyTrue s:shard1  x:legacyTrue_shard1_replica_n1] o.a.s.u.CommitTracker Hard AutoCommit: disabled
   [junit4]   2> 3268285 INFO  (qtp1643175394-19171) [n:127.0.0.1:46236_solr c:legacyTrue s:shard1  x:legacyTrue_shard1_replica_n1] o.a.s.u.CommitTracker Soft AutoCommit: disabled
   [junit4]   2> 3268286 INFO  (qtp1643175394-19171) [n:127.0.0.1:46236_solr c:legacyTrue s:shard1  x:legacyTrue_shard1_replica_n1] o.a.s.s.SolrIndexSearcher Opening [Searcher@142e90a4[legacyTrue_shard1_replica_n1] main]
   [junit4]   2> 3268287 INFO  (qtp1643175394-19171) [n:127.0.0.1:46236_solr c:legacyTrue s:shard1  x:legacyTrue_shard1_replica_n1] o.a.s.r.ManagedResourceStorage Configured ZooKeeperStorageIO with znodeBase: /configs/conf
   [junit4]   2> 3268304 INFO  (qtp1643175394-19171) [n:127.0.0.1:46236_solr c:legacyTrue s:shard1  x:legacyTrue_shard1_replica_n1] o.a.s.r.ManagedResourceStorage Loaded null at path _rest_managed.json using ZooKeeperStorageIO:path=/configs/conf
   [junit4]   2> 3268305 INFO  (qtp1643175394-19171) [n:127.0.0.1:46236_solr c:legacyTrue s:shard1  x:legacyTrue_shard1_replica_n1] o.a.s.h.ReplicationHandler Commits will be reserved for 10000ms.
   [junit4]   2> 3268305 INFO  (qtp1643175394-19171) [n:127.0.0.1:46236_solr c:legacyTrue s:shard1  x:legacyTrue_shard1_replica_n1] o.a.s.u.UpdateLog Could not find max version in index or recent updates, using new clock 1632294168428544000
   [junit4]   2> 3268316 INFO  (searcherExecutor-6370-thread-1-processing-n:127.0.0.1:46236_solr x:legacyTrue_shard1_replica_n1 c:legacyTrue s:shard1) [n:127.0.0.1:46236_solr c:legacyTrue s:shard1  x:legacyTrue_shard1_replica_n1] o.a.s.c.SolrCore [legacyTrue_shard1_replica_n1] Registered new searcher Searcher@142e90a4[legacyTrue_shard1_replica_n1] main{ExitableDirectoryReader(UninvertingDirectoryReader())}
   [junit4]   2> 3268322 INFO  (qtp1643175394-19171) [n:127.0.0.1:46236_solr c:legacyTrue s:shard1  x:legacyTrue_shard1_replica_n1] o.a.s.c.ZkShardTerms Successful update of terms at /collections/legacyTrue/terms/shard1 to Terms{values={core_node2=0}, version=0}
   [junit4]   2> 3268322 INFO  (qtp1643175394-19171) [n:127.0.0.1:46236_solr c:legacyTrue s:shard1  x:legacyTrue_shard1_replica_n1] o.a.s.c.ShardLeaderElectionContextBase make sure parent is created /collections/legacyTrue/leaders/shard1
   [junit4]   2> 3268324 INFO  (qtp1643175394-19171) [n:127.0.0.1:46236_solr c:legacyTrue s:shard1  x:legacyTrue_shard1_replica_n1] o.a.s.c.ShardLeaderElectionContext Enough replicas found to continue.
   [junit4]   2> 3268324 INFO  (qtp1643175394-19171) [n:127.0.0.1:46236_solr c:legacyTrue s:shard1  x:legacyTrue_shard1_replica_n1] o.a.s.c.ShardLeaderElectionContext I may be the new leader - try and sync
   [junit4]   2> 3268324 INFO  (qtp1643175394-19171) [n:127.0.0.1:46236_solr c:legacyTrue s:shard1  x:legacyTrue_shard1_replica_n1] o.a.s.c.SyncStrategy Sync replicas to http://127.0.0.1:46236/solr/legacyTrue_shard1_replica_n1/
   [junit4]   2> 3268324 INFO  (qtp1643175394-19171) [n:127.0.0.1:46236_solr c:legacyTrue s:shard1  x:legacyTrue_shard1_replica_n1] o.a.s.c.SyncStrategy Sync Success - now sync replicas to me
   [junit4]   2> 3268337 INFO  (qtp1643175394-19171) [n:127.0.0.1:46236_solr c:legacyTrue s:shard1  x:legacyTrue_shard1_replica_n1] o.a.s.c.SyncStrategy http://127.0.0.1:46236/solr/legacyTrue_shard1_replica_n1/ has no replicas
   [junit4]   2> 3268337 INFO  (qtp1643175394-19171) [n:127.0.0.1:46236_solr c:legacyTrue s:shard1  x:legacyTrue_shard1_replica_n1] o.a.s.c.ShardLeaderElectionContextBase Creating leader registration node /collections/legacyTrue/leaders/shard1/leader after winning as /collections/legacyTrue/leader_elect/shard1/election/74614443308875781-core_node2-n_0000000000
   [junit4]   2> 3268338 INFO  (qtp1643175394-19171) [n:127.0.0.1:46236_solr c:legacyTrue s:shard1  x:legacyTrue_shard1_replica_n1] o.a.s.c.ShardLeaderElectionContext I am the new leader: http://127.0.0.1:46236/solr/legacyTrue_shard1_replica_n1/ shard1
   [junit4]   2> 3268440 INFO  (zkCallback-6554-thread-2) [    ] o.a.s.c.c.ZkStateReader A cluster state change: [WatchedEvent state:SyncConnected type:NodeDataChanged path:/collections/legacyTrue/state.json] for collection [legacyTrue] has occurred - updating... (live nodes size: [1])
   [junit4]   2> 3268440 INFO  (zkCallback-6554-thread-1) [    ] o.a.s.c.c.ZkStateReader A cluster state change: [WatchedEvent state:SyncConnected type:NodeDataChanged path:/collections/legacyTrue/state.json] for collection [legacyTrue] has occurred - updating... (live nodes size: [1])
   [junit4]   2> 3268441 INFO  (qtp1643175394-19171) [n:127.0.0.1:46236_solr c:legacyTrue s:shard1  x:legacyTrue_shard1_replica_n1] o.a.s.c.ZkController I am the leader, no recovery necessary
   [junit4]   2> 3268443 INFO  (qtp1643175394-19171) [n:127.0.0.1:46236_solr c:legacyTrue s:shard1  x:legacyTrue_shard1_replica_n1] o.a.s.s.HttpSolrCall [admin] webapp=null path=/admin/cores params={qt=/admin/cores&collection.configName=conf&newCollection=true&name=legacyTrue_shard1_replica_n1&action=CREATE&numShards=1&collection=legacyTrue&shard=shard1&wt=javabin&version=2&replicaType=NRT} status=0 QTime=1513
   [junit4]   2> 3268448 INFO  (qtp1643175394-19169) [n:127.0.0.1:46236_solr    ] o.a.s.h.a.CollectionsHandler Wait for new collection to be active for at most 45 seconds. Check all shard replicas
   [junit4]   2> 3268552 INFO  (zkCallback-6554-thread-1) [    ] o.a.s.c.c.ZkStateReader A cluster state change: [WatchedEvent state:SyncConnected type:NodeDataChanged path:/collections/legacyTrue/state.json] for collection [legacyTrue] has occurred - updating... (live nodes size: [1])
   [junit4]   2> 3268552 INFO  (zkCallback-6554-thread-2) [    ] o.a.s.c.c.ZkStateReader A cluster state change: [WatchedEvent state:SyncConnected type:NodeDataChanged path:/collections/legacyTrue/state.json] for collection [legacyTrue] has occurred - updating... (live nodes size: [1])
   [junit4]   2> 3268552 INFO  (qtp1643175394-19169) [n:127.0.0.1:46236_solr    ] o.a.s.s.HttpSolrCall [admin] webapp=null path=/admin/collections params={collection.configName=conf&maxShardsPerNode=1&name=legacyTrue&nrtReplicas=1&action=CREATE&numShards=1&wt=javabin&version=2} status=0 QTime=1743
   [junit4]   2> 3268553 INFO  (zkCallback-6554-thread-3) [    ] o.a.s.c.c.ZkStateReader A cluster state change: [WatchedEvent state:SyncConnected type:NodeDataChanged path:/collections/legacyTrue/state.json] for collection [legacyTrue] has occurred - updating... (live nodes size: [1])
   [junit4]   2> 3268586 INFO  (TEST-LegacyCloudClusterPropTest.testCreateCollectionSwitchLegacyCloud-seed#[E2BBEC610F60BF22]) [    ] o.a.s.c.CoreContainer Shutting down CoreContainer instance=1351416107
   [junit4]   2> 3268586 INFO  (TEST-LegacyCloudClusterPropTest.testCreateCollectionSwitchLegacyCloud-seed#[E2BBEC610F60BF22]) [    ] o.a.s.c.ZkController Remove node as live in ZooKeeper:/live_nodes/127.0.0.1:46236_solr
   [junit4]   2> 3268587 INFO  (TEST-LegacyCloudClusterPropTest.testCreateCollectionSwitchLegacyCloud-seed#[E2BBEC610F60BF22]) [    ] o.a.s.c.ZkController Publish this node as DOWN...
   [junit4]   2> 3268587 INFO  (TEST-LegacyCloudClusterPropTest.testCreateCollectionSwitchLegacyCloud-seed#[E2BBEC610F60BF22]) [    ] o.a.s.c.ZkController Publish node=127.0.0.1:46236_solr as DOWN
   [junit4]   2> 3268590 INFO  (coreCloseExecutor-6375-thread-1) [n:127.0.0.1:46236_solr c:legacyTrue s:shard1 r:core_node2 x:legacyTrue_shard1_replica_n1] o.a.s.c.SolrCore [legacyTrue_shard1_replica_n1]  CLOSING SolrCore org.apache.solr.core.SolrCore@20f45ba9
   [junit4]   2> 3268590 INFO  (coreCloseExecutor-6375-thread-1) [n:127.0.0.1:46236_solr c:legacyTrue s:shard1 r:core_node2 x:legacyTrue_shard1_replica_n1] o.a.s.m.SolrMetricManager Closing metric reporters for registry=solr.core.legacyTrue.shard1.replica_n1, tag=20f45ba9
   [junit4]   2> 3268590 INFO  (coreCloseExecutor-6375-thread-1) [n:127.0.0.1:46236_solr c:legacyTrue s:shard1 r:core_node2 x:legacyTrue_shard1_replica_n1] o.a.s.m.r.SolrJmxReporter Closing reporter [org.apache.solr.metrics.reporters.SolrJmxReporter@524926ec: rootName = solr_46236, domain = solr.core.legacyTrue.shard1.replica_n1, service url = null, agent id = null] for registry solr.core.legacyTrue.shard1.replica_n1 / com.codahale.metrics.MetricRegistry@2aec2554
   [junit4]   2> 3268640 INFO  (coreCloseExecutor-6375-thread-1) [n:127.0.0.1:46236_solr c:legacyTrue s:shard1 r:core_node2 x:legacyTrue_shard1_replica_n1] o.a.s.m.SolrMetricManager Closing metric reporters for registry=solr.collection.legacyTrue.shard1.leader, tag=20f45ba9
   [junit4]   2> 3268662 INFO  (TEST-LegacyCloudClusterPropTest.testCreateCollectionSwitchLegacyCloud-seed#[E2BBEC610F60BF22]) [    ] o.a.s.m.SolrMetricManager Closing metric reporters for registry=solr.node, tag=null
   [junit4]   2> 3268662 INFO  (TEST-LegacyCloudClusterPropTest.testCreateCollectionSwitchLegacyCloud-seed#[E2BBEC610F60BF22]) [    ] o.a.s.m.r.SolrJmxReporter Closing reporter [org.apache.solr.metrics.reporters.SolrJmxReporter@70929243: rootName = solr_46236, domain = solr.node, service url = null, agent id = null] for registry solr.node / com.codahale.metrics.MetricRegistry@6a7b6f70
   [junit4]   2> 3268667 INFO  (TEST-LegacyCloudClusterPropTest.testCreateCollectionSwitchLegacyCloud-seed#[E2BBEC610F60BF22]) [    ] o.a.s.m.SolrMetricManager Closing metric reporters for registry=solr.jvm, tag=null
   [junit4]   2> 3268667 INFO  (TEST-LegacyCloudClusterPropTest.testCreateCollectionSwitchLegacyCloud-seed#[E2BBEC610F60BF22]) [    ] o.a.s.m.r.SolrJmxReporter Closing reporter [org.apache.solr.metrics.reporters.SolrJmxReporter@26a1647c: rootName = solr_46236, domain = solr.jvm, service url = null, agent id = null] for registry solr.jvm / com.codahale.metrics.MetricRegistry@16b7c268
   [junit4]   2> 3268693 INFO  (zkCallback-6554-thread-3) [    ] o.a.s.c.c.ZkStateReader A cluster state change: [WatchedEvent state:SyncConnected type:NodeDataChanged path:/collections/legacyTrue/state.json] for collection [legacyTrue] has occurred - updating... (live nodes size: [1])
   [junit4]   2> 3268693 INFO  (zkCallback-6554-thread-2) [    ] o.a.s.c.c.ZkStateReader A cluster state change: [WatchedEvent state:SyncConnected type:NodeDataChanged path:/collections/legacyTrue/state.json] for collection [legacyTrue] has occurred - updating... (live nodes size: [1])
   [junit4]   2> 3268693 INFO  (zkCallback-6554-thread-1) [    ] o.a.s.c.c.ZkStateReader A cluster state change: [WatchedEvent state:SyncConnected type:NodeDataChanged path:/collections/legacyTrue/state.json] for collection [legacyTrue] has occurred - updating... (live nodes size: [1])
   [junit4]   2> 3268696 INFO  (TEST-LegacyCloudClusterPropTest.testCreateCollectionSwitchLegacyCloud-seed#[E2BBEC610F60BF22]) [    ] o.a.s.m.SolrMetricManager Closing metric reporters for registry=solr.jetty, tag=null
   [junit4]   2> 3268696 INFO  (TEST-LegacyCloudClusterPropTest.testCreateCollectionSwitchLegacyCloud-seed#[E2BBEC610F60BF22]) [    ] o.a.s.m.r.SolrJmxReporter Closing reporter [org.apache.solr.metrics.reporters.SolrJmxReporter@56a4364: rootName = solr_46236, domain = solr.jetty, service url = null, agent id = null] for registry solr.jetty / com.codahale.metrics.MetricRegistry@78b87fc2
   [junit4]   2> 3268696 INFO  (TEST-LegacyCloudClusterPropTest.testCreateCollectionSwitchLegacyCloud-seed#[E2BBEC610F60BF22]) [    ] o.a.s.m.SolrMetricManager Closing metric reporters for registry=solr.cluster, tag=null
   [junit4]   2> 3268729 INFO  (closeThreadPool-6573-thread-2) [    ] o.a.s.c.Overseer Overseer (id=74614443308875781-127.0.0.1:46236_solr-n_0000000000) closing
   [junit4]   2> 3268730 INFO  (OverseerStateUpdate-74614443308875781-127.0.0.1:46236_solr-n_0000000000) [n:127.0.0.1:46236_solr    ] o.a.s.c.Overseer Overseer Loop exiting : 127.0.0.1:46236_solr
   [junit4]   2> 3268746 INFO  (OverseerAutoScalingTriggerThread-74614443308875781-127.0.0.1:46236_solr-n_0000000000) [    ] o.a.s.c.a.OverseerTriggerThread OverseerTriggerThread woken up but we are closed, exiting.
   [junit4]   2> 3268763 INFO  (zkCallback-6567-thread-1) [    ] o.a.s.c.c.ZkStateReader Updated live nodes from ZooKeeper... (1) -> (0)
   [junit4]   2> 3268764 INFO  (zkCallback-6561-thread-1) [    ] o.a.s.c.c.ZkStateReader Updated live nodes from ZooKeeper... (1) -> (0)
   [junit4]   2> 3268778 INFO  (closeThreadPool-6573-thread-1) [    ] o.a.s.c.Overseer Overseer (id=74614443308875781-127.0.0.1:46236_solr-n_0000000000) closing
   [junit4]   2> 3268779 INFO  (TEST-LegacyCloudClusterPropTest.testCreateCollectionSwitchLegacyCloud-seed#[E2BBEC610F60BF22]) [    ] o.a.s.c.Overseer Overseer (id=74614443308875781-127.0.0.1:46236_solr-n_0000000000) closing
   [junit4]   2> 3268799 INFO  (TEST-LegacyCloudClusterPropTest.testCreateCollectionSwitchLegacyCloud-seed#[E2BBEC610F60BF22]) [    ] o.e.j.s.AbstractConnector Stopped ServerConnector@5fd028ff{HTTP/1.1,[http/1.1, h2c]}{127.0.0.1:0}
   [junit4]   2> 3268800 INFO  (TEST-LegacyCloudClusterPropTest.testCreateCollectionSwitchLegacyCloud-seed#[E2BBEC610F60BF22]) [    ] o.e.j.s.h.ContextHandler Stopped o.e.j.s.ServletContextHandler@12380de0{/solr,null,UNAVAILABLE}
   [junit4]   2> 3268800 INFO  (TEST-LegacyCloudClusterPropTest.testCreateCollectionSwitchLegacyCloud-seed#[E2BBEC610F60BF22]) [    ] o.e.j.s.session node0 Stopped scavenging
   [junit4]   2> 3268807 INFO  (TEST-LegacyCloudClusterPropTest.testCreateCollectionSwitchLegacyCloud-seed#[E2BBEC610F60BF22]) [    ] o.a.s.c.s.e.JettySolrRunner Start Jetty (original configured port=0)
   [junit4]   2> 3268807 WARN  (TEST-LegacyCloudClusterPropTest.testCreateCollectionSwitchLegacyCloud-seed#[E2BBEC610F60BF22]) [    ] o.e.j.s.AbstractConnector Ignoring deprecated socket close linger time
   [junit4]   2> 3268807 INFO  (TEST-LegacyCloudClusterPropTest.testCreateCollectionSwitchLegacyCloud-seed#[E2BBEC610F60BF22]) [    ] o.a.s.c.s.e.JettySolrRunner Trying to start Jetty on port 46236 try number 1 ...
   [junit4]   2> 3268807 INFO  (TEST-LegacyCloudClusterPropTest.testCreateCollectionSwitchLegacyCloud-seed#[E2BBEC610F60BF22]) [    ] o.e.j.s.Server jetty-9.4.14.v20181114; built: 2018-11-14T21:20:31.478Z; git: c4550056e785fb5665914545889f21dc136ad9e6; jvm 1.8.0_191-b12
   [junit4]   2> 3268808 INFO  (TEST-LegacyCloudClusterPropTest.testCreateCollectionSwitchLegacyCloud-seed#[E2BBEC610F60BF22]) [    ] o.e.j.s.session DefaultSessionIdManager workerName=node0
   [junit4]   2> 3268808 INFO  (TEST-LegacyCloudClusterPropTest.testCreateCollectionSwitchLegacyCloud-seed#[E2BBEC610F60BF22]) [    ] o.e.j.s.session No SessionScavenger set, using defaults
   [junit4]   2> 3268808 INFO  (TEST-LegacyCloudClusterPropTest.testCreateCollectionSwitchLegacyCloud-seed#[E2BBEC610F60BF22]) [    ] o.e.j.s.session node0 Scavenging every 600000ms
   [junit4]   2> 3268809 INFO  (TEST-LegacyCloudClusterPropTest.testCreateCollectionSwitchLegacyCloud-seed#[E2BBEC610F60BF22]) [    ] o.e.j.s.h.ContextHandler Started o.e.j.s.ServletContextHandler@158bd713{/solr,null,AVAILABLE}
   [junit4]   2> 3268809 INFO  (TEST-LegacyCloudClusterPropTest.testCreateCollectionSwitchLegacyCloud-seed#[E2BBEC610F60BF22]) [    ] o.e.j.s.AbstractConnector Started ServerConnector@6c0faf90{HTTP/1.1,[http/1.1, h2c]}{127.0.0.1:46236}
   [junit4]   2> 3268809 INFO  (TEST-LegacyCloudClusterPropTest.testCreateCollectionSwitchLegacyCloud-seed#[E2BBEC610F60BF22]) [    ] o.e.j.s.Server Started @3269010ms
   [junit4]   2> 3268809 INFO  (TEST-LegacyCloudClusterPropTest.testCreateCollectionSwitchLegacyCloud-seed#[E2BBEC610F60BF22]) [    ] o.a.s.c.s.e.JettySolrRunner Jetty properties: {hostContext=/solr, hostPort=46236}
   [junit4]   2> 3268809 ERROR (TEST-LegacyCloudClusterPropTest.testCreateCollectionSwitchLegacyCloud-seed#[E2BBEC610F60BF22]) [    ] o.a.s.u.StartupLoggingUtils Missing Java Option solr.log.dir. Logging may be missing or incomplete.
   [junit4]   2> 3268809 INFO  (TEST-LegacyCloudClusterPropTest.testCreateCollectionSwitchLegacyCloud-seed#[E2BBEC610F60BF22]) [    ] o.a.s.s.SolrDispatchFilter Using logger factory org.apache.logging.slf4j.Log4jLoggerFactory
   [junit4]   2> 3268809 INFO  (TEST-LegacyCloudClusterPropTest.testCreateCollectionSwitchLegacyCloud-seed#[E2BBEC610F60BF22]) [    ] o.a.s.s.SolrDispatchFilter  ___      _       Welcome to Apache Solr™ version 8.1.0
   [junit4]   2> 3268809 INFO  (TEST-LegacyCloudClusterPropTest.testCreateCollectionSwitchLegacyCloud-seed#[E2BBEC610F60BF22]) [    ] o.a.s.s.SolrDispatchFilter / __| ___| |_ _   Starting in cloud mode on port null
   [junit4]   2> 3268809 INFO  (TEST-LegacyCloudClusterPropTest.testCreateCollectionSwitchLegacyCloud-seed#[E2BBEC610F60BF22]) [    ] o.a.s.s.SolrDispatchFilter \__ \/ _ \ | '_|  Install dir: null
   [junit4]   2> 3268809 INFO  (TEST-LegacyCloudClusterPropTest.testCreateCollectionSwitchLegacyCloud-seed#[E2BBEC610F60BF22]) [    ] o.a.s.s.SolrDispatchFilter |___/\___/_|_|    Start time: 2019-05-01T02:17:05.754Z
   [junit4]   2> 3268837 INFO  (zkConnectionManagerCallback-6575-thread-1) [    ] o.a.s.c.c.ConnectionManager zkClient has connected
   [junit4]   2> 3268838 INFO  (TEST-LegacyCloudClusterPropTest.testCreateCollectionSwitchLegacyCloud-seed#[E2BBEC610F60BF22]) [    ] o.a.s.s.SolrDispatchFilter solr.xml found in ZooKeeper. Loading...
   [junit4]   2> 3269215 INFO  (TEST-LegacyCloudClusterPropTest.testCreateCollectionSwitchLegacyCloud-seed#[E2BBEC610F60BF22]) [    ] o.a.s.h.c.HttpShardHandlerFactory Host whitelist initialized: WhitelistHostChecker [whitelistHosts=null, whitelistHostCheckingEnabled=true]
   [junit4]   2> 3269229 WARN  (TEST-LegacyCloudClusterPropTest.testCreateCollectionSwitchLegacyCloud-seed#[E2BBEC610F60BF22]) [    ] o.e.j.u.s.S.config No Client EndPointIdentificationAlgorithm configured for SslContextFactory@495cecda[provider=null,keyStore=null,trustStore=null]
   [junit4]   2> 3269248 WARN  (TEST-LegacyCloudClusterPropTest.testCreateCollectionSwitchLegacyCloud-seed#[E2BBEC610F60BF22]) [    ] o.e.j.u.s.S.config No Client EndPointIdentificationAlgorithm configured for SslContextFactory@70c21d3[provider=null,keyStore=null,trustStore=null]
   [junit4]   2> 3269249 INFO  (TEST-LegacyCloudClusterPropTest.testCreateCollectionSwitchLegacyCloud-seed#[E2BBEC610F60BF22]) [    ] o.a.s.c.ZkContainer Zookeeper client=127.0.0.1:42786/solr
   [junit4]   2> 3269269 INFO  (zkConnectionManagerCallback-6582-thread-1) [    ] o.a.s.c.c.ConnectionManager zkClient has connected
   [junit4]   2> 3269322 INFO  (zkConnectionManagerCallback-6584-thread-1) [    ] o.a.s.c.c.ConnectionManager zkClient has connected
   [junit4]   2> 3269344 INFO  (TEST-LegacyCloudClusterPropTest.testCreateCollectionSwitchLegacyCloud-seed#[E2BBEC610F60BF22]) [n:127.0.0.1:46236_solr    ] o.a.s.c.OverseerElectionContext I am going to be the leader 127.0.0.1:46236_solr
   [junit4]   2> 3269345 INFO  (TEST-LegacyCloudClusterPropTest.testCreateCollectionSwitchLegacyCloud-seed#[E2BBEC610F60BF22]) [n:127.0.0.1:46236_solr    ] o.a.s.c.Overseer Overseer (id=74614443308875786-127.0.0.1:46236_solr-n_0000000001) starting
   [junit4]   2> 3269390 INFO  (zkConnectionManagerCallback-6591-thread-1) [    ] o.a.s.c.c.ConnectionManager zkClient has connected
   [junit4]   2> 3269392 INFO  (TEST-LegacyCloudClusterPropTest.testCreateCollectionSwitchLegacyCloud-seed#[E2BBEC610F60BF22]) [n:127.0.0.1:46236_solr    ] o.a.s.c.s.i.ZkClientClusterStateProvider Cluster at 127.0.0.1:42786/solr ready
   [junit4]   2> 3269406 INFO  (OverseerStateUpdate-74614443308875786-127.0.0.1:46236_solr-n_0000000001) [n:127.0.0.1:46236_solr    ] o.a.s.c.Overseer Starting to work on the main queue : 127.0.0.1:46236_solr
   [junit4]   2> 3269406 INFO  (TEST-LegacyCloudClusterPropTest.testCreateCollectionSwitchLegacyCloud-seed#[E2BBEC610F60BF22]) [n:127.0.0.1:46236_solr    ] o.a.s.c.ZkController Register node as live in ZooKeeper:/live_nodes/127.0.0.1:46236_solr
   [junit4]   2> 3269409 INFO  (zkCallback-6567-thread-1) [    ] o.a.s.c.c.ZkStateReader Updated live nodes from ZooKeeper... (0) -> (1)
   [junit4]   2> 3269409 INFO  (OverseerStateUpdate-74614443308875786-127.0.0.1:46236_solr-n_0000000001) [n:127.0.0.1:46236_solr    ] o.a.s.c.c.ZkStateReader Updated live nodes from ZooKeeper... (0) -> (1)
   [junit4]   2> 3269427 INFO  (zkCallback-6590-thread-1) [    ] o.a.s.c.c.ZkStateReader Updated live nodes from ZooKeeper... (0) -> (1)
   [junit4]   2> 3269514 INFO  (TEST-LegacyCloudClusterPropTest.testCreateCollectionSwitchLegacyCloud-seed#[E2BBEC610F60BF22]) [n:127.0.0.1:46236_solr    ] o.a.s.h.a.MetricsHistoryHandler No .system collection, keeping metrics history in memory.
   [junit4]   2> 3269647 INFO  (TEST-LegacyCloudClusterPropTest.testCreateCollectionSwitchLegacyCloud-seed#[E2BBEC610F60BF22]) [n:127.0.0.1:46236_solr    ] o.a.s.m.r.SolrJmxReporter JMX monitoring for 'solr_46236.solr.node' (registry 'solr.node') enabled at server: com.sun.jmx.mbeanserver.JmxMBeanServer@241afb14
   [junit4]   2> 3269656 INFO  (TEST-LegacyCloudClusterPropTest.testCreateCollectionSwitchLegacyCloud-seed#[E2BBEC610F60BF22]) [n:127.0.0.1:46236_solr    ] o.a.s.m.r.SolrJmxReporter JMX monitoring for 'solr_46236.solr.jvm' (registry 'solr.jvm') enabled at server: com.sun.jmx.mbeanserver.JmxMBeanServer@241afb14
   [junit4]   2> 3269656 INFO  (TEST-LegacyCloudClusterPropTest.testCreateCollectionSwitchLegacyCloud-seed#[E2BBEC610F60BF22]) [n:127.0.0.1:46236_solr    ] o.a.s.m.r.SolrJmxReporter JMX monitoring for 'solr_46236.solr.jetty' (registry 'solr.jetty') enabled at server: com.sun.jmx.mbeanserver.JmxMBeanServer@241afb14
   [junit4]   2> 3269683 INFO  (TEST-LegacyCloudClusterPropTest.testCreateCollectionSwitchLegacyCloud-seed#[E2BBEC610F60BF22]) [n:127.0.0.1:46236_solr    ] o.a.s.c.CorePropertiesLocator Found 1 core definitions underneath /home/jenkins/jenkins-slave/workspace/Lucene-Solr-Tests-8.x/solr/build/solr-core/test/J0/temp/solr.cloud.LegacyCloudClusterPropTest_E2BBEC610F60BF22-001/tempDir-001/node1/.
   [junit4]   2> 3269683 INFO  (TEST-LegacyCloudClusterPropTest.testCreateCollectionSwitchLegacyCloud-seed#[E2BBEC610F60BF22]) [n:127.0.0.1:46236_solr    ] o.a.s.c.CorePropertiesLocator Cores are: [legacyTrue_shard1_replica_n1]
   [junit4]   2> 3269684 INFO  (coreLoadExecutor-6389-thread-1-processing-n:127.0.0.1:46236_solr) [n:127.0.0.1:46236_solr    ] o.a.s.c.TransientSolrCoreCacheDefault Allocating transient cache for 2147483647 transient cores
   [junit4]   2> 3269715 INFO  (coreLoadExecutor-6389-thread-1-processing-n:127.0.0.1:46236_solr) [n:127.0.0.1:46236_solr    ] o.a.s.c.SolrConfig Using Lucene MatchVersion: 8.1.0
   [junit4]   2> 3269772 INFO  (coreLoadExecutor-6389-thread-1-processing-n:127.0.0.1:46236_solr) [n:127.0.0.1:46236_solr    ] o.a.s.s.IndexSchema [legacyTrue_shard1_replica_n1] Schema name=minimal
   [junit4]   2> 3269783 INFO  (coreLoadExecutor-6389-thread-1-processing-n:127.0.0.1:46236_solr) [n:127.0.0.1:46236_solr    ] o.a.s.s.IndexSchema Loaded schema minimal/1.1 with uniqueid field id
   [junit4]   2> 3269843 INFO  (coreLoadExecutor-6389-thread-1-processing-n:127.0.0.1:46236_solr) [n:127.0.0.1:46236_solr c:legacyTrue s:shard1  x:legacyTrue_shard1_replica_n1] o.a.s.c.SolrConfig Using Lucene MatchVersion: 8.1.0
   [junit4]   2> 3269880 INFO  (coreLoadExecutor-6389-thread-1-processing-n:127.0.0.1:46236_solr) [n:127.0.0.1:46236_solr c:legacyTrue s:shard1  x:legacyTrue_shard1_replica_n1] o.a.s.s.IndexSchema [legacyTrue_shard1_replica_n1] Schema name=minimal
   [junit4]   2> 3269882 INFO  (coreLoadExecutor-6389-thread-1-processing-n:127.0.0.1:46236_solr) [n:127.0.0.1:46236_solr c:legacyTrue s:shard1  x:legacyTrue_shard1_replica_n1] o.a.s.s.IndexSchema Loaded schema minimal/1.1 with uniqueid field id
   [junit4]   2> 3269882 INFO  (coreLoadExecutor-6389-thread-1-processing-n:127.0.0.1:46236_solr) [n:127.0.0.1:46236_solr c:legacyTrue s:shard1  x:legacyTrue_shard1_replica_n1] o.a.s.c.CoreContainer Creating SolrCore 'legacyTrue_shard1_replica_n1' using configuration from collection legacyTrue, trusted=true
   [junit4]   2> 3269883 INFO  (coreLoadExecutor-6389-thread-1-processing-n:127.0.0.1:46236_solr) [n:127.0.0.1:46236_solr c:legacyTrue s:shard1  x:legacyTrue_shard1_replica_n1] o.a.s.m.r.SolrJmxReporter JMX monitoring for 'solr_46236.solr.core.legacyTrue.shard1.replica_n1' (registry 'solr.core.legacyTrue.shard1.replica_n1') enabled at server: com.sun.jmx.mbeanserver.JmxMBeanServer@241afb14
   [junit4]   2> 3269883 INFO  (coreLoadExecutor-6389-thread-1-processing-n:127.0.0.1:46236_solr) [n:127.0.0.1:46236_solr c:legacyTrue s:shard1  x:legacyTrue_shard1_replica_n1] o.a.s.c.SolrCore [[legacyTrue_shard1_replica_n1] ] Opening new SolrCore at [/home/jenkins/jenkins-slave/workspace/Lucene-Solr-Tests-8.x/solr/build/solr-core/test/J0/temp/solr.cloud.LegacyCloudClusterPropTest_E2BBEC610F60BF22-001/tempDir-001/node1/legacyTrue_shard1_replica_n1], dataDir=[/home/jenkins/jenkins-slave/workspace/Lucene-Solr-Tests-8.x/solr/build/solr-core/test/J0/temp/solr.cloud.LegacyCloudClusterPropTest_E2BBEC610F60BF22-001/tempDir-001/node1/./legacyTrue_shard1_replica_n1/data/]
   [junit4]   2> 3270061 INFO  (coreLoadExecutor-6389-thread-1-processing-n:127.0.0.1:46236_solr) [n:127.0.0.1:46236_solr c:legacyTrue s:shard1  x:legacyTrue_shard1_replica_n1] o.a.s.u.UpdateHandler Using UpdateLog implementation: org.apache.solr.update.UpdateLog
   [junit4]   2> 3270061 INFO  (coreLoadExecutor-6389-thread-1-processing-n:127.0.0.1:46236_solr) [n:127.0.0.1:46236_solr c:legacyTrue s:shard1  x:legacyTrue_shard1_replica_n1] o.a.s.u.UpdateLog Initializing UpdateLog: dataDir=null defaultSyncLevel=FLUSH numRecordsToKeep=100 maxNumLogsToKeep=10 numVersionBuckets=65536
   [junit4]   2> 3270061 INFO  (coreLoadExecutor-6389-thread-1-processing-n:127.0.0.1:46236_solr) [n:127.0.0.1:46236_solr c:legacyTrue s:shard1  x:legacyTrue_shard1_replica_n1] o.a.s.u.CommitTracker Hard AutoCommit: disabled
   [junit4]   2> 3270061 INFO  (coreLoadExecutor-6389-thread-1-processing-n:127.0.0.1:46236_solr) [n:127.0.0.1:46236_solr c:legacyTrue s:shard1  x:legacyTrue_shard1_replica_n1] o.a.s.u.CommitTracker Soft AutoCommit: disabled
   [junit4]   2> 3270079 INFO  (coreLoadExecutor-6389-thread-1-processing-n:127.0.0.1:46236_solr) [n:127.0.0.1:46236_solr c:legacyTrue s:shard1  x:legacyTrue_shard1_replica_n1] o.a.s.s.SolrIndexSearcher Opening [Searcher@7de56ce[legacyTrue_shard1_replica_n1] main]
   [junit4]   2> 3270080 INFO  (coreLoadExecutor-6389-thread-1-processing-n:127.0.0.1:46236_solr) [n:127.0.0.1:46236_solr c:legacyTrue s:shard1  x:legacyTrue_shard1_replica_n1] o.a.s.r.ManagedResourceStorage Configured ZooKeeperStorageIO with znodeBase: /configs/conf
   [junit4]   2> 3270080 INFO  (coreLoadExecutor-6389-thread-1-processing-n:127.0.0.1:46236_solr) [n:127.0.0.1:46236_solr c:legacyTrue s:shard1  x:legacyTrue_shard1_replica_n1] o.a.s.r.ManagedResourceStorage Loaded null at path _rest_managed.json using ZooKeeperStorageIO:path=/configs/conf
   [junit4]   2> 3270081 INFO  (coreLoadExecutor-6389-thread-1-processing-n:127.0.0.1:46236_solr) [n:127.0.0.1:46236_solr c:legacyTrue s:shard1  x:legacyTrue_shard1_replica_n1] o.a.s.h.ReplicationHandler Commits will be reserved for 10000ms.
   [junit4]   2> 3270081 INFO  (coreLoadExecutor-6389-thread-1-processing-n:127.0.0.1:46236_solr) [n:127.0.0.1:46236_solr c:legacyTrue s:shard1  x:legacyTrue_shard1_replica_n1] o.a.s.u.UpdateLog Could not find max version in index or recent updates, using new clock 1632294170290814976
   [junit4]   2> 3270102 INFO  (searcherExecutor-6390-thread-1-processing-n:127.0.0.1:46236_solr x:legacyTrue_shard1_replica_n1 c:legacyTrue s:shard1) [n:127.0.0.1:46236_solr c:legacyTrue s:shard1  x:legacyTrue_shard1_replica_n1] o.a.s.c.SolrCore [legacyTrue_shard1_replica_n1] Registered new searcher Searcher@7de56ce[legacyTrue_shard1_replica_n1] main{ExitableDirectoryReader(UninvertingDirectoryReader())}
   [junit4]   2> 3270121 INFO  (coreZkRegister-6377-thread-1-processing-n:127.0.0.1:46236_solr x:legacyTrue_shard1_replica_n1 c:legacyTrue s:shard1) [n:127.0.0.1:46236_solr c:legacyTrue s:shard1 r:core_node2 x:legacyTrue_shard1_replica_n1] o.a.s.c.ShardLeaderElectionContextBase make sure parent is created /collections/legacyTrue/leaders/shard1
   [junit4]   2> 3270155 INFO  (coreZkRegister-6377-thread-1-processing-n:127.0.0.1:46236_solr x:legacyTrue_shard1_replica_n1 c:legacyTrue s:shard1) [n:127.0.0.1:46236_solr c:legacyTrue s:shard1 r:core_node2 x:legacyTrue_shard1_replica_n1] o.a.s.c.ShardLeaderElectionContext Enough replicas found to continue.
   [junit4]   2> 3270155 INFO  (coreZkRegister-6377-thread-1-processing-n:127.0.0.1:46236_solr x:legacyTrue_shard1_replica_n1 c:legacyTrue s:shard1) [n:127.0.0.1:46236_solr c:legacyTrue s:shard1 r:core_node2 x:legacyTrue_shard1_replica_n1] o.a.s.c.ShardLeaderElectionContext I may be the new leader - try and sync
   [junit4]   2> 3270155 INFO  (coreZkRegister-6377-thread-1-processing-n:127.0.0.1:46236_solr x:legacyTrue_shard1_replica_n1 c:legacyTrue s:shard1) [n:127.0.0.1:46236_solr c:legacyTrue s:shard1 r:core_node2 x:legacyTrue_shard1_replica_n1] o.a.s.c.SyncStrategy Sync replicas to http://127.0.0.1:46236/solr/legacyTrue_shard1_replica_n1/
   [junit4]   2> 3270156 INFO  (coreZkRegister-6377-thread-1-processing-n:127.0.0.1:46236_solr x:legacyTrue_shard1_replica_n1 c:legacyTrue s:shard1) [n:127.0.0.1:46236_solr c:legacyTrue s:shard1 r:core_node2 x:legacyTrue_shard1_replica_n1] o.a.s.c.SyncStrategy Sync Success - now sync replicas to me
   [junit4]   2> 3270156 INFO  (coreZkRegister-6377-thread-1-processing-n:127.0.0.1:46236_solr x:legacyTrue_shard1_replica_n1 c:legacyTrue s:shard1) [n:127.0.0.1:46236_solr c:legacyTrue s:shard1 r:core_node2 x:legacyTrue_shard1_replica_n1] o.a.s.c.SyncStrategy http://127.0.0.1:46236/solr/legacyTrue_shard1_replica_n1/ has no replicas
   [junit4]   2> 3270156 INFO  (coreZkRegister-6377-thread-1-processing-n:127.0.0.1:46236_solr x:legacyTrue_shard1_replica_n1 c:legacyTrue s:shard1) [n:127.0.0.1:46236_solr c:legacyTrue s:shard1 r:core_node2 x:legacyTrue_shard1_replica_n1] o.a.s.c.ShardLeaderElectionContextBase Creating leader registration node /collections/legacyTrue/leaders/shard1/leader after winning as /collections/legacyTrue/leader_elect/shard1/election/74614443308875786-core_node2-n_0000000001
   [junit4]   2> 3270157 INFO  (coreZkRegister-6377-thread-1-processing-n:127.0.0.1:46236_solr x:legacyTrue_shard1_replica_n1 c:legacyTrue s:shard1) [n:127.0.0.1:46236_solr c:legacyTrue s:shard1 r:core_node2 x:legacyTrue_shard1_replica_n1] o.a.s.c.ShardLeaderElectionContext I am the new leader: http://127.0.0.1:46236/solr/legacyTrue_shard1_replica_n1/ shard1
   [junit4]   2> 3270158 INFO  (coreZkRegister-6377-thread-1-processing-n:127.0.0.1:46236_solr x:legacyTrue_shard1_replica_n1 c:legacyTrue s:shard1) [n:127.0.0.1:46236_solr c:legacyTrue s:shard1 r:core_node2 x:legacyTrue_shard1_replica_n1] o.a.s.c.ZkController I am the leader, no recovery necessary
   [junit4]   2> 3270259 INFO  (zkCallback-6583-thread-1) [    ] o.a.s.c.c.ZkStateReader A cluster state change: [WatchedEvent state:SyncConnected type:NodeDataChanged path:/collections/legacyTrue/state.json] for collection [legacyTrue] has occurred - updating... (live nodes size: [1])
   [junit4]   2> 3270260 INFO  (zkCallback-6583-thread-2) [    ] o.a.s.c.c.ZkStateReader A cluster state change: [WatchedEvent state:SyncConnected type:NodeDataChanged path:/collections/legacyTrue/state.json] for collection [legacyTrue] has occurred - updating... (live nodes size: [1])
   [junit4]   2> 3270260 INFO  (zkCallback-6583-thread-3) [    ] o.a.s.c.c.ZkStateReader A cluster state change: [WatchedEvent state:SyncConnected type:NodeDataChanged path:/collections/legacyTrue/state.json] for collection [legacyTrue] has occurred - updating... (live nodes size: [1])
   [junit4]   2> 3271129 INFO  (TEST-LegacyCloudClusterPropTest.testCreateCollectionSwitchLegacyCloud-seed#[E2BBEC610F60BF22]) [    ] o.a.h.i.e.RetryExec I/O exception (org.apache.http.NoHttpResponseException) caught when processing request to {}->http://127.0.0.1:46236: The target server failed to respond
   [junit4]   2> 3271129 INFO  (TEST-LegacyCloudClusterPropTest.testCreateCollectionSwitchLegacyCloud-seed#[E2BBEC610F60BF22]) [    ] o.a.h.i.e.RetryExec Retrying request to {}->http://127.0.0.1:46236
   [junit4]   2> 3271130 INFO  (qtp655032778-19233) [n:127.0.0.1:46236_solr    ] o.a.s.h.a.CollectionsHandler Invoked Collection Action :clusterprop with params val=false&name=legacyCloud&action=CLUSTERPROP&wt=javabin&version=2 and sendToOCPQueue=true
   [junit4]   2> 3271139 INFO  (qtp655032778-19233) [n:127.0.0.1:46236_solr    ] o.a.s.s.HttpSolrCall [admin] webapp=null path=/admin/collections params={val=false&name=legacyCloud&action=CLUSTERPROP&wt=javabin&version=2} status=0 QTime=8
   [junit4]   2> 3271139 INFO  (qtp655032778-19231) [n:127.0.0.1:46236_solr    ] o.a.s.h.a.CollectionsHandler Invoked Collection Action :create with params collection.configName=conf&maxShardsPerNode=1&name=legacyFalse&nrtReplicas=1&action=CREATE&numShards=1&wt=javabin&version=2 and sendToOCPQueue=true
   [junit4]   2> 3271143 INFO  (OverseerThreadFactory-6385-thread-1-processing-n:127.0.0.1:46236_solr) [n:127.0.0.1:46236_solr    ] o.a.s.c.a.c.CreateCollectionCmd Create collection legacyFalse
   [junit4]   2> 3271416 INFO  (qtp655032778-19235) [n:127.0.0.1:46236_solr    x:legacyFalse_shard1_replica_n1] o.a.s.h.a.CoreAdminOperation core create command qt=/admin/cores&collection.configName=conf&newCollection=true&name=legacyFalse_shard1_replica_n1&action=CREATE&numShards=1&collection=legacyFalse&shard=shard1&wt=javabin&version=2&replicaType=NRT
   [junit4]   2> 3271419 ERROR (qtp655032778-19235) [n:127.0.0.1:46236_solr    x:legacyFalse_shard1_replica_n1] o.a.s.h.RequestHandlerBase org.apache.solr.common.SolrException: Error CREATEing SolrCore 'legacyFalse_shard1_replica_n1': non legacy mode coreNodeName missing {collection.configName=conf, numShards=1, shard=shard1, collection=legacyFalse, replicaType=NRT}
   [junit4]   2> 	at org.apache.solr.core.CoreContainer.create(CoreContainer.java:1187)
   [junit4]   2> 	at org.apache.solr.handler.admin.CoreAdminOperation.lambda$static$0(CoreAdminOperation.java:92)
   [junit4]   2> 	at org.apache.solr.handler.admin.CoreAdminOperation.execute(CoreAdminOperation.java:360)
   [junit4]   2> 	at org.apache.solr.handler.admin.CoreAdminHandler$CallInfo.call(CoreAdminHandler.java:396)
   [junit4]   2> 	at org.apache.solr.handler.admin.CoreAdminHandler.handleRequestBody(CoreAdminHandler.java:180)
   [junit4]   2> 	at org.apache.solr.handler.RequestHandlerBase.handleRequest(RequestHandlerBase.java:199)
   [junit4]   2> 	at org.apache.solr.servlet.HttpSolrCall.handleAdmin(HttpSolrCall.java:796)
   [junit4]   2> 	at org.apache.solr.servlet.HttpSolrCall.handleAdminRequest(HttpSolrCall.java:762)
   [junit4]   2> 	at org.apache.solr.servlet.HttpSolrCall.call(HttpSolrCall.java:522)
   [junit4]   2> 	at org.apache.solr.servlet.SolrDispatchFilter.doFilter(SolrDispatchFilter.java:397)
   [junit4]   2> 	at org.apache.solr.servlet.SolrDispatchFilter.doFilter(SolrDispatchFilter.java:343)
   [junit4]   2> 	at org.eclipse.jetty.servlet.ServletHandler$CachedChain.doFilter(ServletHandler.java:1610)
   [junit4]   2> 	at org.apache.solr.client.solrj.embedded.JettySolrRunner$DebugFilter.doFilter(JettySolrRunner.java:165)
   [junit4]   2> 	at org.eclipse.jetty.servlet.ServletHandler$CachedChain.doFilter(ServletHandler.java:1610)
   [junit4]   2> 	at org.eclipse.jetty.servlet.ServletHandler.doHandle(ServletHandler.java:540)
   [junit4]   2> 	at org.eclipse.jetty.server.handler.ScopedHandler.nextHandle(ScopedHandler.java:255)
   [junit4]   2> 	at org.eclipse.jetty.server.session.SessionHandler.doHandle(SessionHandler.java:1588)
   [junit4]   2> 	at org.eclipse.jetty.server.handler.ScopedHandler.nextHandle(ScopedHandler.java:255)
   [junit4]   2> 	at org.eclipse.jetty.server.handler.ContextHandler.doHandle(ContextHandler.java:1345)
   [junit4]   2> 	at org.eclipse.jetty.server.handler.ScopedHandler.nextScope(ScopedHandler.java:203)
   [junit4]   2> 	at org.eclipse.jetty.servlet.ServletHandler.doScope(ServletHandler.java:480)
   [junit4]   2> 	at org.eclipse.jetty.server.session.SessionHandler.doScope(SessionHandler.java:1557)
   [junit4]   2> 	at org.eclipse.jetty.server.handler.ScopedHandler.nextScope(ScopedHandler.java:201)
   [junit4]   2> 	at org.eclipse.jetty.server.handler.ContextHandler.doScope(ContextHandler.java:1247)
   [junit4]   2> 	at org.eclipse.jetty.server.handler.ScopedHandler.handle(ScopedHandler.java:144)
   [junit4]   2> 	at org.eclipse.jetty.server.handler.gzip.GzipHandler.handle(GzipHandler.java:703)
   [junit4]   2> 	at org.eclipse.jetty.server.handler.HandlerWrapper.handle(HandlerWrapper.java:132)
   [junit4]   2> 	at org.eclipse.jetty.server.Server.handle(Server.java:502)
   [junit4]   2> 	at org.eclipse.jetty.server.HttpChannel.handle(HttpChannel.java:364)
   [junit4]   2> 	at org.eclipse.jetty.server.HttpConnection.onFillable(HttpConnection.java:260)
   [junit4]   2> 	at org.eclipse.jetty.io.AbstractConnection$ReadCallback.succeeded(AbstractConnection.java:305)
   [junit4]   2> 	at org.eclipse.jetty.io.FillInterest.fillable(FillInterest.java:103)
   [junit4]   2> 	at org.eclipse.jetty.io.ChannelEndPoint$2.run(ChannelEndPoint.java:118)
   [junit4]   2> 	at org.eclipse.jetty.util.thread.QueuedThreadPool.runJob(QueuedThreadPool.java:765)
   [junit4]   2> 	at org.eclipse.jetty.util.thread.QueuedThreadPool$2.run(QueuedThreadPool.java:683)
   [junit4]   2> 	at java.lang.Thread.run(Thread.java:748)
   [junit4]   2> Caused by: org.apache.solr.common.SolrException: non legacy mode coreNodeName missing {collection.configName=conf, numShards=1, shard=shard1, collection=legacyFalse, replicaType=NRT}
   [junit4]   2> 	at org.apache.solr.core.CoreContainer.create(CoreContainer.java:1134)
   [junit4]   2> 	... 35 more
   [junit4]   2> 
   [junit4]   2> 3271419 INFO  (qtp655032778-19235) [n:127.0.0.1:46236_solr    x:legacyFalse_shard1_replica_n1] o.a.s.s.HttpSolrCall [admin] webapp=null path=/admin/cores params={qt=/admin/cores&collection.configName=conf&newCollection=true&name=legacyFalse_shard1_replica_n1&action=CREATE&numShards=1&collection=legacyFalse&shard=shard1&wt=javabin&version=2&replicaType=NRT} status=400 QTime=3
   [junit4]   2> 3271422 ERROR (OverseerThreadFactory-6385-thread-1-processing-n:127.0.0.1:46236_solr) [n:127.0.0.1:46236_solr    ] o.a.s.c.a.c.OverseerCollectionMessageHandler Error from shard: http://127.0.0.1:46236/solr
   [junit4]   2>           => org.apache.solr.client.solrj.impl.HttpSolrClient$RemoteSolrException: Error from server at http://127.0.0.1:46236/solr: Error CREATEing SolrCore 'legacyFalse_shard1_replica_n1': non legacy mode coreNodeName missing {collection.configName=conf, numShards=1, shard=shard1, collection=legacyFalse, replicaType=NRT}
   [junit4]   2> 	at org.apache.solr.client.solrj.impl.HttpSolrClient.executeMethod(HttpSolrClient.java:649)
   [junit4]   2> org.apache.solr.client.solrj.impl.HttpSolrClient$RemoteSolrException: Error from server at http://127.0.0.1:46236/solr: Error CREATEing SolrCore 'legacyFalse_shard1_replica_n1': non legacy mode coreNodeName missing {collection.configName=conf, numShards=1, shard=shard1, collection=legacyFalse, replicaType=NRT}
   [junit4]   2> 	at org.apache.solr.client.solrj.impl.HttpSolrClient.executeMethod(HttpSolrClient.java:649) ~[java/:?]
   [junit4]   2> 	at org.apache.solr.client.solrj.impl.HttpSolrClient.request(HttpSolrClient.java:255) ~[java/:?]
   [junit4]   2> 	at org.apache.solr.client.solrj.impl.HttpSolrClient.request(HttpSolrClient.java:244) ~[java/:?]
   [junit4]   2> 	at org.apache.solr.client.solrj.SolrClient.request(SolrClient.java:1274) ~[java/:?]
   [junit4]   2> 	at org.apache.solr.handler.component.HttpShardHandlerFactory$1.request(HttpShardHandlerFactory.java:172) ~[java/:?]
   [junit4]   2> 	at org.apache.solr.handler.component.HttpShardHandler.lambda$submit$0(HttpShardHandler.java:188) ~[java/:?]
   [junit4]   2> 	at java.util.concurrent.FutureTask.run(FutureTask.java:266) ~[?:1.8.0_191]
   [junit4]   2> 	at java.util.concurrent.Executors$RunnableAdapter.call(Executors.java:511) ~[?:1.8.0_191]
   [junit4]   2> 	at java.util.concurrent.FutureTask.run(FutureTask.java:266) ~[?:1.8.0_191]
   [junit4]   2> 	at com.codahale.metrics.InstrumentedExecutorService$InstrumentedRunnable.run(InstrumentedExecutorService.java:181) ~[metrics-core-4.0.5.jar:4.0.5]
   [junit4]   2> 	at org.apache.solr.common.util.ExecutorUtil$MDCAwareThreadPoolExecutor.lambda$execute$0(ExecutorUtil.java:209) ~[java/:?]
   [junit4]   2> 	at java.util.concurrent.ThreadPoolExecutor.runWorker(ThreadPoolExecutor.java:1149) ~[?:1.8.0_191]
   [junit4]   2> 	at java.util.concurrent.ThreadPoolExecutor$Worker.run(ThreadPoolExecutor.java:624) ~[?:1.8.0_191]
   [junit4]   2> 	at java.lang.Thread.run(Thread.java:748) [?:1.8.0_191]
   [junit4]   2> 3271422 ERROR (OverseerThreadFactory-6385-thread-1-processing-n:127.0.0.1:46236_solr) [n:127.0.0.1:46236_solr    ] o.a.s.c.a.c.OverseerCollectionMessageHandler Cleaning up collection [legacyFalse].
   [junit4]   2> 3271423 INFO  (OverseerThreadFactory-6385-thread-1-processing-n:127.0.0.1:46236_solr) [n:127.0.0.1:46236_solr    ] o.a.s.c.a.c.OverseerCollectionMessageHandler Executing Collection Cmd=action=UNLOAD&deleteInstanceDir=true&deleteDataDir=true&deleteMetricsHistory=true, asyncId=null
   [junit4]   2> 3271529 INFO  (zkCallback-6583-thread-3) [    ] o.a.s.c.c.ZkStateReader A cluster state change: [WatchedEvent state:SyncConnected type:NodeDeleted path:/collections/legacyFalse/state.json] for collection [legacyFalse] has occurred - updating... (live nodes size: [1])
   [junit4]   2> 3271532 INFO  (OverseerThreadFactory-6385-thread-1-processing-n:127.0.0.1:46236_solr) [n:127.0.0.1:46236_solr    ] o.a.s.c.a.c.CreateCollectionCmd Cleaned up artifacts for failed create collection for [legacyFalse]
   [junit4]   2> 3271532 ERROR (OverseerThreadFactory-6385-thread-1-processing-n:127.0.0.1:46236_solr) [n:127.0.0.1:46236_solr    ] o.a.s.c.a.c.OverseerCollectionMessageHandler Collection: legacyFalse operation: create failed:org.apache.solr.common.SolrException: Underlying core creation failed while creating collection: legacyFalse
   [junit4]   2> 	at org.apache.solr.cloud.api.collections.CreateCollectionCmd.call(CreateCollectionCmd.java:302)
   [junit4]   2> 	at org.apache.solr.cloud.api.collections.OverseerCollectionMessageHandler.processMessage(OverseerCollectionMessageHandler.java:264)
   [junit4]   2> 	at org.apache.solr.cloud.OverseerTaskProcessor$Runner.run(OverseerTaskProcessor.java:505)
   [junit4]   2> 	at org.apache.solr.common.util.ExecutorUtil$MDCAwareThreadPoolExecutor.lambda$execute$0(ExecutorUtil.java:209)
   [junit4]   2> 	at java.util.concurrent.ThreadPoolExecutor.runWorker(ThreadPoolExecutor.java:1149)
   [junit4]   2> 	at java.util.concurrent.ThreadPoolExecutor$Worker.run(ThreadPoolExecutor.java:624)
   [junit4]   2> 	at java.lang.Thread.run(Thread.java:748)
   [junit4]   2> 
   [junit4]   2> 3271548 INFO  (qtp655032778-19231) [n:127.0.0.1:46236_solr    ] o.a.s.s.HttpSolrCall [admin] webapp=null path=/admin/collections params={collection.configName=conf&maxShardsPerNode=1&name=legacyFalse&nrtReplicas=1&action=CREATE&numShards=1&wt=javabin&version=2} status=400 QTime=408
   [junit4]   2> 3271557 INFO  (TEST-LegacyCloudClusterPropTest.testCreateCollectionSwitchLegacyCloud-seed#[E2BBEC610F60BF22]) [    ] o.a.s.c.c.ZkStateReader Updated live nodes from ZooKeeper... (0) -> (1)
   [junit4]   2> 3271559 INFO  (qtp655032778-19232) [n:127.0.0.1:46236_solr    ] o.a.s.h.a.CollectionsHandler Invoked Collection Action :delete with params name=legacyTrue&action=DELETE&wt=javabin&version=2 and sendToOCPQueue=true
   [junit4]   2> 3271575 INFO  (OverseerCollectionConfigSetProcessor-74614443308875786-127.0.0.1:46236_solr-n_0000000001) [n:127.0.0.1:46236_solr    ] o.a.s.c.OverseerTaskQueue Response ZK path: /overseer/collection-queue-work/qnr-0000000002 doesn't exist.  Requestor may have disconnected from ZooKeeper
   [junit4]   2> 3271576 INFO  (OverseerThreadFactory-6385-thread-2-processing-n:127.0.0.1:46236_solr) [n:127.0.0.1:46236_solr    ] o.a.s.c.a.c.OverseerCollectionMessageHandler Executing Collection Cmd=action=UNLOAD&deleteInstanceDir=true&deleteDataDir=true&deleteMetricsHistory=true, asyncId=null
   [junit4]   2> 3271576 INFO  (qtp655032778-19233) [n:127.0.0.1:46236_solr    x:legacyTrue_shard1_replica_n1] o.a.s.m.SolrMetricManager Closing metric reporters for registry=solr.core.legacyTrue.shard1.replica_n1, tag=null
   [junit4]   2> 3271576 INFO  (qtp655032778-19233) [n:127.0.0.1:46236_solr    x:legacyTrue_shard1_replica_n1] o.a.s.m.r.SolrJmxReporter Closing reporter [org.apache.solr.metrics.reporters.SolrJmxReporter@4cac8dd3: rootName = solr_46236, domain = solr.core.legacyTrue.shard1.replica_n1, service url = null, agent id = null] for registry solr.core.legacyTrue.shard1.replica_n1 / com.codahale.metrics.MetricRegistry@73f70d78
   [junit4]   2> 3271603 INFO  (qtp655032778-19233) [n:127.0.0.1:46236_solr    x:legacyTrue_shard1_replica_n1] o.a.s.c.SolrCore [legacyTrue_shard1_replica_n1]  CLOSING SolrCore org.apache.solr.core.SolrCore@38198dbd
   [junit4]   2> 3271603 INFO  (qtp655032778-19233) [n:127.0.0.1:46236_solr    x:legacyTrue_shard1_replica_n1] o.a.s.m.SolrMetricManager Closing metric reporters for registry=solr.core.legacyTrue.shard1.replica_n1, tag=38198dbd
   [junit4]   2> 3271603 INFO  (qtp655032778-19233) [n:127.0.0.1:46236_solr    x:legacyTrue_shard1_replica_n1] o.a.s.m.SolrMetricManager Closing metric reporters for registry=solr.collection.legacyTrue.shard1.leader, tag=38198dbd
   [junit4]   2> 3271618 INFO  (qtp655032778-19233) [n:127.0.0.1:46236_solr    x:legacyTrue_shard1_replica_n1] o.a.s.c.ZkShardTerms Successful update of terms at /collections/legacyTrue/terms/shard1 to Terms{values={}, version=1}
   [junit4]   2> 3271619 INFO  (qtp655032778-19233) [n:127.0.0.1:46236_solr    x:legacyTrue_shard1_replica_n1] o.a.s.s.HttpSolrCall [admin] webapp=null path=/admin/cores params={deleteInstanceDir=true&deleteMetricsHistory=true&core=legacyTrue_shard1_replica_n1&qt=/admin/cores&deleteDataDir=true&action=UNLOAD&wt=javabin&version=2} status=0 QTime=43
   [junit4]   2> 3271721 INFO  (zkCallback-6583-thread-3) [    ] o.a.s.c.c.ZkStateReader A cluster state change: [WatchedEvent state:SyncConnected type:NodeDeleted path:/collections/legacyTrue/state.json] for collection [legacyTrue] has occurred - updating... (live nodes size: [1])
   [junit4]   2> 3271721 INFO  (zkCallback-6583-thread-2) [    ] o.a.s.c.c.ZkStateReader A cluster state change: [WatchedEvent state:SyncConnected type:NodeDeleted path:/collections/legacyTrue/state.json] for collection [legacyTrue] has occurred - updating... (live nodes size: [1])
   [junit4]   2> 3271721 INFO  (zkCallback-6583-thread-1) [    ] o.a.s.c.c.ZkStateReader A cluster state change: [WatchedEvent state:SyncConnected type:NodeDeleted path:/collections/legacyTrue/state.json] for collection [legacyTrue] has occurred - updating... (live nodes size: [1])
   [junit4]   2> 3271736 INFO  (qtp655032778-19232) [n:127.0.0.1:46236_solr    ] o.a.s.s.HttpSolrCall [admin] webapp=null path=/admin/collections params={name=legacyTrue&action=DELETE&wt=javabin&version=2} status=0 QTime=176
   [junit4]   2> 3271737 INFO  (TEST-LegacyCloudClusterPropTest.testCreateCollectionSwitchLegacyCloud-seed#[E2BBEC610F60BF22]) [    ] o.a.s.SolrTestCaseJ4 ###Ending testCreateCollectionSwitchLegacyCloud
   [junit4]   2> NOTE: reproduce with: ant test  -Dtestcase=LegacyCloudClusterPropTest -Dtests.method=testCreateCollectionSwitchLegacyCloud -Dtests.seed=E2BBEC610F60BF22 -Dtests.multiplier=2 -Dtests.slow=true -Dtests.locale=ar-KW -Dtests.timezone=America/El_Salvador -Dtests.asserts=true -Dtests.file.encoding=UTF-8
   [junit4] ERROR   4.97s J0 | LegacyCloudClusterPropTest.testCreateCollectionSwitchLegacyCloud <<<
   [junit4]    > Throwable #1: org.apache.solr.client.solrj.impl.HttpSolrClient$RemoteSolrException: Error from server at http://127.0.0.1:46236/solr: Underlying core creation failed while creating collection: legacyFalse
   [junit4]    > 	at __randomizedtesting.SeedInfo.seed([E2BBEC610F60BF22:33BC1EE4AB6F3410]:0)
   [junit4]    > 	at org.apache.solr.client.solrj.impl.HttpSolrClient.executeMethod(HttpSolrClient.java:649)
   [junit4]    > 	at org.apache.solr.client.solrj.impl.HttpSolrClient.request(HttpSolrClient.java:255)
   [junit4]    > 	at org.apache.solr.client.solrj.impl.HttpSolrClient.request(HttpSolrClient.java:244)
   [junit4]    > 	at org.apache.solr.client.solrj.impl.LBSolrClient.doRequest(LBSolrClient.java:368)
   [junit4]    > 	at org.apache.solr.client.solrj.impl.LBSolrClient.request(LBSolrClient.java:296)
   [junit4]    > 	at org.apache.solr.client.solrj.impl.BaseCloudSolrClient.sendRequest(BaseCloudSolrClient.java:1068)
   [junit4]    > 	at org.apache.solr.client.solrj.impl.BaseCloudSolrClient.requestWithRetryOnStaleState(BaseCloudSolrClient.java:837)
   [junit4]    > 	at org.apache.solr.client.solrj.impl.BaseCloudSolrClient.request(BaseCloudSolrClient.java:769)
   [junit4]    > 	at org.apache.solr.client.solrj.SolrRequest.process(SolrRequest.java:207)
   [junit4]    > 	at org.apache.solr.client.solrj.SolrRequest.process(SolrRequest.java:224)
   [junit4]    > 	at org.apache.solr.cloud.LegacyCloudClusterPropTest.createAndTest(LegacyCloudClusterPropTest.java:95)
   [junit4]    > 	at org.apache.solr.cloud.LegacyCloudClusterPropTest.testCreateCollectionSwitchLegacyCloud(LegacyCloudClusterPropTest.java:79)
   [junit4]    > 	at java.lang.Thread.run(Thread.java:748)
   [junit4]   2> 3271753 INFO  (jetty-closer-6596-thread-1) [    ] o.a.s.c.CoreContainer Shutting down CoreContainer instance=1369328956
   [junit4]   2> 3271753 INFO  (jetty-closer-6596-thread-1) [    ] o.a.s.c.ZkController Remove node as live in ZooKeeper:/live_nodes/127.0.0.1:46236_solr
   [junit4]   2> 3271753 INFO  (jetty-closer-6596-thread-1) [    ] o.a.s.c.ZkController Publish this node as DOWN...
   [junit4]   2> 3271753 INFO  (jetty-closer-6596-thread-1) [    ] o.a.s.c.ZkController Publish node=127.0.0.1:46236_solr as DOWN
   [junit4]   2> 3271755 INFO  (jetty-closer-6596-thread-1) [    ] o.a.s.m.SolrMetricManager Closing metric reporters for registry=solr.node, tag=null
   [junit4]   2> 3271755 INFO  (jetty-closer-6596-thread-1) [    ] o.a.s.m.r.SolrJmxReporter Closing reporter [org.apache.solr.metrics.reporters.SolrJmxReporter@63fc6243: rootName = solr_46236, domain = solr.node, service url = null, agent id = null] for registry solr.node / com.codahale.metrics.MetricRegistry@5c69fd7d
   [junit4]   2> 3271759 INFO  (jetty-closer-6596-thread-1) [    ] o.a.s.m.SolrMetricManager Closing metric reporters for registry=solr.jvm, tag=null
   [junit4]   2> 3271759 INFO  (jetty-closer-6596-thread-1) [    ] o.a.s.m.r.SolrJmxReporter Closing reporter [org.apache.solr.metrics.reporters.SolrJmxReporter@58dfb05b: rootName = solr_46236, domain = solr.jvm, service url = null, agent id = null] for registry solr.jvm / com.codahale.metrics.MetricRegistry@16b7c268
   [junit4]   2> 3271773 INFO  (jetty-closer-6596-thread-1) [    ] o.a.s.m.SolrMetricManager Closing metric reporters for registry=solr.jetty, tag=null
   [junit4]   2> 3271773 INFO  (jetty-closer-6596-thread-1) [    ] o.a.s.m.r.SolrJmxReporter Closing reporter [org.apache.solr.metrics.reporters.SolrJmxReporter@6cef85a5: rootName = solr_46236, domain = solr.jetty, service url = null, agent id = null] for registry solr.jetty / com.codahale.metrics.MetricRegistry@78b87fc2
   [junit4]   2> 3271773 INFO  (jetty-closer-6596-thread-1) [    ] o.a.s.m.SolrMetricManager Closing metric reporters for registry=solr.cluster, tag=null
   [junit4]   2> 3271780 INFO  (closeThreadPool-6600-thread-1) [    ] o.a.s.c.Overseer Overseer (id=74614443308875786-127.0.0.1:46236_solr-n_0000000001) closing
   [junit4]   2> 3271796 INFO  (OverseerStateUpdate-74614443308875786-127.0.0.1:46236_solr-n_0000000001) [n:127.0.0.1:46236_solr    ] o.a.s.c.Overseer Overseer Loop exiting : 127.0.0.1:46236_solr
   [junit4]   2> 3271806 INFO  (OverseerAutoScalingTriggerThread-74614443308875786-127.0.0.1:46236_solr-n_0000000001) [    ] o.a.s.c.a.OverseerTriggerThread OverseerTriggerThread woken up but we are closed, exiting.
   [junit4]   2> 3271808 INFO  (jetty-closer-6596-thread-1) [    ] o.a.s.c.Overseer Overseer (id=74614443308875786-127.0.0.1:46236_solr-n_0000000001) closing
   [junit4]   2> 3271808 INFO  (closeThreadPool-6600-thread-2) [    ] o.a.s.c.Overseer Overseer (id=74614443308875786-127.0.0.1:46236_solr-n_0000000001) closing
   [junit4]   2> 3271809 INFO  (jetty-closer-6596-thread-1) [    ] o.e.j.s.AbstractConnector Stopped ServerConnector@6c0faf90{HTTP/1.1,[http/1.1, h2c]}{127.0.0.1:46236}
   [junit4]   2> 3271810 INFO  (jetty-closer-6596-thread-1) [    ] o.e.j.s.h.ContextHandler Stopped o.e.j.s.ServletContextHandler@158bd713{/solr,null,UNAVAILABLE}
   [junit4]   2> 3271810 INFO  (jetty-closer-6596-thread-1) [    ] o.e.j.s.session node0 Stopped scavenging
   [junit4]   2> 3271829 INFO  (SUITE-LegacyCloudClusterPropTest-seed#[E2BBEC610F60BF22]-worker) [    ] o.a.s.c.ZkTestServer Shutting down ZkTestServer.
   [junit4]   2> 3271831 WARN  (ZkTestServer Run Thread) [    ] o.a.s.c.ZkTestServer Watch limit violations: 
   [junit4]   2> Maximum concurrent create/delete watches above limit:
   [junit4]   2> 
   [junit4]   2> 	6	/solr/aliases.json
   [junit4]   2> 	4	/solr/collections/legacyTrue/terms/shard1
   [junit4]   2> 	3	/solr/clusterprops.json
   [junit4]   2> 	2	/solr/security.json
   [junit4]   2> 	2	/solr/configs/conf
   [junit4]   2> 	2	/solr/collections/legacyTrue/state.json
   [junit4]   2> 
   [junit4]   2> Maximum concurrent data watches above limit:
   [junit4]   2> 
   [junit4]   2> 	13	/solr/collections/legacyTrue/state.json
   [junit4]   2> 	6	/solr/clusterstate.json
   [junit4]   2> 	6	/solr/clusterprops.json
   [junit4]   2> 	2	/solr/autoscaling.json
   [junit4]   2> 
   [junit4]   2> Maximum concurrent children watches above limit:
   [junit4]   2> 
   [junit4]   2> 	7	/solr/collections
   [junit4]   2> 	5	/solr/live_nodes
   [junit4]   2> 	2	/solr/overseer/queue
   [junit4]   2> 	2	/solr/autoscaling/events/.scheduled_maintenance
   [junit4]   2> 	2	/solr/autoscaling/events/.auto_add_replicas
   [junit4]   2> 	2	/solr/overseer/collection-queue-work
   [junit4]   2> 	2	/solr/overseer/queue-work
   [junit4]   2> 
   [junit4]   2> 3271832 INFO  (SUITE-LegacyCloudClusterPropTest-seed#[E2BBEC610F60BF22]-worker) [    ] o.a.s.c.ZkTestServer parse host and port list: 127.0.0.1:42786
   [junit4]   2> 3271832 INFO  (SUITE-LegacyCloudClusterPropTest-seed#[E2BBEC610F60BF22]-worker) [    ] o.a.s.c.ZkTestServer connecting to 127.0.0.1 42786
   [junit4]   2> NOTE: leaving temporary files on disk at: /home/jenkins/jenkins-slave/workspace/Lucene-Solr-Tests-8.x/solr/build/solr-core/test/J0/temp/solr.cloud.LegacyCloudClusterPropTest_E2BBEC610F60BF22-001
   [junit4]   2> May 01, 2019 2:17:09 AM com.carrotsearch.randomizedtesting.ThreadLeakControl checkThreadLeaks
   [junit4]   2> WARNING: Will linger awaiting termination of 1 leaked thread(s).
   [junit4]   2> NOTE: test params are: codec=Asserting(Lucene80): {}, docValues:{}, maxPointsInLeafNode=1309, maxMBSortInHeap=6.449322112731518, sim=Asserting(org.apache.lucene.search.similarities.AssertingSimilarity@79a79fb9), locale=ar-KW, timezone=America/El_Salvador
   [junit4]   2> NOTE: Linux 4.4.0-112-generic amd64/Oracle Corporation 1.8.0_191 (64-bit)/cpus=4,threads=1,free=150726936,total=525336576
   [junit4]   2> NOTE: All tests run in this JVM: [PeerSyncReplicationTest, TestBinaryResponseWriter, SolrRrdBackendFactoryTest, CoreAdminCreateDiscoverTest, TestSubQueryTransformerCrossCore, DeleteShardTest, AuthToolTest, TestPhraseSuggestions, CachingDirectoryFactoryTest, TestFilteredDocIdSet, AnalyticsMergeStrategyTest, SimplePostToolTest, TestScoreJoinQPScore, TestUtilizeNode, TestCrossCoreJoin, DistributedFacetPivotSmallTest, TestGeoJSONResponseWriter, TestHalfAndHalfDocValues, V2ApiIntegrationTest, TestManagedSchemaThreadSafety, TestCopyFieldCollectionResource, ComputePlanActionTest, TestSafeXMLParsing, CSVRequestHandlerTest, DocValuesMissingTest, QueryEqualityTest, TestTlogReplica, TestSearchPerf, PropertiesRequestHandlerTest, ZkSolrClientTest, BooleanFieldTest, ExplicitHLLTest, TestRuleBasedAuthorizationPlugin, RequestLoggingTest, HttpPartitionOnCommitTest, TestRestoreCore, MaxSizeAutoCommitTest, BasicAuthIntegrationTest, TestComplexPhraseLeadingWildcard, IndexBasedSpellCheckerTest, IndexSchemaTest, TestLMDirichletSimilarityFactory, TestBlobHandler, TestReRankQParserPlugin, DistributedSpellCheckComponentTest, TestSolrDeletionPolicy1, EnumFieldTest, SpellPossibilityIteratorTest, NumberUtilsTest, CreateCollectionCleanupTest, TestRequestForwarding, TestInfoStreamLogging, InfoHandlerTest, TestReplicationHandlerBackup, TestInPlaceUpdatesStandalone, TestEmbeddedSolrServerAdminHandler, TestTrieFacet, TestAnalyzedSuggestions, TriggerEventQueueTest, DeleteLastCustomShardedReplicaTest, TestMacros, RestoreTriggerStateTest, CacheHeaderTest, TestSchemaManager, SpatialHeatmapFacetsTest, TestSchemaSimilarityResource, UninvertDocValuesMergePolicyTest, TestCloudSchemaless, TestDocTermOrds, TimeRoutedAliasUpdateProcessorTest, TestLegacyField, TestJsonFacetsWithNestedObjects, CoreAdminRequestStatusTest, UtilsToolTest, BigEndianAscendingWordDeserializerTest, RequiredFieldsTest, TestCryptoKeys, WordBreakSolrSpellCheckerTest, RollingRestartTest, TestNumericRangeQuery64, DistanceFunctionTest, UUIDUpdateProcessorFallbackTest, SolrIndexConfigTest, DirectoryFactoryTest, TestIntervalFaceting, TestMinMaxOnMultiValuedField, CursorMarkTest, ReindexCollectionTest, TestPostingsSolrHighlighter, DistributedFacetPivotLargeTest, TermsComponentTest, ClassificationUpdateProcessorTest, TestNumericTerms32, TestCollectionAPI, ChaosMonkeyNothingIsSafeTest, CurrencyFieldTypeTest, SolrSlf4jReporterTest, TestSimClusterStateProvider, DistributedQueryComponentCustomSortTest, TestHashPartitioner, DistributedDebugComponentTest, TestStressUserVersions, ConjunctionSolrSpellCheckerTest, TestBadConfig, TestSweetSpotSimilarityFactory, CdcrVersionReplicationTest, TestSolrQueryParser, JsonLoaderTest, TestSolrCloudSnapshots, TestDeprecatedFilters, OverseerStatusTest, MBeansHandlerTest, ScheduledTriggerTest, ShardRoutingCustomTest, TestExtendedDismaxParser, NumericFieldsTest, TestLegacyNumericRangeQueryBuilder, TlogReplayBufferedWhileIndexingTest, TestSolrCoreParser, TestImpersonationWithHadoopAuth, TestNonDefinedSimilarityFactory, TestChildDocTransformer, DataDrivenBlockJoinTest, TaggingAttributeTest, BufferStoreTest, PluginInfoTest, TestXmlQParserPlugin, TestSmileRequest, DistributedUpdateProcessorTest, VMParamsZkACLAndCredentialsProvidersTest, TestJsonFacetRefinement, TestPrepRecovery, SystemLogListenerTest, RootFieldTest, TestLegacyTerms, TestSimDistributedQueue, TestSimNodeLostTrigger, TestSimGenericDistributedQueue, TestCloudPivotFacet, TestCoreAdminApis, TestGraphTermsQParserPlugin, TestDistributedSearch, TestRandomFaceting, TestJettySolrRunner, ActionThrottleTest, AliasIntegrationTest, BasicZkTest, CleanupOldIndexTest, CloudExitableDirectoryReaderTest, CollectionPropsTest, ConcurrentCreateRoutedAliasTest, ConfigSetsAPITest, ConnectionManagerTest, DistribDocExpirationUpdateProcessorTest, DistributedVersionInfoTest, LeaderFailoverAfterPartitionTest, LegacyCloudClusterPropTest]
   [junit4] Completed [495/855 (1!)] on J0 in 6.54s, 1 test, 1 error <<< FAILURES!

[...truncated 10250 lines...]
BUILD FAILED
/home/jenkins/jenkins-slave/workspace/Lucene-Solr-Tests-8.x/build.xml:634: The following error occurred while executing this line:
/home/jenkins/jenkins-slave/workspace/Lucene-Solr-Tests-8.x/build.xml:128: Found 1 violations in source files (File uses Mockito but has no assumeWorkingMockito() call).

Total time: 204 minutes 45 seconds
Build step 'Invoke Ant' marked build as failure
Archiving artifacts
Recording test results
Email was triggered for: Failure - Any
Sending email for trigger: Failure - Any

Mime
View raw message