lucene-dev mailing list archives

Site index · List index
Message view « Date » · « Thread »
Top « Date » · « Thread »
From Policeman Jenkins Server <jenk...@thetaphi.de>
Subject [JENKINS] Lucene-Solr-8.x-Linux (64bit/jdk-11.0.2) - Build # 514 - Unstable!
Date Sun, 05 May 2019 01:16:18 GMT
Build: https://jenkins.thetaphi.de/job/Lucene-Solr-8.x-Linux/514/
Java: 64bit/jdk-11.0.2 -XX:-UseCompressedOops -XX:+UseParallelGC

8 tests failed.
FAILED:  org.apache.solr.update.processor.DistributedUpdateProcessorTest.testVersionDelete

Error Message:


Stack Trace:
java.lang.NullPointerException
	at __randomizedtesting.SeedInfo.seed([5ED48C678637330F:AD9AD8DADFDB1AB5]:0)
	at org.mockito.Mockito.spy(Mockito.java:1980)
	at org.apache.solr.update.processor.DistributedUpdateProcessorTest.runCommands(DistributedUpdateProcessorTest.java:144)
	at org.apache.solr.update.processor.DistributedUpdateProcessorTest.testVersionDelete(DistributedUpdateProcessorTest.java:125)
	at java.base/jdk.internal.reflect.NativeMethodAccessorImpl.invoke0(Native Method)
	at java.base/jdk.internal.reflect.NativeMethodAccessorImpl.invoke(NativeMethodAccessorImpl.java:62)
	at java.base/jdk.internal.reflect.DelegatingMethodAccessorImpl.invoke(DelegatingMethodAccessorImpl.java:43)
	at java.base/java.lang.reflect.Method.invoke(Method.java:566)
	at com.carrotsearch.randomizedtesting.RandomizedRunner.invoke(RandomizedRunner.java:1750)
	at com.carrotsearch.randomizedtesting.RandomizedRunner$8.evaluate(RandomizedRunner.java:938)
	at com.carrotsearch.randomizedtesting.RandomizedRunner$9.evaluate(RandomizedRunner.java:974)
	at com.carrotsearch.randomizedtesting.RandomizedRunner$10.evaluate(RandomizedRunner.java:988)
	at org.mockito.internal.junit.JUnitRule$1.evaluateSafely(JUnitRule.java:52)
	at org.mockito.internal.junit.JUnitRule$1.evaluate(JUnitRule.java:43)
	at com.carrotsearch.randomizedtesting.rules.SystemPropertiesRestoreRule$1.evaluate(SystemPropertiesRestoreRule.java:57)
	at org.apache.lucene.util.TestRuleSetupTeardownChained$1.evaluate(TestRuleSetupTeardownChained.java:49)
	at org.apache.lucene.util.AbstractBeforeAfterRule$1.evaluate(AbstractBeforeAfterRule.java:45)
	at org.apache.lucene.util.TestRuleThreadAndTestName$1.evaluate(TestRuleThreadAndTestName.java:48)
	at org.apache.lucene.util.TestRuleIgnoreAfterMaxFailures$1.evaluate(TestRuleIgnoreAfterMaxFailures.java:64)
	at org.apache.lucene.util.TestRuleMarkFailure$1.evaluate(TestRuleMarkFailure.java:47)
	at com.carrotsearch.randomizedtesting.rules.StatementAdapter.evaluate(StatementAdapter.java:36)
	at com.carrotsearch.randomizedtesting.ThreadLeakControl$StatementRunner.run(ThreadLeakControl.java:368)
	at com.carrotsearch.randomizedtesting.ThreadLeakControl.forkTimeoutingTask(ThreadLeakControl.java:817)
	at com.carrotsearch.randomizedtesting.ThreadLeakControl$3.evaluate(ThreadLeakControl.java:468)
	at com.carrotsearch.randomizedtesting.RandomizedRunner.runSingleTest(RandomizedRunner.java:947)
	at com.carrotsearch.randomizedtesting.RandomizedRunner$5.evaluate(RandomizedRunner.java:832)
	at com.carrotsearch.randomizedtesting.RandomizedRunner$6.evaluate(RandomizedRunner.java:883)
	at com.carrotsearch.randomizedtesting.RandomizedRunner$7.evaluate(RandomizedRunner.java:894)
	at com.carrotsearch.randomizedtesting.rules.StatementAdapter.evaluate(StatementAdapter.java:36)
	at com.carrotsearch.randomizedtesting.rules.SystemPropertiesRestoreRule$1.evaluate(SystemPropertiesRestoreRule.java:57)
	at org.apache.lucene.util.AbstractBeforeAfterRule$1.evaluate(AbstractBeforeAfterRule.java:45)
	at com.carrotsearch.randomizedtesting.rules.StatementAdapter.evaluate(StatementAdapter.java:36)
	at org.apache.lucene.util.TestRuleStoreClassName$1.evaluate(TestRuleStoreClassName.java:41)
	at com.carrotsearch.randomizedtesting.rules.NoShadowingOrOverridesOnMethodsRule$1.evaluate(NoShadowingOrOverridesOnMethodsRule.java:40)
	at com.carrotsearch.randomizedtesting.rules.NoShadowingOrOverridesOnMethodsRule$1.evaluate(NoShadowingOrOverridesOnMethodsRule.java:40)
	at com.carrotsearch.randomizedtesting.rules.StatementAdapter.evaluate(StatementAdapter.java:36)
	at com.carrotsearch.randomizedtesting.rules.StatementAdapter.evaluate(StatementAdapter.java:36)
	at org.apache.lucene.util.TestRuleAssertionsRequired$1.evaluate(TestRuleAssertionsRequired.java:53)
	at org.apache.lucene.util.TestRuleMarkFailure$1.evaluate(TestRuleMarkFailure.java:47)
	at org.apache.lucene.util.TestRuleIgnoreAfterMaxFailures$1.evaluate(TestRuleIgnoreAfterMaxFailures.java:64)
	at org.apache.lucene.util.TestRuleIgnoreTestSuites$1.evaluate(TestRuleIgnoreTestSuites.java:54)
	at com.carrotsearch.randomizedtesting.rules.StatementAdapter.evaluate(StatementAdapter.java:36)
	at com.carrotsearch.randomizedtesting.ThreadLeakControl$StatementRunner.run(ThreadLeakControl.java:368)
	at java.base/java.lang.Thread.run(Thread.java:834)


FAILED:  org.apache.solr.update.processor.DistributedUpdateProcessorTest.testVersionAdd

Error Message:


Stack Trace:
java.lang.NullPointerException
	at __randomizedtesting.SeedInfo.seed([5ED48C678637330F:F63E7F9A7127D3CA]:0)
	at org.mockito.Mockito.spy(Mockito.java:1980)
	at org.apache.solr.update.processor.DistributedUpdateProcessorTest.runCommands(DistributedUpdateProcessorTest.java:144)
	at org.apache.solr.update.processor.DistributedUpdateProcessorTest.testVersionAdd(DistributedUpdateProcessorTest.java:101)
	at java.base/jdk.internal.reflect.NativeMethodAccessorImpl.invoke0(Native Method)
	at java.base/jdk.internal.reflect.NativeMethodAccessorImpl.invoke(NativeMethodAccessorImpl.java:62)
	at java.base/jdk.internal.reflect.DelegatingMethodAccessorImpl.invoke(DelegatingMethodAccessorImpl.java:43)
	at java.base/java.lang.reflect.Method.invoke(Method.java:566)
	at com.carrotsearch.randomizedtesting.RandomizedRunner.invoke(RandomizedRunner.java:1750)
	at com.carrotsearch.randomizedtesting.RandomizedRunner$8.evaluate(RandomizedRunner.java:938)
	at com.carrotsearch.randomizedtesting.RandomizedRunner$9.evaluate(RandomizedRunner.java:974)
	at com.carrotsearch.randomizedtesting.RandomizedRunner$10.evaluate(RandomizedRunner.java:988)
	at org.mockito.internal.junit.JUnitRule$1.evaluateSafely(JUnitRule.java:52)
	at org.mockito.internal.junit.JUnitRule$1.evaluate(JUnitRule.java:43)
	at com.carrotsearch.randomizedtesting.rules.SystemPropertiesRestoreRule$1.evaluate(SystemPropertiesRestoreRule.java:57)
	at org.apache.lucene.util.TestRuleSetupTeardownChained$1.evaluate(TestRuleSetupTeardownChained.java:49)
	at org.apache.lucene.util.AbstractBeforeAfterRule$1.evaluate(AbstractBeforeAfterRule.java:45)
	at org.apache.lucene.util.TestRuleThreadAndTestName$1.evaluate(TestRuleThreadAndTestName.java:48)
	at org.apache.lucene.util.TestRuleIgnoreAfterMaxFailures$1.evaluate(TestRuleIgnoreAfterMaxFailures.java:64)
	at org.apache.lucene.util.TestRuleMarkFailure$1.evaluate(TestRuleMarkFailure.java:47)
	at com.carrotsearch.randomizedtesting.rules.StatementAdapter.evaluate(StatementAdapter.java:36)
	at com.carrotsearch.randomizedtesting.ThreadLeakControl$StatementRunner.run(ThreadLeakControl.java:368)
	at com.carrotsearch.randomizedtesting.ThreadLeakControl.forkTimeoutingTask(ThreadLeakControl.java:817)
	at com.carrotsearch.randomizedtesting.ThreadLeakControl$3.evaluate(ThreadLeakControl.java:468)
	at com.carrotsearch.randomizedtesting.RandomizedRunner.runSingleTest(RandomizedRunner.java:947)
	at com.carrotsearch.randomizedtesting.RandomizedRunner$5.evaluate(RandomizedRunner.java:832)
	at com.carrotsearch.randomizedtesting.RandomizedRunner$6.evaluate(RandomizedRunner.java:883)
	at com.carrotsearch.randomizedtesting.RandomizedRunner$7.evaluate(RandomizedRunner.java:894)
	at com.carrotsearch.randomizedtesting.rules.StatementAdapter.evaluate(StatementAdapter.java:36)
	at com.carrotsearch.randomizedtesting.rules.SystemPropertiesRestoreRule$1.evaluate(SystemPropertiesRestoreRule.java:57)
	at org.apache.lucene.util.AbstractBeforeAfterRule$1.evaluate(AbstractBeforeAfterRule.java:45)
	at com.carrotsearch.randomizedtesting.rules.StatementAdapter.evaluate(StatementAdapter.java:36)
	at org.apache.lucene.util.TestRuleStoreClassName$1.evaluate(TestRuleStoreClassName.java:41)
	at com.carrotsearch.randomizedtesting.rules.NoShadowingOrOverridesOnMethodsRule$1.evaluate(NoShadowingOrOverridesOnMethodsRule.java:40)
	at com.carrotsearch.randomizedtesting.rules.NoShadowingOrOverridesOnMethodsRule$1.evaluate(NoShadowingOrOverridesOnMethodsRule.java:40)
	at com.carrotsearch.randomizedtesting.rules.StatementAdapter.evaluate(StatementAdapter.java:36)
	at com.carrotsearch.randomizedtesting.rules.StatementAdapter.evaluate(StatementAdapter.java:36)
	at org.apache.lucene.util.TestRuleAssertionsRequired$1.evaluate(TestRuleAssertionsRequired.java:53)
	at org.apache.lucene.util.TestRuleMarkFailure$1.evaluate(TestRuleMarkFailure.java:47)
	at org.apache.lucene.util.TestRuleIgnoreAfterMaxFailures$1.evaluate(TestRuleIgnoreAfterMaxFailures.java:64)
	at org.apache.lucene.util.TestRuleIgnoreTestSuites$1.evaluate(TestRuleIgnoreTestSuites.java:54)
	at com.carrotsearch.randomizedtesting.rules.StatementAdapter.evaluate(StatementAdapter.java:36)
	at com.carrotsearch.randomizedtesting.ThreadLeakControl$StatementRunner.run(ThreadLeakControl.java:368)
	at java.base/java.lang.Thread.run(Thread.java:834)


FAILED:  org.apache.solr.update.processor.DistributedUpdateProcessorTest.testVersionDelete

Error Message:


Stack Trace:
java.lang.NullPointerException
	at __randomizedtesting.SeedInfo.seed([5ED48C678637330F:AD9AD8DADFDB1AB5]:0)
	at org.mockito.Mockito.spy(Mockito.java:1980)
	at org.apache.solr.update.processor.DistributedUpdateProcessorTest.runCommands(DistributedUpdateProcessorTest.java:144)
	at org.apache.solr.update.processor.DistributedUpdateProcessorTest.testVersionDelete(DistributedUpdateProcessorTest.java:125)
	at java.base/jdk.internal.reflect.NativeMethodAccessorImpl.invoke0(Native Method)
	at java.base/jdk.internal.reflect.NativeMethodAccessorImpl.invoke(NativeMethodAccessorImpl.java:62)
	at java.base/jdk.internal.reflect.DelegatingMethodAccessorImpl.invoke(DelegatingMethodAccessorImpl.java:43)
	at java.base/java.lang.reflect.Method.invoke(Method.java:566)
	at com.carrotsearch.randomizedtesting.RandomizedRunner.invoke(RandomizedRunner.java:1750)
	at com.carrotsearch.randomizedtesting.RandomizedRunner$8.evaluate(RandomizedRunner.java:938)
	at com.carrotsearch.randomizedtesting.RandomizedRunner$9.evaluate(RandomizedRunner.java:974)
	at com.carrotsearch.randomizedtesting.RandomizedRunner$10.evaluate(RandomizedRunner.java:988)
	at org.mockito.internal.junit.JUnitRule$1.evaluateSafely(JUnitRule.java:52)
	at org.mockito.internal.junit.JUnitRule$1.evaluate(JUnitRule.java:43)
	at com.carrotsearch.randomizedtesting.rules.SystemPropertiesRestoreRule$1.evaluate(SystemPropertiesRestoreRule.java:57)
	at org.apache.lucene.util.TestRuleSetupTeardownChained$1.evaluate(TestRuleSetupTeardownChained.java:49)
	at org.apache.lucene.util.AbstractBeforeAfterRule$1.evaluate(AbstractBeforeAfterRule.java:45)
	at org.apache.lucene.util.TestRuleThreadAndTestName$1.evaluate(TestRuleThreadAndTestName.java:48)
	at org.apache.lucene.util.TestRuleIgnoreAfterMaxFailures$1.evaluate(TestRuleIgnoreAfterMaxFailures.java:64)
	at org.apache.lucene.util.TestRuleMarkFailure$1.evaluate(TestRuleMarkFailure.java:47)
	at com.carrotsearch.randomizedtesting.rules.StatementAdapter.evaluate(StatementAdapter.java:36)
	at com.carrotsearch.randomizedtesting.ThreadLeakControl$StatementRunner.run(ThreadLeakControl.java:368)
	at com.carrotsearch.randomizedtesting.ThreadLeakControl.forkTimeoutingTask(ThreadLeakControl.java:817)
	at com.carrotsearch.randomizedtesting.ThreadLeakControl$3.evaluate(ThreadLeakControl.java:468)
	at com.carrotsearch.randomizedtesting.RandomizedRunner.runSingleTest(RandomizedRunner.java:947)
	at com.carrotsearch.randomizedtesting.RandomizedRunner$5.evaluate(RandomizedRunner.java:832)
	at com.carrotsearch.randomizedtesting.RandomizedRunner$6.evaluate(RandomizedRunner.java:883)
	at com.carrotsearch.randomizedtesting.RandomizedRunner$7.evaluate(RandomizedRunner.java:894)
	at com.carrotsearch.randomizedtesting.rules.StatementAdapter.evaluate(StatementAdapter.java:36)
	at com.carrotsearch.randomizedtesting.rules.SystemPropertiesRestoreRule$1.evaluate(SystemPropertiesRestoreRule.java:57)
	at org.apache.lucene.util.AbstractBeforeAfterRule$1.evaluate(AbstractBeforeAfterRule.java:45)
	at com.carrotsearch.randomizedtesting.rules.StatementAdapter.evaluate(StatementAdapter.java:36)
	at org.apache.lucene.util.TestRuleStoreClassName$1.evaluate(TestRuleStoreClassName.java:41)
	at com.carrotsearch.randomizedtesting.rules.NoShadowingOrOverridesOnMethodsRule$1.evaluate(NoShadowingOrOverridesOnMethodsRule.java:40)
	at com.carrotsearch.randomizedtesting.rules.NoShadowingOrOverridesOnMethodsRule$1.evaluate(NoShadowingOrOverridesOnMethodsRule.java:40)
	at com.carrotsearch.randomizedtesting.rules.StatementAdapter.evaluate(StatementAdapter.java:36)
	at com.carrotsearch.randomizedtesting.rules.StatementAdapter.evaluate(StatementAdapter.java:36)
	at org.apache.lucene.util.TestRuleAssertionsRequired$1.evaluate(TestRuleAssertionsRequired.java:53)
	at org.apache.lucene.util.TestRuleMarkFailure$1.evaluate(TestRuleMarkFailure.java:47)
	at org.apache.lucene.util.TestRuleIgnoreAfterMaxFailures$1.evaluate(TestRuleIgnoreAfterMaxFailures.java:64)
	at org.apache.lucene.util.TestRuleIgnoreTestSuites$1.evaluate(TestRuleIgnoreTestSuites.java:54)
	at com.carrotsearch.randomizedtesting.rules.StatementAdapter.evaluate(StatementAdapter.java:36)
	at com.carrotsearch.randomizedtesting.ThreadLeakControl$StatementRunner.run(ThreadLeakControl.java:368)
	at java.base/java.lang.Thread.run(Thread.java:834)


FAILED:  org.apache.solr.update.processor.DistributedUpdateProcessorTest.testVersionAdd

Error Message:


Stack Trace:
java.lang.NullPointerException
	at __randomizedtesting.SeedInfo.seed([5ED48C678637330F:F63E7F9A7127D3CA]:0)
	at org.mockito.Mockito.spy(Mockito.java:1980)
	at org.apache.solr.update.processor.DistributedUpdateProcessorTest.runCommands(DistributedUpdateProcessorTest.java:144)
	at org.apache.solr.update.processor.DistributedUpdateProcessorTest.testVersionAdd(DistributedUpdateProcessorTest.java:101)
	at java.base/jdk.internal.reflect.NativeMethodAccessorImpl.invoke0(Native Method)
	at java.base/jdk.internal.reflect.NativeMethodAccessorImpl.invoke(NativeMethodAccessorImpl.java:62)
	at java.base/jdk.internal.reflect.DelegatingMethodAccessorImpl.invoke(DelegatingMethodAccessorImpl.java:43)
	at java.base/java.lang.reflect.Method.invoke(Method.java:566)
	at com.carrotsearch.randomizedtesting.RandomizedRunner.invoke(RandomizedRunner.java:1750)
	at com.carrotsearch.randomizedtesting.RandomizedRunner$8.evaluate(RandomizedRunner.java:938)
	at com.carrotsearch.randomizedtesting.RandomizedRunner$9.evaluate(RandomizedRunner.java:974)
	at com.carrotsearch.randomizedtesting.RandomizedRunner$10.evaluate(RandomizedRunner.java:988)
	at org.mockito.internal.junit.JUnitRule$1.evaluateSafely(JUnitRule.java:52)
	at org.mockito.internal.junit.JUnitRule$1.evaluate(JUnitRule.java:43)
	at com.carrotsearch.randomizedtesting.rules.SystemPropertiesRestoreRule$1.evaluate(SystemPropertiesRestoreRule.java:57)
	at org.apache.lucene.util.TestRuleSetupTeardownChained$1.evaluate(TestRuleSetupTeardownChained.java:49)
	at org.apache.lucene.util.AbstractBeforeAfterRule$1.evaluate(AbstractBeforeAfterRule.java:45)
	at org.apache.lucene.util.TestRuleThreadAndTestName$1.evaluate(TestRuleThreadAndTestName.java:48)
	at org.apache.lucene.util.TestRuleIgnoreAfterMaxFailures$1.evaluate(TestRuleIgnoreAfterMaxFailures.java:64)
	at org.apache.lucene.util.TestRuleMarkFailure$1.evaluate(TestRuleMarkFailure.java:47)
	at com.carrotsearch.randomizedtesting.rules.StatementAdapter.evaluate(StatementAdapter.java:36)
	at com.carrotsearch.randomizedtesting.ThreadLeakControl$StatementRunner.run(ThreadLeakControl.java:368)
	at com.carrotsearch.randomizedtesting.ThreadLeakControl.forkTimeoutingTask(ThreadLeakControl.java:817)
	at com.carrotsearch.randomizedtesting.ThreadLeakControl$3.evaluate(ThreadLeakControl.java:468)
	at com.carrotsearch.randomizedtesting.RandomizedRunner.runSingleTest(RandomizedRunner.java:947)
	at com.carrotsearch.randomizedtesting.RandomizedRunner$5.evaluate(RandomizedRunner.java:832)
	at com.carrotsearch.randomizedtesting.RandomizedRunner$6.evaluate(RandomizedRunner.java:883)
	at com.carrotsearch.randomizedtesting.RandomizedRunner$7.evaluate(RandomizedRunner.java:894)
	at com.carrotsearch.randomizedtesting.rules.StatementAdapter.evaluate(StatementAdapter.java:36)
	at com.carrotsearch.randomizedtesting.rules.SystemPropertiesRestoreRule$1.evaluate(SystemPropertiesRestoreRule.java:57)
	at org.apache.lucene.util.AbstractBeforeAfterRule$1.evaluate(AbstractBeforeAfterRule.java:45)
	at com.carrotsearch.randomizedtesting.rules.StatementAdapter.evaluate(StatementAdapter.java:36)
	at org.apache.lucene.util.TestRuleStoreClassName$1.evaluate(TestRuleStoreClassName.java:41)
	at com.carrotsearch.randomizedtesting.rules.NoShadowingOrOverridesOnMethodsRule$1.evaluate(NoShadowingOrOverridesOnMethodsRule.java:40)
	at com.carrotsearch.randomizedtesting.rules.NoShadowingOrOverridesOnMethodsRule$1.evaluate(NoShadowingOrOverridesOnMethodsRule.java:40)
	at com.carrotsearch.randomizedtesting.rules.StatementAdapter.evaluate(StatementAdapter.java:36)
	at com.carrotsearch.randomizedtesting.rules.StatementAdapter.evaluate(StatementAdapter.java:36)
	at org.apache.lucene.util.TestRuleAssertionsRequired$1.evaluate(TestRuleAssertionsRequired.java:53)
	at org.apache.lucene.util.TestRuleMarkFailure$1.evaluate(TestRuleMarkFailure.java:47)
	at org.apache.lucene.util.TestRuleIgnoreAfterMaxFailures$1.evaluate(TestRuleIgnoreAfterMaxFailures.java:64)
	at org.apache.lucene.util.TestRuleIgnoreTestSuites$1.evaluate(TestRuleIgnoreTestSuites.java:54)
	at com.carrotsearch.randomizedtesting.rules.StatementAdapter.evaluate(StatementAdapter.java:36)
	at com.carrotsearch.randomizedtesting.ThreadLeakControl$StatementRunner.run(ThreadLeakControl.java:368)
	at java.base/java.lang.Thread.run(Thread.java:834)


FAILED:  org.apache.solr.update.processor.DistributedUpdateProcessorTest.testVersionDelete

Error Message:


Stack Trace:
java.lang.NullPointerException
	at __randomizedtesting.SeedInfo.seed([5ED48C678637330F:AD9AD8DADFDB1AB5]:0)
	at org.mockito.Mockito.spy(Mockito.java:1980)
	at org.apache.solr.update.processor.DistributedUpdateProcessorTest.runCommands(DistributedUpdateProcessorTest.java:144)
	at org.apache.solr.update.processor.DistributedUpdateProcessorTest.testVersionDelete(DistributedUpdateProcessorTest.java:125)
	at java.base/jdk.internal.reflect.NativeMethodAccessorImpl.invoke0(Native Method)
	at java.base/jdk.internal.reflect.NativeMethodAccessorImpl.invoke(NativeMethodAccessorImpl.java:62)
	at java.base/jdk.internal.reflect.DelegatingMethodAccessorImpl.invoke(DelegatingMethodAccessorImpl.java:43)
	at java.base/java.lang.reflect.Method.invoke(Method.java:566)
	at com.carrotsearch.randomizedtesting.RandomizedRunner.invoke(RandomizedRunner.java:1750)
	at com.carrotsearch.randomizedtesting.RandomizedRunner$8.evaluate(RandomizedRunner.java:938)
	at com.carrotsearch.randomizedtesting.RandomizedRunner$9.evaluate(RandomizedRunner.java:974)
	at com.carrotsearch.randomizedtesting.RandomizedRunner$10.evaluate(RandomizedRunner.java:988)
	at org.mockito.internal.junit.JUnitRule$1.evaluateSafely(JUnitRule.java:52)
	at org.mockito.internal.junit.JUnitRule$1.evaluate(JUnitRule.java:43)
	at com.carrotsearch.randomizedtesting.rules.SystemPropertiesRestoreRule$1.evaluate(SystemPropertiesRestoreRule.java:57)
	at org.apache.lucene.util.TestRuleSetupTeardownChained$1.evaluate(TestRuleSetupTeardownChained.java:49)
	at org.apache.lucene.util.AbstractBeforeAfterRule$1.evaluate(AbstractBeforeAfterRule.java:45)
	at org.apache.lucene.util.TestRuleThreadAndTestName$1.evaluate(TestRuleThreadAndTestName.java:48)
	at org.apache.lucene.util.TestRuleIgnoreAfterMaxFailures$1.evaluate(TestRuleIgnoreAfterMaxFailures.java:64)
	at org.apache.lucene.util.TestRuleMarkFailure$1.evaluate(TestRuleMarkFailure.java:47)
	at com.carrotsearch.randomizedtesting.rules.StatementAdapter.evaluate(StatementAdapter.java:36)
	at com.carrotsearch.randomizedtesting.ThreadLeakControl$StatementRunner.run(ThreadLeakControl.java:368)
	at com.carrotsearch.randomizedtesting.ThreadLeakControl.forkTimeoutingTask(ThreadLeakControl.java:817)
	at com.carrotsearch.randomizedtesting.ThreadLeakControl$3.evaluate(ThreadLeakControl.java:468)
	at com.carrotsearch.randomizedtesting.RandomizedRunner.runSingleTest(RandomizedRunner.java:947)
	at com.carrotsearch.randomizedtesting.RandomizedRunner$5.evaluate(RandomizedRunner.java:832)
	at com.carrotsearch.randomizedtesting.RandomizedRunner$6.evaluate(RandomizedRunner.java:883)
	at com.carrotsearch.randomizedtesting.RandomizedRunner$7.evaluate(RandomizedRunner.java:894)
	at com.carrotsearch.randomizedtesting.rules.StatementAdapter.evaluate(StatementAdapter.java:36)
	at com.carrotsearch.randomizedtesting.rules.SystemPropertiesRestoreRule$1.evaluate(SystemPropertiesRestoreRule.java:57)
	at org.apache.lucene.util.AbstractBeforeAfterRule$1.evaluate(AbstractBeforeAfterRule.java:45)
	at com.carrotsearch.randomizedtesting.rules.StatementAdapter.evaluate(StatementAdapter.java:36)
	at org.apache.lucene.util.TestRuleStoreClassName$1.evaluate(TestRuleStoreClassName.java:41)
	at com.carrotsearch.randomizedtesting.rules.NoShadowingOrOverridesOnMethodsRule$1.evaluate(NoShadowingOrOverridesOnMethodsRule.java:40)
	at com.carrotsearch.randomizedtesting.rules.NoShadowingOrOverridesOnMethodsRule$1.evaluate(NoShadowingOrOverridesOnMethodsRule.java:40)
	at com.carrotsearch.randomizedtesting.rules.StatementAdapter.evaluate(StatementAdapter.java:36)
	at com.carrotsearch.randomizedtesting.rules.StatementAdapter.evaluate(StatementAdapter.java:36)
	at org.apache.lucene.util.TestRuleAssertionsRequired$1.evaluate(TestRuleAssertionsRequired.java:53)
	at org.apache.lucene.util.TestRuleMarkFailure$1.evaluate(TestRuleMarkFailure.java:47)
	at org.apache.lucene.util.TestRuleIgnoreAfterMaxFailures$1.evaluate(TestRuleIgnoreAfterMaxFailures.java:64)
	at org.apache.lucene.util.TestRuleIgnoreTestSuites$1.evaluate(TestRuleIgnoreTestSuites.java:54)
	at com.carrotsearch.randomizedtesting.rules.StatementAdapter.evaluate(StatementAdapter.java:36)
	at com.carrotsearch.randomizedtesting.ThreadLeakControl$StatementRunner.run(ThreadLeakControl.java:368)
	at java.base/java.lang.Thread.run(Thread.java:834)


FAILED:  org.apache.solr.update.processor.DistributedUpdateProcessorTest.testVersionAdd

Error Message:


Stack Trace:
java.lang.NullPointerException
	at __randomizedtesting.SeedInfo.seed([5ED48C678637330F:F63E7F9A7127D3CA]:0)
	at org.mockito.Mockito.spy(Mockito.java:1980)
	at org.apache.solr.update.processor.DistributedUpdateProcessorTest.runCommands(DistributedUpdateProcessorTest.java:144)
	at org.apache.solr.update.processor.DistributedUpdateProcessorTest.testVersionAdd(DistributedUpdateProcessorTest.java:101)
	at java.base/jdk.internal.reflect.NativeMethodAccessorImpl.invoke0(Native Method)
	at java.base/jdk.internal.reflect.NativeMethodAccessorImpl.invoke(NativeMethodAccessorImpl.java:62)
	at java.base/jdk.internal.reflect.DelegatingMethodAccessorImpl.invoke(DelegatingMethodAccessorImpl.java:43)
	at java.base/java.lang.reflect.Method.invoke(Method.java:566)
	at com.carrotsearch.randomizedtesting.RandomizedRunner.invoke(RandomizedRunner.java:1750)
	at com.carrotsearch.randomizedtesting.RandomizedRunner$8.evaluate(RandomizedRunner.java:938)
	at com.carrotsearch.randomizedtesting.RandomizedRunner$9.evaluate(RandomizedRunner.java:974)
	at com.carrotsearch.randomizedtesting.RandomizedRunner$10.evaluate(RandomizedRunner.java:988)
	at org.mockito.internal.junit.JUnitRule$1.evaluateSafely(JUnitRule.java:52)
	at org.mockito.internal.junit.JUnitRule$1.evaluate(JUnitRule.java:43)
	at com.carrotsearch.randomizedtesting.rules.SystemPropertiesRestoreRule$1.evaluate(SystemPropertiesRestoreRule.java:57)
	at org.apache.lucene.util.TestRuleSetupTeardownChained$1.evaluate(TestRuleSetupTeardownChained.java:49)
	at org.apache.lucene.util.AbstractBeforeAfterRule$1.evaluate(AbstractBeforeAfterRule.java:45)
	at org.apache.lucene.util.TestRuleThreadAndTestName$1.evaluate(TestRuleThreadAndTestName.java:48)
	at org.apache.lucene.util.TestRuleIgnoreAfterMaxFailures$1.evaluate(TestRuleIgnoreAfterMaxFailures.java:64)
	at org.apache.lucene.util.TestRuleMarkFailure$1.evaluate(TestRuleMarkFailure.java:47)
	at com.carrotsearch.randomizedtesting.rules.StatementAdapter.evaluate(StatementAdapter.java:36)
	at com.carrotsearch.randomizedtesting.ThreadLeakControl$StatementRunner.run(ThreadLeakControl.java:368)
	at com.carrotsearch.randomizedtesting.ThreadLeakControl.forkTimeoutingTask(ThreadLeakControl.java:817)
	at com.carrotsearch.randomizedtesting.ThreadLeakControl$3.evaluate(ThreadLeakControl.java:468)
	at com.carrotsearch.randomizedtesting.RandomizedRunner.runSingleTest(RandomizedRunner.java:947)
	at com.carrotsearch.randomizedtesting.RandomizedRunner$5.evaluate(RandomizedRunner.java:832)
	at com.carrotsearch.randomizedtesting.RandomizedRunner$6.evaluate(RandomizedRunner.java:883)
	at com.carrotsearch.randomizedtesting.RandomizedRunner$7.evaluate(RandomizedRunner.java:894)
	at com.carrotsearch.randomizedtesting.rules.StatementAdapter.evaluate(StatementAdapter.java:36)
	at com.carrotsearch.randomizedtesting.rules.SystemPropertiesRestoreRule$1.evaluate(SystemPropertiesRestoreRule.java:57)
	at org.apache.lucene.util.AbstractBeforeAfterRule$1.evaluate(AbstractBeforeAfterRule.java:45)
	at com.carrotsearch.randomizedtesting.rules.StatementAdapter.evaluate(StatementAdapter.java:36)
	at org.apache.lucene.util.TestRuleStoreClassName$1.evaluate(TestRuleStoreClassName.java:41)
	at com.carrotsearch.randomizedtesting.rules.NoShadowingOrOverridesOnMethodsRule$1.evaluate(NoShadowingOrOverridesOnMethodsRule.java:40)
	at com.carrotsearch.randomizedtesting.rules.NoShadowingOrOverridesOnMethodsRule$1.evaluate(NoShadowingOrOverridesOnMethodsRule.java:40)
	at com.carrotsearch.randomizedtesting.rules.StatementAdapter.evaluate(StatementAdapter.java:36)
	at com.carrotsearch.randomizedtesting.rules.StatementAdapter.evaluate(StatementAdapter.java:36)
	at org.apache.lucene.util.TestRuleAssertionsRequired$1.evaluate(TestRuleAssertionsRequired.java:53)
	at org.apache.lucene.util.TestRuleMarkFailure$1.evaluate(TestRuleMarkFailure.java:47)
	at org.apache.lucene.util.TestRuleIgnoreAfterMaxFailures$1.evaluate(TestRuleIgnoreAfterMaxFailures.java:64)
	at org.apache.lucene.util.TestRuleIgnoreTestSuites$1.evaluate(TestRuleIgnoreTestSuites.java:54)
	at com.carrotsearch.randomizedtesting.rules.StatementAdapter.evaluate(StatementAdapter.java:36)
	at com.carrotsearch.randomizedtesting.ThreadLeakControl$StatementRunner.run(ThreadLeakControl.java:368)
	at java.base/java.lang.Thread.run(Thread.java:834)


FAILED:  org.apache.solr.update.processor.DistributedUpdateProcessorTest.testVersionDelete

Error Message:


Stack Trace:
java.lang.NullPointerException
	at __randomizedtesting.SeedInfo.seed([5ED48C678637330F:AD9AD8DADFDB1AB5]:0)
	at org.mockito.Mockito.spy(Mockito.java:1980)
	at org.apache.solr.update.processor.DistributedUpdateProcessorTest.runCommands(DistributedUpdateProcessorTest.java:144)
	at org.apache.solr.update.processor.DistributedUpdateProcessorTest.testVersionDelete(DistributedUpdateProcessorTest.java:125)
	at java.base/jdk.internal.reflect.NativeMethodAccessorImpl.invoke0(Native Method)
	at java.base/jdk.internal.reflect.NativeMethodAccessorImpl.invoke(NativeMethodAccessorImpl.java:62)
	at java.base/jdk.internal.reflect.DelegatingMethodAccessorImpl.invoke(DelegatingMethodAccessorImpl.java:43)
	at java.base/java.lang.reflect.Method.invoke(Method.java:566)
	at com.carrotsearch.randomizedtesting.RandomizedRunner.invoke(RandomizedRunner.java:1750)
	at com.carrotsearch.randomizedtesting.RandomizedRunner$8.evaluate(RandomizedRunner.java:938)
	at com.carrotsearch.randomizedtesting.RandomizedRunner$9.evaluate(RandomizedRunner.java:974)
	at com.carrotsearch.randomizedtesting.RandomizedRunner$10.evaluate(RandomizedRunner.java:988)
	at org.mockito.internal.junit.JUnitRule$1.evaluateSafely(JUnitRule.java:52)
	at org.mockito.internal.junit.JUnitRule$1.evaluate(JUnitRule.java:43)
	at com.carrotsearch.randomizedtesting.rules.SystemPropertiesRestoreRule$1.evaluate(SystemPropertiesRestoreRule.java:57)
	at org.apache.lucene.util.TestRuleSetupTeardownChained$1.evaluate(TestRuleSetupTeardownChained.java:49)
	at org.apache.lucene.util.AbstractBeforeAfterRule$1.evaluate(AbstractBeforeAfterRule.java:45)
	at org.apache.lucene.util.TestRuleThreadAndTestName$1.evaluate(TestRuleThreadAndTestName.java:48)
	at org.apache.lucene.util.TestRuleIgnoreAfterMaxFailures$1.evaluate(TestRuleIgnoreAfterMaxFailures.java:64)
	at org.apache.lucene.util.TestRuleMarkFailure$1.evaluate(TestRuleMarkFailure.java:47)
	at com.carrotsearch.randomizedtesting.rules.StatementAdapter.evaluate(StatementAdapter.java:36)
	at com.carrotsearch.randomizedtesting.ThreadLeakControl$StatementRunner.run(ThreadLeakControl.java:368)
	at com.carrotsearch.randomizedtesting.ThreadLeakControl.forkTimeoutingTask(ThreadLeakControl.java:817)
	at com.carrotsearch.randomizedtesting.ThreadLeakControl$3.evaluate(ThreadLeakControl.java:468)
	at com.carrotsearch.randomizedtesting.RandomizedRunner.runSingleTest(RandomizedRunner.java:947)
	at com.carrotsearch.randomizedtesting.RandomizedRunner$5.evaluate(RandomizedRunner.java:832)
	at com.carrotsearch.randomizedtesting.RandomizedRunner$6.evaluate(RandomizedRunner.java:883)
	at com.carrotsearch.randomizedtesting.RandomizedRunner$7.evaluate(RandomizedRunner.java:894)
	at com.carrotsearch.randomizedtesting.rules.StatementAdapter.evaluate(StatementAdapter.java:36)
	at com.carrotsearch.randomizedtesting.rules.SystemPropertiesRestoreRule$1.evaluate(SystemPropertiesRestoreRule.java:57)
	at org.apache.lucene.util.AbstractBeforeAfterRule$1.evaluate(AbstractBeforeAfterRule.java:45)
	at com.carrotsearch.randomizedtesting.rules.StatementAdapter.evaluate(StatementAdapter.java:36)
	at org.apache.lucene.util.TestRuleStoreClassName$1.evaluate(TestRuleStoreClassName.java:41)
	at com.carrotsearch.randomizedtesting.rules.NoShadowingOrOverridesOnMethodsRule$1.evaluate(NoShadowingOrOverridesOnMethodsRule.java:40)
	at com.carrotsearch.randomizedtesting.rules.NoShadowingOrOverridesOnMethodsRule$1.evaluate(NoShadowingOrOverridesOnMethodsRule.java:40)
	at com.carrotsearch.randomizedtesting.rules.StatementAdapter.evaluate(StatementAdapter.java:36)
	at com.carrotsearch.randomizedtesting.rules.StatementAdapter.evaluate(StatementAdapter.java:36)
	at org.apache.lucene.util.TestRuleAssertionsRequired$1.evaluate(TestRuleAssertionsRequired.java:53)
	at org.apache.lucene.util.TestRuleMarkFailure$1.evaluate(TestRuleMarkFailure.java:47)
	at org.apache.lucene.util.TestRuleIgnoreAfterMaxFailures$1.evaluate(TestRuleIgnoreAfterMaxFailures.java:64)
	at org.apache.lucene.util.TestRuleIgnoreTestSuites$1.evaluate(TestRuleIgnoreTestSuites.java:54)
	at com.carrotsearch.randomizedtesting.rules.StatementAdapter.evaluate(StatementAdapter.java:36)
	at com.carrotsearch.randomizedtesting.ThreadLeakControl$StatementRunner.run(ThreadLeakControl.java:368)
	at java.base/java.lang.Thread.run(Thread.java:834)


FAILED:  org.apache.solr.update.processor.DistributedUpdateProcessorTest.testVersionAdd

Error Message:


Stack Trace:
java.lang.NullPointerException
	at __randomizedtesting.SeedInfo.seed([5ED48C678637330F:F63E7F9A7127D3CA]:0)
	at org.mockito.Mockito.spy(Mockito.java:1980)
	at org.apache.solr.update.processor.DistributedUpdateProcessorTest.runCommands(DistributedUpdateProcessorTest.java:144)
	at org.apache.solr.update.processor.DistributedUpdateProcessorTest.testVersionAdd(DistributedUpdateProcessorTest.java:101)
	at java.base/jdk.internal.reflect.NativeMethodAccessorImpl.invoke0(Native Method)
	at java.base/jdk.internal.reflect.NativeMethodAccessorImpl.invoke(NativeMethodAccessorImpl.java:62)
	at java.base/jdk.internal.reflect.DelegatingMethodAccessorImpl.invoke(DelegatingMethodAccessorImpl.java:43)
	at java.base/java.lang.reflect.Method.invoke(Method.java:566)
	at com.carrotsearch.randomizedtesting.RandomizedRunner.invoke(RandomizedRunner.java:1750)
	at com.carrotsearch.randomizedtesting.RandomizedRunner$8.evaluate(RandomizedRunner.java:938)
	at com.carrotsearch.randomizedtesting.RandomizedRunner$9.evaluate(RandomizedRunner.java:974)
	at com.carrotsearch.randomizedtesting.RandomizedRunner$10.evaluate(RandomizedRunner.java:988)
	at org.mockito.internal.junit.JUnitRule$1.evaluateSafely(JUnitRule.java:52)
	at org.mockito.internal.junit.JUnitRule$1.evaluate(JUnitRule.java:43)
	at com.carrotsearch.randomizedtesting.rules.SystemPropertiesRestoreRule$1.evaluate(SystemPropertiesRestoreRule.java:57)
	at org.apache.lucene.util.TestRuleSetupTeardownChained$1.evaluate(TestRuleSetupTeardownChained.java:49)
	at org.apache.lucene.util.AbstractBeforeAfterRule$1.evaluate(AbstractBeforeAfterRule.java:45)
	at org.apache.lucene.util.TestRuleThreadAndTestName$1.evaluate(TestRuleThreadAndTestName.java:48)
	at org.apache.lucene.util.TestRuleIgnoreAfterMaxFailures$1.evaluate(TestRuleIgnoreAfterMaxFailures.java:64)
	at org.apache.lucene.util.TestRuleMarkFailure$1.evaluate(TestRuleMarkFailure.java:47)
	at com.carrotsearch.randomizedtesting.rules.StatementAdapter.evaluate(StatementAdapter.java:36)
	at com.carrotsearch.randomizedtesting.ThreadLeakControl$StatementRunner.run(ThreadLeakControl.java:368)
	at com.carrotsearch.randomizedtesting.ThreadLeakControl.forkTimeoutingTask(ThreadLeakControl.java:817)
	at com.carrotsearch.randomizedtesting.ThreadLeakControl$3.evaluate(ThreadLeakControl.java:468)
	at com.carrotsearch.randomizedtesting.RandomizedRunner.runSingleTest(RandomizedRunner.java:947)
	at com.carrotsearch.randomizedtesting.RandomizedRunner$5.evaluate(RandomizedRunner.java:832)
	at com.carrotsearch.randomizedtesting.RandomizedRunner$6.evaluate(RandomizedRunner.java:883)
	at com.carrotsearch.randomizedtesting.RandomizedRunner$7.evaluate(RandomizedRunner.java:894)
	at com.carrotsearch.randomizedtesting.rules.StatementAdapter.evaluate(StatementAdapter.java:36)
	at com.carrotsearch.randomizedtesting.rules.SystemPropertiesRestoreRule$1.evaluate(SystemPropertiesRestoreRule.java:57)
	at org.apache.lucene.util.AbstractBeforeAfterRule$1.evaluate(AbstractBeforeAfterRule.java:45)
	at com.carrotsearch.randomizedtesting.rules.StatementAdapter.evaluate(StatementAdapter.java:36)
	at org.apache.lucene.util.TestRuleStoreClassName$1.evaluate(TestRuleStoreClassName.java:41)
	at com.carrotsearch.randomizedtesting.rules.NoShadowingOrOverridesOnMethodsRule$1.evaluate(NoShadowingOrOverridesOnMethodsRule.java:40)
	at com.carrotsearch.randomizedtesting.rules.NoShadowingOrOverridesOnMethodsRule$1.evaluate(NoShadowingOrOverridesOnMethodsRule.java:40)
	at com.carrotsearch.randomizedtesting.rules.StatementAdapter.evaluate(StatementAdapter.java:36)
	at com.carrotsearch.randomizedtesting.rules.StatementAdapter.evaluate(StatementAdapter.java:36)
	at org.apache.lucene.util.TestRuleAssertionsRequired$1.evaluate(TestRuleAssertionsRequired.java:53)
	at org.apache.lucene.util.TestRuleMarkFailure$1.evaluate(TestRuleMarkFailure.java:47)
	at org.apache.lucene.util.TestRuleIgnoreAfterMaxFailures$1.evaluate(TestRuleIgnoreAfterMaxFailures.java:64)
	at org.apache.lucene.util.TestRuleIgnoreTestSuites$1.evaluate(TestRuleIgnoreTestSuites.java:54)
	at com.carrotsearch.randomizedtesting.rules.StatementAdapter.evaluate(StatementAdapter.java:36)
	at com.carrotsearch.randomizedtesting.ThreadLeakControl$StatementRunner.run(ThreadLeakControl.java:368)
	at java.base/java.lang.Thread.run(Thread.java:834)




Build Log:
[...truncated 15754 lines...]
   [junit4] Suite: org.apache.solr.update.processor.DistributedUpdateProcessorTest
   [junit4]   2> Creating dataDir: /home/jenkins/workspace/Lucene-Solr-8.x-Linux/solr/build/solr-core/test/J1/temp/solr.update.processor.DistributedUpdateProcessorTest_5ED48C678637330F-001/init-core-data-001
   [junit4]   2> 1974955 WARN  (SUITE-DistributedUpdateProcessorTest-seed#[5ED48C678637330F]-worker) [    ] o.a.s.SolrTestCaseJ4 startTrackingSearchers: numOpens=1 numCloses=1
   [junit4]   2> 1974955 INFO  (SUITE-DistributedUpdateProcessorTest-seed#[5ED48C678637330F]-worker) [    ] o.a.s.SolrTestCaseJ4 Using TrieFields (NUMERIC_POINTS_SYSPROP=false) w/NUMERIC_DOCVALUES_SYSPROP=false
   [junit4]   2> 1974955 INFO  (SUITE-DistributedUpdateProcessorTest-seed#[5ED48C678637330F]-worker) [    ] o.a.s.SolrTestCaseJ4 Randomized ssl (false) and clientAuth (false) via: @org.apache.solr.util.RandomizeSSL(reason="", ssl=0.0/0.0, value=0.0/0.0, clientAuth=0.0/0.0)
   [junit4]   2> 1974955 INFO  (SUITE-DistributedUpdateProcessorTest-seed#[5ED48C678637330F]-worker) [    ] o.a.s.SolrTestCaseJ4 SecureRandom sanity checks: test.solr.allowed.securerandom=null & java.security.egd=file:/dev/./urandom
   [junit4]   2> 1974955 INFO  (SUITE-DistributedUpdateProcessorTest-seed#[5ED48C678637330F]-worker) [    ] o.a.s.SolrTestCaseJ4 ####initCore
   [junit4]   2> 1974956 INFO  (SUITE-DistributedUpdateProcessorTest-seed#[5ED48C678637330F]-worker) [    ] o.a.s.c.SolrResourceLoader [null] Added 2 libs to classloader, from paths: [/home/jenkins/workspace/Lucene-Solr-8.x-Linux/solr/core/src/test-files/solr/collection1/lib, /home/jenkins/workspace/Lucene-Solr-8.x-Linux/solr/core/src/test-files/solr/collection1/lib/classes]
   [junit4]   2> 1974966 INFO  (SUITE-DistributedUpdateProcessorTest-seed#[5ED48C678637330F]-worker) [    ] o.a.s.c.SolrConfig Using Lucene MatchVersion: 8.2.0
   [junit4]   2> 1974994 INFO  (SUITE-DistributedUpdateProcessorTest-seed#[5ED48C678637330F]-worker) [    ] o.a.s.s.IndexSchema [null] Schema name=schema-minimal-with-another-uniqkey
   [junit4]   2> 1974994 INFO  (SUITE-DistributedUpdateProcessorTest-seed#[5ED48C678637330F]-worker) [    ] o.a.s.s.IndexSchema Loaded schema schema-minimal-with-another-uniqkey/1.1 with uniqueid field notid
   [junit4]   2> 1975069 INFO  (SUITE-DistributedUpdateProcessorTest-seed#[5ED48C678637330F]-worker) [    ] o.a.s.h.c.HttpShardHandlerFactory Host whitelist initialized: WhitelistHostChecker [whitelistHosts=null, whitelistHostCheckingEnabled=true]
   [junit4]   2> 1975070 WARN  (SUITE-DistributedUpdateProcessorTest-seed#[5ED48C678637330F]-worker) [    ] o.e.j.u.s.S.config No Client EndPointIdentificationAlgorithm configured for SslContextFactory@1edb4490[provider=null,keyStore=null,trustStore=null]
   [junit4]   2> 1975072 WARN  (SUITE-DistributedUpdateProcessorTest-seed#[5ED48C678637330F]-worker) [    ] o.e.j.u.s.S.config No Client EndPointIdentificationAlgorithm configured for SslContextFactory@2989fc27[provider=null,keyStore=null,trustStore=null]
   [junit4]   2> 1975080 INFO  (SUITE-DistributedUpdateProcessorTest-seed#[5ED48C678637330F]-worker) [    ] o.a.s.c.TransientSolrCoreCacheDefault Allocating transient cache for 2147483647 transient cores
   [junit4]   2> 1975080 INFO  (SUITE-DistributedUpdateProcessorTest-seed#[5ED48C678637330F]-worker) [    ] o.a.s.h.a.MetricsHistoryHandler No .system collection, keeping metrics history in memory.
   [junit4]   2> 1975088 INFO  (SUITE-DistributedUpdateProcessorTest-seed#[5ED48C678637330F]-worker) [    ] o.a.s.m.r.SolrJmxReporter JMX monitoring for 'solr.node' (registry 'solr.node') enabled at server: com.sun.jmx.mbeanserver.JmxMBeanServer@28c5dc6f
   [junit4]   2> 1975093 INFO  (SUITE-DistributedUpdateProcessorTest-seed#[5ED48C678637330F]-worker) [    ] o.a.s.m.r.SolrJmxReporter JMX monitoring for 'solr.jvm' (registry 'solr.jvm') enabled at server: com.sun.jmx.mbeanserver.JmxMBeanServer@28c5dc6f
   [junit4]   2> 1975093 INFO  (SUITE-DistributedUpdateProcessorTest-seed#[5ED48C678637330F]-worker) [    ] o.a.s.m.r.SolrJmxReporter JMX monitoring for 'solr.jetty' (registry 'solr.jetty') enabled at server: com.sun.jmx.mbeanserver.JmxMBeanServer@28c5dc6f
   [junit4]   2> 1975094 INFO  (coreLoadExecutor-13695-thread-1) [    x:collection1] o.a.s.c.SolrResourceLoader [null] Added 2 libs to classloader, from paths: [/home/jenkins/workspace/Lucene-Solr-8.x-Linux/solr/core/src/test-files/solr/collection1/lib, /home/jenkins/workspace/Lucene-Solr-8.x-Linux/solr/core/src/test-files/solr/collection1/lib/classes]
   [junit4]   2> 1975105 INFO  (coreLoadExecutor-13695-thread-1) [    x:collection1] o.a.s.c.SolrConfig Using Lucene MatchVersion: 8.2.0
   [junit4]   2> 1975128 INFO  (coreLoadExecutor-13695-thread-1) [    x:collection1] o.a.s.s.IndexSchema [collection1] Schema name=schema-minimal-with-another-uniqkey
   [junit4]   2> 1975129 INFO  (coreLoadExecutor-13695-thread-1) [    x:collection1] o.a.s.s.IndexSchema Loaded schema schema-minimal-with-another-uniqkey/1.1 with uniqueid field notid
   [junit4]   2> 1975129 INFO  (coreLoadExecutor-13695-thread-1) [    x:collection1] o.a.s.c.CoreContainer Creating SolrCore 'collection1' using configuration from instancedir /home/jenkins/workspace/Lucene-Solr-8.x-Linux/solr/core/src/test-files/solr/collection1, trusted=true
   [junit4]   2> 1975129 INFO  (coreLoadExecutor-13695-thread-1) [    x:collection1] o.a.s.m.r.SolrJmxReporter JMX monitoring for 'solr.core.collection1' (registry 'solr.core.collection1') enabled at server: com.sun.jmx.mbeanserver.JmxMBeanServer@28c5dc6f
   [junit4]   2> 1975129 INFO  (coreLoadExecutor-13695-thread-1) [    x:collection1] o.a.s.c.SolrCore [[collection1] ] Opening new SolrCore at [/home/jenkins/workspace/Lucene-Solr-8.x-Linux/solr/core/src/test-files/solr/collection1], dataDir=[/home/jenkins/workspace/Lucene-Solr-8.x-Linux/solr/build/solr-core/test/J1/temp/solr.update.processor.DistributedUpdateProcessorTest_5ED48C678637330F-001/init-core-data-001/]
   [junit4]   2> 1975130 INFO  (coreLoadExecutor-13695-thread-1) [    x:collection1] o.a.s.u.RandomMergePolicy RandomMergePolicy wrapping class org.apache.lucene.index.AlcoholicMergePolicy: [AlcoholicMergePolicy: minMergeSize=0, mergeFactor=10, maxMergeSize=539690193, maxMergeSizeForForcedMerge=9223372036854775807, calibrateSizeByDeletes=true, maxMergeDocs=2147483647, maxCFSSegmentSizeMB=8.796093022207999E12, noCFSRatio=0.1]
   [junit4]   2> 1975157 INFO  (coreLoadExecutor-13695-thread-1) [    x:collection1] o.a.s.u.CommitTracker Hard AutoCommit: disabled
   [junit4]   2> 1975157 INFO  (coreLoadExecutor-13695-thread-1) [    x:collection1] o.a.s.u.CommitTracker Soft AutoCommit: disabled
   [junit4]   2> 1975157 INFO  (coreLoadExecutor-13695-thread-1) [    x:collection1] o.a.s.u.RandomMergePolicy RandomMergePolicy wrapping class org.apache.lucene.index.TieredMergePolicy: [TieredMergePolicy: maxMergeAtOnce=27, maxMergeAtOnceExplicit=29, maxMergedSegmentMB=68.3232421875, floorSegmentMB=0.3583984375, forceMergeDeletesPctAllowed=17.353171465687172, segmentsPerTier=37.0, maxCFSSegmentSizeMB=8.796093022207999E12, noCFSRatio=0.0, deletesPctAllowed=45.31365908392238
   [junit4]   2> 1975157 INFO  (coreLoadExecutor-13695-thread-1) [    x:collection1] o.a.s.s.SolrIndexSearcher Opening [Searcher@7c5d41ce[collection1] main]
   [junit4]   2> 1975158 INFO  (coreLoadExecutor-13695-thread-1) [    x:collection1] o.a.s.h.c.SpellCheckComponent Initializing spell checkers
   [junit4]   2> 1975205 INFO  (coreLoadExecutor-13695-thread-1) [    x:collection1] o.a.s.s.DirectSolrSpellChecker init: {name=direct,classname=DirectSolrSpellChecker,field=lowerfilt,minQueryLength=3}
   [junit4]   2> 1975301 INFO  (coreLoadExecutor-13695-thread-1) [    x:collection1] o.a.s.h.ReplicationHandler Commits will be reserved for 10000ms.
   [junit4]   2> 1975301 INFO  (searcherExecutor-13696-thread-1-processing-x:collection1) [    x:collection1] o.a.s.h.c.SpellCheckComponent Loading spell index for spellchecker: default
   [junit4]   2> 1975302 INFO  (searcherExecutor-13696-thread-1-processing-x:collection1) [    x:collection1] o.a.s.h.c.SpellCheckComponent Loading spell index for spellchecker: direct
   [junit4]   2> 1975302 INFO  (searcherExecutor-13696-thread-1-processing-x:collection1) [    x:collection1] o.a.s.h.c.SpellCheckComponent Loading spell index for spellchecker: wordbreak
   [junit4]   2> 1975302 INFO  (searcherExecutor-13696-thread-1-processing-x:collection1) [    x:collection1] o.a.s.h.c.SpellCheckComponent Loading spell index for spellchecker: multipleFields
   [junit4]   2> 1975302 INFO  (searcherExecutor-13696-thread-1-processing-x:collection1) [    x:collection1] o.a.s.h.c.SpellCheckComponent Loading spell index for spellchecker: jarowinkler
   [junit4]   2> 1975302 INFO  (SUITE-DistributedUpdateProcessorTest-seed#[5ED48C678637330F]-worker) [    ] o.a.s.SolrTestCaseJ4 ####initCore end
   [junit4]   2> 1975302 INFO  (searcherExecutor-13696-thread-1-processing-x:collection1) [    x:collection1] o.a.s.h.c.SpellCheckComponent Loading spell index for spellchecker: external
   [junit4]   2> 1975302 INFO  (searcherExecutor-13696-thread-1-processing-x:collection1) [    x:collection1] o.a.s.h.c.SpellCheckComponent Loading spell index for spellchecker: freq
   [junit4]   2> 1975302 INFO  (searcherExecutor-13696-thread-1-processing-x:collection1) [    x:collection1] o.a.s.h.c.SpellCheckComponent Loading spell index for spellchecker: fqcn
   [junit4]   2> 1975303 INFO  (searcherExecutor-13696-thread-1-processing-x:collection1) [    x:collection1] o.a.s.h.c.SpellCheckComponent Loading spell index for spellchecker: perDict
   [junit4]   2> 1975303 INFO  (searcherExecutor-13696-thread-1-processing-x:collection1) [    x:collection1] o.a.s.c.SolrCore [collection1] Registered new searcher Searcher@7c5d41ce[collection1] main{ExitableDirectoryReader(UninvertingDirectoryReader())}
   [junit4]   2> 1975326 INFO  (TEST-DistributedUpdateProcessorTest.testShouldBufferUpdateZk-seed#[5ED48C678637330F]) [    ] o.a.s.SolrTestCaseJ4 ###Starting testShouldBufferUpdateZk
   [junit4]   2> 1975326 INFO  (TEST-DistributedUpdateProcessorTest.testShouldBufferUpdateZk-seed#[5ED48C678637330F]) [    ] o.a.s.SolrTestCaseJ4 ###Ending testShouldBufferUpdateZk
   [junit4]   2> 1975338 INFO  (TEST-DistributedUpdateProcessorTest.testVersionDelete-seed#[5ED48C678637330F]) [    ] o.a.s.SolrTestCaseJ4 ###Starting testVersionDelete
   [junit4]   2> 1975339 INFO  (TEST-DistributedUpdateProcessorTest.testVersionDelete-seed#[5ED48C678637330F]) [    ] o.a.s.SolrTestCaseJ4 ###Ending testVersionDelete
   [junit4]   2> NOTE: reproduce with: ant test  -Dtestcase=DistributedUpdateProcessorTest -Dtests.method=testVersionDelete -Dtests.seed=5ED48C678637330F -Dtests.multiplier=3 -Dtests.slow=true -Dtests.locale=saq-KE -Dtests.timezone=Pacific/Tahiti -Dtests.asserts=true -Dtests.file.encoding=US-ASCII
   [junit4] ERROR   0.01s J1 | DistributedUpdateProcessorTest.testVersionDelete <<<
   [junit4]    > Throwable #1: java.lang.NullPointerException
   [junit4]    > 	at __randomizedtesting.SeedInfo.seed([5ED48C678637330F:AD9AD8DADFDB1AB5]:0)
   [junit4]    > 	at org.mockito.Mockito.spy(Mockito.java:1980)
   [junit4]    > 	at org.apache.solr.update.processor.DistributedUpdateProcessorTest.runCommands(DistributedUpdateProcessorTest.java:144)
   [junit4]    > 	at org.apache.solr.update.processor.DistributedUpdateProcessorTest.testVersionDelete(DistributedUpdateProcessorTest.java:125)
   [junit4]    > 	at java.base/jdk.internal.reflect.NativeMethodAccessorImpl.invoke0(Native Method)
   [junit4]    > 	at java.base/jdk.internal.reflect.NativeMethodAccessorImpl.invoke(NativeMethodAccessorImpl.java:62)
   [junit4]    > 	at java.base/jdk.internal.reflect.DelegatingMethodAccessorImpl.invoke(DelegatingMethodAccessorImpl.java:43)
   [junit4]    > 	at java.base/java.lang.reflect.Method.invoke(Method.java:566)
   [junit4]    > 	at org.mockito.internal.junit.JUnitRule$1.evaluateSafely(JUnitRule.java:52)
   [junit4]    > 	at org.mockito.internal.junit.JUnitRule$1.evaluate(JUnitRule.java:43)
   [junit4]    > 	at java.base/java.lang.Thread.run(Thread.java:834)
   [junit4]   2> 1975349 INFO  (TEST-DistributedUpdateProcessorTest.testVersionAdd-seed#[5ED48C678637330F]) [    ] o.a.s.SolrTestCaseJ4 ###Starting testVersionAdd
   [junit4]   2> 1975350 INFO  (TEST-DistributedUpdateProcessorTest.testVersionAdd-seed#[5ED48C678637330F]) [    ] o.a.s.SolrTestCaseJ4 ###Ending testVersionAdd
   [junit4]   2> NOTE: reproduce with: ant test  -Dtestcase=DistributedUpdateProcessorTest -Dtests.method=testVersionAdd -Dtests.seed=5ED48C678637330F -Dtests.multiplier=3 -Dtests.slow=true -Dtests.locale=saq-KE -Dtests.timezone=Pacific/Tahiti -Dtests.asserts=true -Dtests.file.encoding=US-ASCII
   [junit4] ERROR   0.01s J1 | DistributedUpdateProcessorTest.testVersionAdd <<<
   [junit4]    > Throwable #1: java.lang.NullPointerException
   [junit4]    > 	at __randomizedtesting.SeedInfo.seed([5ED48C678637330F:F63E7F9A7127D3CA]:0)
   [junit4]    > 	at org.mockito.Mockito.spy(Mockito.java:1980)
   [junit4]    > 	at org.apache.solr.update.processor.DistributedUpdateProcessorTest.runCommands(DistributedUpdateProcessorTest.java:144)
   [junit4]    > 	at org.apache.solr.update.processor.DistributedUpdateProcessorTest.testVersionAdd(DistributedUpdateProcessorTest.java:101)
   [junit4]    > 	at java.base/jdk.internal.reflect.NativeMethodAccessorImpl.invoke0(Native Method)
   [junit4]    > 	at java.base/jdk.internal.reflect.NativeMethodAccessorImpl.invoke(NativeMethodAccessorImpl.java:62)
   [junit4]    > 	at java.base/jdk.internal.reflect.DelegatingMethodAccessorImpl.invoke(DelegatingMethodAccessorImpl.java:43)
   [junit4]    > 	at java.base/java.lang.reflect.Method.invoke(Method.java:566)
   [junit4]    > 	at org.mockito.internal.junit.JUnitRule$1.evaluateSafely(JUnitRule.java:52)
   [junit4]    > 	at org.mockito.internal.junit.JUnitRule$1.evaluate(JUnitRule.java:43)
   [junit4]    > 	at java.base/java.lang.Thread.run(Thread.java:834)
   [junit4]   2> 1975351 INFO  (SUITE-DistributedUpdateProcessorTest-seed#[5ED48C678637330F]-worker) [    ] o.a.s.SolrTestCaseJ4 ###deleteCore
   [junit4]   2> 1975351 INFO  (SUITE-DistributedUpdateProcessorTest-seed#[5ED48C678637330F]-worker) [    ] o.a.s.c.CoreContainer Shutting down CoreContainer instance=2090514975
   [junit4]   2> 1975351 INFO  (coreCloseExecutor-13700-thread-1) [    x:collection1] o.a.s.c.SolrCore [collection1]  CLOSING SolrCore org.apache.solr.core.SolrCore@d0ca9e7
   [junit4]   2> 1975351 INFO  (coreCloseExecutor-13700-thread-1) [    x:collection1] o.a.s.m.SolrMetricManager Closing metric reporters for registry=solr.core.collection1, tag=d0ca9e7
   [junit4]   2> 1975351 INFO  (coreCloseExecutor-13700-thread-1) [    x:collection1] o.a.s.m.r.SolrJmxReporter Closing reporter [org.apache.solr.metrics.reporters.SolrJmxReporter@7fcbec9f: rootName = null, domain = solr.core.collection1, service url = null, agent id = null] for registry solr.core.collection1 / com.codahale.metrics.MetricRegistry@37feff41
   [junit4]   2> 1975359 INFO  (SUITE-DistributedUpdateProcessorTest-seed#[5ED48C678637330F]-worker) [    ] o.a.s.m.SolrMetricManager Closing metric reporters for registry=solr.node, tag=null
   [junit4]   2> 1975360 INFO  (SUITE-DistributedUpdateProcessorTest-seed#[5ED48C678637330F]-worker) [    ] o.a.s.m.r.SolrJmxReporter Closing reporter [org.apache.solr.metrics.reporters.SolrJmxReporter@4cf29010: rootName = null, domain = solr.node, service url = null, agent id = null] for registry solr.node / com.codahale.metrics.MetricRegistry@3201aee6
   [junit4]   2> 1975363 INFO  (SUITE-DistributedUpdateProcessorTest-seed#[5ED48C678637330F]-worker) [    ] o.a.s.m.SolrMetricManager Closing metric reporters for registry=solr.jvm, tag=null
   [junit4]   2> 1975363 INFO  (SUITE-DistributedUpdateProcessorTest-seed#[5ED48C678637330F]-worker) [    ] o.a.s.m.r.SolrJmxReporter Closing reporter [org.apache.solr.metrics.reporters.SolrJmxReporter@321fd5a5: rootName = null, domain = solr.jvm, service url = null, agent id = null] for registry solr.jvm / com.codahale.metrics.MetricRegistry@5c289d91
   [junit4]   2> 1975365 INFO  (SUITE-DistributedUpdateProcessorTest-seed#[5ED48C678637330F]-worker) [    ] o.a.s.m.SolrMetricManager Closing metric reporters for registry=solr.jetty, tag=null
   [junit4]   2> 1975365 INFO  (SUITE-DistributedUpdateProcessorTest-seed#[5ED48C678637330F]-worker) [    ] o.a.s.m.r.SolrJmxReporter Closing reporter [org.apache.solr.metrics.reporters.SolrJmxReporter@71926b02: rootName = null, domain = solr.jetty, service url = null, agent id = null] for registry solr.jetty / com.codahale.metrics.MetricRegistry@6ba6ce29
   [junit4]   2> NOTE: leaving temporary files on disk at: /home/jenkins/workspace/Lucene-Solr-8.x-Linux/solr/build/solr-core/test/J1/temp/solr.update.processor.DistributedUpdateProcessorTest_5ED48C678637330F-001
   [junit4]   2> NOTE: test params are: codec=Asserting(Lucene80): {}, docValues:{}, maxPointsInLeafNode=787, maxMBSortInHeap=6.091974380700316, sim=Asserting(org.apache.lucene.search.similarities.AssertingSimilarity@6b88fcf4), locale=saq-KE, timezone=Pacific/Tahiti
   [junit4]   2> NOTE: Linux 4.18.0-17-generic amd64/Oracle Corporation 11.0.2 (64-bit)/cpus=8,threads=1,free=298855640,total=531628032
   [junit4]   2> NOTE: All tests run in this JVM: [LeaderElectionIntegrationTest, TestUnifiedSolrHighlighter, TestSolr4Spatial, ReplicaListTransformerTest, DistributedExpandComponentTest, TestDocTermOrdsUninvertLimit, CoreAdminHandlerTest, AssignTest, ShardRoutingTest, HighlighterMaxOffsetTest, TestStressRecovery, ManagedSchemaRoundRobinCloudTest, StressHdfsTest, SortByFunctionTest, HttpPartitionTest, TriLevelCompositeIdRoutingTest, TestInPlaceUpdatesDistrib, IndexSizeTriggerTest, DeleteNodeTest, TestChildDocTransformerHierarchy, OrderedExecutorTest, TestMergePolicyConfig, SolrIndexMetricsTest, TestRandomCollapseQParserPlugin, DistributedSuggestComponentTest, DistributedFacetPivotLongTailTest, DirectSolrConnectionTest, RecoveryAfterSoftCommitTest, TestFuzzyAnalyzedSuggestions, TestStressVersions, TestSolrFieldCacheBean, V2StandaloneTest, TestExactSharedStatsCache, TestPushWriter, TestSha256AuthenticationProvider, MultiDestinationAuditLoggerTest, ExecutePlanActionTest, ShardsWhitelistTest, SolrJmxReporterCloudTest, SparseHLLTest, TestSimExecutePlanAction, CdcrReplicationHandlerTest, InfixSuggestersTest, RulesTest, TestDynamicFieldCollectionResource, TestMultiWordSynonyms, TestFiltering, HdfsBasicDistributedZkTest, TestBM25SimilarityFactory, VersionInfoTest, BJQParserTest, FullSolrCloudDistribCmdsTest, TestManagedSchema, XmlInterpolationTest, TestCoreContainer, BlockJoinFacetSimpleTest, Tagger2Test, ResourceLoaderTest, DistributedFacetSimpleRefinementLongTailTest, HdfsDirectoryTest, JSONWriterTest, OutOfBoxZkACLAndCredentialsProvidersTest, TestRandomFaceting, BasicDistributedZkTest, ConfigSetsAPITest, TestCollectionAPIs, PreAnalyzedUpdateProcessorTest, ClassificationUpdateProcessorFactoryTest, TestAddFieldRealTimeGet, TestSolrCloudWithKerberosAlt, TestCloudPseudoReturnFields, DateFieldTest, SignificantTermsQParserPluginTest, TestSimpleTextCodec, SpellCheckCollatorTest, ShardSplitTest, WrapperMergePolicyFactoryTest, HdfsTlogReplayBufferedWhileIndexingTest, SSLMigrationTest, OverseerTaskQueueTest, AdminHandlersProxyTest, TestMiniSolrCloudClusterSSL, DirectSolrSpellCheckerTest, MoreLikeThisHandlerTest, SpellingQueryConverterTest, TestJsonFacets, TestTolerantSearch, TestOmitPositions, MigrateRouteKeyTest, ScriptEngineTest, TestNestedDocsSort, SplitShardTest, DistanceUnitsTest, PeerSyncTest, SecurityConfHandlerTest, SuggesterFSTTest, TestRandomRequestDistribution, TestPayloadCheckQParserPlugin, TestWithCollection, JavabinLoaderTest, TestCodecSupport, TestXIncludeConfig, TestSolrCloudWithHadoopAuthPlugin, StatsComponentTest, IgnoreLargeDocumentProcessorFactoryTest, NodeLostTriggerTest, TestStressInPlaceUpdates, TestCloudInspectUtil, RemoteQueryErrorTest, ClusterStateTest, TestNamedUpdateProcessors, TransactionLogTest, TestRetrieveFieldsOptimizer, TestDistributedStatsComponentCardinality, TestNumericTokenStream, MetricsHandlerTest, SearchRateTriggerIntegrationTest, SolrCloudReportersTest, DistribJoinFromCollectionTest, ExitableDirectoryReaderTest, TestValueSourceCache, TestQuerySenderNoQuery, AutoAddReplicasPlanActionTest, TestExceedMaxTermLength, TokenizerChainTest, TestCloudJSONFacetJoinDomain, QueryResultKeyTest, FullHLLTest, TestDynamicURP, MetricsConfigTest, ZkStateWriterTest, TestWriterPerf, OverseerModifyCollectionTest, TestHighlightDedupGrouping, TestLuceneMatchVersion, TestEmbeddedSolrServerConstructors, HdfsRestartWhileUpdatingTest, TestUseDocValuesAsStored2, AuditLoggerIntegrationTest, ConcurrentDeleteAndCreateCollectionTest, TestDocumentBuilder, PathHierarchyTokenizerFactoryTest, ProtectedTermFilterFactoryTest, TestCharFilters, TestJettySolrRunner, ConnectionReuseTest, AddReplicaTest, AssignBackwardCompatibilityTest, ChaosMonkeyNothingIsSafeWithPullReplicasTest, ChaosMonkeySafeLeaderWithPullReplicasTest, CollectionPropsTest, CreateCollectionCleanupTest, CreateRoutedAliasTest, DeleteInactiveReplicaTest, DeleteShardTest, DeleteStatusTest, DistribCursorPagingTest, DocValuesNotIndexedTest, ForceLeaderTest, LeaderFailoverAfterPartitionTest, LegacyCloudClusterPropTest, MetricsHistoryIntegrationTest, MoveReplicaHDFSFailoverTest, MoveReplicaHDFSTest, MoveReplicaTest, SystemCollectionCompatTest, TestAuthenticationFramework, TestCloudRecovery2, TestCloudSearcherWarming, TestLeaderElectionZkExpiry, TestPullReplica, TestPullReplicaErrorHandling, TestTlogReplica, TestTolerantUpdateProcessorCloud, VMParamsZkACLAndCredentialsProvidersTest, ZkControllerTest, ZkFailoverTest, CollectionTooManyReplicasTest, TestCollectionsAPIViaSolrCloudCluster, TestLocalFSCloudBackupRestore, TestRequestStatusCollectionAPI, NodeAddedTriggerTest, ScheduledTriggerIntegrationTest, SystemLogListenerTest, TriggerEventQueueTest, TriggerIntegrationTest, CdcrVersionReplicationTest, CachingDirectoryFactoryTest, TestSolrDeletionPolicy1, TestSolrDeletionPolicy2, TestSolrCloudSnapshots, TestReplicationHandlerBackup, TestReplicationHandlerDiskOverFlow, TestReqParamsAPI, TestRestoreCore, TestSQLHandler, TestSolrConfigHandlerConcurrent, CoreAdminRequestStatusTest, CoreMergeIndexesAdminHandlerTest, DaemonStreamApiTest, StatsReloadRaceTest, CustomHighlightComponentTest, DistributedMLTComponentTest, DistributedQueryComponentOptimizationTest, TermVectorComponentTest, TestHttpShardHandlerFactory, TestPivotHelperCode, TestTrackingShardHandlerFactory, SolrMetricsIntegrationTest, SimpleFacetsTest, TestRemoteStreaming, TestBinaryResponseWriter, TestCSVResponseWriter, TestGeoJSONResponseWriter, TestJavabinTupleStreamParser, TestSubQueryTransformerDistrib, TestFieldCollectionResource, TestFieldResource, TestFieldTypeCollectionResource, TestSchemaNameResource, TestSchemaSimilarityResource, TestSchemaVersionResource, TestManagedStopFilterFactory, TestManagedSynonymGraphFilterFactory, BooleanFieldTest, ChangedSchemaMergeTest, DocValuesMissingTest, DocValuesTest, PreAnalyzedFieldTest, PrimitiveFieldTypeTest, RequiredFieldsTest, SchemaApiFailureTest, TestCloudManagedSchema, TestCollationField, TestCollationFieldDocValues, TestSchemaManager, TestSortableTextField, AnalyticsQueryTest, CurrencyRangeFacetCloudTest, QueryEqualityTest, QueryParsingTest, RankQueryTest, TestComplexPhraseQParserPlugin, TestCustomSort, TestElisionMultitermQuery, TestFastLRUCache, TestFieldSortValues, TestGraphTermsQParserPlugin, TestIndexSearcher, TestMaxScoreQueryParser, TestPseudoReturnFields, TestQueryUtils, TestRealTimeGet, TestRecoveryHdfs, TestIndexingPerformance, TestNestedUpdateProcessor, AtomicUpdateProcessorFactoryTest, AtomicUpdateRemovalJavabinTest, AtomicUpdatesTest, ClassificationUpdateProcessorTest, CloneFieldUpdateProcessorFactoryTest, DefaultValueUpdateProcessorTest, DistributedUpdateProcessorTest]
   [junit4] Completed [821/855 (1!)] on J1 in 0.50s, 3 tests, 2 errors <<< FAILURES!

[...truncated 43224 lines...]
[repro] Jenkins log URL: https://jenkins.thetaphi.de/job/Lucene-Solr-8.x-Linux/514/consoleText

[repro] Revision: 3d9d72ba690792537bd82b418eb868a172b8acea

[repro] Ant options: "-Dargs=-XX:-UseCompressedOops -XX:+UseParallelGC"
[repro] Repro line:  ant test  -Dtestcase=DistributedUpdateProcessorTest -Dtests.method=testVersionDelete -Dtests.seed=5ED48C678637330F -Dtests.multiplier=3 -Dtests.slow=true -Dtests.locale=saq-KE -Dtests.timezone=Pacific/Tahiti -Dtests.asserts=true -Dtests.file.encoding=US-ASCII

[repro] Repro line:  ant test  -Dtestcase=DistributedUpdateProcessorTest -Dtests.method=testVersionAdd -Dtests.seed=5ED48C678637330F -Dtests.multiplier=3 -Dtests.slow=true -Dtests.locale=saq-KE -Dtests.timezone=Pacific/Tahiti -Dtests.asserts=true -Dtests.file.encoding=US-ASCII

[repro] ant clean

[...truncated 6 lines...]
[repro] Test suites by module:
[repro]    solr/core
[repro]       DistributedUpdateProcessorTest
[repro] ant compile-test

[...truncated 3581 lines...]
[repro] ant test-nocompile -Dtests.dups=5 -Dtests.maxfailures=5 -Dtests.class="*.DistributedUpdateProcessorTest" -Dtests.showOutput=onerror "-Dargs=-XX:-UseCompressedOops -XX:+UseParallelGC" -Dtests.seed=5ED48C678637330F -Dtests.multiplier=3 -Dtests.slow=true -Dtests.locale=saq-KE -Dtests.timezone=Pacific/Tahiti -Dtests.asserts=true -Dtests.file.encoding=US-ASCII

[...truncated 32 lines...]
   [junit4] Suite: org.apache.solr.update.processor.DistributedUpdateProcessorTest
   [junit4]   2> Creating dataDir: /home/jenkins/workspace/Lucene-Solr-8.x-Linux/solr/build/solr-core/test/J2/temp/solr.update.processor.DistributedUpdateProcessorTest_5ED48C678637330F-001/init-core-data-001
   [junit4]   2> 2441 INFO  (SUITE-DistributedUpdateProcessorTest-seed#[5ED48C678637330F]-worker) [    ] o.a.s.SolrTestCaseJ4 Using TrieFields (NUMERIC_POINTS_SYSPROP=false) w/NUMERIC_DOCVALUES_SYSPROP=false
   [junit4]   2> 2474 INFO  (SUITE-DistributedUpdateProcessorTest-seed#[5ED48C678637330F]-worker) [    ] o.e.j.u.log Logging initialized @2500ms to org.eclipse.jetty.util.log.Slf4jLog
   [junit4]   2> 2481 INFO  (SUITE-DistributedUpdateProcessorTest-seed#[5ED48C678637330F]-worker) [    ] o.a.s.SolrTestCaseJ4 Randomized ssl (false) and clientAuth (false) via: @org.apache.solr.util.RandomizeSSL(reason="", value=0.0/0.0, ssl=0.0/0.0, clientAuth=0.0/0.0)
   [junit4]   2> 2500 INFO  (SUITE-DistributedUpdateProcessorTest-seed#[5ED48C678637330F]-worker) [    ] o.a.s.SolrTestCaseJ4 SecureRandom sanity checks: test.solr.allowed.securerandom=null & java.security.egd=file:/dev/./urandom
   [junit4]   2> 2518 INFO  (SUITE-DistributedUpdateProcessorTest-seed#[5ED48C678637330F]-worker) [    ] o.a.s.SolrTestCaseJ4 ####initCore
   [junit4]   2> 2583 INFO  (SUITE-DistributedUpdateProcessorTest-seed#[5ED48C678637330F]-worker) [    ] o.a.s.c.SolrResourceLoader Using system property solr.solr.home: /home/jenkins/workspace/Lucene-Solr-8.x-Linux/solr/core/src/test-files/solr
   [junit4]   2> 2586 INFO  (SUITE-DistributedUpdateProcessorTest-seed#[5ED48C678637330F]-worker) [    ] o.a.s.c.SolrResourceLoader [null] Added 2 libs to classloader, from paths: [/home/jenkins/workspace/Lucene-Solr-8.x-Linux/solr/core/src/test-files/solr/collection1/lib, /home/jenkins/workspace/Lucene-Solr-8.x-Linux/solr/core/src/test-files/solr/collection1/lib/classes]
   [junit4]   2> 2843 INFO  (SUITE-DistributedUpdateProcessorTest-seed#[5ED48C678637330F]-worker) [    ] o.a.s.c.SolrConfig Using Lucene MatchVersion: 8.2.0
   [junit4]   2> 3107 INFO  (SUITE-DistributedUpdateProcessorTest-seed#[5ED48C678637330F]-worker) [    ] o.a.s.s.IndexSchema [null] Schema name=schema-minimal-with-another-uniqkey
   [junit4]   2> 3125 INFO  (SUITE-DistributedUpdateProcessorTest-seed#[5ED48C678637330F]-worker) [    ] o.a.s.s.IndexSchema Loaded schema schema-minimal-with-another-uniqkey/1.1 with uniqueid field notid
   [junit4]   2> 3567 INFO  (SUITE-DistributedUpdateProcessorTest-seed#[5ED48C678637330F]-worker) [    ] o.a.s.h.c.HttpShardHandlerFactory Host whitelist initialized: WhitelistHostChecker [whitelistHosts=null, whitelistHostCheckingEnabled=true]
   [junit4]   2> 3826 WARN  (SUITE-DistributedUpdateProcessorTest-seed#[5ED48C678637330F]-worker) [    ] o.e.j.u.s.S.config No Client EndPointIdentificationAlgorithm configured for SslContextFactory@11903819[provider=null,keyStore=null,trustStore=null]
   [junit4]   2> 3982 WARN  (SUITE-DistributedUpdateProcessorTest-seed#[5ED48C678637330F]-worker) [    ] o.e.j.u.s.S.config No Client EndPointIdentificationAlgorithm configured for SslContextFactory@275a158f[provider=null,keyStore=null,trustStore=null]
   [junit4]   2> 4349 INFO  (SUITE-DistributedUpdateProcessorTest-seed#[5ED48C678637330F]-worker) [    ] o.a.s.c.TransientSolrCoreCacheDefault Allocating transient cache for 2147483647 transient cores
   [junit4]   2> 4350 INFO  (SUITE-DistributedUpdateProcessorTest-seed#[5ED48C678637330F]-worker) [    ] o.a.s.h.a.MetricsHistoryHandler No .system collection, keeping metrics history in memory.
   [junit4]   2> 4449 INFO  (SUITE-DistributedUpdateProcessorTest-seed#[5ED48C678637330F]-worker) [    ] o.a.s.m.r.SolrJmxReporter JMX monitoring for 'solr.node' (registry 'solr.node') enabled at server: com.sun.jmx.mbeanserver.JmxMBeanServer@4e6606b4
   [junit4]   2> 4451 INFO  (SUITE-DistributedUpdateProcessorTest-seed#[5ED48C678637330F]-worker) [    ] o.a.s.m.r.SolrJmxReporter JMX monitoring for 'solr.jvm' (registry 'solr.jvm') enabled at server: com.sun.jmx.mbeanserver.JmxMBeanServer@4e6606b4
   [junit4]   2> 4451 INFO  (SUITE-DistributedUpdateProcessorTest-seed#[5ED48C678637330F]-worker) [    ] o.a.s.m.r.SolrJmxReporter JMX monitoring for 'solr.jetty' (registry 'solr.jetty') enabled at server: com.sun.jmx.mbeanserver.JmxMBeanServer@4e6606b4
   [junit4]   2> 4487 INFO  (coreLoadExecutor-9-thread-1) [    x:collection1] o.a.s.c.SolrResourceLoader [null] Added 2 libs to classloader, from paths: [/home/jenkins/workspace/Lucene-Solr-8.x-Linux/solr/core/src/test-files/solr/collection1/lib, /home/jenkins/workspace/Lucene-Solr-8.x-Linux/solr/core/src/test-files/solr/collection1/lib/classes]
   [junit4]   2> 4564 INFO  (coreLoadExecutor-9-thread-1) [    x:collection1] o.a.s.c.SolrConfig Using Lucene MatchVersion: 8.2.0
   [junit4]   2> 4639 INFO  (coreLoadExecutor-9-thread-1) [    x:collection1] o.a.s.s.IndexSchema [collection1] Schema name=schema-minimal-with-another-uniqkey
   [junit4]   2> 4642 INFO  (coreLoadExecutor-9-thread-1) [    x:collection1] o.a.s.s.IndexSchema Loaded schema schema-minimal-with-another-uniqkey/1.1 with uniqueid field notid
   [junit4]   2> 4643 INFO  (coreLoadExecutor-9-thread-1) [    x:collection1] o.a.s.c.CoreContainer Creating SolrCore 'collection1' using configuration from instancedir /home/jenkins/workspace/Lucene-Solr-8.x-Linux/solr/core/src/test-files/solr/collection1, trusted=true
   [junit4]   2> 4669 INFO  (coreLoadExecutor-9-thread-1) [    x:collection1] o.a.s.m.r.SolrJmxReporter JMX monitoring for 'solr.core.collection1' (registry 'solr.core.collection1') enabled at server: com.sun.jmx.mbeanserver.JmxMBeanServer@4e6606b4
   [junit4]   2> 4682 INFO  (coreLoadExecutor-9-thread-1) [    x:collection1] o.a.s.c.SolrCore [[collection1] ] Opening new SolrCore at [/home/jenkins/workspace/Lucene-Solr-8.x-Linux/solr/core/src/test-files/solr/collection1], dataDir=[/home/jenkins/workspace/Lucene-Solr-8.x-Linux/solr/build/solr-core/test/J2/temp/solr.update.processor.DistributedUpdateProcessorTest_5ED48C678637330F-001/init-core-data-001/]
   [junit4]   2> 4717 INFO  (coreLoadExecutor-9-thread-1) [    x:collection1] o.a.s.u.RandomMergePolicy RandomMergePolicy wrapping class org.apache.lucene.index.AlcoholicMergePolicy: [AlcoholicMergePolicy: minMergeSize=0, mergeFactor=10, maxMergeSize=539690193, maxMergeSizeForForcedMerge=9223372036854775807, calibrateSizeByDeletes=true, maxMergeDocs=2147483647, maxCFSSegmentSizeMB=8.796093022207999E12, noCFSRatio=0.1]
   [junit4]   2> 5217 INFO  (coreLoadExecutor-9-thread-1) [    x:collection1] o.a.s.u.CommitTracker Hard AutoCommit: disabled
   [junit4]   2> 5217 INFO  (coreLoadExecutor-9-thread-1) [    x:collection1] o.a.s.u.CommitTracker Soft AutoCommit: disabled
   [junit4]   2> 5220 INFO  (coreLoadExecutor-9-thread-1) [    x:collection1] o.a.s.u.RandomMergePolicy RandomMergePolicy wrapping class org.apache.lucene.index.TieredMergePolicy: [TieredMergePolicy: maxMergeAtOnce=27, maxMergeAtOnceExplicit=29, maxMergedSegmentMB=68.3232421875, floorSegmentMB=0.3583984375, forceMergeDeletesPctAllowed=17.353171465687172, segmentsPerTier=37.0, maxCFSSegmentSizeMB=8.796093022207999E12, noCFSRatio=0.0, deletesPctAllowed=45.31365908392238
   [junit4]   2> 5228 INFO  (coreLoadExecutor-9-thread-1) [    x:collection1] o.a.s.s.SolrIndexSearcher Opening [Searcher@46439476[collection1] main]
   [junit4]   2> 5255 INFO  (coreLoadExecutor-9-thread-1) [    x:collection1] o.a.s.h.c.SpellCheckComponent Initializing spell checkers
   [junit4]   2> 5325 INFO  (coreLoadExecutor-9-thread-1) [    x:collection1] o.a.s.s.DirectSolrSpellChecker init: {name=direct,classname=DirectSolrSpellChecker,field=lowerfilt,minQueryLength=3}
   [junit4]   2> 5487 INFO  (coreLoadExecutor-9-thread-1) [    x:collection1] o.a.s.h.ReplicationHandler Commits will be reserved for 10000ms.
   [junit4]   2> 5488 INFO  (searcherExecutor-10-thread-1-processing-x:collection1) [    x:collection1] o.a.s.h.c.SpellCheckComponent Loading spell index for spellchecker: default
   [junit4]   2> 5493 INFO  (SUITE-DistributedUpdateProcessorTest-seed#[5ED48C678637330F]-worker) [    ] o.a.s.SolrTestCaseJ4 ####initCore end
   [junit4]   2> 5494 INFO  (searcherExecutor-10-thread-1-processing-x:collection1) [    x:collection1] o.a.s.h.c.SpellCheckComponent Loading spell index for spellchecker: direct
   [junit4]   2> 5494 INFO  (searcherExecutor-10-thread-1-processing-x:collection1) [    x:collection1] o.a.s.h.c.SpellCheckComponent Loading spell index for spellchecker: wordbreak
   [junit4]   2> 5494 INFO  (searcherExecutor-10-thread-1-processing-x:collection1) [    x:collection1] o.a.s.h.c.SpellCheckComponent Loading spell index for spellchecker: multipleFields
   [junit4]   2> 5495 INFO  (searcherExecutor-10-thread-1-processing-x:collection1) [    x:collection1] o.a.s.h.c.SpellCheckComponent Loading spell index for spellchecker: jarowinkler
   [junit4]   2> 5496 INFO  (searcherExecutor-10-thread-1-processing-x:collection1) [    x:collection1] o.a.s.h.c.SpellCheckComponent Loading spell index for spellchecker: external
   [junit4]   2> 5497 INFO  (searcherExecutor-10-thread-1-processing-x:collection1) [    x:collection1] o.a.s.h.c.SpellCheckComponent Loading spell index for spellchecker: freq
   [junit4]   2> 5498 INFO  (searcherExecutor-10-thread-1-processing-x:collection1) [    x:collection1] o.a.s.h.c.SpellCheckComponent Loading spell index for spellchecker: fqcn
   [junit4]   2> 5499 INFO  (searcherExecutor-10-thread-1-processing-x:collection1) [    x:collection1] o.a.s.h.c.SpellCheckComponent Loading spell index for spellchecker: perDict
   [junit4]   2> 5505 INFO  (searcherExecutor-10-thread-1-processing-x:collection1) [    x:collection1] o.a.s.c.SolrCore [collection1] Registered new searcher Searcher@46439476[collection1] main{ExitableDirectoryReader(UninvertingDirectoryReader())}
   [junit4]   2> 5843 INFO  (TEST-DistributedUpdateProcessorTest.testShouldBufferUpdateZk-seed#[5ED48C678637330F]) [    ] o.a.s.SolrTestCaseJ4 ###Starting testShouldBufferUpdateZk
   [junit4]   2> 5850 INFO  (TEST-DistributedUpdateProcessorTest.testShouldBufferUpdateZk-seed#[5ED48C678637330F]) [    ] o.a.s.SolrTestCaseJ4 ###Ending testShouldBufferUpdateZk
   [junit4] OK      0.36s J2 | DistributedUpdateProcessorTest.testShouldBufferUpdateZk
   [junit4]   2> 5863 INFO  (TEST-DistributedUpdateProcessorTest.testVersionDelete-seed#[5ED48C678637330F]) [    ] o.a.s.SolrTestCaseJ4 ###Starting testVersionDelete
   [junit4]   2> 5864 INFO  (TEST-DistributedUpdateProcessorTest.testVersionDelete-seed#[5ED48C678637330F]) [    ] o.a.s.SolrTestCaseJ4 ###Ending testVersionDelete
   [junit4]   2> NOTE: reproduce with: ant test  -Dtestcase=DistributedUpdateProcessorTest -Dtests.method=testVersionDelete -Dtests.seed=5ED48C678637330F -Dtests.multiplier=3 -Dtests.slow=true -Dtests.badapples=true -Dtests.locale=saq-KE -Dtests.timezone=Pacific/Tahiti -Dtests.asserts=true -Dtests.file.encoding=US-ASCII
   [junit4] ERROR   0.01s J2 | DistributedUpdateProcessorTest.testVersionDelete <<<
   [junit4]    > Throwable #1: java.lang.NullPointerException
   [junit4]    > 	at __randomizedtesting.SeedInfo.seed([5ED48C678637330F:AD9AD8DADFDB1AB5]:0)
   [junit4]    > 	at org.mockito.Mockito.spy(Mockito.java:1980)
   [junit4]    > 	at org.apache.solr.update.processor.DistributedUpdateProcessorTest.runCommands(DistributedUpdateProcessorTest.java:144)
   [junit4]    > 	at org.apache.solr.update.processor.DistributedUpdateProcessorTest.testVersionDelete(DistributedUpdateProcessorTest.java:125)
   [junit4]    > 	at java.base/jdk.internal.reflect.NativeMethodAccessorImpl.invoke0(Native Method)
   [junit4]    > 	at java.base/jdk.internal.reflect.NativeMethodAccessorImpl.invoke(NativeMethodAccessorImpl.java:62)
   [junit4]    > 	at java.base/jdk.internal.reflect.DelegatingMethodAccessorImpl.invoke(DelegatingMethodAccessorImpl.java:43)
   [junit4]    > 	at java.base/java.lang.reflect.Method.invoke(Method.java:566)
   [junit4]    > 	at org.mockito.internal.junit.JUnitRule$1.evaluateSafely(JUnitRule.java:52)
   [junit4]    > 	at org.mockito.internal.junit.JUnitRule$1.evaluate(JUnitRule.java:43)
   [junit4]    > 	at java.base/java.lang.Thread.run(Thread.java:834)
   [junit4]   2> 5875 INFO  (TEST-DistributedUpdateProcessorTest.testVersionAdd-seed#[5ED48C678637330F]) [    ] o.a.s.SolrTestCaseJ4 ###Starting testVersionAdd
   [junit4]   2> NOTE: reproduce with: ant test  -Dtestcase=DistributedUpdateProcessorTest -Dtests.method=testVersionAdd -Dtests.seed=5ED48C678637330F -Dtests.multiplier=3 -Dtests.slow=true -Dtests.badapples=true -Dtests.locale=saq-KE -Dtests.timezone=Pacific/Tahiti -Dtests.asserts=true -Dtests.file.encoding=US-ASCII
   [junit4] ERROR   0.01s J2 | DistributedUpdateProcessorTest.testVersionAdd <<<
   [junit4]    > Throwable #1: java.lang.NullPointerException
   [junit4]    > 	at __randomizedtesting.SeedInfo.seed([5ED48C678637330F:F63E7F9A7127D3CA]:0)
   [junit4]    > 	at org.mockito.Mockito.spy(Mockito.java:1980)
   [junit4]    > 	at org.apache.solr.update.processor.DistributedUpdateProcessorTest.runCommands(DistributedUpdateProcessorTest.java:144)
   [junit4]    > 	at org.apache.solr.update.processor.DistributedUpdateProcessorTest.testVersionAdd(DistributedUpdateProcessorTest.java:101)
   [junit4]    > 	at java.base/jdk.internal.reflect.NativeMethodAccessorImpl.invoke0(Native Method)
   [junit4]    > 	at java.base/jdk.internal.reflect.NativeMethodAccessorImpl.invoke(NativeMethodAccessorImpl.java:62)
   [junit4]    > 	at java.base/jdk.internal.reflect.DelegatingMethodAccessorImpl.invoke(DelegatingMethodAccessorImpl.java:43)
   [junit4]    > 	at java.base/java.lang.reflect.Method.invoke(Method.java:566)
   [junit4]    > 	at org.mockito.internal.junit.JUnitRule$1.evaluateSafely(JUnitRule.java:52)
   [junit4]    > 	at org.mockito.internal.junit.JUnitRule$1.evaluate(JUnitRule.java:43)
   [junit4]    > 	at java.base/java.lang.Thread.run(Thread.java:834)
   [junit4]   2> 5876 INFO  (TEST-DistributedUpdateProcessorTest.testVersionAdd-seed#[5ED48C678637330F]) [    ] o.a.s.SolrTestCaseJ4 ###Ending testVersionAdd
   [junit4]   2> 5878 INFO  (SUITE-DistributedUpdateProcessorTest-seed#[5ED48C678637330F]-worker) [    ] o.a.s.SolrTestCaseJ4 ###deleteCore
   [junit4]   2> 5878 INFO  (SUITE-DistributedUpdateProcessorTest-seed#[5ED48C678637330F]-worker) [    ] o.a.s.c.CoreContainer Shutting down CoreContainer instance=543641543
   [junit4]   2> 5879 INFO  (coreCloseExecutor-14-thread-1) [    x:collection1] o.a.s.c.SolrCore [collection1]  CLOSING SolrCore org.apache.solr.core.SolrCore@5fe98cad
   [junit4]   2> 5879 INFO  (coreCloseExecutor-14-thread-1) [    x:collection1] o.a.s.m.SolrMetricManager Closing metric reporters for registry=solr.core.collection1, tag=5fe98cad
   [junit4]   2> 5880 INFO  (coreCloseExecutor-14-thread-1) [    x:collection1] o.a.s.m.r.SolrJmxReporter Closing reporter [org.apache.solr.metrics.reporters.SolrJmxReporter@567bf342: rootName = null, domain = solr.core.collection1, service url = null, agent id = null] for registry solr.core.collection1 / com.codahale.metrics.MetricRegistry@6fd65181
   [junit4]   2> 5921 INFO  (SUITE-DistributedUpdateProcessorTest-seed#[5ED48C678637330F]-worker) [    ] o.a.s.m.SolrMetricManager Closing metric reporters for registry=solr.node, tag=null
   [junit4]   2> 5921 INFO  (SUITE-DistributedUpdateProcessorTest-seed#[5ED48C678637330F]-worker) [    ] o.a.s.m.r.SolrJmxReporter Closing reporter [org.apache.solr.metrics.reporters.SolrJmxReporter@4e76854b: rootName = null, domain = solr.node, service url = null, agent id = null] for registry solr.node / com.codahale.metrics.MetricRegistry@7d3f4229
   [junit4]   2> 5929 INFO  (SUITE-DistributedUpdateProcessorTest-seed#[5ED48C678637330F]-worker) [    ] o.a.s.m.SolrMetricManager Closing metric reporters for registry=solr.jvm, tag=null
   [junit4]   2> 5929 INFO  (SUITE-DistributedUpdateProcessorTest-seed#[5ED48C678637330F]-worker) [    ] o.a.s.m.r.SolrJmxReporter Closing reporter [org.apache.solr.metrics.reporters.SolrJmxReporter@48217215: rootName = null, domain = solr.jvm, service url = null, agent id = null] for registry solr.jvm / com.codahale.metrics.MetricRegistry@41ae2062
   [junit4]   2> 5929 INFO  (SUITE-DistributedUpdateProcessorTest-seed#[5ED48C678637330F]-worker) [    ] o.a.s.m.SolrMetricManager Closing metric reporters for registry=solr.jetty, tag=null
   [junit4]   2> 5929 INFO  (SUITE-DistributedUpdateProcessorTest-seed#[5ED48C678637330F]-worker) [    ] o.a.s.m.r.SolrJmxReporter Closing reporter [org.apache.solr.metrics.reporters.SolrJmxReporter@87a587: rootName = null, domain = solr.jetty, service url = null, agent id = null] for registry solr.jetty / com.codahale.metrics.MetricRegistry@72738989
   [junit4]   2> NOTE: leaving temporary files on disk at: /home/jenkins/workspace/Lucene-Solr-8.x-Linux/solr/build/solr-core/test/J2/temp/solr.update.processor.DistributedUpdateProcessorTest_5ED48C678637330F-001
   [junit4]   2> NOTE: test params are: codec=Asserting(Lucene80): {}, docValues:{}, maxPointsInLeafNode=787, maxMBSortInHeap=6.091974380700316, sim=Asserting(org.apache.lucene.search.similarities.AssertingSimilarity@16b282b7), locale=saq-KE, timezone=Pacific/Tahiti
   [junit4]   2> NOTE: Linux 4.18.0-17-generic amd64/Oracle Corporation 11.0.2 (64-bit)/cpus=8,threads=2,free=354727672,total=502267904
   [junit4]   2> NOTE: All tests run in this JVM: [DistributedUpdateProcessorTest]
   [junit4] Completed [1/5 (1!)] on J2 in 5.24s, 3 tests, 2 errors <<< FAILURES!

[...truncated 1 lines...]
   [junit4] Suite: org.apache.solr.update.processor.DistributedUpdateProcessorTest
   [junit4]   2> Creating dataDir: /home/jenkins/workspace/Lucene-Solr-8.x-Linux/solr/build/solr-core/test/J0/temp/solr.update.processor.DistributedUpdateProcessorTest_5ED48C678637330F-001/init-core-data-001
   [junit4]   2> 2473 INFO  (SUITE-DistributedUpdateProcessorTest-seed#[5ED48C678637330F]-worker) [    ] o.a.s.SolrTestCaseJ4 Using TrieFields (NUMERIC_POINTS_SYSPROP=false) w/NUMERIC_DOCVALUES_SYSPROP=false
   [junit4]   2> 2505 INFO  (SUITE-DistributedUpdateProcessorTest-seed#[5ED48C678637330F]-worker) [    ] o.e.j.u.log Logging initialized @2534ms to org.eclipse.jetty.util.log.Slf4jLog
   [junit4]   2> 2514 INFO  (SUITE-DistributedUpdateProcessorTest-seed#[5ED48C678637330F]-worker) [    ] o.a.s.SolrTestCaseJ4 Randomized ssl (false) and clientAuth (false) via: @org.apache.solr.util.RandomizeSSL(reason="", value=0.0/0.0, ssl=0.0/0.0, clientAuth=0.0/0.0)
   [junit4]   2> 2529 INFO  (SUITE-DistributedUpdateProcessorTest-seed#[5ED48C678637330F]-worker) [    ] o.a.s.SolrTestCaseJ4 SecureRandom sanity checks: test.solr.allowed.securerandom=null & java.security.egd=file:/dev/./urandom
   [junit4]   2> 2544 INFO  (SUITE-DistributedUpdateProcessorTest-seed#[5ED48C678637330F]-worker) [    ] o.a.s.SolrTestCaseJ4 ####initCore
   [junit4]   2> 2617 INFO  (SUITE-DistributedUpdateProcessorTest-seed#[5ED48C678637330F]-worker) [    ] o.a.s.c.SolrResourceLoader Using system property solr.solr.home: /home/jenkins/workspace/Lucene-Solr-8.x-Linux/solr/core/src/test-files/solr
   [junit4]   2> 2619 INFO  (SUITE-DistributedUpdateProcessorTest-seed#[5ED48C678637330F]-worker) [    ] o.a.s.c.SolrResourceLoader [null] Added 2 libs to classloader, from paths: [/home/jenkins/workspace/Lucene-Solr-8.x-Linux/solr/core/src/test-files/solr/collection1/lib, /home/jenkins/workspace/Lucene-Solr-8.x-Linux/solr/core/src/test-files/solr/collection1/lib/classes]
   [junit4]   2> 2895 INFO  (SUITE-DistributedUpdateProcessorTest-seed#[5ED48C678637330F]-worker) [    ] o.a.s.c.SolrConfig Using Lucene MatchVersion: 8.2.0
   [junit4]   2> 3157 INFO  (SUITE-DistributedUpdateProcessorTest-seed#[5ED48C678637330F]-worker) [    ] o.a.s.s.IndexSchema [null] Schema name=schema-minimal-with-another-uniqkey
   [junit4]   2> 3170 INFO  (SUITE-DistributedUpdateProcessorTest-seed#[5ED48C678637330F]-worker) [    ] o.a.s.s.IndexSchema Loaded schema schema-minimal-with-another-uniqkey/1.1 with uniqueid field notid
   [junit4]   2> 3695 INFO  (SUITE-DistributedUpdateProcessorTest-seed#[5ED48C678637330F]-worker) [    ] o.a.s.h.c.HttpShardHandlerFactory Host whitelist initialized: WhitelistHostChecker [whitelistHosts=null, whitelistHostCheckingEnabled=true]
   [junit4]   2> 3967 WARN  (SUITE-DistributedUpdateProcessorTest-seed#[5ED48C678637330F]-worker) [    ] o.e.j.u.s.S.config No Client EndPointIdentificationAlgorithm configured for SslContextFactory@50d32d92[provider=null,keyStore=null,trustStore=null]
   [junit4]   2> 4128 WARN  (SUITE-DistributedUpdateProcessorTest-seed#[5ED48C678637330F]-worker) [    ] o.e.j.u.s.S.config No Client EndPointIdentificationAlgorithm configured for SslContextFactory@286f3275[provider=null,keyStore=null,trustStore=null]
   [junit4]   2> 4464 INFO  (SUITE-DistributedUpdateProcessorTest-seed#[5ED48C678637330F]-worker) [    ] o.a.s.c.TransientSolrCoreCacheDefault Allocating transient cache for 2147483647 transient cores
   [junit4]   2> 4465 INFO  (SUITE-DistributedUpdateProcessorTest-seed#[5ED48C678637330F]-worker) [    ] o.a.s.h.a.MetricsHistoryHandler No .system collection, keeping metrics history in memory.
   [junit4]   2> 4573 INFO  (SUITE-DistributedUpdateProcessorTest-seed#[5ED48C678637330F]-worker) [    ] o.a.s.m.r.SolrJmxReporter JMX monitoring for 'solr.node' (registry 'solr.node') enabled at server: com.sun.jmx.mbeanserver.JmxMBeanServer@4e6606b4
   [junit4]   2> 4574 INFO  (SUITE-DistributedUpdateProcessorTest-seed#[5ED48C678637330F]-worker) [    ] o.a.s.m.r.SolrJmxReporter JMX monitoring for 'solr.jvm' (registry 'solr.jvm') enabled at server: com.sun.jmx.mbeanserver.JmxMBeanServer@4e6606b4
   [junit4]   2> 4575 INFO  (SUITE-DistributedUpdateProcessorTest-seed#[5ED48C678637330F]-worker) [    ] o.a.s.m.r.SolrJmxReporter JMX monitoring for 'solr.jetty' (registry 'solr.jetty') enabled at server: com.sun.jmx.mbeanserver.JmxMBeanServer@4e6606b4
   [junit4]   2> 4632 INFO  (coreLoadExecutor-9-thread-1) [    x:collection1] o.a.s.c.SolrResourceLoader [null] Added 2 libs to classloader, from paths: [/home/jenkins/workspace/Lucene-Solr-8.x-Linux/solr/core/src/test-files/solr/collection1/lib, /home/jenkins/workspace/Lucene-Solr-8.x-Linux/solr/core/src/test-files/solr/collection1/lib/classes]
   [junit4]   2> 4697 INFO  (coreLoadExecutor-9-thread-1) [    x:collection1] o.a.s.c.SolrConfig Using Lucene MatchVersion: 8.2.0
   [junit4]   2> 4758 INFO  (coreLoadExecutor-9-thread-1) [    x:collection1] o.a.s.s.IndexSchema [collection1] Schema name=schema-minimal-with-another-uniqkey
   [junit4]   2> 4761 INFO  (coreLoadExecutor-9-thread-1) [    x:collection1] o.a.s.s.IndexSchema Loaded schema schema-minimal-with-another-uniqkey/1.1 with uniqueid field notid
   [junit4]   2> 4762 INFO  (coreLoadExecutor-9-thread-1) [    x:collection1] o.a.s.c.CoreContainer Creating SolrCore 'collection1' using configuration from instancedir /home/jenkins/workspace/Lucene-Solr-8.x-Linux/solr/core/src/test-files/solr/collection1, trusted=true
   [junit4]   2> 4788 INFO  (coreLoadExecutor-9-thread-1) [    x:collection1] o.a.s.m.r.SolrJmxReporter JMX monitoring for 'solr.core.collection1' (registry 'solr.core.collection1') enabled at server: com.sun.jmx.mbeanserver.JmxMBeanServer@4e6606b4
   [junit4]   2> 4801 INFO  (coreLoadExecutor-9-thread-1) [    x:collection1] o.a.s.c.SolrCore [[collection1] ] Opening new SolrCore at [/home/jenkins/workspace/Lucene-Solr-8.x-Linux/solr/core/src/test-files/solr/collection1], dataDir=[/home/jenkins/workspace/Lucene-Solr-8.x-Linux/solr/build/solr-core/test/J0/temp/solr.update.processor.DistributedUpdateProcessorTest_5ED48C678637330F-001/init-core-data-001/]
   [junit4]   2> 4843 INFO  (coreLoadExecutor-9-thread-1) [    x:collection1] o.a.s.u.RandomMergePolicy RandomMergePolicy wrapping class org.apache.lucene.index.AlcoholicMergePolicy: [AlcoholicMergePolicy: minMergeSize=0, mergeFactor=10, maxMergeSize=539690193, maxMergeSizeForForcedMerge=9223372036854775807, calibrateSizeByDeletes=true, maxMergeDocs=2147483647, maxCFSSegmentSizeMB=8.796093022207999E12, noCFSRatio=0.1]
   [junit4]   2> 5285 INFO  (coreLoadExecutor-9-thread-1) [    x:collection1] o.a.s.u.CommitTracker Hard AutoCommit: disabled
   [junit4]   2> 5285 INFO  (coreLoadExecutor-9-thread-1) [    x:collection1] o.a.s.u.CommitTracker Soft AutoCommit: disabled
   [junit4]   2> 5288 INFO  (coreLoadExecutor-9-thread-1) [    x:collection1] o.a.s.u.RandomMergePolicy RandomMergePolicy wrapping class org.apache.lucene.index.TieredMergePolicy: [TieredMergePolicy: maxMergeAtOnce=27, maxMergeAtOnceExplicit=29, maxMergedSegmentMB=68.3232421875, floorSegmentMB=0.3583984375, forceMergeDeletesPctAllowed=17.353171465687172, segmentsPerTier=37.0, maxCFSSegmentSizeMB=8.796093022207999E12, noCFSRatio=0.0, deletesPctAllowed=45.31365908392238
   [junit4]   2> 5299 INFO  (coreLoadExecutor-9-thread-1) [    x:collection1] o.a.s.s.SolrIndexSearcher Opening [Searcher@86772cf[collection1] main]
   [junit4]   2> 5334 INFO  (coreLoadExecutor-9-thread-1) [    x:collection1] o.a.s.h.c.SpellCheckComponent Initializing spell checkers
   [junit4]   2> 5394 INFO  (coreLoadExecutor-9-thread-1) [    x:collection1] o.a.s.s.DirectSolrSpellChecker init: {name=direct,classname=DirectSolrSpellChecker,field=lowerfilt,minQueryLength=3}
   [junit4]   2> 5543 INFO  (coreLoadExecutor-9-thread-1) [    x:collection1] o.a.s.h.ReplicationHandler Commits will be reserved for 10000ms.
   [junit4]   2> 5544 INFO  (searcherExecutor-10-thread-1-processing-x:collection1) [    x:collection1] o.a.s.h.c.SpellCheckComponent Loading spell index for spellchecker: default
   [junit4]   2> 5547 INFO  (SUITE-DistributedUpdateProcessorTest-seed#[5ED48C678637330F]-worker) [    ] o.a.s.SolrTestCaseJ4 ####initCore end
   [junit4]   2> 5548 INFO  (searcherExecutor-10-thread-1-processing-x:collection1) [    x:collection1] o.a.s.h.c.SpellCheckComponent Loading spell index for spellchecker: direct
   [junit4]   2> 5548 INFO  (searcherExecutor-10-thread-1-processing-x:collection1) [    x:collection1] o.a.s.h.c.SpellCheckComponent Loading spell index for spellchecker: wordbreak
   [junit4]   2> 5548 INFO  (searcherExecutor-10-thread-1-processing-x:collection1) [    x:collection1] o.a.s.h.c.SpellCheckComponent Loading spell index for spellchecker: multipleFields
   [junit4]   2> 5556 INFO  (searcherExecutor-10-thread-1-processing-x:collection1) [    x:collection1] o.a.s.h.c.SpellCheckComponent Loading spell index for spellchecker: jarowinkler
   [junit4]   2> 5557 INFO  (searcherExecutor-10-thread-1-processing-x:collection1) [    x:collection1] o.a.s.h.c.SpellCheckComponent Loading spell index for spellchecker: external
   [junit4]   2> 5558 INFO  (searcherExecutor-10-thread-1-processing-x:collection1) [    x:collection1] o.a.s.h.c.SpellCheckComponent Loading spell index for spellchecker: freq
   [junit4]   2> 5559 INFO  (searcherExecutor-10-thread-1-processing-x:collection1) [    x:collection1] o.a.s.h.c.SpellCheckComponent Loading spell index for spellchecker: fqcn
   [junit4]   2> 5559 INFO  (searcherExecutor-10-thread-1-processing-x:collection1) [    x:collection1] o.a.s.h.c.SpellCheckComponent Loading spell index for spellchecker: perDict
   [junit4]   2> 5570 INFO  (searcherExecutor-10-thread-1-processing-x:collection1) [    x:collection1] o.a.s.c.SolrCore [collection1] Registered new searcher Searcher@86772cf[collection1] main{ExitableDirectoryReader(UninvertingDirectoryReader())}
   [junit4]   2> 5907 INFO  (TEST-DistributedUpdateProcessorTest.testShouldBufferUpdateZk-seed#[5ED48C678637330F]) [    ] o.a.s.SolrTestCaseJ4 ###Starting testShouldBufferUpdateZk
   [junit4]   2> 5913 INFO  (TEST-DistributedUpdateProcessorTest.testShouldBufferUpdateZk-seed#[5ED48C678637330F]) [    ] o.a.s.SolrTestCaseJ4 ###Ending testShouldBufferUpdateZk
   [junit4] OK      0.37s J0 | DistributedUpdateProcessorTest.testShouldBufferUpdateZk
   [junit4]   2> 5937 INFO  (TEST-DistributedUpdateProcessorTest.testVersionDelete-seed#[5ED48C678637330F]) [    ] o.a.s.SolrTestCaseJ4 ###Starting testVersionDelete
   [junit4]   2> 5941 INFO  (TEST-DistributedUpdateProcessorTest.testVersionDelete-seed#[5ED48C678637330F]) [    ] o.a.s.SolrTestCaseJ4 ###Ending testVersionDelete
   [junit4]   2> NOTE: reproduce with: ant test  -Dtestcase=DistributedUpdateProcessorTest -Dtests.method=testVersionDelete -Dtests.seed=5ED48C678637330F -Dtests.multiplier=3 -Dtests.slow=true -Dtests.badapples=true -Dtests.locale=saq-KE -Dtests.timezone=Pacific/Tahiti -Dtests.asserts=true -Dtests.file.encoding=US-ASCII
   [junit4] ERROR   0.03s J0 | DistributedUpdateProcessorTest.testVersionDelete <<<
   [junit4]    > Throwable #1: java.lang.NullPointerException
   [junit4]    > 	at __randomizedtesting.SeedInfo.seed([5ED48C678637330F:AD9AD8DADFDB1AB5]:0)
   [junit4]    > 	at org.mockito.Mockito.spy(Mockito.java:1980)
   [junit4]    > 	at org.apache.solr.updat

[...truncated too long message...]

on1) [    x:collection1] o.a.s.c.SolrCore [collection1] Registered new searcher Searcher@3289b13c[collection1] main{ExitableDirectoryReader(UninvertingDirectoryReader())}
   [junit4]   2> 7092 INFO  (TEST-DistributedUpdateProcessorTest.testShouldBufferUpdateZk-seed#[5ED48C678637330F]) [    ] o.a.s.SolrTestCaseJ4 ###Starting testShouldBufferUpdateZk
   [junit4]   2> 7093 INFO  (TEST-DistributedUpdateProcessorTest.testShouldBufferUpdateZk-seed#[5ED48C678637330F]) [    ] o.a.s.SolrTestCaseJ4 ###Ending testShouldBufferUpdateZk
   [junit4] OK      0.01s J2 | DistributedUpdateProcessorTest.testShouldBufferUpdateZk
   [junit4]   2> 7099 INFO  (TEST-DistributedUpdateProcessorTest.testVersionDelete-seed#[5ED48C678637330F]) [    ] o.a.s.SolrTestCaseJ4 ###Starting testVersionDelete
   [junit4]   2> 7100 INFO  (TEST-DistributedUpdateProcessorTest.testVersionDelete-seed#[5ED48C678637330F]) [    ] o.a.s.SolrTestCaseJ4 ###Ending testVersionDelete
   [junit4]   2> NOTE: reproduce with: ant test  -Dtestcase=DistributedUpdateProcessorTest -Dtests.method=testVersionDelete -Dtests.seed=5ED48C678637330F -Dtests.multiplier=3 -Dtests.slow=true -Dtests.badapples=true -Dtests.locale=saq-KE -Dtests.timezone=Pacific/Tahiti -Dtests.asserts=true -Dtests.file.encoding=US-ASCII
   [junit4] ERROR   0.01s J2 | DistributedUpdateProcessorTest.testVersionDelete <<<
   [junit4]    > Throwable #1: java.lang.NullPointerException
   [junit4]    > 	at __randomizedtesting.SeedInfo.seed([5ED48C678637330F:AD9AD8DADFDB1AB5]:0)
   [junit4]    > 	at org.mockito.Mockito.spy(Mockito.java:1980)
   [junit4]    > 	at org.apache.solr.update.processor.DistributedUpdateProcessorTest.runCommands(DistributedUpdateProcessorTest.java:144)
   [junit4]    > 	at org.apache.solr.update.processor.DistributedUpdateProcessorTest.testVersionDelete(DistributedUpdateProcessorTest.java:125)
   [junit4]    > 	at java.base/jdk.internal.reflect.NativeMethodAccessorImpl.invoke0(Native Method)
   [junit4]    > 	at java.base/jdk.internal.reflect.NativeMethodAccessorImpl.invoke(NativeMethodAccessorImpl.java:62)
   [junit4]    > 	at java.base/jdk.internal.reflect.DelegatingMethodAccessorImpl.invoke(DelegatingMethodAccessorImpl.java:43)
   [junit4]    > 	at java.base/java.lang.reflect.Method.invoke(Method.java:566)
   [junit4]    > 	at org.mockito.internal.junit.JUnitRule$1.evaluateSafely(JUnitRule.java:52)
   [junit4]    > 	at org.mockito.internal.junit.JUnitRule$1.evaluate(JUnitRule.java:43)
   [junit4]    > 	at java.base/java.lang.Thread.run(Thread.java:834)
   [junit4]   2> 7107 INFO  (TEST-DistributedUpdateProcessorTest.testVersionAdd-seed#[5ED48C678637330F]) [    ] o.a.s.SolrTestCaseJ4 ###Starting testVersionAdd
   [junit4]   2> 7107 INFO  (TEST-DistributedUpdateProcessorTest.testVersionAdd-seed#[5ED48C678637330F]) [    ] o.a.s.SolrTestCaseJ4 ###Ending testVersionAdd
   [junit4]   2> NOTE: reproduce with: ant test  -Dtestcase=DistributedUpdateProcessorTest -Dtests.method=testVersionAdd -Dtests.seed=5ED48C678637330F -Dtests.multiplier=3 -Dtests.slow=true -Dtests.badapples=true -Dtests.locale=saq-KE -Dtests.timezone=Pacific/Tahiti -Dtests.asserts=true -Dtests.file.encoding=US-ASCII
   [junit4] ERROR   0.01s J2 | DistributedUpdateProcessorTest.testVersionAdd <<<
   [junit4]    > Throwable #1: java.lang.NullPointerException
   [junit4]    > 	at __randomizedtesting.SeedInfo.seed([5ED48C678637330F:F63E7F9A7127D3CA]:0)
   [junit4]    > 	at org.mockito.Mockito.spy(Mockito.java:1980)
   [junit4]    > 	at org.apache.solr.update.processor.DistributedUpdateProcessorTest.runCommands(DistributedUpdateProcessorTest.java:144)
   [junit4]    > 	at org.apache.solr.update.processor.DistributedUpdateProcessorTest.testVersionAdd(DistributedUpdateProcessorTest.java:101)
   [junit4]    > 	at java.base/jdk.internal.reflect.NativeMethodAccessorImpl.invoke0(Native Method)
   [junit4]    > 	at java.base/jdk.internal.reflect.NativeMethodAccessorImpl.invoke(NativeMethodAccessorImpl.java:62)
   [junit4]    > 	at java.base/jdk.internal.reflect.DelegatingMethodAccessorImpl.invoke(DelegatingMethodAccessorImpl.java:43)
   [junit4]    > 	at java.base/java.lang.reflect.Method.invoke(Method.java:566)
   [junit4]    > 	at org.mockito.internal.junit.JUnitRule$1.evaluateSafely(JUnitRule.java:52)
   [junit4]    > 	at org.mockito.internal.junit.JUnitRule$1.evaluate(JUnitRule.java:43)
   [junit4]    > 	at java.base/java.lang.Thread.run(Thread.java:834)
   [junit4]   2> 7108 INFO  (SUITE-DistributedUpdateProcessorTest-seed#[5ED48C678637330F]-worker) [    ] o.a.s.SolrTestCaseJ4 ###deleteCore
   [junit4]   2> 7108 INFO  (SUITE-DistributedUpdateProcessorTest-seed#[5ED48C678637330F]-worker) [    ] o.a.s.c.CoreContainer Shutting down CoreContainer instance=2147214494
   [junit4]   2> 7109 INFO  (coreCloseExecutor-29-thread-1) [    x:collection1] o.a.s.c.SolrCore [collection1]  CLOSING SolrCore org.apache.solr.core.SolrCore@2dc700f4
   [junit4]   2> 7110 INFO  (coreCloseExecutor-29-thread-1) [    x:collection1] o.a.s.m.SolrMetricManager Closing metric reporters for registry=solr.core.collection1, tag=2dc700f4
   [junit4]   2> 7110 INFO  (coreCloseExecutor-29-thread-1) [    x:collection1] o.a.s.m.r.SolrJmxReporter Closing reporter [org.apache.solr.metrics.reporters.SolrJmxReporter@67a1ca6d: rootName = null, domain = solr.core.collection1, service url = null, agent id = null] for registry solr.core.collection1 / com.codahale.metrics.MetricRegistry@4fd7c876
   [junit4]   2> 7145 INFO  (SUITE-DistributedUpdateProcessorTest-seed#[5ED48C678637330F]-worker) [    ] o.a.s.m.SolrMetricManager Closing metric reporters for registry=solr.node, tag=null
   [junit4]   2> 7145 INFO  (SUITE-DistributedUpdateProcessorTest-seed#[5ED48C678637330F]-worker) [    ] o.a.s.m.r.SolrJmxReporter Closing reporter [org.apache.solr.metrics.reporters.SolrJmxReporter@610910ef: rootName = null, domain = solr.node, service url = null, agent id = null] for registry solr.node / com.codahale.metrics.MetricRegistry@87e370d
   [junit4]   2> 7152 INFO  (SUITE-DistributedUpdateProcessorTest-seed#[5ED48C678637330F]-worker) [    ] o.a.s.m.SolrMetricManager Closing metric reporters for registry=solr.jvm, tag=null
   [junit4]   2> 7152 INFO  (SUITE-DistributedUpdateProcessorTest-seed#[5ED48C678637330F]-worker) [    ] o.a.s.m.r.SolrJmxReporter Closing reporter [org.apache.solr.metrics.reporters.SolrJmxReporter@7c41f54: rootName = null, domain = solr.jvm, service url = null, agent id = null] for registry solr.jvm / com.codahale.metrics.MetricRegistry@41ae2062
   [junit4]   2> 7152 INFO  (SUITE-DistributedUpdateProcessorTest-seed#[5ED48C678637330F]-worker) [    ] o.a.s.m.SolrMetricManager Closing metric reporters for registry=solr.jetty, tag=null
   [junit4]   2> 7152 INFO  (SUITE-DistributedUpdateProcessorTest-seed#[5ED48C678637330F]-worker) [    ] o.a.s.m.r.SolrJmxReporter Closing reporter [org.apache.solr.metrics.reporters.SolrJmxReporter@3d409058: rootName = null, domain = solr.jetty, service url = null, agent id = null] for registry solr.jetty / com.codahale.metrics.MetricRegistry@72738989
   [junit4]   2> NOTE: leaving temporary files on disk at: /home/jenkins/workspace/Lucene-Solr-8.x-Linux/solr/build/solr-core/test/J2/temp/solr.update.processor.DistributedUpdateProcessorTest_5ED48C678637330F-002
   [junit4]   2> NOTE: test params are: codec=Asserting(Lucene80): {}, docValues:{}, maxPointsInLeafNode=787, maxMBSortInHeap=6.091974380700316, sim=Asserting(org.apache.lucene.search.similarities.AssertingSimilarity@76c273fb), locale=saq-KE, timezone=Pacific/Tahiti
   [junit4]   2> NOTE: Linux 4.18.0-17-generic amd64/Oracle Corporation 11.0.2 (64-bit)/cpus=8,threads=1,free=386783832,total=498597888
   [junit4]   2> NOTE: All tests run in this JVM: [DistributedUpdateProcessorTest, DistributedUpdateProcessorTest]
   [junit4] Completed [5/5 (5!)] on J2 in 1.00s, 3 tests, 2 errors <<< FAILURES!

[...truncated 20 lines...]
BUILD FAILED
/home/jenkins/workspace/Lucene-Solr-8.x-Linux/lucene/common-build.xml:1573: The following error occurred while executing this line:
/home/jenkins/workspace/Lucene-Solr-8.x-Linux/lucene/common-build.xml:1100: There were test failures: 5 suites, 15 tests, 10 errors [seed: 5ED48C678637330F]

Total time: 9 seconds

[repro] Setting last failure code to 256

[repro] Failures:
[repro]   5/5 failed: org.apache.solr.update.processor.DistributedUpdateProcessorTest
[repro] Exiting with code 256
+ mv lucene/build lucene/build.repro
+ mv solr/build solr/build.repro
+ mv lucene/build.orig lucene/build
+ mv solr/build.orig solr/build
Archiving artifacts
Setting ANT_1_8_2_HOME=/home/jenkins/tools/hudson.tasks.Ant_AntInstallation/ANT_1.8.2
[WARNINGS] Parsing warnings in console log with parser Java Compiler (javac)
Setting ANT_1_8_2_HOME=/home/jenkins/tools/hudson.tasks.Ant_AntInstallation/ANT_1.8.2
No credentials specified
Setting ANT_1_8_2_HOME=/home/jenkins/tools/hudson.tasks.Ant_AntInstallation/ANT_1.8.2
<Git Blamer> Using GitBlamer to create author and commit information for all warnings.
<Git Blamer> GIT_COMMIT=3d9d72ba690792537bd82b418eb868a172b8acea, workspace=/home/jenkins/workspace/Lucene-Solr-8.x-Linux
[WARNINGS] Computing warning deltas based on reference build #513
Recording test results
Setting ANT_1_8_2_HOME=/home/jenkins/tools/hudson.tasks.Ant_AntInstallation/ANT_1.8.2
Build step 'Publish JUnit test result report' changed build result to UNSTABLE
Email was triggered for: Unstable (Test Failures)
Sending email for trigger: Unstable (Test Failures)
Setting ANT_1_8_2_HOME=/home/jenkins/tools/hudson.tasks.Ant_AntInstallation/ANT_1.8.2
Setting ANT_1_8_2_HOME=/home/jenkins/tools/hudson.tasks.Ant_AntInstallation/ANT_1.8.2
Setting ANT_1_8_2_HOME=/home/jenkins/tools/hudson.tasks.Ant_AntInstallation/ANT_1.8.2
Setting ANT_1_8_2_HOME=/home/jenkins/tools/hudson.tasks.Ant_AntInstallation/ANT_1.8.2
Setting ANT_1_8_2_HOME=/home/jenkins/tools/hudson.tasks.Ant_AntInstallation/ANT_1.8.2
Setting ANT_1_8_2_HOME=/home/jenkins/tools/hudson.tasks.Ant_AntInstallation/ANT_1.8.2

Mime
View raw message