lucene-dev mailing list archives

Site index · List index
Message view « Date » · « Thread »
Top « Date » · « Thread »
From Policeman Jenkins Server <jenk...@thetaphi.de>
Subject [JENKINS] Lucene-Solr-8.x-Windows (32bit/jdk1.8.0_201) - Build # 257 - Still Unstable!
Date Wed, 15 May 2019 20:30:50 GMT
Build: https://jenkins.thetaphi.de/job/Lucene-Solr-8.x-Windows/257/
Java: 32bit/jdk1.8.0_201 -server -XX:+UseParallelGC

1 tests failed.
FAILED:  org.apache.solr.metrics.rrd.SolrRrdBackendFactoryTest.testBasic

Error Message:
{} expected:<1> but was:<0>

Stack Trace:
java.lang.AssertionError: {} expected:<1> but was:<0>
	at __randomizedtesting.SeedInfo.seed([672C56C588071EFE:CCD64BD057DB98D0]:0)
	at org.junit.Assert.fail(Assert.java:88)
	at org.junit.Assert.failNotEquals(Assert.java:834)
	at org.junit.Assert.assertEquals(Assert.java:645)
	at org.apache.solr.metrics.rrd.SolrRrdBackendFactoryTest.testBasic(SolrRrdBackendFactoryTest.java:94)
	at sun.reflect.NativeMethodAccessorImpl.invoke0(Native Method)
	at sun.reflect.NativeMethodAccessorImpl.invoke(NativeMethodAccessorImpl.java:62)
	at sun.reflect.DelegatingMethodAccessorImpl.invoke(DelegatingMethodAccessorImpl.java:43)
	at java.lang.reflect.Method.invoke(Method.java:498)
	at com.carrotsearch.randomizedtesting.RandomizedRunner.invoke(RandomizedRunner.java:1750)
	at com.carrotsearch.randomizedtesting.RandomizedRunner$8.evaluate(RandomizedRunner.java:938)
	at com.carrotsearch.randomizedtesting.RandomizedRunner$9.evaluate(RandomizedRunner.java:974)
	at com.carrotsearch.randomizedtesting.RandomizedRunner$10.evaluate(RandomizedRunner.java:988)
	at com.carrotsearch.randomizedtesting.rules.SystemPropertiesRestoreRule$1.evaluate(SystemPropertiesRestoreRule.java:57)
	at org.apache.lucene.util.TestRuleSetupTeardownChained$1.evaluate(TestRuleSetupTeardownChained.java:49)
	at org.apache.lucene.util.AbstractBeforeAfterRule$1.evaluate(AbstractBeforeAfterRule.java:45)
	at org.apache.lucene.util.TestRuleThreadAndTestName$1.evaluate(TestRuleThreadAndTestName.java:48)
	at org.apache.lucene.util.TestRuleIgnoreAfterMaxFailures$1.evaluate(TestRuleIgnoreAfterMaxFailures.java:64)
	at org.apache.lucene.util.TestRuleMarkFailure$1.evaluate(TestRuleMarkFailure.java:47)
	at com.carrotsearch.randomizedtesting.rules.StatementAdapter.evaluate(StatementAdapter.java:36)
	at com.carrotsearch.randomizedtesting.ThreadLeakControl$StatementRunner.run(ThreadLeakControl.java:368)
	at com.carrotsearch.randomizedtesting.ThreadLeakControl.forkTimeoutingTask(ThreadLeakControl.java:817)
	at com.carrotsearch.randomizedtesting.ThreadLeakControl$3.evaluate(ThreadLeakControl.java:468)
	at com.carrotsearch.randomizedtesting.RandomizedRunner.runSingleTest(RandomizedRunner.java:947)
	at com.carrotsearch.randomizedtesting.RandomizedRunner$5.evaluate(RandomizedRunner.java:832)
	at com.carrotsearch.randomizedtesting.RandomizedRunner$6.evaluate(RandomizedRunner.java:883)
	at com.carrotsearch.randomizedtesting.RandomizedRunner$7.evaluate(RandomizedRunner.java:894)
	at com.carrotsearch.randomizedtesting.rules.StatementAdapter.evaluate(StatementAdapter.java:36)
	at com.carrotsearch.randomizedtesting.rules.SystemPropertiesRestoreRule$1.evaluate(SystemPropertiesRestoreRule.java:57)
	at org.apache.lucene.util.AbstractBeforeAfterRule$1.evaluate(AbstractBeforeAfterRule.java:45)
	at com.carrotsearch.randomizedtesting.rules.StatementAdapter.evaluate(StatementAdapter.java:36)
	at org.apache.lucene.util.TestRuleStoreClassName$1.evaluate(TestRuleStoreClassName.java:41)
	at com.carrotsearch.randomizedtesting.rules.NoShadowingOrOverridesOnMethodsRule$1.evaluate(NoShadowingOrOverridesOnMethodsRule.java:40)
	at com.carrotsearch.randomizedtesting.rules.NoShadowingOrOverridesOnMethodsRule$1.evaluate(NoShadowingOrOverridesOnMethodsRule.java:40)
	at com.carrotsearch.randomizedtesting.rules.StatementAdapter.evaluate(StatementAdapter.java:36)
	at com.carrotsearch.randomizedtesting.rules.StatementAdapter.evaluate(StatementAdapter.java:36)
	at com.carrotsearch.randomizedtesting.rules.StatementAdapter.evaluate(StatementAdapter.java:36)
	at org.apache.lucene.util.TestRuleAssertionsRequired$1.evaluate(TestRuleAssertionsRequired.java:53)
	at org.apache.lucene.util.TestRuleMarkFailure$1.evaluate(TestRuleMarkFailure.java:47)
	at org.apache.lucene.util.TestRuleIgnoreAfterMaxFailures$1.evaluate(TestRuleIgnoreAfterMaxFailures.java:64)
	at org.apache.lucene.util.TestRuleIgnoreTestSuites$1.evaluate(TestRuleIgnoreTestSuites.java:54)
	at com.carrotsearch.randomizedtesting.rules.StatementAdapter.evaluate(StatementAdapter.java:36)
	at com.carrotsearch.randomizedtesting.ThreadLeakControl$StatementRunner.run(ThreadLeakControl.java:368)
	at java.lang.Thread.run(Thread.java:748)




Build Log:
[...truncated 13565 lines...]
   [junit4] Suite: org.apache.solr.metrics.rrd.SolrRrdBackendFactoryTest
   [junit4]   2> 1298827 INFO  (SUITE-SolrRrdBackendFactoryTest-seed#[672C56C588071EFE]-worker)
[    ] o.a.s.SolrTestCaseJ4 SecureRandom sanity checks: test.solr.allowed.securerandom=null
& java.security.egd=file:/dev/./urandom
   [junit4]   2> Creating dataDir: C:\Users\jenkins\workspace\Lucene-Solr-8.x-Windows\solr\build\solr-core\test\J1\temp\solr.metrics.rrd.SolrRrdBackendFactoryTest_672C56C588071EFE-001\init-core-data-001
   [junit4]   2> 1298828 WARN  (SUITE-SolrRrdBackendFactoryTest-seed#[672C56C588071EFE]-worker)
[    ] o.a.s.SolrTestCaseJ4 startTrackingSearchers: numOpens=5 numCloses=5
   [junit4]   2> 1298828 INFO  (SUITE-SolrRrdBackendFactoryTest-seed#[672C56C588071EFE]-worker)
[    ] o.a.s.SolrTestCaseJ4 Using PointFields (NUMERIC_POINTS_SYSPROP=true) w/NUMERIC_DOCVALUES_SYSPROP=true
   [junit4]   2> 1298833 INFO  (SUITE-SolrRrdBackendFactoryTest-seed#[672C56C588071EFE]-worker)
[    ] o.a.s.SolrTestCaseJ4 Randomized ssl (false) and clientAuth (true) via: @org.apache.solr.util.RandomizeSSL(reason=,
value=NaN, ssl=NaN, clientAuth=NaN)
   [junit4]   2> 1298850 INFO  (TEST-SolrRrdBackendFactoryTest.testBasic-seed#[672C56C588071EFE])
[    ] o.a.s.SolrTestCaseJ4 ###Starting testBasic
   [junit4]   2> 1298850 DEBUG (TEST-SolrRrdBackendFactoryTest.testBasic-seed#[672C56C588071EFE])
[    ] o.a.s.m.r.SolrRrdBackendFactory Created 28176767
   [junit4]   2> 1298999 DEBUG (SolrRrdBackendFactory-5563-thread-1) [    ] o.a.s.m.r.SolrRrdBackendFactory
-- maybe sync backends: [foo]
   [junit4]   2> 1299015 DEBUG (SolrRrdBackendFactory-5563-thread-1) [    ] o.a.s.m.r.SolrRrdBackendFactory
-- syncing [foo]
   [junit4]   2> 1299015 DEBUG (TEST-SolrRrdBackendFactoryTest.testBasic-seed#[672C56C588071EFE])
[    ] o.a.s.m.r.SolrRrdBackendFactory Closing 28176767
   [junit4]   2> 1299016 INFO  (TEST-SolrRrdBackendFactoryTest.testBasic-seed#[672C56C588071EFE])
[    ] o.a.s.SolrTestCaseJ4 ###Ending testBasic
   [junit4]   2> NOTE: reproduce with: ant test  -Dtestcase=SolrRrdBackendFactoryTest -Dtests.method=testBasic
-Dtests.seed=672C56C588071EFE -Dtests.slow=true -Dtests.locale=es-HN -Dtests.timezone=CTT
-Dtests.asserts=true -Dtests.file.encoding=UTF-8
   [junit4] FAILURE 0.18s J1 | SolrRrdBackendFactoryTest.testBasic <<<
   [junit4]    > Throwable #1: java.lang.AssertionError: {} expected:<1> but was:<0>
   [junit4]    > 	at __randomizedtesting.SeedInfo.seed([672C56C588071EFE:CCD64BD057DB98D0]:0)
   [junit4]    > 	at org.apache.solr.metrics.rrd.SolrRrdBackendFactoryTest.testBasic(SolrRrdBackendFactoryTest.java:94)
   [junit4]    > 	at java.lang.Thread.run(Thread.java:748)
   [junit4]   2> NOTE: leaving temporary files on disk at: C:\Users\jenkins\workspace\Lucene-Solr-8.x-Windows\solr\build\solr-core\test\J1\temp\solr.metrics.rrd.SolrRrdBackendFactoryTest_672C56C588071EFE-001
   [junit4]   2> NOTE: test params are: codec=Lucene80, sim=Asserting(org.apache.lucene.search.similarities.AssertingSimilarity@f4f382),
locale=es-HN, timezone=CTT
   [junit4]   2> NOTE: Windows 10 10.0 x86/Oracle Corporation 1.8.0_201 (32-bit)/cpus=3,threads=1,free=57485168,total=379584512
   [junit4]   2> NOTE: All tests run in this JVM: [TestStressRecovery, TestCSVLoader, ZkNodePropsTest,
TestCollectionAPI, ByteBuffersDirectoryFactoryTest, UninvertDocValuesMergePolicyTest, TestPullReplica,
WordBreakSolrSpellCheckerTest, TestCloudPivotFacet, HighlighterTest, MaxSizeAutoCommitTest,
TestUtilizeNode, TestSimComputePlanAction, CollectionPropsTest, NotRequiredUniqueKeyTest,
XmlInterpolationTest, MultiDestinationAuditLoggerTest, AutoScalingHandlerTest, SolrTestCaseJ4Test,
DistributedIntervalFacetingTest, TestImplicitCoreProperties, HdfsRecoverLeaseTest, CollectionTooManyReplicasTest,
TestFiltering, TestExclusionRuleCollectionAccess, TestShortCircuitedRequests, CdcrBootstrapTest,
TermVectorComponentTest, TestReplicaProperties, TestPerFieldSimilarityWithDefaultOverride,
SearchRateTriggerTest, TestMinMaxOnMultiValuedField, TestDistributedMap, DocValuesMissingTest,
LeaderTragicEventTest, TestApiFramework, HdfsDirectoryTest, TestRealTimeGet, TestAtomicUpdateErrorCases,
TestJsonFacetsStatsParsing, OverseerTaskQueueTest, SliceStateTest, TestMinHashQParser, TestManagedResource,
TestLegacyFieldCache, TestPKIAuthenticationPlugin, SolrIndexMetricsTest, TestSimTriggerIntegration,
TestConfigsApi, TestInPlaceUpdatesStandalone, CoreMergeIndexesAdminHandlerTest, TestDocSet,
HttpTriggerListenerTest, BasicZkTest, QueryResultKeyTest, TestFieldCache, TestReplicationHandler,
NoCacheHeaderTest, SampleTest, DistributedQueryComponentCustomSortTest, CopyFieldTest, TestDeleteCollectionOnDownNodes,
AuthToolTest, TestImpersonationWithHadoopAuth, TestSSLRandomization, TestFuzzyAnalyzedSuggestions,
TimeRoutedAliasUpdateProcessorTest, ParsingFieldUpdateProcessorsTest, OverseerCollectionConfigSetProcessorTest,
AdminHandlersProxyTest, TestTestInjection, MetricTriggerIntegrationTest, TestSolrCLIRunExample,
TestSchemalessBufferedUpdates, DebugComponentTest, SolrMetricReporterTest, SparseHLLTest,
RequestHandlersTest, BigEndianAscendingWordSerializerTest, TestDFISimilarityFactory, TestPushWriter,
DistribCursorPagingTest, TestSolrCloudWithKerberosAlt, NestedShardedAtomicUpdateTest, DistributedQueryElevationComponentTest,
TestStressCloudBlindAtomicUpdates, TestChildDocTransformerHierarchy, TestSimNodeLostTrigger,
CustomHighlightComponentTest, RootFieldTest, TestStressUserVersions, TestConfigSetsAPI, HdfsRestartWhileUpdatingTest,
OverseerRolesTest, CoreAdminOperationTest, DistribJoinFromCollectionTest, TestReplicationHandlerDiskOverFlow,
SimpleFacetsTest, TestLegacyTerms, TestCoreBackup, SolrLogAuditLoggerPluginTest, RangeFacetCloudTest,
TestSolrConfigHandler, TestCloudSearcherWarming, CloudMLTQParserTest, TestCustomStream, BooleanFieldTest,
TestConfig, DistributedVersionInfoTest, ZkSolrClientTest, ShufflingReplicaListTransformerTest,
TransactionLogTest, TestManagedSynonymFilterFactory, SolrRrdBackendFactoryTest]
   [junit4] Completed [193/857 (1!)] on J1 in 0.53s, 1 test, 1 failure <<< FAILURES!

[...truncated 48270 lines...]
[repro] Jenkins log URL: https://jenkins.thetaphi.de/job/Lucene-Solr-8.x-Windows/257/consoleText

[repro] Revision: 0316e2a786eab2eac2c2b0b70c52d3c031ef0d9c

[repro] Ant options: "-Dargs=-server -XX:+UseParallelGC"

[repro] ant clean

[...truncated 6 lines...]
[repro] Test suites by module:
[repro]    solr\core
[repro]       SolrRrdBackendFactoryTest
[repro] ant compile-test

[...truncated 3598 lines...]
[repro] ant test-nocompile -Dtests.dups=5 -Dtests.maxfailures=5 -Dtests.class="*.SolrRrdBackendFactoryTest"
-Dtests.showOutput=onerror "-Dargs=-server -XX:+UseParallelGC" -Dtests.seed=672C56C588071EFE
-Dtests.slow=true -Dtests.locale=es-HN -Dtests.timezone=CTT -Dtests.asserts=true -Dtests.file.encoding=UTF-8

[...truncated 68 lines...]
[repro] Failures:
[repro]   0/5 failed: org.apache.solr.metrics.rrd.SolrRrdBackendFactoryTest
[repro] Exiting with code 0

[...truncated 78 lines...]

Mime
View raw message