lucene-dev mailing list archives

Site index · List index
Message view « Date » · « Thread »
Top « Date » · « Thread »
From Policeman Jenkins Server <jenk...@thetaphi.de>
Subject [JENKINS-EA] Lucene-Solr-master-Linux (64bit/jdk-13-ea+shipilev-fastdebug) - Build # 24078 - Unstable!
Date Tue, 14 May 2019 19:22:00 GMT
Build: https://jenkins.thetaphi.de/job/Lucene-Solr-master-Linux/24078/
Java: 64bit/jdk-13-ea+shipilev-fastdebug -XX:+UseCompressedOops -XX:+UseG1GC

1 tests failed.
FAILED:  org.apache.solr.security.JWTAuthPluginIntegrationTest.testMetrics

Error Message:
Server returned HTTP response code: 401 for URL: http://127.0.0.1:33213/solr/jwtColl/query?q=*:*

Stack Trace:
java.io.IOException: Server returned HTTP response code: 401 for URL: http://127.0.0.1:33213/solr/jwtColl/query?q=*:*
	at __randomizedtesting.SeedInfo.seed([A9807A5850E309AA:5792A8FA4CE97E19]:0)
	at java.base/sun.net.www.protocol.http.HttpURLConnection.getInputStream0(HttpURLConnection.java:1913)
	at java.base/sun.net.www.protocol.http.HttpURLConnection.getInputStream(HttpURLConnection.java:1509)
	at java.base/java.net.URLConnection.getContent(URLConnection.java:749)
	at org.apache.solr.security.JWTAuthPluginIntegrationTest.get(JWTAuthPluginIntegrationTest.java:207)
	at org.apache.solr.security.JWTAuthPluginIntegrationTest.testMetrics(JWTAuthPluginIntegrationTest.java:149)
	at java.base/jdk.internal.reflect.NativeMethodAccessorImpl.invoke0(Native Method)
	at java.base/jdk.internal.reflect.NativeMethodAccessorImpl.invoke(NativeMethodAccessorImpl.java:62)
	at java.base/jdk.internal.reflect.DelegatingMethodAccessorImpl.invoke(DelegatingMethodAccessorImpl.java:43)
	at java.base/java.lang.reflect.Method.invoke(Method.java:567)
	at com.carrotsearch.randomizedtesting.RandomizedRunner.invoke(RandomizedRunner.java:1750)
	at com.carrotsearch.randomizedtesting.RandomizedRunner$8.evaluate(RandomizedRunner.java:938)
	at com.carrotsearch.randomizedtesting.RandomizedRunner$9.evaluate(RandomizedRunner.java:974)
	at com.carrotsearch.randomizedtesting.RandomizedRunner$10.evaluate(RandomizedRunner.java:988)
	at com.carrotsearch.randomizedtesting.rules.SystemPropertiesRestoreRule$1.evaluate(SystemPropertiesRestoreRule.java:57)
	at org.apache.lucene.util.TestRuleSetupTeardownChained$1.evaluate(TestRuleSetupTeardownChained.java:49)
	at org.apache.lucene.util.AbstractBeforeAfterRule$1.evaluate(AbstractBeforeAfterRule.java:45)
	at org.apache.lucene.util.TestRuleThreadAndTestName$1.evaluate(TestRuleThreadAndTestName.java:48)
	at org.apache.lucene.util.TestRuleIgnoreAfterMaxFailures$1.evaluate(TestRuleIgnoreAfterMaxFailures.java:64)
	at org.apache.lucene.util.TestRuleMarkFailure$1.evaluate(TestRuleMarkFailure.java:47)
	at com.carrotsearch.randomizedtesting.rules.StatementAdapter.evaluate(StatementAdapter.java:36)
	at com.carrotsearch.randomizedtesting.ThreadLeakControl$StatementRunner.run(ThreadLeakControl.java:368)
	at com.carrotsearch.randomizedtesting.ThreadLeakControl.forkTimeoutingTask(ThreadLeakControl.java:817)
	at com.carrotsearch.randomizedtesting.ThreadLeakControl$3.evaluate(ThreadLeakControl.java:468)
	at com.carrotsearch.randomizedtesting.RandomizedRunner.runSingleTest(RandomizedRunner.java:947)
	at com.carrotsearch.randomizedtesting.RandomizedRunner$5.evaluate(RandomizedRunner.java:832)
	at com.carrotsearch.randomizedtesting.RandomizedRunner$6.evaluate(RandomizedRunner.java:883)
	at com.carrotsearch.randomizedtesting.RandomizedRunner$7.evaluate(RandomizedRunner.java:894)
	at com.carrotsearch.randomizedtesting.rules.StatementAdapter.evaluate(StatementAdapter.java:36)
	at com.carrotsearch.randomizedtesting.rules.SystemPropertiesRestoreRule$1.evaluate(SystemPropertiesRestoreRule.java:57)
	at org.apache.lucene.util.AbstractBeforeAfterRule$1.evaluate(AbstractBeforeAfterRule.java:45)
	at com.carrotsearch.randomizedtesting.rules.StatementAdapter.evaluate(StatementAdapter.java:36)
	at org.apache.lucene.util.TestRuleStoreClassName$1.evaluate(TestRuleStoreClassName.java:41)
	at com.carrotsearch.randomizedtesting.rules.NoShadowingOrOverridesOnMethodsRule$1.evaluate(NoShadowingOrOverridesOnMethodsRule.java:40)
	at com.carrotsearch.randomizedtesting.rules.NoShadowingOrOverridesOnMethodsRule$1.evaluate(NoShadowingOrOverridesOnMethodsRule.java:40)
	at com.carrotsearch.randomizedtesting.rules.StatementAdapter.evaluate(StatementAdapter.java:36)
	at com.carrotsearch.randomizedtesting.rules.StatementAdapter.evaluate(StatementAdapter.java:36)
	at org.apache.lucene.util.TestRuleAssertionsRequired$1.evaluate(TestRuleAssertionsRequired.java:53)
	at org.apache.lucene.util.TestRuleMarkFailure$1.evaluate(TestRuleMarkFailure.java:47)
	at org.apache.lucene.util.TestRuleIgnoreAfterMaxFailures$1.evaluate(TestRuleIgnoreAfterMaxFailures.java:64)
	at org.apache.lucene.util.TestRuleIgnoreTestSuites$1.evaluate(TestRuleIgnoreTestSuites.java:54)
	at com.carrotsearch.randomizedtesting.rules.StatementAdapter.evaluate(StatementAdapter.java:36)
	at com.carrotsearch.randomizedtesting.ThreadLeakControl$StatementRunner.run(ThreadLeakControl.java:368)
	at java.base/java.lang.Thread.run(Thread.java:830)




Build Log:
[...truncated 15269 lines...]
   [junit4] Suite: org.apache.solr.security.JWTAuthPluginIntegrationTest
   [junit4]   2> Creating dataDir: /home/jenkins/workspace/Lucene-Solr-master-Linux/solr/build/solr-core/test/J2/temp/solr.security.JWTAuthPluginIntegrationTest_A9807A5850E309AA-001/init-core-data-001
   [junit4]   2> 3412584 WARN  (SUITE-JWTAuthPluginIntegrationTest-seed#[A9807A5850E309AA]-worker) [    ] o.a.s.SolrTestCaseJ4 startTrackingSearchers: numOpens=1 numCloses=1
   [junit4]   2> 3412584 INFO  (SUITE-JWTAuthPluginIntegrationTest-seed#[A9807A5850E309AA]-worker) [    ] o.a.s.SolrTestCaseJ4 Using PointFields (NUMERIC_POINTS_SYSPROP=true) w/NUMERIC_DOCVALUES_SYSPROP=false
   [junit4]   2> 3412585 INFO  (SUITE-JWTAuthPluginIntegrationTest-seed#[A9807A5850E309AA]-worker) [    ] o.a.s.SolrTestCaseJ4 Randomized ssl (false) and clientAuth (false) via: @org.apache.solr.SolrTestCaseJ4$SuppressSSL(bugUrl="None")
   [junit4]   2> 3412585 INFO  (SUITE-JWTAuthPluginIntegrationTest-seed#[A9807A5850E309AA]-worker) [    ] o.a.s.SolrTestCaseJ4 SecureRandom sanity checks: test.solr.allowed.securerandom=null & java.security.egd=file:/dev/./urandom
   [junit4]   2> 3412588 INFO  (TEST-JWTAuthPluginIntegrationTest.createCollectionUpdateAndQueryDistributed-seed#[A9807A5850E309AA]) [    ] o.a.s.SolrTestCaseJ4 ###Starting createCollectionUpdateAndQueryDistributed
   [junit4]   2> 3412589 INFO  (TEST-JWTAuthPluginIntegrationTest.createCollectionUpdateAndQueryDistributed-seed#[A9807A5850E309AA]) [    ] o.a.s.c.MiniSolrCloudCluster Starting cluster of 2 servers in /home/jenkins/workspace/Lucene-Solr-master-Linux/solr/build/solr-core/test/J2/temp/solr.security.JWTAuthPluginIntegrationTest_A9807A5850E309AA-001/tempDir-001
   [junit4]   2> 3412590 INFO  (TEST-JWTAuthPluginIntegrationTest.createCollectionUpdateAndQueryDistributed-seed#[A9807A5850E309AA]) [    ] o.a.s.c.ZkTestServer STARTING ZK TEST SERVER
   [junit4]   2> 3412590 INFO  (ZkTestServer Run Thread) [    ] o.a.s.c.ZkTestServer client port:0.0.0.0/0.0.0.0:0
   [junit4]   2> 3412590 INFO  (ZkTestServer Run Thread) [    ] o.a.s.c.ZkTestServer Starting server
   [junit4]   2> 3412690 INFO  (TEST-JWTAuthPluginIntegrationTest.createCollectionUpdateAndQueryDistributed-seed#[A9807A5850E309AA]) [    ] o.a.s.c.ZkTestServer start zk server on port:38449
   [junit4]   2> 3412691 INFO  (TEST-JWTAuthPluginIntegrationTest.createCollectionUpdateAndQueryDistributed-seed#[A9807A5850E309AA]) [    ] o.a.s.c.ZkTestServer parse host and port list: 127.0.0.1:38449
   [junit4]   2> 3412691 INFO  (TEST-JWTAuthPluginIntegrationTest.createCollectionUpdateAndQueryDistributed-seed#[A9807A5850E309AA]) [    ] o.a.s.c.ZkTestServer connecting to 127.0.0.1 38449
   [junit4]   2> 3412694 INFO  (zkConnectionManagerCallback-16304-thread-1) [    ] o.a.s.c.c.ConnectionManager zkClient has connected
   [junit4]   2> 3412699 INFO  (zkConnectionManagerCallback-16306-thread-1) [    ] o.a.s.c.c.ConnectionManager zkClient has connected
   [junit4]   2> 3412723 INFO  (zkConnectionManagerCallback-16308-thread-1) [    ] o.a.s.c.c.ConnectionManager zkClient has connected
   [junit4]   2> 3412726 WARN  (jetty-launcher-16309-thread-1) [    ] o.e.j.s.AbstractConnector Ignoring deprecated socket close linger time
   [junit4]   2> 3412726 INFO  (jetty-launcher-16309-thread-1) [    ] o.a.s.c.s.e.JettySolrRunner Start Jetty (original configured port=0)
   [junit4]   2> 3412726 INFO  (jetty-launcher-16309-thread-1) [    ] o.a.s.c.s.e.JettySolrRunner Trying to start Jetty on port 0 try number 1 ...
   [junit4]   2> 3412727 INFO  (jetty-launcher-16309-thread-1) [    ] o.e.j.s.Server jetty-9.4.14.v20181114; built: 2018-11-14T21:20:31.478Z; git: c4550056e785fb5665914545889f21dc136ad9e6; jvm 13-testing+0-builds.shipilev.net-openjdk-jdk-b845-20190430-jdk-1318
   [junit4]   2> 3412732 WARN  (jetty-launcher-16309-thread-2) [    ] o.e.j.s.AbstractConnector Ignoring deprecated socket close linger time
   [junit4]   2> 3412732 INFO  (jetty-launcher-16309-thread-2) [    ] o.a.s.c.s.e.JettySolrRunner Start Jetty (original configured port=0)
   [junit4]   2> 3412732 INFO  (jetty-launcher-16309-thread-2) [    ] o.a.s.c.s.e.JettySolrRunner Trying to start Jetty on port 0 try number 1 ...
   [junit4]   2> 3412732 INFO  (jetty-launcher-16309-thread-2) [    ] o.e.j.s.Server jetty-9.4.14.v20181114; built: 2018-11-14T21:20:31.478Z; git: c4550056e785fb5665914545889f21dc136ad9e6; jvm 13-testing+0-builds.shipilev.net-openjdk-jdk-b845-20190430-jdk-1318
   [junit4]   2> 3412775 INFO  (jetty-launcher-16309-thread-1) [    ] o.e.j.s.session DefaultSessionIdManager workerName=node0
   [junit4]   2> 3412775 INFO  (jetty-launcher-16309-thread-1) [    ] o.e.j.s.session No SessionScavenger set, using defaults
   [junit4]   2> 3412775 INFO  (jetty-launcher-16309-thread-1) [    ] o.e.j.s.session node0 Scavenging every 600000ms
   [junit4]   2> 3412779 INFO  (jetty-launcher-16309-thread-2) [    ] o.e.j.s.session DefaultSessionIdManager workerName=node0
   [junit4]   2> 3412779 INFO  (jetty-launcher-16309-thread-2) [    ] o.e.j.s.session No SessionScavenger set, using defaults
   [junit4]   2> 3412779 INFO  (jetty-launcher-16309-thread-2) [    ] o.e.j.s.session node0 Scavenging every 600000ms
   [junit4]   2> 3412780 INFO  (jetty-launcher-16309-thread-1) [    ] o.e.j.s.h.ContextHandler Started o.e.j.s.ServletContextHandler@76892e9f{/solr,null,AVAILABLE}
   [junit4]   2> 3412781 INFO  (jetty-launcher-16309-thread-1) [    ] o.e.j.s.AbstractConnector Started ServerConnector@43e7b22{HTTP/1.1,[http/1.1, h2c]}{127.0.0.1:37477}
   [junit4]   2> 3412781 INFO  (jetty-launcher-16309-thread-1) [    ] o.e.j.s.Server Started @3412831ms
   [junit4]   2> 3412781 INFO  (jetty-launcher-16309-thread-1) [    ] o.a.s.c.s.e.JettySolrRunner Jetty properties: {hostContext=/solr, hostPort=37477}
   [junit4]   2> 3412781 ERROR (jetty-launcher-16309-thread-1) [    ] o.a.s.u.StartupLoggingUtils Missing Java Option solr.log.dir. Logging may be missing or incomplete.
   [junit4]   2> 3412781 INFO  (jetty-launcher-16309-thread-1) [    ] o.a.s.s.SolrDispatchFilter Using logger factory org.apache.logging.slf4j.Log4jLoggerFactory
   [junit4]   2> 3412781 INFO  (jetty-launcher-16309-thread-1) [    ] o.a.s.s.SolrDispatchFilter  ___      _       Welcome to Apache Solr™ version 9.0.0
   [junit4]   2> 3412781 INFO  (jetty-launcher-16309-thread-1) [    ] o.a.s.s.SolrDispatchFilter / __| ___| |_ _   Starting in cloud mode on port null
   [junit4]   2> 3412781 INFO  (jetty-launcher-16309-thread-1) [    ] o.a.s.s.SolrDispatchFilter \__ \/ _ \ | '_|  Install dir: null
   [junit4]   2> 3412781 INFO  (jetty-launcher-16309-thread-1) [    ] o.a.s.s.SolrDispatchFilter |___/\___/_|_|    Start time: 2019-05-14T18:48:54.609772Z
   [junit4]   2> 3412783 INFO  (jetty-launcher-16309-thread-2) [    ] o.e.j.s.h.ContextHandler Started o.e.j.s.ServletContextHandler@48a310c{/solr,null,AVAILABLE}
   [junit4]   2> 3412784 INFO  (jetty-launcher-16309-thread-2) [    ] o.e.j.s.AbstractConnector Started ServerConnector@2b90045d{HTTP/1.1,[http/1.1, h2c]}{127.0.0.1:44131}
   [junit4]   2> 3412784 INFO  (jetty-launcher-16309-thread-2) [    ] o.e.j.s.Server Started @3412834ms
   [junit4]   2> 3412784 INFO  (jetty-launcher-16309-thread-2) [    ] o.a.s.c.s.e.JettySolrRunner Jetty properties: {hostContext=/solr, hostPort=44131}
   [junit4]   2> 3412784 ERROR (jetty-launcher-16309-thread-2) [    ] o.a.s.u.StartupLoggingUtils Missing Java Option solr.log.dir. Logging may be missing or incomplete.
   [junit4]   2> 3412784 INFO  (jetty-launcher-16309-thread-2) [    ] o.a.s.s.SolrDispatchFilter Using logger factory org.apache.logging.slf4j.Log4jLoggerFactory
   [junit4]   2> 3412784 INFO  (jetty-launcher-16309-thread-2) [    ] o.a.s.s.SolrDispatchFilter  ___      _       Welcome to Apache Solr™ version 9.0.0
   [junit4]   2> 3412784 INFO  (jetty-launcher-16309-thread-2) [    ] o.a.s.s.SolrDispatchFilter / __| ___| |_ _   Starting in cloud mode on port null
   [junit4]   2> 3412784 INFO  (jetty-launcher-16309-thread-2) [    ] o.a.s.s.SolrDispatchFilter \__ \/ _ \ | '_|  Install dir: null
   [junit4]   2> 3412784 INFO  (jetty-launcher-16309-thread-2) [    ] o.a.s.s.SolrDispatchFilter |___/\___/_|_|    Start time: 2019-05-14T18:48:54.612829Z
   [junit4]   2> 3412796 INFO  (zkConnectionManagerCallback-16313-thread-1) [    ] o.a.s.c.c.ConnectionManager zkClient has connected
   [junit4]   2> 3412796 INFO  (jetty-launcher-16309-thread-2) [    ] o.a.s.s.SolrDispatchFilter solr.xml found in ZooKeeper. Loading...
   [junit4]   2> 3412803 INFO  (zkConnectionManagerCallback-16311-thread-1) [    ] o.a.s.c.c.ConnectionManager zkClient has connected
   [junit4]   2> 3412804 INFO  (jetty-launcher-16309-thread-1) [    ] o.a.s.s.SolrDispatchFilter solr.xml found in ZooKeeper. Loading...
   [junit4]   2> 3412914 INFO  (jetty-launcher-16309-thread-1) [    ] o.a.s.h.c.HttpShardHandlerFactory Host whitelist initialized: WhitelistHostChecker [whitelistHosts=null, whitelistHostCheckingEnabled=true]
   [junit4]   2> 3412932 WARN  (jetty-launcher-16309-thread-1) [    ] o.e.j.u.s.S.config No Client EndPointIdentificationAlgorithm configured for SslContextFactory@40de2fbc[provider=null,keyStore=null,trustStore=null]
   [junit4]   2> 3412954 WARN  (jetty-launcher-16309-thread-1) [    ] o.e.j.u.s.S.config No Client EndPointIdentificationAlgorithm configured for SslContextFactory@7e7b5e73[provider=null,keyStore=null,trustStore=null]
   [junit4]   2> 3412956 INFO  (jetty-launcher-16309-thread-1) [    ] o.a.s.c.ZkContainer Zookeeper client=127.0.0.1:38449/solr
   [junit4]   2> 3412999 INFO  (zkConnectionManagerCallback-16321-thread-1) [    ] o.a.s.c.c.ConnectionManager zkClient has connected
   [junit4]   2> 3413047 INFO  (zkConnectionManagerCallback-16323-thread-1) [    ] o.a.s.c.c.ConnectionManager zkClient has connected
   [junit4]   2> 3413121 INFO  (jetty-launcher-16309-thread-2) [    ] o.a.s.h.c.HttpShardHandlerFactory Host whitelist initialized: WhitelistHostChecker [whitelistHosts=null, whitelistHostCheckingEnabled=true]
   [junit4]   2> 3413122 WARN  (jetty-launcher-16309-thread-2) [    ] o.e.j.u.s.S.config No Client EndPointIdentificationAlgorithm configured for SslContextFactory@2a0d5f8b[provider=null,keyStore=null,trustStore=null]
   [junit4]   2> 3413124 INFO  (jetty-launcher-16309-thread-1) [n:127.0.0.1:37477_solr    ] o.a.s.c.OverseerElectionContext I am going to be the leader 127.0.0.1:37477_solr
   [junit4]   2> 3413125 INFO  (jetty-launcher-16309-thread-1) [n:127.0.0.1:37477_solr    ] o.a.s.c.Overseer Overseer (id=72251257485000710-127.0.0.1:37477_solr-n_0000000000) starting
   [junit4]   2> 3413136 WARN  (jetty-launcher-16309-thread-2) [    ] o.e.j.u.s.S.config No Client EndPointIdentificationAlgorithm configured for SslContextFactory@2991fc92[provider=null,keyStore=null,trustStore=null]
   [junit4]   2> 3413137 INFO  (jetty-launcher-16309-thread-2) [    ] o.a.s.c.ZkContainer Zookeeper client=127.0.0.1:38449/solr
   [junit4]   2> 3413139 INFO  (zkConnectionManagerCallback-16332-thread-1) [    ] o.a.s.c.c.ConnectionManager zkClient has connected
   [junit4]   2> 3413142 INFO  (jetty-launcher-16309-thread-1) [n:127.0.0.1:37477_solr    ] o.a.s.c.s.i.ZkClientClusterStateProvider Cluster at 127.0.0.1:38449/solr ready
   [junit4]   2> 3413147 INFO  (OverseerStateUpdate-72251257485000710-127.0.0.1:37477_solr-n_0000000000) [n:127.0.0.1:37477_solr    ] o.a.s.c.Overseer Starting to work on the main queue : 127.0.0.1:37477_solr
   [junit4]   2> 3413151 INFO  (zkConnectionManagerCallback-16336-thread-1) [    ] o.a.s.c.c.ConnectionManager zkClient has connected
   [junit4]   2> 3413160 INFO  (jetty-launcher-16309-thread-1) [n:127.0.0.1:37477_solr    ] o.a.s.c.ZkController Register node as live in ZooKeeper:/live_nodes/127.0.0.1:37477_solr
   [junit4]   2> 3413162 INFO  (jetty-launcher-16309-thread-1) [n:127.0.0.1:37477_solr    ] o.a.s.c.CoreContainer Initializing authentication plugin: solr.JWTAuthPlugin
   [junit4]   2> 3413171 INFO  (zkConnectionManagerCallback-16338-thread-1) [    ] o.a.s.c.c.ConnectionManager zkClient has connected
   [junit4]   2> 3413174 INFO  (jetty-launcher-16309-thread-2) [n:127.0.0.1:44131_solr    ] o.a.s.c.c.ZkStateReader Updated live nodes from ZooKeeper... (0) -> (1)
   [junit4]   2> 3413178 INFO  (jetty-launcher-16309-thread-2) [n:127.0.0.1:44131_solr    ] o.a.s.c.ZkController Publish node=127.0.0.1:44131_solr as DOWN
   [junit4]   2> 3413178 INFO  (jetty-launcher-16309-thread-2) [n:127.0.0.1:44131_solr    ] o.a.s.c.TransientSolrCoreCacheDefault Allocating transient cache for 2147483647 transient cores
   [junit4]   2> 3413178 INFO  (jetty-launcher-16309-thread-2) [n:127.0.0.1:44131_solr    ] o.a.s.c.ZkController Register node as live in ZooKeeper:/live_nodes/127.0.0.1:44131_solr
   [junit4]   2> 3413180 INFO  (zkCallback-16322-thread-1) [    ] o.a.s.c.c.ZkStateReader Updated live nodes from ZooKeeper... (0) -> (2)
   [junit4]   2> 3413184 INFO  (zkCallback-16331-thread-1) [    ] o.a.s.c.c.ZkStateReader Updated live nodes from ZooKeeper... (0) -> (2)
   [junit4]   2> 3413192 INFO  (zkCallback-16337-thread-1) [    ] o.a.s.c.c.ZkStateReader Updated live nodes from ZooKeeper... (1) -> (2)
   [junit4]   2> 3413251 INFO  (zkConnectionManagerCallback-16345-thread-1) [    ] o.a.s.c.c.ConnectionManager zkClient has connected
   [junit4]   2> 3413262 INFO  (jetty-launcher-16309-thread-2) [n:127.0.0.1:44131_solr    ] o.a.s.c.c.ZkStateReader Updated live nodes from ZooKeeper... (0) -> (2)
   [junit4]   2> 3413263 INFO  (jetty-launcher-16309-thread-2) [n:127.0.0.1:44131_solr    ] o.a.s.c.s.i.ZkClientClusterStateProvider Cluster at 127.0.0.1:38449/solr ready
   [junit4]   2> 3413264 INFO  (jetty-launcher-16309-thread-2) [n:127.0.0.1:44131_solr    ] o.a.s.c.CoreContainer Initializing authentication plugin: solr.JWTAuthPlugin
   [junit4]   2> 3413551 WARN  (jetty-launcher-16309-thread-2) [n:127.0.0.1:44131_solr    ] o.a.s.s.JWTAuthPlugin Warning: No adminUiScope provided, fallback to 'solr' as required scope. If this is not correct, the Admin UI login may not work
   [junit4]   2> 3413595 WARN  (jetty-launcher-16309-thread-1) [n:127.0.0.1:37477_solr    ] o.a.s.s.JWTAuthPlugin Warning: No adminUiScope provided, fallback to 'solr' as required scope. If this is not correct, the Admin UI login may not work
   [junit4]   2> 3414658 INFO  (jetty-launcher-16309-thread-2) [n:127.0.0.1:44131_solr    ] o.a.s.h.a.MetricsHistoryHandler No .system collection, keeping metrics history in memory.
   [junit4]   2> 3414658 INFO  (jetty-launcher-16309-thread-1) [n:127.0.0.1:37477_solr    ] o.a.s.h.a.MetricsHistoryHandler No .system collection, keeping metrics history in memory.
   [junit4]   2> 3414718 INFO  (jetty-launcher-16309-thread-1) [n:127.0.0.1:37477_solr    ] o.a.s.m.r.SolrJmxReporter JMX monitoring for 'solr_37477.solr.node' (registry 'solr.node') enabled at server: com.sun.jmx.mbeanserver.JmxMBeanServer@105a279a
   [junit4]   2> 3414719 INFO  (jetty-launcher-16309-thread-2) [n:127.0.0.1:44131_solr    ] o.a.s.m.r.SolrJmxReporter JMX monitoring for 'solr_44131.solr.node' (registry 'solr.node') enabled at server: com.sun.jmx.mbeanserver.JmxMBeanServer@105a279a
   [junit4]   2> 3414749 INFO  (jetty-launcher-16309-thread-1) [n:127.0.0.1:37477_solr    ] o.a.s.m.r.SolrJmxReporter JMX monitoring for 'solr_37477.solr.jvm' (registry 'solr.jvm') enabled at server: com.sun.jmx.mbeanserver.JmxMBeanServer@105a279a
   [junit4]   2> 3414749 INFO  (jetty-launcher-16309-thread-1) [n:127.0.0.1:37477_solr    ] o.a.s.m.r.SolrJmxReporter JMX monitoring for 'solr_37477.solr.jetty' (registry 'solr.jetty') enabled at server: com.sun.jmx.mbeanserver.JmxMBeanServer@105a279a
   [junit4]   2> 3414751 INFO  (jetty-launcher-16309-thread-2) [n:127.0.0.1:44131_solr    ] o.a.s.m.r.SolrJmxReporter JMX monitoring for 'solr_44131.solr.jvm' (registry 'solr.jvm') enabled at server: com.sun.jmx.mbeanserver.JmxMBeanServer@105a279a
   [junit4]   2> 3414751 INFO  (jetty-launcher-16309-thread-2) [n:127.0.0.1:44131_solr    ] o.a.s.m.r.SolrJmxReporter JMX monitoring for 'solr_44131.solr.jetty' (registry 'solr.jetty') enabled at server: com.sun.jmx.mbeanserver.JmxMBeanServer@105a279a
   [junit4]   2> 3414751 INFO  (jetty-launcher-16309-thread-1) [n:127.0.0.1:37477_solr    ] o.a.s.c.CorePropertiesLocator Found 0 core definitions underneath /home/jenkins/workspace/Lucene-Solr-master-Linux/solr/build/solr-core/test/J2/temp/solr.security.JWTAuthPluginIntegrationTest_A9807A5850E309AA-001/tempDir-001/node1/.
   [junit4]   2> 3414754 INFO  (jetty-launcher-16309-thread-2) [n:127.0.0.1:44131_solr    ] o.a.s.c.CorePropertiesLocator Found 0 core definitions underneath /home/jenkins/workspace/Lucene-Solr-master-Linux/solr/build/solr-core/test/J2/temp/solr.security.JWTAuthPluginIntegrationTest_A9807A5850E309AA-001/tempDir-001/node2/.
   [junit4]   2> 3414869 INFO  (zkConnectionManagerCallback-16352-thread-1) [    ] o.a.s.c.c.ConnectionManager zkClient has connected
   [junit4]   2> 3414870 INFO  (TEST-JWTAuthPluginIntegrationTest.createCollectionUpdateAndQueryDistributed-seed#[A9807A5850E309AA]) [    ] o.a.s.c.c.ZkStateReader Updated live nodes from ZooKeeper... (0) -> (2)
   [junit4]   2> 3414871 INFO  (TEST-JWTAuthPluginIntegrationTest.createCollectionUpdateAndQueryDistributed-seed#[A9807A5850E309AA]) [    ] o.a.s.c.s.i.ZkClientClusterStateProvider Cluster at 127.0.0.1:38449/solr ready
   [junit4]   2> 3420949 INFO  (qtp1973101306-41063) [n:127.0.0.1:44131_solr    ] o.a.s.h.a.CollectionsHandler Invoked Collection Action :create with params name=jwtColl&action=CREATE&numShards=2 and sendToOCPQueue=true
   [junit4]   2> 3420951 INFO  (OverseerThreadFactory-13080-thread-1-processing-n:127.0.0.1:37477_solr) [n:127.0.0.1:37477_solr    ] o.a.s.c.a.c.CreateCollectionCmd Create collection jwtColl
   [junit4]   2> 3420952 INFO  (OverseerThreadFactory-13080-thread-1-processing-n:127.0.0.1:37477_solr) [n:127.0.0.1:37477_solr    ] o.a.s.c.c.ZkConfigManager Copying zk node /configs/_default/protwords.txt to /configs/jwtColl.AUTOCREATED/protwords.txt
   [junit4]   2> 3420953 INFO  (OverseerThreadFactory-13080-thread-1-processing-n:127.0.0.1:37477_solr) [n:127.0.0.1:37477_solr    ] o.a.s.c.c.ZkConfigManager Copying zk node /configs/_default/managed-schema to /configs/jwtColl.AUTOCREATED/managed-schema
   [junit4]   2> 3420954 INFO  (OverseerThreadFactory-13080-thread-1-processing-n:127.0.0.1:37477_solr) [n:127.0.0.1:37477_solr    ] o.a.s.c.c.ZkConfigManager Copying zk node /configs/_default/solrconfig.xml to /configs/jwtColl.AUTOCREATED/solrconfig.xml
   [junit4]   2> 3420955 INFO  (OverseerThreadFactory-13080-thread-1-processing-n:127.0.0.1:37477_solr) [n:127.0.0.1:37477_solr    ] o.a.s.c.c.ZkConfigManager Copying zk node /configs/_default/synonyms.txt to /configs/jwtColl.AUTOCREATED/synonyms.txt
   [junit4]   2> 3420956 INFO  (OverseerThreadFactory-13080-thread-1-processing-n:127.0.0.1:37477_solr) [n:127.0.0.1:37477_solr    ] o.a.s.c.c.ZkConfigManager Copying zk node /configs/_default/stopwords.txt to /configs/jwtColl.AUTOCREATED/stopwords.txt
   [junit4]   2> 3420957 INFO  (OverseerThreadFactory-13080-thread-1-processing-n:127.0.0.1:37477_solr) [n:127.0.0.1:37477_solr    ] o.a.s.c.c.ZkConfigManager Copying zk node /configs/_default/lang/contractions_it.txt to /configs/jwtColl.AUTOCREATED/lang/contractions_it.txt
   [junit4]   2> 3420958 INFO  (OverseerThreadFactory-13080-thread-1-processing-n:127.0.0.1:37477_solr) [n:127.0.0.1:37477_solr    ] o.a.s.c.c.ZkConfigManager Copying zk node /configs/_default/lang/stemdict_nl.txt to /configs/jwtColl.AUTOCREATED/lang/stemdict_nl.txt
   [junit4]   2> 3420959 INFO  (OverseerThreadFactory-13080-thread-1-processing-n:127.0.0.1:37477_solr) [n:127.0.0.1:37477_solr    ] o.a.s.c.c.ZkConfigManager Copying zk node /configs/_default/lang/stopwords_hy.txt to /configs/jwtColl.AUTOCREATED/lang/stopwords_hy.txt
   [junit4]   2> 3420960 INFO  (OverseerThreadFactory-13080-thread-1-processing-n:127.0.0.1:37477_solr) [n:127.0.0.1:37477_solr    ] o.a.s.c.c.ZkConfigManager Copying zk node /configs/_default/lang/stopwords_no.txt to /configs/jwtColl.AUTOCREATED/lang/stopwords_no.txt
   [junit4]   2> 3420962 INFO  (OverseerThreadFactory-13080-thread-1-processing-n:127.0.0.1:37477_solr) [n:127.0.0.1:37477_solr    ] o.a.s.c.c.ZkConfigManager Copying zk node /configs/_default/lang/contractions_ca.txt to /configs/jwtColl.AUTOCREATED/lang/contractions_ca.txt
   [junit4]   2> 3420963 INFO  (OverseerThreadFactory-13080-thread-1-processing-n:127.0.0.1:37477_solr) [n:127.0.0.1:37477_solr    ] o.a.s.c.c.ZkConfigManager Copying zk node /configs/_default/lang/stopwords_id.txt to /configs/jwtColl.AUTOCREATED/lang/stopwords_id.txt
   [junit4]   2> 3420964 INFO  (OverseerThreadFactory-13080-thread-1-processing-n:127.0.0.1:37477_solr) [n:127.0.0.1:37477_solr    ] o.a.s.c.c.ZkConfigManager Copying zk node /configs/_default/lang/stopwords_ga.txt to /configs/jwtColl.AUTOCREATED/lang/stopwords_ga.txt
   [junit4]   2> 3420965 INFO  (OverseerThreadFactory-13080-thread-1-processing-n:127.0.0.1:37477_solr) [n:127.0.0.1:37477_solr    ] o.a.s.c.c.ZkConfigManager Copying zk node /configs/_default/lang/stopwords_hi.txt to /configs/jwtColl.AUTOCREATED/lang/stopwords_hi.txt
   [junit4]   2> 3420967 INFO  (OverseerThreadFactory-13080-thread-1-processing-n:127.0.0.1:37477_solr) [n:127.0.0.1:37477_solr    ] o.a.s.c.c.ZkConfigManager Copying zk node /configs/_default/lang/stopwords_da.txt to /configs/jwtColl.AUTOCREATED/lang/stopwords_da.txt
   [junit4]   2> 3420968 INFO  (OverseerThreadFactory-13080-thread-1-processing-n:127.0.0.1:37477_solr) [n:127.0.0.1:37477_solr    ] o.a.s.c.c.ZkConfigManager Copying zk node /configs/_default/lang/stopwords_ja.txt to /configs/jwtColl.AUTOCREATED/lang/stopwords_ja.txt
   [junit4]   2> 3420969 INFO  (OverseerThreadFactory-13080-thread-1-processing-n:127.0.0.1:37477_solr) [n:127.0.0.1:37477_solr    ] o.a.s.c.c.ZkConfigManager Copying zk node /configs/_default/lang/stopwords_pt.txt to /configs/jwtColl.AUTOCREATED/lang/stopwords_pt.txt
   [junit4]   2> 3420970 INFO  (OverseerThreadFactory-13080-thread-1-processing-n:127.0.0.1:37477_solr) [n:127.0.0.1:37477_solr    ] o.a.s.c.c.ZkConfigManager Copying zk node /configs/_default/lang/stopwords_hu.txt to /configs/jwtColl.AUTOCREATED/lang/stopwords_hu.txt
   [junit4]   2> 3420971 INFO  (OverseerThreadFactory-13080-thread-1-processing-n:127.0.0.1:37477_solr) [n:127.0.0.1:37477_solr    ] o.a.s.c.c.ZkConfigManager Copying zk node /configs/_default/lang/stopwords_el.txt to /configs/jwtColl.AUTOCREATED/lang/stopwords_el.txt
   [junit4]   2> 3420972 INFO  (OverseerThreadFactory-13080-thread-1-processing-n:127.0.0.1:37477_solr) [n:127.0.0.1:37477_solr    ] o.a.s.c.c.ZkConfigManager Copying zk node /configs/_default/lang/stopwords_ru.txt to /configs/jwtColl.AUTOCREATED/lang/stopwords_ru.txt
   [junit4]   2> 3420973 INFO  (OverseerThreadFactory-13080-thread-1-processing-n:127.0.0.1:37477_solr) [n:127.0.0.1:37477_solr    ] o.a.s.c.c.ZkConfigManager Copying zk node /configs/_default/lang/stopwords_tr.txt to /configs/jwtColl.AUTOCREATED/lang/stopwords_tr.txt
   [junit4]   2> 3420975 INFO  (OverseerThreadFactory-13080-thread-1-processing-n:127.0.0.1:37477_solr) [n:127.0.0.1:37477_solr    ] o.a.s.c.c.ZkConfigManager Copying zk node /configs/_default/lang/stopwords_ar.txt to /configs/jwtColl.AUTOCREATED/lang/stopwords_ar.txt
   [junit4]   2> 3420976 INFO  (OverseerThreadFactory-13080-thread-1-processing-n:127.0.0.1:37477_solr) [n:127.0.0.1:37477_solr    ] o.a.s.c.c.ZkConfigManager Copying zk node /configs/_default/lang/userdict_ja.txt to /configs/jwtColl.AUTOCREATED/lang/userdict_ja.txt
   [junit4]   2> 3420977 INFO  (OverseerThreadFactory-13080-thread-1-processing-n:127.0.0.1:37477_solr) [n:127.0.0.1:37477_solr    ] o.a.s.c.c.ZkConfigManager Copying zk node /configs/_default/lang/stopwords_eu.txt to /configs/jwtColl.AUTOCREATED/lang/stopwords_eu.txt
   [junit4]   2> 3420977 INFO  (OverseerThreadFactory-13080-thread-1-processing-n:127.0.0.1:37477_solr) [n:127.0.0.1:37477_solr    ] o.a.s.c.c.ZkConfigManager Copying zk node /configs/_default/lang/stopwords_it.txt to /configs/jwtColl.AUTOCREATED/lang/stopwords_it.txt
   [junit4]   2> 3420978 INFO  (OverseerThreadFactory-13080-thread-1-processing-n:127.0.0.1:37477_solr) [n:127.0.0.1:37477_solr    ] o.a.s.c.c.ZkConfigManager Copying zk node /configs/_default/lang/stopwords_cz.txt to /configs/jwtColl.AUTOCREATED/lang/stopwords_cz.txt
   [junit4]   2> 3420979 INFO  (OverseerThreadFactory-13080-thread-1-processing-n:127.0.0.1:37477_solr) [n:127.0.0.1:37477_solr    ] o.a.s.c.c.ZkConfigManager Copying zk node /configs/_default/lang/stoptags_ja.txt to /configs/jwtColl.AUTOCREATED/lang/stoptags_ja.txt
   [junit4]   2> 3420980 INFO  (OverseerThreadFactory-13080-thread-1-processing-n:127.0.0.1:37477_solr) [n:127.0.0.1:37477_solr    ] o.a.s.c.c.ZkConfigManager Copying zk node /configs/_default/lang/contractions_fr.txt to /configs/jwtColl.AUTOCREATED/lang/contractions_fr.txt
   [junit4]   2> 3420981 INFO  (OverseerThreadFactory-13080-thread-1-processing-n:127.0.0.1:37477_solr) [n:127.0.0.1:37477_solr    ] o.a.s.c.c.ZkConfigManager Copying zk node /configs/_default/lang/stopwords_de.txt to /configs/jwtColl.AUTOCREATED/lang/stopwords_de.txt
   [junit4]   2> 3420982 INFO  (OverseerThreadFactory-13080-thread-1-processing-n:127.0.0.1:37477_solr) [n:127.0.0.1:37477_solr    ] o.a.s.c.c.ZkConfigManager Copying zk node /configs/_default/lang/stopwords_fa.txt to /configs/jwtColl.AUTOCREATED/lang/stopwords_fa.txt
   [junit4]   2> 3420983 INFO  (OverseerThreadFactory-13080-thread-1-processing-n:127.0.0.1:37477_solr) [n:127.0.0.1:37477_solr    ] o.a.s.c.c.ZkConfigManager Copying zk node /configs/_default/lang/contractions_ga.txt to /configs/jwtColl.AUTOCREATED/lang/contractions_ga.txt
   [junit4]   2> 3420984 INFO  (OverseerThreadFactory-13080-thread-1-processing-n:127.0.0.1:37477_solr) [n:127.0.0.1:37477_solr    ] o.a.s.c.c.ZkConfigManager Copying zk node /configs/_default/lang/stopwords_ca.txt to /configs/jwtColl.AUTOCREATED/lang/stopwords_ca.txt
   [junit4]   2> 3420985 INFO  (OverseerThreadFactory-13080-thread-1-processing-n:127.0.0.1:37477_solr) [n:127.0.0.1:37477_solr    ] o.a.s.c.c.ZkConfigManager Copying zk node /configs/_default/lang/stopwords_nl.txt to /configs/jwtColl.AUTOCREATED/lang/stopwords_nl.txt
   [junit4]   2> 3420986 INFO  (OverseerThreadFactory-13080-thread-1-processing-n:127.0.0.1:37477_solr) [n:127.0.0.1:37477_solr    ] o.a.s.c.c.ZkConfigManager Copying zk node /configs/_default/lang/stopwords_bg.txt to /configs/jwtColl.AUTOCREATED/lang/stopwords_bg.txt
   [junit4]   2> 3420987 INFO  (OverseerThreadFactory-13080-thread-1-processing-n:127.0.0.1:37477_solr) [n:127.0.0.1:37477_solr    ] o.a.s.c.c.ZkConfigManager Copying zk node /configs/_default/lang/stopwords_lv.txt to /configs/jwtColl.AUTOCREATED/lang/stopwords_lv.txt
   [junit4]   2> 3420987 INFO  (OverseerThreadFactory-13080-thread-1-processing-n:127.0.0.1:37477_solr) [n:127.0.0.1:37477_solr    ] o.a.s.c.c.ZkConfigManager Copying zk node /configs/_default/lang/stopwords_en.txt to /configs/jwtColl.AUTOCREATED/lang/stopwords_en.txt
   [junit4]   2> 3420988 INFO  (OverseerThreadFactory-13080-thread-1-processing-n:127.0.0.1:37477_solr) [n:127.0.0.1:37477_solr    ] o.a.s.c.c.ZkConfigManager Copying zk node /configs/_default/lang/stopwords_es.txt to /configs/jwtColl.AUTOCREATED/lang/stopwords_es.txt
   [junit4]   2> 3420989 INFO  (OverseerThreadFactory-13080-thread-1-processing-n:127.0.0.1:37477_solr) [n:127.0.0.1:37477_solr    ] o.a.s.c.c.ZkConfigManager Copying zk node /configs/_default/lang/stopwords_th.txt to /configs/jwtColl.AUTOCREATED/lang/stopwords_th.txt
   [junit4]   2> 3420991 INFO  (OverseerThreadFactory-13080-thread-1-processing-n:127.0.0.1:37477_solr) [n:127.0.0.1:37477_solr    ] o.a.s.c.c.ZkConfigManager Copying zk node /configs/_default/lang/stopwords_ro.txt to /configs/jwtColl.AUTOCREATED/lang/stopwords_ro.txt
   [junit4]   2> 3420992 INFO  (OverseerThreadFactory-13080-thread-1-processing-n:127.0.0.1:37477_solr) [n:127.0.0.1:37477_solr    ] o.a.s.c.c.ZkConfigManager Copying zk node /configs/_default/lang/stopwords_fr.txt to /configs/jwtColl.AUTOCREATED/lang/stopwords_fr.txt
   [junit4]   2> 3420993 INFO  (OverseerThreadFactory-13080-thread-1-processing-n:127.0.0.1:37477_solr) [n:127.0.0.1:37477_solr    ] o.a.s.c.c.ZkConfigManager Copying zk node /configs/_default/lang/stopwords_sv.txt to /configs/jwtColl.AUTOCREATED/lang/stopwords_sv.txt
   [junit4]   2> 3420994 INFO  (OverseerThreadFactory-13080-thread-1-processing-n:127.0.0.1:37477_solr) [n:127.0.0.1:37477_solr    ] o.a.s.c.c.ZkConfigManager Copying zk node /configs/_default/lang/stopwords_fi.txt to /configs/jwtColl.AUTOCREATED/lang/stopwords_fi.txt
   [junit4]   2> 3420995 INFO  (OverseerThreadFactory-13080-thread-1-processing-n:127.0.0.1:37477_solr) [n:127.0.0.1:37477_solr    ] o.a.s.c.c.ZkConfigManager Copying zk node /configs/_default/lang/hyphenations_ga.txt to /configs/jwtColl.AUTOCREATED/lang/hyphenations_ga.txt
   [junit4]   2> 3420996 INFO  (OverseerThreadFactory-13080-thread-1-processing-n:127.0.0.1:37477_solr) [n:127.0.0.1:37477_solr    ] o.a.s.c.c.ZkConfigManager Copying zk node /configs/_default/lang/stopwords_gl.txt to /configs/jwtColl.AUTOCREATED/lang/stopwords_gl.txt
   [junit4]   2> 3420997 INFO  (OverseerThreadFactory-13080-thread-1-processing-n:127.0.0.1:37477_solr) [n:127.0.0.1:37477_solr    ] o.a.s.c.c.ZkConfigManager Copying zk node /configs/_default/params.json to /configs/jwtColl.AUTOCREATED/params.json
   [junit4]   2> 3421116 INFO  (qtp763337078-41060) [n:127.0.0.1:37477_solr    ] o.a.s.s.HttpSolrCall [admin] webapp=null path=/admin/info/key params={omitHeader=true&wt=json} status=0 QTime=0
   [junit4]   2> 3421116 INFO  (qtp763337078-41062) [    ] o.a.s.s.PKIAuthenticationPlugin New Key obtained from  node: 127.0.0.1:37477_solr / MIIBIjANBgkqhkiG9w0BAQEFAAOCAQ8AMIIBCgKCAQEAtaDuHfJOCrBfWr+1HeL4RmlJcM1dAmsu270902waXCxxW6oECBfPveqx1hsMGtqmcg0a3SH7MppRS0K7gIraryrsHOtuZni6h7e0M4PEYLTyavEx7WHzXXF7rSeAt3ohlf+gYta4v0p8nT0uWdeH/l+gj2awqk3CpEFzgifqZ288sKLbnnl5LS8GG/jzB4bFyfN1pWe4aUU7YMrsg5gYqqYqcbExT7OkL119O9sYSAHEPbEX+mgYV66+Zjx7IzUO+KCQIlS4NUprf+WDU+13rMqNsuZ/GU4JxqxaFHG//5sgze1Z/NFH1kSbfPZx6Row0Mh0Lle9Z3uceWhvigbonQIDAQAB
   [junit4]   2> 3421117 INFO  (qtp763337078-41062) [n:127.0.0.1:37477_solr    ] o.a.s.s.HttpSolrCall [admin] webapp=null path=/admin/metrics params={prefix=CONTAINER.fs.usableSpace,CONTAINER.fs.totalSpace,CORE.coreName&wt=javabin&version=2&group=solr.node,solr.core} status=0 QTime=0
   [junit4]   2> 3421123 INFO  (qtp763337078-41060) [n:127.0.0.1:37477_solr    ] o.a.s.s.HttpSolrCall [admin] webapp=null path=/admin/info/key params={omitHeader=true&wt=json} status=0 QTime=0
   [junit4]   2> 3421123 INFO  (qtp1973101306-41061) [    ] o.a.s.s.PKIAuthenticationPlugin New Key obtained from  node: 127.0.0.1:37477_solr / MIIBIjANBgkqhkiG9w0BAQEFAAOCAQ8AMIIBCgKCAQEAtaDuHfJOCrBfWr+1HeL4RmlJcM1dAmsu270902waXCxxW6oECBfPveqx1hsMGtqmcg0a3SH7MppRS0K7gIraryrsHOtuZni6h7e0M4PEYLTyavEx7WHzXXF7rSeAt3ohlf+gYta4v0p8nT0uWdeH/l+gj2awqk3CpEFzgifqZ288sKLbnnl5LS8GG/jzB4bFyfN1pWe4aUU7YMrsg5gYqqYqcbExT7OkL119O9sYSAHEPbEX+mgYV66+Zjx7IzUO+KCQIlS4NUprf+WDU+13rMqNsuZ/GU4JxqxaFHG//5sgze1Z/NFH1kSbfPZx6Row0Mh0Lle9Z3uceWhvigbonQIDAQAB
   [junit4]   2> 3421125 INFO  (qtp1973101306-41061) [n:127.0.0.1:44131_solr    ] o.a.s.s.HttpSolrCall [admin] webapp=null path=/admin/metrics params={prefix=CONTAINER.fs.usableSpace,CONTAINER.fs.totalSpace,CORE.coreName&wt=javabin&version=2&group=solr.node,solr.core} status=0 QTime=0
   [junit4]   2> 3421128 INFO  (OverseerStateUpdate-72251257485000710-127.0.0.1:37477_solr-n_0000000000) [n:127.0.0.1:37477_solr    ] o.a.s.c.o.SliceMutator createReplica() {
   [junit4]   2>   "operation":"ADDREPLICA",
   [junit4]   2>   "collection":"jwtColl",
   [junit4]   2>   "shard":"shard1",
   [junit4]   2>   "core":"jwtColl_shard1_replica_n1",
   [junit4]   2>   "state":"down",
   [junit4]   2>   "base_url":"http://127.0.0.1:44131/solr",
   [junit4]   2>   "type":"NRT",
   [junit4]   2>   "waitForFinalState":"false"} 
   [junit4]   2> 3421129 INFO  (OverseerStateUpdate-72251257485000710-127.0.0.1:37477_solr-n_0000000000) [n:127.0.0.1:37477_solr    ] o.a.s.c.o.SliceMutator createReplica() {
   [junit4]   2>   "operation":"ADDREPLICA",
   [junit4]   2>   "collection":"jwtColl",
   [junit4]   2>   "shard":"shard2",
   [junit4]   2>   "core":"jwtColl_shard2_replica_n2",
   [junit4]   2>   "state":"down",
   [junit4]   2>   "base_url":"http://127.0.0.1:37477/solr",
   [junit4]   2>   "type":"NRT",
   [junit4]   2>   "waitForFinalState":"false"} 
   [junit4]   2> 3421336 INFO  (qtp763337078-41062) [n:127.0.0.1:37477_solr    x:jwtColl_shard2_replica_n2] o.a.s.h.a.CoreAdminOperation core create command qt=/admin/cores&coreNodeName=core_node4&collection.configName=jwtColl.AUTOCREATED&newCollection=true&name=jwtColl_shard2_replica_n2&action=CREATE&numShards=2&collection=jwtColl&shard=shard2&wt=javabin&version=2&replicaType=NRT
   [junit4]   2> 3421336 INFO  (qtp1973101306-41065) [n:127.0.0.1:44131_solr    x:jwtColl_shard1_replica_n1] o.a.s.h.a.CoreAdminOperation core create command qt=/admin/cores&coreNodeName=core_node3&collection.configName=jwtColl.AUTOCREATED&newCollection=true&name=jwtColl_shard1_replica_n1&action=CREATE&numShards=2&collection=jwtColl&shard=shard1&wt=javabin&version=2&replicaType=NRT
   [junit4]   2> 3421336 INFO  (qtp763337078-41062) [n:127.0.0.1:37477_solr    x:jwtColl_shard2_replica_n2] o.a.s.c.TransientSolrCoreCacheDefault Allocating transient cache for 2147483647 transient cores
   [junit4]   2> 3422348 INFO  (qtp1973101306-41065) [n:127.0.0.1:44131_solr c:jwtColl s:shard1 r:core_node3 x:jwtColl_shard1_replica_n1] o.a.s.c.RequestParams conf resource params.json loaded . version : 0 
   [junit4]   2> 3422348 INFO  (qtp763337078-41062) [n:127.0.0.1:37477_solr c:jwtColl s:shard2 r:core_node4 x:jwtColl_shard2_replica_n2] o.a.s.c.RequestParams conf resource params.json loaded . version : 0 
   [junit4]   2> 3422348 INFO  (qtp1973101306-41065) [n:127.0.0.1:44131_solr c:jwtColl s:shard1 r:core_node3 x:jwtColl_shard1_replica_n1] o.a.s.c.RequestParams request params refreshed to version 0
   [junit4]   2> 3422348 INFO  (qtp763337078-41062) [n:127.0.0.1:37477_solr c:jwtColl s:shard2 r:core_node4 x:jwtColl_shard2_replica_n2] o.a.s.c.RequestParams request params refreshed to version 0
   [junit4]   2> 3422348 WARN  (qtp763337078-41062) [n:127.0.0.1:37477_solr c:jwtColl s:shard2 r:core_node4 x:jwtColl_shard2_replica_n2] o.a.s.c.SolrConfig Couldn't add files from /home/jenkins/workspace/Lucene-Solr-master-Linux/solr/build/solr-core/test/J2/temp/solr.security.JWTAuthPluginIntegrationTest_A9807A5850E309AA-001/tempDir-001/node1/jwtColl_shard2_replica_n2/../../../../contrib/extraction/lib filtered by .*\.jar to classpath: /home/jenkins/workspace/Lucene-Solr-master-Linux/solr/build/solr-core/test/J2/temp/solr.security.JWTAuthPluginIntegrationTest_A9807A5850E309AA-001/tempDir-001/node1/jwtColl_shard2_replica_n2/../../../../contrib/extraction/lib
   [junit4]   2> 3422348 WARN  (qtp1973101306-41065) [n:127.0.0.1:44131_solr c:jwtColl s:shard1 r:core_node3 x:jwtColl_shard1_replica_n1] o.a.s.c.SolrConfig Couldn't add files from /home/jenkins/workspace/Lucene-Solr-master-Linux/solr/build/solr-core/test/J2/temp/solr.security.JWTAuthPluginIntegrationTest_A9807A5850E309AA-001/tempDir-001/node2/jwtColl_shard1_replica_n1/../../../../contrib/extraction/lib filtered by .*\.jar to classpath: /home/jenkins/workspace/Lucene-Solr-master-Linux/solr/build/solr-core/test/J2/temp/solr.security.JWTAuthPluginIntegrationTest_A9807A5850E309AA-001/tempDir-001/node2/jwtColl_shard1_replica_n1/../../../../contrib/extraction/lib
   [junit4]   2> 3422349 WARN  (qtp1973101306-41065) [n:127.0.0.1:44131_solr c:jwtColl s:shard1 r:core_node3 x:jwtColl_shard1_replica_n1] o.a.s.c.SolrConfig Couldn't add files from /home/jenkins/workspace/Lucene-Solr-master-Linux/solr/build/solr-core/test/J2/temp/solr.security.JWTAuthPluginIntegrationTest_A9807A5850E309AA-001/tempDir-001/node2/jwtColl_shard1_replica_n1/../../../../dist filtered by solr-cell-\d.*\.jar to classpath: /home/jenkins/workspace/Lucene-Solr-master-Linux/solr/build/solr-core/test/J2/temp/solr.security.JWTAuthPluginIntegrationTest_A9807A5850E309AA-001/tempDir-001/node2/jwtColl_shard1_replica_n1/../../../../dist
   [junit4]   2> 3422349 WARN  (qtp763337078-41062) [n:127.0.0.1:37477_solr c:jwtColl s:shard2 r:core_node4 x:jwtColl_shard2_replica_n2] o.a.s.c.SolrConfig Couldn't add files from /home/jenkins/workspace/Lucene-Solr-master-Linux/solr/build/solr-core/test/J2/temp/solr.security.JWTAuthPluginIntegrationTest_A9807A5850E309AA-001/tempDir-001/node1/jwtColl_shard2_replica_n2/../../../../dist filtered by solr-cell-\d.*\.jar to classpath: /home/jenkins/workspace/Lucene-Solr-master-Linux/solr/build/solr-core/test/J2/temp/solr.security.JWTAuthPluginIntegrationTest_A9807A5850E309AA-001/tempDir-001/node1/jwtColl_shard2_replica_n2/../../../../dist
   [junit4]   2> 3422349 WARN  (qtp1973101306-41065) [n:127.0.0.1:44131_solr c:jwtColl s:shard1 r:core_node3 x:jwtColl_shard1_replica_n1] o.a.s.c.SolrConfig Couldn't add files from /home/jenkins/workspace/Lucene-Solr-master-Linux/solr/build/solr-core/test/J2/temp/solr.security.JWTAuthPluginIntegrationTest_A9807A5850E309AA-001/tempDir-001/node2/jwtColl_shard1_replica_n1/../../../../contrib/clustering/lib filtered by .*\.jar to classpath: /home/jenkins/workspace/Lucene-Solr-master-Linux/solr/build/solr-core/test/J2/temp/solr.security.JWTAuthPluginIntegrationTest_A9807A5850E309AA-001/tempDir-001/node2/jwtColl_shard1_replica_n1/../../../../contrib/clustering/lib
   [junit4]   2> 3422349 WARN  (qtp763337078-41062) [n:127.0.0.1:37477_solr c:jwtColl s:shard2 r:core_node4 x:jwtColl_shard2_replica_n2] o.a.s.c.SolrConfig Couldn't add files from /home/jenkins/workspace/Lucene-Solr-master-Linux/solr/build/solr-core/test/J2/temp/solr.security.JWTAuthPluginIntegrationTest_A9807A5850E309AA-001/tempDir-001/node1/jwtColl_shard2_replica_n2/../../../../contrib/clustering/lib filtered by .*\.jar to classpath: /home/jenkins/workspace/Lucene-Solr-master-Linux/solr/build/solr-core/test/J2/temp/solr.security.JWTAuthPluginIntegrationTest_A9807A5850E309AA-001/tempDir-001/node1/jwtColl_shard2_replica_n2/../../../../contrib/clustering/lib
   [junit4]   2> 3422349 WARN  (qtp1973101306-41065) [n:127.0.0.1:44131_solr c:jwtColl s:shard1 r:core_node3 x:jwtColl_shard1_replica_n1] o.a.s.c.SolrConfig Couldn't add files from /home/jenkins/workspace/Lucene-Solr-master-Linux/solr/build/solr-core/test/J2/temp/solr.security.JWTAuthPluginIntegrationTest_A9807A5850E309AA-001/tempDir-001/node2/jwtColl_shard1_replica_n1/../../../../dist filtered by solr-clustering-\d.*\.jar to classpath: /home/jenkins/workspace/Lucene-Solr-master-Linux/solr/build/solr-core/test/J2/temp/solr.security.JWTAuthPluginIntegrationTest_A9807A5850E309AA-001/tempDir-001/node2/jwtColl_shard1_replica_n1/../../../../dist
   [junit4]   2> 3422349 WARN  (qtp763337078-41062) [n:127.0.0.1:37477_solr c:jwtColl s:shard2 r:core_node4 x:jwtColl_shard2_replica_n2] o.a.s.c.SolrConfig Couldn't add files from /home/jenkins/workspace/Lucene-Solr-master-Linux/solr/build/solr-core/test/J2/temp/solr.security.JWTAuthPluginIntegrationTest_A9807A5850E309AA-001/tempDir-001/node1/jwtColl_shard2_replica_n2/../../../../dist filtered by solr-clustering-\d.*\.jar to classpath: /home/jenkins/workspace/Lucene-Solr-master-Linux/solr/build/solr-core/test/J2/temp/solr.security.JWTAuthPluginIntegrationTest_A9807A5850E309AA-001/tempDir-001/node1/jwtColl_shard2_replica_n2/../../../../dist
   [junit4]   2> 3422349 WARN  (qtp1973101306-41065) [n:127.0.0.1:44131_solr c:jwtColl s:shard1 r:core_node3 x:jwtColl_shard1_replica_n1] o.a.s.c.SolrConfig Couldn't add files from /home/jenkins/workspace/Lucene-Solr-master-Linux/solr/build/solr-core/test/J2/temp/solr.security.JWTAuthPluginIntegrationTest_A9807A5850E309AA-001/tempDir-001/node2/jwtColl_shard1_replica_n1/../../../../contrib/langid/lib filtered by .*\.jar to classpath: /home/jenkins/workspace/Lucene-Solr-master-Linux/solr/build/solr-core/test/J2/temp/solr.security.JWTAuthPluginIntegrationTest_A9807A5850E309AA-001/tempDir-001/node2/jwtColl_shard1_replica_n1/../../../../contrib/langid/lib
   [junit4]   2> 3422349 WARN  (qtp763337078-41062) [n:127.0.0.1:37477_solr c:jwtColl s:shard2 r:core_node4 x:jwtColl_shard2_replica_n2] o.a.s.c.SolrConfig Couldn't add files from /home/jenkins/workspace/Lucene-Solr-master-Linux/solr/build/solr-core/test/J2/temp/solr.security.JWTAuthPluginIntegrationTest_A9807A5850E309AA-001/tempDir-001/node1/jwtColl_shard2_replica_n2/../../../../contrib/langid/lib filtered by .*\.jar to classpath: /home/jenkins/workspace/Lucene-Solr-master-Linux/solr/build/solr-core/test/J2/temp/solr.security.JWTAuthPluginIntegrationTest_A9807A5850E309AA-001/tempDir-001/node1/jwtColl_shard2_replica_n2/../../../../contrib/langid/lib
   [junit4]   2> 3422349 WARN  (qtp763337078-41062) [n:127.0.0.1:37477_solr c:jwtColl s:shard2 r:core_node4 x:jwtColl_shard2_replica_n2] o.a.s.c.SolrConfig Couldn't add files from /home/jenkins/workspace/Lucene-Solr-master-Linux/solr/build/solr-core/test/J2/temp/solr.security.JWTAuthPluginIntegrationTest_A9807A5850E309AA-001/tempDir-001/node1/jwtColl_shard2_replica_n2/../../../../dist filtered by solr-langid-\d.*\.jar to classpath: /home/jenkins/workspace/Lucene-Solr-master-Linux/solr/build/solr-core/test/J2/temp/solr.security.JWTAuthPluginIntegrationTest_A9807A5850E309AA-001/tempDir-001/node1/jwtColl_shard2_replica_n2/../../../../dist
   [junit4]   2> 3422349 WARN  (qtp1973101306-41065) [n:127.0.0.1:44131_solr c:jwtColl s:shard1 r:core_node3 x:jwtColl_shard1_replica_n1] o.a.s.c.SolrConfig Couldn't add files from /home/jenkins/workspace/Lucene-Solr-master-Linux/solr/build/solr-core/test/J2/temp/solr.security.JWTAuthPluginIntegrationTest_A9807A5850E309AA-001/tempDir-001/node2/jwtColl_shard1_replica_n1/../../../../dist filtered by solr-langid-\d.*\.jar to classpath: /home/jenkins/workspace/Lucene-Solr-master-Linux/solr/build/solr-core/test/J2/temp/solr.security.JWTAuthPluginIntegrationTest_A9807A5850E309AA-001/tempDir-001/node2/jwtColl_shard1_replica_n1/../../../../dist
   [junit4]   2> 3422349 WARN  (qtp763337078-41062) [n:127.0.0.1:37477_solr c:jwtColl s:shard2 r:core_node4 x:jwtColl_shard2_replica_n2] o.a.s.c.SolrConfig Couldn't add files from /home/jenkins/workspace/Lucene-Solr-master-Linux/solr/build/solr-core/test/J2/temp/solr.security.JWTAuthPluginIntegrationTest_A9807A5850E309AA-001/tempDir-001/node1/jwtColl_shard2_replica_n2/../../../../contrib/velocity/lib filtered by .*\.jar to classpath: /home/jenkins/workspace/Lucene-Solr-master-Linux/solr/build/solr-core/test/J2/temp/solr.security.JWTAuthPluginIntegrationTest_A9807A5850E309AA-001/tempDir-001/node1/jwtColl_shard2_replica_n2/../../../../contrib/velocity/lib
   [junit4]   2> 3422349 WARN  (qtp1973101306-41065) [n:127.0.0.1:44131_solr c:jwtColl s:shard1 r:core_node3 x:jwtColl_shard1_replica_n1] o.a.s.c.SolrConfig Couldn't add files from /home/jenkins/workspace/Lucene-Solr-master-Linux/solr/build/solr-core/test/J2/temp/solr.security.JWTAuthPluginIntegrationTest_A9807A5850E309AA-001/tempDir-001/node2/jwtColl_shard1_replica_n1/../../../../contrib/velocity/lib filtered by .*\.jar to classpath: /home/jenkins/workspace/Lucene-Solr-master-Linux/solr/build/solr-core/test/J2/temp/solr.security.JWTAuthPluginIntegrationTest_A9807A5850E309AA-001/tempDir-001/node2/jwtColl_shard1_replica_n1/../../../../contrib/velocity/lib
   [junit4]   2> 3422349 WARN  (qtp763337078-41062) [n:127.0.0.1:37477_solr c:jwtColl s:shard2 r:core_node4 x:jwtColl_shard2_replica_n2] o.a.s.c.SolrConfig Couldn't add files from /home/jenkins/workspace/Lucene-Solr-master-Linux/solr/build/solr-core/test/J2/temp/solr.security.JWTAuthPluginIntegrationTest_A9807A5850E309AA-001/tempDir-001/node1/jwtColl_shard2_replica_n2/../../../../dist filtered by solr-velocity-\d.*\.jar to classpath: /home/jenkins/workspace/Lucene-Solr-master-Linux/solr/build/solr-core/test/J2/temp/solr.security.JWTAuthPluginIntegrationTest_A9807A5850E309AA-001/tempDir-001/node1/jwtColl_shard2_replica_n2/../../../../dist
   [junit4]   2> 3422349 WARN  (qtp1973101306-41065) [n:127.0.0.1:44131_solr c:jwtColl s:shard1 r:core_node3 x:jwtColl_shard1_replica_n1] o.a.s.c.SolrConfig Couldn't add files from /home/jenkins/workspace/Lucene-Solr-master-Linux/solr/build/solr-core/test/J2/temp/solr.security.JWTAuthPluginIntegrationTest_A9807A5850E309AA-001/tempDir-001/node2/jwtColl_shard1_replica_n1/../../../../dist filtered by solr-velocity-\d.*\.jar to classpath: /home/jenkins/workspace/Lucene-Solr-master-Linux/solr/build/solr-core/test/J2/temp/solr.security.JWTAuthPluginIntegrationTest_A9807A5850E309AA-001/tempDir-001/node2/jwtColl_shard1_replica_n1/../../../../dist
   [junit4]   2> 3422349 WARN  (qtp763337078-41062) [n:127.0.0.1:37477_solr c:jwtColl s:shard2 r:core_node4 x:jwtColl_shard2_replica_n2] o.a.s.c.SolrConfig Couldn't add files from /home/jenkins/workspace/Lucene-Solr-master-Linux/solr/build/solr-core/test/J2/temp/solr.security.JWTAuthPluginIntegrationTest_A9807A5850E309AA-001/tempDir-001/node1/jwtColl_shard2_replica_n2/../../../../dist filtered by solr-ltr-\d.*\.jar to classpath: /home/jenkins/workspace/Lucene-Solr-master-Linux/solr/build/solr-core/test/J2/temp/solr.security.JWTAuthPluginIntegrationTest_A9807A5850E309AA-001/tempDir-001/node1/jwtColl_shard2_replica_n2/../../../../dist
   [junit4]   2> 3422349 WARN  (qtp1973101306-41065) [n:127.0.0.1:44131_solr c:jwtColl s:shard1 r:core_node3 x:jwtColl_shard1_replica_n1] o.a.s.c.SolrConfig Couldn't add files from /home/jenkins/workspace/Lucene-Solr-master-Linux/solr/build/solr-core/test/J2/temp/solr.security.JWTAuthPluginIntegrationTest_A9807A5850E309AA-001/tempDir-001/node2/jwtColl_shard1_replica_n1/../../../../dist filtered by solr-ltr-\d.*\.jar to classpath: /home/jenkins/workspace/Lucene-Solr-master-Linux/solr/build/solr-core/test/J2/temp/solr.security.JWTAuthPluginIntegrationTest_A9807A5850E309AA-001/tempDir-001/node2/jwtColl_shard1_replica_n1/../../../../dist
   [junit4]   2> 3422350 INFO  (qtp763337078-41062) [n:127.0.0.1:37477_solr c:jwtColl s:shard2 r:core_node4 x:jwtColl_shard2_replica_n2] o.a.s.c.SolrConfig Using Lucene MatchVersion: 9.0.0
   [junit4]   2> 3422350 INFO  (qtp1973101306-41065) [n:127.0.0.1:44131_solr c:jwtColl s:shard1 r:core_node3 x:jwtColl_shard1_replica_n1] o.a.s.c.SolrConfig Using Lucene MatchVersion: 9.0.0
   [junit4]   2> 3422384 INFO  (qtp1973101306-41065) [n:127.0.0.1:44131_solr c:jwtColl s:shard1 r:core_node3 x:jwtColl_shard1_replica_n1] o.a.s.s.IndexSchema [jwtColl_shard1_replica_n1] Schema name=default-config
   [junit4]   2> 3422384 INFO  (qtp763337078-41062) [n:127.0.0.1:37477_solr c:jwtColl s:shard2 r:core_node4 x:jwtColl_shard2_replica_n2] o.a.s.s.IndexSchema [jwtColl_shard2_replica_n2] Schema name=default-config
   [junit4]   2> 3422641 INFO  (qtp1973101306-41065) [n:127.0.0.1:44131_solr c:jwtColl s:shard1 r:core_node3 x:jwtColl_shard1_replica_n1] o.a.s.s.IndexSchema Loaded schema default-config/1.6 with uniqueid field id
   [junit4]   2> 3422650 INFO  (qtp763337078-41062) [n:127.0.0.1:37477_solr c:jwtColl s:shard2 r:core_node4 x:jwtColl_shard2_replica_n2] o.a.s.s.IndexSchema Loaded schema default-config/1.6 with uniqueid field id
   [junit4]   2> 3422674 INFO  (qtp1973101306-41065) [n:127.0.0.1:44131_solr c:jwtColl s:shard1 r:core_node3 x:jwtColl_shard1_replica_n1] o.a.s.c.CoreContainer Creating SolrCore 'jwtColl_shard1_replica_n1' using configuration from collection jwtColl, trusted=true
   [junit4]   2> 3422675 INFO  (qtp1973101306-41065) [n:127.0.0.1:44131_solr c:jwtColl s:shard1 r:core_node3 x:jwtColl_shard1_replica_n1] o.a.s.m.r.SolrJmxReporter JMX monitoring for 'solr_44131.solr.core.jwtColl.shard1.replica_n1' (registry 'solr.core.jwtColl.shard1.replica_n1') enabled at server: com.sun.jmx.mbeanserver.JmxMBeanServer@105a279a
   [junit4]   2> 3422675 INFO  (qtp1973101306-41065) [n:127.0.0.1:44131_solr c:jwtColl s:shard1 r:core_node3 x:jwtColl_shard1_replica_n1] o.a.s.c.SolrCore [[jwtColl_shard1_replica_n1] ] Opening new SolrCore at [/home/jenkins/workspace/Lucene-Solr-master-Linux/solr/build/solr-core/test/J2/temp/solr.security.JWTAuthPluginIntegrationTest_A9807A5850E309AA-001/tempDir-001/node2/jwtColl_shard1_replica_n1], dataDir=[/home/jenkins/workspace/Lucene-Solr-master-Linux/solr/build/solr-core/test/J2/temp/solr.security.JWTAuthPluginIntegrationTest_A9807A5850E309AA-001/tempDir-001/node2/./jwtColl_shard1_replica_n1/data/]
   [junit4]   2> 3422683 INFO  (qtp763337078-41062) [n:127.0.0.1:37477_solr c:jwtColl s:shard2 r:core_node4 x:jwtColl_shard2_replica_n2] o.a.s.c.CoreContainer Creating SolrCore 'jwtColl_shard2_replica_n2' using configuration from collection jwtColl, trusted=true
   [junit4]   2> 3422683 INFO  (qtp1973101306-41065) [n:127.0.0.1:44131_solr c:jwtColl s:shard1 r:core_node3 x:jwtColl_shard1_replica_n1] o.a.s.r.XSLTResponseWriter xsltCacheLifetimeSeconds=5
   [junit4]   2> 3422684 INFO  (qtp763337078-41062) [n:127.0.0.1:37477_solr c:jwtColl s:shard2 r:core_node4 x:jwtColl_shard2_replica_n2] o.a.s.m.r.SolrJmxReporter JMX monitoring for 'solr_37477.solr.core.jwtColl.shard2.replica_n2' (registry 'solr.core.jwtColl.shard2.replica_n2') enabled at server: com.sun.jmx.mbeanserver.JmxMBeanServer@105a279a
   [junit4]   2> 3422684 INFO  (qtp763337078-41062) [n:127.0.0.1:37477_solr c:jwtColl s:shard2 r:core_node4 x:jwtColl_shard2_replica_n2] o.a.s.c.SolrCore [[jwtColl_shard2_replica_n2] ] Opening new SolrCore at [/home/jenkins/workspace/Lucene-Solr-master-Linux/solr/build/solr-core/test/J2/temp/solr.security.JWTAuthPluginIntegrationTest_A9807A5850E309AA-001/tempDir-001/node1/jwtColl_shard2_replica_n2], dataDir=[/home/jenkins/workspace/Lucene-Solr-master-Linux/solr/build/solr-core/test/J2/temp/solr.security.JWTAuthPluginIntegrationTest_A9807A5850E309AA-001/tempDir-001/node1/./jwtColl_shard2_replica_n2/data/]
   [junit4]   2> 3422691 INFO  (qtp763337078-41062) [n:127.0.0.1:37477_solr c:jwtColl s:shard2 r:core_node4 x:jwtColl_shard2_replica_n2] o.a.s.r.XSLTResponseWriter xsltCacheLifetimeSeconds=5
   [junit4]   2> 3423759 INFO  (qtp763337078-41062) [n:127.0.0.1:37477_solr c:jwtColl s:shard2 r:core_node4 x:jwtColl_shard2_replica_n2] o.a.s.u.UpdateHandler Using UpdateLog implementation: org.apache.solr.update.UpdateLog
   [junit4]   2> 3423760 INFO  (qtp763337078-41062) [n:127.0.0.1:37477_solr c:jwtColl s:shard2 r:core_node4 x:jwtColl_shard2_replica_n2] o.a.s.u.UpdateLog Initializing UpdateLog: dataDir= defaultSyncLevel=FLUSH numRecordsToKeep=100 maxNumLogsToKeep=10 numVersionBuckets=65536
   [junit4]   2> 3423760 INFO  (qtp1973101306-41065) [n:127.0.0.1:44131_solr c:jwtColl s:shard1 r:core_node3 x:jwtColl_shard1_replica_n1] o.a.s.u.UpdateHandler Using UpdateLog implementation: org.apache.solr.update.UpdateLog
   [junit4]   2> 3423760 INFO  (qtp1973101306-41065) [n:127.0.0.1:44131_solr c:jwtColl s:shard1 r:core_node3 x:jwtColl_shard1_replica_n1] o.a.s.u.UpdateLog Initializing UpdateLog: dataDir= defaultSyncLevel=FLUSH numRecordsToKeep=100 maxNumLogsToKeep=10 numVersionBuckets=65536
   [junit4]   2> 3423762 INFO  (qtp763337078-41062) [n:127.0.0.1:37477_solr c:jwtColl s:shard2 r:core_node4 x:jwtColl_shard2_replica_n2] o.a.s.u.CommitTracker Hard AutoCommit: if uncommitted for 15000ms; 
   [junit4]   2> 3423762 INFO  (qtp763337078-41062) [n:127.0.0.1:37477_solr c:jwtColl s:shard2 r:core_node4 x:jwtColl_shard2_replica_n2] o.a.s.u.CommitTracker Soft AutoCommit: disabled
   [junit4]   2> 3423762 INFO  (qtp1973101306-41065) [n:127.0.0.1:44131_solr c:jwtColl s:shard1 r:core_node3 x:jwtColl_shard1_replica_n1] o.a.s.u.CommitTracker Hard AutoCommit: if uncommitted for 15000ms; 
   [junit4]   2> 3423762 INFO  (qtp1973101306-41065) [n:127.0.0.1:44131_solr c:jwtColl s:shard1 r:core_node3 x:jwtColl_shard1_replica_n1] o.a.s.u.CommitTracker Soft AutoCommit: disabled
   [junit4]   2> 3423766 INFO  (qtp1973101306-41065) [n:127.0.0.1:44131_solr c:jwtColl s:shard1 r:core_node3 x:jwtColl_shard1_replica_n1] o.a.s.s.SolrIndexSearcher Opening [Searcher@6f39fbb2[jwtColl_shard1_replica_n1] main]
   [junit4]   2> 3423767 INFO  (qtp1973101306-41065) [n:127.0.0.1:44131_solr c:jwtColl s:shard1 r:core_node3 x:jwtColl_shard1_replica_n1] o.a.s.r.ManagedResourceStorage Configured ZooKeeperStorageIO with znodeBase: /configs/jwtColl.AUTOCREATED
   [junit4]   2> 3423767 INFO  (qtp1973101306-41065) [n:127.0.0.1:44131_solr c:jwtColl s:shard1 r:core_node3 x:jwtColl_shard1_replica_n1] o.a.s.r.ManagedResourceStorage Loaded null at path _rest_managed.json using ZooKeeperStorageIO:path=/configs/jwtColl.AUTOCREATED
   [junit4]   2> 3423767 INFO  (qtp1973101306-41065) [n:127.0.0.1:44131_solr c:jwtColl s:shard1 r:core_node3 x:jwtColl_shard1_replica_n1] o.a.s.s.ZkIndexSchemaReader Creating ZooKeeper watch for the managed schema at /configs/jwtColl.AUTOCREATED/managed-schema
   [junit4]   2> 3423768 INFO  (qtp1973101306-41065) [n:127.0.0.1:44131_solr c:jwtColl s:shard1 r:core_node3 x:jwtColl_shard1_replica_n1] o.a.s.s.ZkIndexSchemaReader Current schema version 0 is already the latest
   [junit4]   2> 3423768 INFO  (qtp1973101306-41065) [n:127.0.0.1:44131_solr c:jwtColl s:shard1 r:core_node3 x:jwtColl_shard1_replica_n1] o.a.s.h.c.SpellCheckComponent Initializing spell checkers
   [junit4]   2> 3423769 INFO  (qtp1973101306-41065) [n:127.0.0.1:44131_solr c:jwtColl s:shard1 r:core_node3 x:jwtColl_shard1_replica_n1] o.a.s.s.DirectSolrSpellChecker init: {name=default,field=_text_,classname=solr.DirectSolrSpellChecker,distanceMeasure=internal,accuracy=0.5,maxEdits=2,minPrefix=1,maxInspections=5,minQueryLength=4,maxQueryFrequency=0.01}
   [junit4]   2> 3423770 INFO  (qtp1973101306-41065) [n:127.0.0.1:44131_solr c:jwtColl s:shard1 r:core_node3 x:jwtColl_shard1_replica_n1] o.a.s.h.ReplicationHandler Commits will be reserved for 10000ms.
   [junit4]   2> 3423770 INFO  (qtp1973101306-41065) [n:127.0.0.1:44131_solr c:jwtColl s:shard1 r:core_node3 x:jwtColl_shard1_replica_n1] o.a.s.u.UpdateLog Could not find max version in index or recent updates, using new clock 1633534340600168448
   [junit4]   2> 3423772 INFO  (qtp763337078-41062) [n:127.0.0.1:37477_solr c:jwtColl s:shard2 r:core_node4 x:jwtColl_shard2_replica_n2] o.a.s.s.SolrIndexSearcher Opening [Searcher@75c1d4ac[jwtColl_shard2_replica_n2] main]
   [junit4]   2> 3423773 INFO  (qtp763337078-41062) [n:127.0.0.1:37477_solr c:jwtColl s:shard2 r:core_node4 x:jwtColl_shard2_replica_n2] o.a.s.r.ManagedResourceStorage Configured ZooKeeperStorageIO with znodeBase: /configs/jwtColl.AUTOCREATED
   [junit4]   2> 3423774 INFO  (qtp763337078-41062) [n:127.0.0.1:37477_solr c:jwtColl s:shard2 r:core_node4 x:jwtColl_shard2_replica_n2] o.a.s.r.ManagedResourceStorage Loaded null at path _rest_managed.json using ZooKeeperStorageIO:path=/configs/jwtColl.AUTOCREATED
   [junit4]   2> 3423774 INFO  (qtp763337078-41062) [n:127.0.0.1:37477_solr c:jwtColl s:shard2 r:core_node4 x:jwtColl_shard2_replica_n2] o.a.s.s.ZkIndexSchemaReader Creating ZooKeeper watch for the managed schema at /configs/jwtColl.AUTOCREATED/managed-schema
   [junit4]   2> 3423775 INFO  (qtp763337078-41062) [n:127.0.0.1:37477_solr c:jwtColl s:shard2 r:core_node4 x:jwtColl_shard2_replica_n2] o.a.s.s.ZkIndexSchemaReader Current schema version 0 is already the latest
   [junit4]   2> 3423775 INFO  (searcherExecutor-13089-thread-1-processing-n:127.0.0.1:44131_solr x:jwtColl_shard1_replica_n1 c:jwtColl s:shard1 r:core_node3) [n:127.0.0.1:44131_solr c:jwtColl s:shard1 r:core_node3 x:jwtColl_shard1_replica_n1] o.a.s.c.QuerySenderListener QuerySenderListener sending requests to Searcher@6f39fbb2[jwtColl_shard1_replica_n1] main{ExitableDirectoryReader(UninvertingDirectoryReader())}
   [junit4]   2> 3423775 INFO  (searcherExecutor-13089-thread-1-processing-n:127.0.0.1:44131_solr x:jwtColl_shard1_replica_n1 c:jwtColl s:shard1 r:core_node3) [n:127.0.0.1:44131_solr c:jwtColl s:shard1 r:core_node3 x:jwtColl_shard1_replica_n1] o.a.s.c.QuerySenderListener QuerySenderListener done.
   [junit4]   2> 3423775 INFO  (searcherExecutor-13089-thread-1-processing-n:127.0.0.1:44131_solr x:jwtColl_shard1_replica_n1 c:jwtColl s:shard1 r:core_node3) [n:127.0.0.1:44131_solr c:jwtColl s:shard1 r:core_node3 x:jwtColl_shard1_replica_n1] o.a.s.h.c.SpellCheckComponent Loading spell index for spellchecker: default
   [junit4]   2> 3423776 INFO  (qtp763337078-41062) [n:127.0.0.1:37477_solr c:jwtColl s:shard2 r:core_node4 x:jwtColl_shard2_replica_n2] o.a.s.h.c.SpellCheckComponent Initializing spell checkers
   [junit4]   2> 3423776 INFO  (qtp763337078-41062) [n:127.0.0.1:37477_solr c:jwtColl s:shard2 r:core_node4 x:jwtColl_shard2_replica_n2] o.a.s.s.DirectSolrSpellChecker init: {name=default,field=_text_,classname=solr.DirectSolrSpellChecker,distanceMeasure=internal,accuracy=0.5,maxEdits=2,minPrefix=1,maxInspections=5,minQueryLength=4,maxQueryFrequency=0.01}
   [junit4]   2> 3423776 INFO  (qtp1973101306-41065) [n:127.0.0.1:44131_solr c:jwtColl s:shard1 r:core_node3 x:jwtColl_shard1_replica_n1] o.a.s.c.ZkShardTerms Successful update of terms at /collections/jwtColl/terms/shard1 to Terms{values={core_node3=0}, version=0}
   [junit4]   2> 3423776 INFO  (qtp1973101306-41065) [n:127.0.0.1:44131_solr c:jwtColl s:shard1 r:core_node3 x:jwtColl_shard1_replica_n1] o.a.s.c.ShardLeaderElectionContextBase make sure parent is created /collections/jwtColl/leaders/shard1
   [junit4]   2> 3423777 INFO  (searcherExecutor-13089-thread-1-processing-n:127.0.0.1:44131_solr x:jwtColl_shard1_replica_n1 c:jwtColl s:shard1 r:core_node3) [n:127.0.0.1:44131_solr c:jwtColl s:shard1 r:core_node3 x:jwtColl_shard1_replica_n1] o.a.s.c.SolrCore [jwtColl_shard1_replica_n1] Registered new searcher Searcher@6f39fbb2[jwtColl_shard1_replica_n1] main{ExitableDirectoryReader(UninvertingDirectoryReader())}
   [junit4]   2> 3423779 INFO  (qtp1973101306-41065) [n:127.0.0.1:44131_solr c:jwtColl s:shard1 r:core_node3 x:jwtColl_shard1_replica_n1] o.a.s.c.ShardLeaderElectionContext Enough replicas found to continue.
   [junit4]   2> 3423779 INFO  (qtp1973101306-41065) [n:127.0.0.1:44131_solr c:jwtColl s:shard1 r:core_node3 x:jwtColl_shard1_replica_n1] o.a.s.c.ShardLeaderElectionContext I may be the new leader - try and sync
   [junit4]   2> 3423779 INFO  (qtp1973101306-41065) [n:127.0.0.1:44131_solr c:jwtColl s:shard1 r:core_node3 x:jwtColl_shard1_replica_n1] o.a.s.c.SyncStrategy Sync replicas to http://127.0.0.1:44131/solr/jwtColl_shard1_replica_n1/
   [junit4]   2> 3423780 INFO  (qtp1973101306-41065) [n:127.0.0.1:44131_solr c:jwtColl s:shard1 r:core_node3 x:jwtColl_shard1_replica_n1] o.a.s.c.SyncStrategy Sync Success - now sync replicas to me
   [junit4]   2> 3423780 INFO  (qtp763337078-41062) [n:127.0.0.1:37477_solr c:jwtColl s:shard2 r:core_node4 x:jwtColl_shard2_replica_n2] o.a.s.h.ReplicationHandler Commits will be reserved for 10000ms.
   [junit4]   2> 3423780 INFO  (qtp763337078-41062) [n:127.0.0.1:37477_solr c:jwtColl s:shard2 r:core_node4 x:jwtColl_shard2_replica_n2] o.a.s.u.UpdateLog Could not find max version in index or recent updates, using new clock 1633534340610654208
   [junit4]   2> 3423780 INFO  (qtp1973101306-41065) [n:127.0.0.1:44131_solr c:jwtColl s:shard1 r:core_node3 x:jwtColl_shard1_replica_n1] o.a.s.c.SyncStrategy http://127.0.0.1:44131/solr/jwtColl_shard1_replica_n1/ has no replicas
   [junit4]   2> 3423780 INFO  (qtp1973101306-41065) [n:127.0.0.1:44131_solr c:jwtColl s:shard1 r:core_node3 x:jwtColl_shard1_replica_n1] o.a.s.c.ShardLeaderElectionContextBase Creating leader registration node /collections/jwtColl/leaders/shard1/leader after winning as /collections/jwtColl/leader_elect/shard1/election/72251257485000713-core_node3-n_0000000000
   [junit4]   2> 3423782 INFO  (qtp1973101306-41065) [n:127.0.0.1:44131_solr c:jwtColl s:shard1 r:core_node3 x:jwtColl_shard1_replica_n1] o.a.s.c.ShardLeaderElectionContext I am the new leader: http://127.0.0.1:44131/solr/jwtColl_shard1_replica_n1/ shard1
   [junit4]   2> 3423782 INFO  (searcherExecutor-13090-thread-1-processing-n:127.0.0.1:37477_solr x:jwtColl_shard2_replica_n2 c:jwtColl s:shard2 r:core_node4) [n:127.0.0.1:37477_solr c:jwtColl s:shard2 r:core_node4 x:jwtColl_shard2_replica_n2] o.a.s.c.QuerySenderListener QuerySenderListener sending requests to Searcher@75c1d4ac[jwtColl_shard2_replica_n2] main{ExitableDirectoryReader(UninvertingDirectoryReader())}
   [junit4]   2> 3423782 INFO  (searcherExecutor-13090-thread-1-processing-n:127.0.0.1:37477_solr x:jwtColl_shard2_replica_n2 c:jwtColl s:shard2 r:core_node4) [n:127.0.0.1:37477_solr c:jwtColl s:shard2 r:core_node4 x:jwtColl_shard2_replica_n2] o.a.s.c.QuerySenderListener QuerySenderListener done.
   [junit4]   2> 3423782 INFO  (searcherExecutor-13090-thread-1-processing-n:127.0.0.1:37477_solr x:jwtColl_shard2_replica_n2 c:jwtColl s:shard2 r:core_node4) [n:127.0.0.1:37477_solr c:jwtColl s:shard2 r:core_node4 x:jwtColl_shard2_replica_n2] o.a.s.h.c.SpellCheckComponent Loading spell index for spellchecker: default
   [junit4]   2> 3423784 INFO  (searcherExecutor-13090-thread-1-processing-n:127.0.0.1:37477_solr x:jwtColl_shard2_replica_n2 c:jwtColl s:shard2 r:core_node4) [n:127.0.0.1:37477_solr c:jwtColl s:shard2 r:core_node4 x:jwtColl_shard2_replica_n2] o.a.s.c.SolrCore [jwtColl_shard2_replica_n2] Registered new searcher Searcher@75c1d4ac[jwtColl_shard2_replica_n2] main{ExitableDirectoryReader(UninvertingDirectoryReader())}
   [junit4]   2> 3423785 INFO  (zkCallback-16337-thread-1) [    ] o.a.s.c.c.ZkStateReader A cluster state change: [WatchedEvent state:SyncConnected type:NodeDataChanged path:/collections/jwtColl/state.json] for collection [jwtColl] has occurred - updating... (live nodes size: [2])
   [junit4]   2> 3423785 INFO  (qtp1973101306-41065) [n:127.0.0.1:44131_solr c:jwtColl s:shard1 r:core_node3 x:jwtColl_shard1_replica_n1] o.a.s.c.ZkController I am the leader, no recovery necessary
   [junit4]   2> 3423788 INFO  (qtp763337078-41062) [n:127.0.0.1:37477_solr c:jwtColl s:shard2 r:core_node4 x:jwtColl_shard2_replica_n2] o.a.s.c.ZkShardTerms Successful update of terms at /collections/jwtColl/terms/shard2 to Terms{values={core_node4=0}, version=0}
   [junit4]   2> 3423788 INFO  (qtp763337078-41062) [n:127.0.0.1:37477_solr c:jwtColl s:shard2 r:core_node4 x:jwtColl_shard2_replica_n2] o.a.s.c.ShardLeaderElectionContextBase make sure parent is created /collections/jwtColl/leaders/shard2
   [junit4]   2> 3423790 INFO  (qtp763337078-41062) [n:127.0.0.1:37477_solr c:jwtColl s:shard2 r:core_node4 x:jwtColl_shard2_replica_n2] o.a.s.c.ShardLeaderElectionContext Enough replicas found to continue.
   [junit4]   2> 3423791 INFO  (qtp763337078-41062) [n:127.0.0.1:37477_solr c:jwtColl s:shard2 r:core_node4 x:jwtColl_shard2_replica_n2] o.a.s.c.ShardLeaderElectionContext I may be the new leader - try and sync
   [junit4]   2> 3423791 INFO  (qtp763337078-41062) [n:127.0.0.1:37477_solr c:jwtColl s:shard2 r:core_node4 x:jwtColl_shard2_replica_n2] o.a.s.c.SyncStrategy Sync replicas to http://127.0.0.1:37477/solr/jwtColl_shard2_replica_n2/
   [junit4]   2> 3423791 INFO  (qtp763337078-41062) [n:127.0.0.1:37477_solr c:jwtColl s:shard2 r:core_node4 x:jwtColl_shard2_replica_n2] o.a.s.c.SyncStrategy Sync Success - now sync replicas to me
   [junit4]   2> 3423791 INFO  (qtp763337078-41062) [n:127.0.0.1:37477_solr c:jwtColl s:shard2 r:core_node4 x:jwtColl_shard2_replica_n2] o.a.s.c.SyncStrategy http://127.0.0.1:37477/solr/jwtColl_shard2_replica_n2/ has no replicas
   [junit4]   2> 3423791 INFO  (qtp763337078-41062) [n:127.0.0.1:37477_solr c:jwtColl s:shard2 r:core_node4 x:jwtColl_shard2_replica_n2] o.a.s.c.ShardLeaderElectionContextBase Creating leader registration node /collections/jwtColl/leaders/shard2/leader after winning as /collections/jwtColl/leader_elect/shard2/election/72251257485000710-core_node4-n_0000000000
   [junit4]   2> 3423793 INFO  (zkCallback-16337-thread-2) [    ] o.a.s.c.c.ZkStateReader A cluster state change: [WatchedEvent state:SyncConnected type:NodeDataChanged path:/collections/jwtColl/state.json] for collection [jwtColl] has occurred - updating... (live nodes size: [2])
   [junit4]   2> 3423793 INFO  (qtp763337078-41062) [n:127.0.0.1:37477_solr c:jwtColl s:shard2 r:core_node4 x:jwtColl_shard2_replica_n2] o.a.s.c.ShardLeaderElectionContext I am the new leader: http://127.0.0.1:37477/solr/jwtColl_shard2_replica_n2/ shard2
   [junit4]   2> 3423894 INFO  (zkCallback-16322-thread-2) [    ] o.a.s.c.c.ZkStateReader A cluster state change: [WatchedEvent state:SyncConnected type:NodeDataChanged path:/collections/jwtColl/state.json] for collection [jwtColl] has occurred - updating... (live nodes size: [2])
   [junit4]   2> 3423895 INFO  (qtp763337078-41062) [n:127.0.0.1:37477_solr c:jwtColl s:shard2 r:core_node4 x:jwtColl_shard2_replica_n2] o.a.s.c.ZkController I am the leader, no recovery necessary
   [junit4]   2> 3423895 INFO  (zkCallback-16337-thread-2) [    ] o.a.s.c.c.ZkStateReader A cluster state change: [WatchedEvent state:SyncConnected type:NodeDataChanged path:/collections/jwtColl/state.json] for collection [jwtColl] has occurred - updating... (live nodes size: [2])
   [junit4]   2> 3423895 INFO  (zkCallback-16337-thread-1) [    ] o.a.s.c.c.ZkStateReader A cluster state change: [WatchedEvent state:SyncConnected type:NodeDataChanged path:/collections/jwtColl/state.json] for collection [jwtColl] has occurred - updating... (live nodes size: [2])
   [junit4]   2> 3423896 INFO  (zkCallback-16337-thread-3) [    ] o.a.s.c.c.ZkStateReader A cluster state change: [WatchedEvent state:SyncConnected type:NodeDataChanged path:/collections/jwtColl/state.json] for collection [jwtColl] has occurred - updating... (live nodes size: [2])
   [junit4]   2> 3423919 INFO  (qtp763337078-41062) [n:127.0.0.1:37477_solr c:jwtColl s:shard2 r:core_node4 x:jwtColl_shard2_replica_n2] o.a.s.s.HttpSolrCall [admin] webapp=null path=/admin/cores params={qt=/admin/cores&coreNodeName=core_node4&collection.configName=jwtColl.AUTOCREATED&newCollection=true&name=jwtColl_shard2_replica_n2&action=CREATE&numShards=2&collection=jwtColl&shard=shard2&wt=javabin&version=2&replicaType=NRT} status=0 QTime=2583
   [junit4]   2> 3423919 INFO  (qtp1973101306-41065) [n:127.0.0.1:44131_solr c:jwtColl s:shard1 r:core_node3 x:jwtColl_shard1_replica_n1] o.a.s.s.HttpSolrCall [admin] webapp=null path=/admin/cores params={qt=/admin/cores&coreNodeName=core_node3&collection.configName=jwtColl.AUTOCREATED&newCollection=true&name=jwtColl_shard1_replica_n1&action=CREATE&numShards=2&collection=jwtColl&shard=shard1&wt=javabin&version=2&replicaType=NRT} status=0 QTime=2582
   [junit4]   2> 3424007 INFO  (zkCallback-16322-thread-1) [    ] o.a.s.c.c.ZkStateReader A cluster state change: [WatchedEvent state:SyncConnected type:NodeDataChanged path:/collections/jwtColl/state.json] for collection [jwtColl] has occurred - updating... (live nodes size: [2])
   [junit4]   2> 3424007 INFO  (zkCallback-16322-thread-2) [    ] o.a.s.c.c.ZkStateReader A cluster state change: [WatchedEvent state:SyncConnected type:NodeDataChanged path:/collections/jwtColl/state.json] for collection [jwtColl] has occurred - updating... (live nodes size: [2])
   [junit4]   2> 3424011 INFO  (zkCallback-16337-thread-2) [    ] o.a.s.c.c.ZkStateReader A cluster state change: [WatchedEvent state:SyncConnected type:NodeDataChanged path:/collections/jwtColl/state.json] for collection [jwtColl] has occurred - updating... (live nodes size: [2])
   [junit4]   2> 3424011 INFO  (zkCallback-16337-thread-1) [    ] o.a.s.c.c.ZkStateReader A cluster state change: [WatchedEvent state:SyncConnected type:NodeDataChanged path:/collections/jwtColl/state.json] for collection [jwtColl] has occurred - updating... (live nodes size: [2])
   [junit4]   2> 3424012 INFO  (zkCallback-16337-thread-3) [    ] o.a.s.c.c.ZkStateReader A cluster state change: [WatchedEvent state:SyncConnected type:NodeDataChanged path:/collections/jwtColl/state.json] for collection [jwtColl] has occurred - updating... (live nodes size: [2])
   [junit4]   2> 3424242 INFO  (qtp1973101306-41063) [n:127.0.0.1:44131_solr    ] o.a.s.h.a.CollectionsHandler Wait for new collection to be active for at most 45 seconds. Check all shard replicas
   [junit4]   2> 3424242 INFO  (qtp1973101306-41063) [n:127.0.0.1:44131_solr    ] o.a.s.s.HttpSolrCall [admin] webapp=null path=/admin/collections params={name=jwtColl&action=CREATE&numShards=2} status=0 QTime=3293
   [junit4]   2> 3425095 INFO  (qtp1973101306-41061) [n:127.0.0.1:44131_solr    ] o.a.s.s.HttpSolrCall [admin] webapp=null path=/admin/info/key params={omitHeader=true&wt=json} status=0 QTime=1
   [junit4]   2> 3425097 INFO  (qtp763337078-41062) [n:127.0.0.1:37477_solr c:jwtColl s:shard2 r:core_node4 x:jwtColl_shard2_replica_n2] o.a.s.s.PKIAuthenticationPlugin New Key obtained from  node: 127.0.0.1:44131_solr / MIIBIjANBgkqhkiG9w0BAQEFAAOCAQ8AMIIBCgKCAQEAlbqrVic/LrutxuBGsPhJ/NVuU2A9xmTnHoz8Cd4Njw6aWBOXtEJ56MXzFx7X/JsHiZYO5xnx1YKJU1OEO/n2bBWwcAS3G8V8IadqMgBQ9XlpeXHOVTj0Xc9KK78BrJW+x90c5b0Tvr/n18DHMRD+X4ca0joK2FNfAi0cv09wMFWCiS/O+GXvdH8AwnxbAb+RdFmumHIpmDdBSAZdnTW9RAHB8yitCEm/cdWDFQ9wGxpxCaBdfRhZlZvDxnI3OYzYiI14XcrMxBkGZtZwRLu3OXjvfe2MH59sDc7dRmIxkSSBqDsjhAa7CAQ52rl1Z8y4Y0ircUdZK2lpKphC/jjrfwIDAQAB
   [junit4]   2> 3425104 INFO  (qtp763337078-41062) [n:127.0.0.1:37477_solr c:jwtColl s:shard2 r:core_node4 x:jwtColl_shard2_replica_n2] o.a.s.c.ZkShardTerms Successful update of terms at /collections/jwtColl/terms/shard2 to Terms{values={core_node4=1}, version=1}
   [junit4]   2> 3425104 INFO  (qtp763337078-41062) [n:127.0.0.1:37477_solr c:jwtColl s:shard2 r:core_node4 x:jwtColl_shard2_replica_n2] o.a.s.u.p.LogUpdateProcessorFactory [jwtColl_shard2_replica_n2]  webapp=/solr path=/update params={update.distrib=TOLEADER&distrib.from=http://127.0.0.1:44131/solr/jwtColl_shard1_replica_n1/&wt=javabin&version=2}{add=[2 (1633534341992677376), 3 (1633534341994774528)]} 0 6
   [junit4]   2> 3425117 INFO  (qtp763337078-41064) [n:127.0.0.1:37477_solr c:jwtColl s:shard2 r:core_node4 x:jwtColl_shard2_replica_n2] o.a.s.u.DirectUpdateHandler2 start commit{_version_=1633534342012600320,optimize=false,openSearcher=true,waitSearcher=true,expungeDeletes=false,softCommit=false,prepareCommit=false}
   [junit4]   2> 3425117 INFO  (qtp763337078-41064) [n:127.0.0.1:37477_solr c:jwtColl s:shard2 r:core_node4 x:jwtColl_shard2_replica_n2] o.a.s.u.SolrIndexWriter Calling setCommitData with IW:org.apache.solr.update.SolrIndexWriter@1c60600b commitCommandVersion:1633534342012600320
   [junit4]   2> 3425205 INFO  (qtp763337078-41064) [n:127.0.0.1:37477_solr c:jwtColl s:shard2 r:core_node4 x:jwtColl_shard2_replica_n2] o.a.s.s.SolrIndexSearcher Opening [Searcher@6bc02e8c[jwtColl_shard2_replica_n2] main]
   [junit4]   2> 3425205 INFO  (qtp763337078-41064) [n:127.0.0.1:37477_solr c:jwtColl s:shard2 r:core_node4 x:jwtColl_shard2_replica_n2] o.a.s.u.DirectUpdateHandler2 end_commit_flush
   [junit4]   2> 3425205 INFO  (searcherExecutor-13090-thread-1-processing-n:127.0.0.1:37477_solr x:jwtColl_shard2_replica_n2 c:jwtColl s:shard2 r:core_node4) [n:127.0.0.1:37477_solr c:jwtColl s:shard2 r:core_node4 x:jwtColl_shard2_replica_n2] o.a.s.c.QuerySenderListener QuerySenderListener sending requests to Searcher@6bc02e8c[jwtColl_shard2_replica_n2] main{ExitableDirectoryReader(UninvertingDirectoryReader(Uninverting(_0(9.0.0):C2:[diagnostics={os.arch=amd64, java.runtime.version=13-testing+0-builds.shipilev.net-openjdk-jdk-b845-20190430-jdk-1318, os.version=4.18.0-17-generic, os=Linux, java.vendor=Aleksey Shipilev, timestamp=1557859747023, java.version=13-testing, java.vm.version=13-testing+0-builds.shipilev.net-openjdk-jdk-b845-20190430-jdk-1318, lucene.version=9.0.0, source=flush}]:[attributes={Lucene50StoredFieldsFormat.mode=BEST_SPEED}])))}
   [junit4]   2> 3425205 INFO  (searcherExecutor-13090-thread-1-processing-n:127.0.0.1:37477_solr x:jwtColl_shard2_replica_n2 c:jwtColl s:shard2 r:core_node4) [n:127.0.0.1:37477_solr c:jwtColl s:shard2 r:core_node4 x:jwtColl_shard2_replica_n2] o.a.s.c.QuerySenderListener QuerySenderListener done.
   [junit4]   2> 3425209 INFO  (searcherExecutor-13090-thread-1-processing-n:127.0.0.1:37477_solr x:jwtColl_shard2_replica_n2 c:jwtColl s:shard2 r:core_node4) [n:127.0.0.1:37477_solr c:jwtColl s:shard2 r:core_node4 x:jwtColl_shard2_replica_n2] o.a.s.c.SolrCore [jwtColl_shard2_replica_n2] Registered new searcher Searcher@6bc02e8c[jwtColl_shard2_replica_n2] main{ExitableDirectoryReader(UninvertingDirectoryReader(Uninverting(_0(9.0.0):C2:[diagnostics={os.arch=amd64, java.runtime.version=13-testing+0-builds.shipilev.net-openjdk-jdk-b845-20190430-jdk-1318, os.version=4.18.0-17-generic, os=Linux, java.vendor=Aleksey Shipilev, timestamp=1557859747023, java.version=13-testing, java.vm.version=13-testing+0-builds.shipilev.net-openjdk-jdk-b845-20190430-jdk-1318, lucene.version=9.0.0, source=flush}]:[attributes={Lucene50StoredFieldsFormat.mode=BEST_SPEED}])))}
   [junit4]   2> 3425209 INFO  (qtp763337078-41064) [n:127.0.0.1:37477_solr c:jwtColl s:shard2 r:core_node4 x:jwtColl_shard2_replica_n2] o.a.s.u.p.LogUpdateProcessorFactory [jwtColl_shard2_replica_n2]  webapp=/solr path=/update params={update.distrib=TOLEADER&waitSearcher=true&openSearcher=true&commit=true&softCommit=false&distrib.from=http://127.0.0.1:44131/solr/jwtColl_shard1_replica_n1/&commit_end_point=leaders&wt=javabin&version=2&expungeDeletes=false}{commit=} 0 93
   [junit4]   2> 3425210 INFO  (qtp1973101306-41065) [n:127.0.0.1:44131_solr c:jwtColl s:shard1 r:core_node3 x:jwtColl_shard1_replica_n1] o.a.s.u.DirectUpdateHandler2 start commit{_version_=1633534342110117888,optimize=false,openSearcher=true,waitSearcher=true,expungeDeletes=false,softCommit=false,prepareCommit=false}
   [junit4]   2> 3425210 INFO  (qtp1973101306-41065) [n:127.0.0.1:44131_solr c:jwtColl s:shard1 r:core_node3 x:jwtColl_shard1_replica_n1] o.a.s.u.SolrIndexWriter Calling setCommitData with IW:org.apache.solr.update.SolrIndexWriter@55c8d43e commitCommandVersion:1633534342110117888
   [junit4]   2> 3425213 INFO  (qtp1973101306-41065) [n:127.0.0.1:44131_solr c:jwtColl s:shard1 r:core_node3 x:jwtColl_shard1_replica_n1] o.a.s.s.SolrIndexSearcher Opening [Searcher@2b8c4116[jwtColl_shard1_replica_n1] main]
   [junit4]   2> 3425213 INFO  (qtp1973101306-41065) [n:127.0.0.1:44131_solr c:jwtColl s:shard1 r:core_node3 x:jwtColl_shard1_replica_n1] o.a.s.u.DirectUpdateHandler2 end_commit_flush
   [junit4]   2> 3425213 INFO  (searcherExecutor-13089-thread-1-processing-n:127.0.0.1:44131_solr x:jwtColl_shard1_replica_n1 c:jwtColl s:shard1 r:core_node3) [n:127.0.0.1:44131_solr c:jwtColl s:shard1 r:core_node3 x:jwtColl_shard1_replica_n1] o.a.s.c.QuerySenderListener QuerySenderListener sending requests to Searcher@2b8c4116[jwtColl_shard1_replica_n1] main{ExitableDirectoryReader(UninvertingDirectoryReader(Uninverting(_0(9.0.0):C1:[diagnostics={os.arch=amd64, java.runtime.version=13-testing+0-builds.shipilev.net-openjdk-jdk-b845-20190430-jdk-1318, os.version=4.18.0-17-generic, os=Linux, java.vendor=Aleksey Shipilev, timestamp=1557859747040, java.version=13-testing, java.vm.version=13-testing+0-builds.shipilev.net-openjdk-jdk-b845-20190430-jdk-1318, lucene.version=9.0.0, source=flush}]:[attributes={Lucene50StoredFieldsFormat.mode=BEST_SPEED}])))}
   [junit4]   2> 3425213 INFO  (searcherExecutor-13089-thread-1-processing-n:127.0.0.1:44131_solr x:jwtColl_shard1_replica_n1 c:jwtColl s:shard1 r:core_node3) [n:127.0.0.1:44131_solr c:jwtColl s:shard1 r:core_node3 x:jwtColl_shard1_replica_n1] o.a.s.c.QuerySenderListener QuerySenderListener done.
   [junit4]   2> 3425217 INFO  (searcherExecutor-13089-thread-1-processing-n:127.0.0.1:44131_solr x:jwtColl_shard1_replica_n1 c:jwtColl s:shard1 r:core_node3) [n:127.0.0.1:44131_solr c:jwtColl s:shard1 r:core_node3 x:jwtColl_shard1_replica_n1] o.a.s.c.SolrCore [jwtColl_shard1_replica_n1] Registered new searcher Searcher@2b8c4116[jwtColl_shard1_replica_n1] main{ExitableDirectoryReader(UninvertingDirectoryReader(Uninverting(_0(9.0.0):C1:[diagnostics={os.arch=amd64, java.runtime.version=13-testing+0-builds.shipilev.net-openjdk-jdk-b845-20190430-jdk-1318, os.version=4.18.0-17-generic, os=Linux, java.vendor=Aleksey Shipilev, timestamp=1557859747040, java.version=13-testing, java.vm.version=13-testing+0-builds.shipilev.net-openjdk-jdk-b845-20190430-jdk-1318, lucene.version=9.0.0, source=flush}]:[attributes={Lucene50StoredFieldsFormat.mode=BEST_SPEED}])))}
   [junit4]   2> 3425218 INFO  (qtp1973101306-41065) [n:127.0.0.1:44131_solr c:jwtColl s:shard1 r:core_node3 x:jwtColl_shard1_replica_n1] o.a.s.c.ZkShardTerms Successful update of terms at /collections/jwtColl/terms/shard1 to Terms{values={core_node3=1}, version=1}
   [junit4]   2> 3425218 INFO  (qtp1973101306-41065) [n:127.0.0.1:44131_solr c:jwtColl s:shard1 r:core_node3 x:jwtColl_shard1_replica_n1] o.a.s.u.p.LogUpdateProcessorFactory [jwtColl_shard1_replica_n1]  webapp=/solr path=/update params={commit=true}{add=[1 (1633534341931859968), 2, 3],commit=} 0 178
   [junit4]   2> 3425298 INFO  (qtp1973101306-41063) [n:127.0.0.1:44131_solr c:jwtColl s:shard1 r:core_node3 x:jwtColl_shard1_replica_n1] o.a.s.c.S.Request [jwtColl_shard1_replica_n1]  webapp=/solr path=/query params={q=*:*&distrib=false} hits=1 status=0 QTime=11
   [junit4]   2> 3425393 INFO  (qtp1973101306-41065) [n:127.0.0.1:44131_solr c:jwtColl s:shard1 r:core_node3 x:jwtColl_shard1_replica_n1] o.a.s.c.S.Request [jwtColl_shard1_replica_n1]  webapp=/solr path=/query params={df=_text_&distrib=false&qt=/query&fl=id&fl=score&shards.purpose=4&start=0&fsv=true&shard.url=http://127.0.0.1:44131/solr/jwtColl_shard1_replica_n1/&rows=10&version=2&q=*:*&NOW=1557859747132&isShard=true&wt=javabin} hits=1 status=0 QTime=0
   [junit4]   2> 3426145 INFO  (OverseerCollectionConfigSetProcessor-72251257485000710-127.0.0.1:37477_solr-n_0000000000) [n:127.0.0.1:37477_solr    ] o.a.s.c.OverseerTaskQueue Response ZK path: /overseer/collection-queue-work/qnr-0000000000 doesn't exist.  Requestor may have disconnected from ZooKeeper
   [junit4]   2> 3426146 INFO  (qtp763337078-41064) [n:127.0.0.1:37477_solr c:jwtColl s:shard2 r:core_node4 x:jwtColl_shard2_replica_n2] o.a.s.c.S.Request [jwtColl_shard2_replica_n2]  webapp=/solr path=/query params={df=_text_&distrib=false&qt=/query&fl=id&fl=score&shards.purpose=4&start=0&fsv=true&shard.url=http://127.0.0.1:37477/solr/jwtColl_shard2_replica_n2/&rows=10&version=2&q=*:*&NOW=1557859747132&isShard=true&wt=javabin} hits=2 status=0 QTime=1
   [junit4]   2> 3426151 INFO  (qtp1973101306-41063) [n:127.0.0.1:44131_solr c:jwtColl s:shard1 r:core_node3 x:jwtColl_shard1_replica_n1] o.a.s.c.S.Request [jwtColl_shard1_replica_n1]  webapp=/solr path=/query params={q=*:*&df=_text_&distrib=false&qt=/query&shards.purpose=64&NOW=1557859747132&ids=1&isShard=true&shard.url=http://127.0.0.1:44131/solr/jwtColl_shard1_replica_n1/&wt=javabin&version=2} status=0 QTime=1
   [junit4]   2> 3426152 INFO  (qtp763337078-41060) [n:127.0.0.1:37477_solr c:jwtColl s:shard2 r:core_node4 x:jwtColl_shard2_replica_n2] o.a.s.c.S.Request [jwtColl_shard2_replica_n2]  webapp=/solr path=/query params={q=*:*&df=_text_&distrib=false&qt=/query&shards.purpose=64&NOW=1557859747132&ids=2,3&isShard=true&shard.url=http://127.0.0.1:37477/solr/jwtColl_shard2_replica_n2/&wt=javabin&version=2} status=0 QTime=2
   [junit4]   2> 3426153 INFO  (qtp1973101306-41061) [n:127.0.0.1:44131_solr c:jwtColl s:shard1 r:core_node3 x:jwtColl_shard1_replica_n1] o.a.s.c.S.Request [jwtColl_shard1_replica_n1]  webapp=/solr path=/query params={q=*:*} hits=3 status=0 QTime=849
   [junit4]   2> 3426159 INFO  (qtp1973101306-41065) [n:127.0.0.1:44131_solr    ] o.a.s.h.a.CollectionsHandler Invoked Collection Action :delete with params name=jwtColl&action=DELETE and sendToOCPQueue=true
   [junit4]   2> 3426167 INFO  (OverseerThreadFactory-13080-thread-2-processing-n:127.0.0.1:37477_solr) [n:127.0.0.1:37477_solr    ] o.a.s.c.a.c.OverseerCollectionMessageHandler Executing Collection Cmd=action=UNLOAD&deleteInstanceDir=true&deleteDataDir=true&deleteMetricsHistory=true, asyncId=null
   [junit4]   2> 3426216 INFO  (qtp763337078-41062) [n:127.0.0.1:37477_solr    x:jwtColl_shard2_replica_n2] o.a.s.m.SolrMetricManager Closing metric reporters for registry=solr.core.jwtColl.shard2.replica_n2, tag=null
   [junit4]   2> 3426216 INFO  (qtp763337078-41062) [n:127.0.0.1:37477_solr    x:jwtColl_shard2_replica_n2] o.a.s.m.r.SolrJmxReporter Closing reporter [org.apache.solr.metrics.reporters.SolrJmxReporter@50a2b30b: rootName = solr_37477, domain = solr.core.jwtColl.shard2.replica_n2, service url = null, agent id = null] for registry solr.core.jwtColl.shard2.replica_n2 / com.codahale.metrics.MetricRegistry@76b6fd16
   [junit4]   2> 3426250 INFO  (qtp763337078-41062) [n:127.0.0.1:37477_solr    x:jwtColl_shard2_replica_n2] o.a.s.c.SolrCore [jwtColl_shard2_replica_n2]  CLOSING SolrCore org.apache.solr.core.SolrCore@432965c2
   [junit4]   2> 3426250 INFO  (qtp763337078-41062) [n:127.0.0.1:37477_solr    x:jwtColl_shard2_replica_n2] o.a.s.m.SolrMetricManager Closing metric reporters for registry=solr.core.jwtColl.shard2.replica_n2, tag=432965c2
   [junit4]   2> 3426250 INFO  (qtp763337078-41062) [n:127.0.0.1:37477_solr    x:jwtColl_shard2_replica_n2] o.a.s.m.SolrMetricManager Closing metric reporters for registry=solr.collection.jwtColl.shard2.leader, tag=432965c2
   [junit4]   2> 3426262 INFO  (qtp1973101306-41063) [n:127.0.0.1:44131_solr    x:jwtColl_shard1_replica_n1] o.a.s.m.SolrMetricManager Closing metric reporters for registry=solr.core.jwtColl.shard1.replica_n1, tag=null
   [junit4]   2> 3426262 INFO  (qtp1973101306-41063) [n:127.0.0.1:44131_solr    x:jwtColl_shard1_replica_n1] o.a.s.m.r.SolrJmxReporter Closing reporter [org.apache.solr.metrics.reporters.SolrJmxReporter@4b6f4c1: rootName = solr_44131, domain = solr.core.jwtColl.shard1.replica_n1, service url = null, agent id = null] for registry solr.core.jwtColl.shard1.replica_n1 / com.codahale.metrics.MetricRegistry@43d6de39
   [junit4]   2> 3426298 INFO  (qtp1973101306-41063) [n:127.0.0.1:44131_solr    x:jwtColl_shard1_replica_n1] o.a.s.c.SolrCore [jwtColl_shard1_replica_n1]  CLOSING SolrCore org.apache.solr.core.SolrCore@2d33e00f
   [junit4]   2> 3426298 INFO  (qtp1973101306-41063) [n:127.0.0.1:44131_solr    x:jwtColl_shard1_replica_n1] o.a.s.m.SolrMetricManager Closing metric reporters for registry=solr.core.jwtColl.shard1.replica_n1, tag=2d33e00f
   [junit4]   2> 3426298 INFO  (qtp1973101306-41063) [n:127.0.0.1:44131_solr    x:jwtColl_shard1_replica_n1] o.a.s.m.SolrMetricManager Closing metric reporters for registry=solr.collection.jwtColl.shard1.leader, tag=2d33e00f
   [junit4]   2> 3426369 INFO  (qtp763337078-41062) [n:127.0.0.1:37477_solr    x:jwtColl_shard2_replica_n2] o.a.s.c.ZkShardTerms Successful update of terms at /collections/jwtColl/terms/shard2 to Terms{values={}, version=2}
   [junit4]   2> 3426376 INFO  (qtp763337078-41062) [n:127.0.0.1:37477_solr    x:jwtColl_shard2_replica_n2] o.a.s.s.HttpSolrCall [admin] webapp=null path=/admin/cores params={deleteInstanceDir=true&deleteMetricsHistory=true&core=jwtColl_shard2_replica_n2&qt=/admin/cores&deleteDataDir=true&action=UNLOAD&wt=javabin&version=2} status=0 QTime=161
   [junit4]   2> 3426379 INFO  (zkCallback-16337-thread-3) [    ] o.a.s.c.c.ZkStateReader A cluster state change: [WatchedEvent state:SyncConnected type:NodeDataChanged path:/collections/jwtColl/state.json] for collection [jwtColl] has occurred - updating... (live nodes size: [2])
   [junit4]   2> 3426379 INFO  (zkCallback-16337-thread-1) [    ] o.a.s.c.c.ZkStateReader A cluster state change: [WatchedEvent state:SyncConnected type:NodeDataChanged path:/collections/jwtColl/state.json] for collection [jwtColl] has occurred - updating... (live nodes size: [2])
   [junit4]   2> 3426379 INFO  (zkCallback-16337-thread-2) [    ] o.a.s.c.c.ZkStateReader A cluster state change: [WatchedEvent state:SyncConnected type:NodeDataChanged path:/collections/jwtColl/state.json] for collection [jwtColl] has occurred - updating... (live nodes size: [2])
   [junit4]   2> 3426380 INFO  (zkCallback-16322-thread-3) [    ] o.a.s.c.c.ZkStateReader A cluster state change: [WatchedEvent state:SyncConnected type:NodeDataChanged path:/collections/jwtColl/state.json] for collection [jwtColl] has occurred - updating... (live nodes size: [2])
   [junit4]   2> 3426380 INFO  (zkCallback-16322-thread-1) [    ] o.a.s.c.c.ZkStateReader A cluster state change: [WatchedEvent state:SyncConnected type:NodeDataChanged path:/collections/jwtColl/state.json] for collection [jwtColl] has occurred - updating... (live nodes size: [2])
   [junit4]   2> 3426440 INFO  (qtp1973101306-41063) [n:127.0.0.1:44131_solr    x:jwtColl_shard1_replica_n1] o.a.s.c.ZkShardTerms Successful update of terms at /collections/jwtColl/terms/shard1 to Terms{values={}, version=2}
   [junit4]   2> 3426459 INFO  (qtp1973101306-41063) [n:127.0.0.1:44131_solr    x:jwtColl_shard1_replica_n1] o.a.s.s.HttpSolrCall [ad

[...truncated too long message...]

nector@76c06e07{HTTP/1.1,[http/1.1, h2c]}{127.0.0.1:0}
   [junit4]   2> 3432421 INFO  (jetty-closer-16475-thread-2) [    ] o.e.j.s.h.ContextHandler Stopped o.e.j.s.ServletContextHandler@5550c7e3{/solr,null,UNAVAILABLE}
   [junit4]   2> 3432421 INFO  (jetty-closer-16475-thread-2) [    ] o.e.j.s.session node0 Stopped scavenging
   [junit4]   2> 3432421 INFO  (TEST-JWTAuthPluginIntegrationTest.infoRequestWithoutToken-seed#[A9807A5850E309AA]) [    ] o.a.s.c.ZkTestServer Shutting down ZkTestServer.
   [junit4]   2> 3432422 WARN  (ZkTestServer Run Thread) [    ] o.a.s.c.ZkTestServer Watch limit violations: 
   [junit4]   2> Maximum concurrent create/delete watches above limit:
   [junit4]   2> 
   [junit4]   2> 	5	/solr/aliases.json
   [junit4]   2> 	5	/solr/clusterprops.json
   [junit4]   2> 	2	/solr/security.json
   [junit4]   2> 
   [junit4]   2> Maximum concurrent data watches above limit:
   [junit4]   2> 
   [junit4]   2> 	5	/solr/clusterstate.json
   [junit4]   2> 	5	/solr/clusterprops.json
   [junit4]   2> 
   [junit4]   2> Maximum concurrent children watches above limit:
   [junit4]   2> 
   [junit4]   2> 	5	/solr/live_nodes
   [junit4]   2> 	5	/solr/collections
   [junit4]   2> 
   [junit4]   2> 3432423 INFO  (TEST-JWTAuthPluginIntegrationTest.infoRequestWithoutToken-seed#[A9807A5850E309AA]) [    ] o.a.s.c.ZkTestServer parse host and port list: 127.0.0.1:33961
   [junit4]   2> 3432423 INFO  (TEST-JWTAuthPluginIntegrationTest.infoRequestWithoutToken-seed#[A9807A5850E309AA]) [    ] o.a.s.c.ZkTestServer connecting to 127.0.0.1 33961
   [junit4]   2> 3432423 INFO  (TEST-JWTAuthPluginIntegrationTest.infoRequestWithoutToken-seed#[A9807A5850E309AA]) [    ] o.a.s.SolrTestCaseJ4 ###Ending infoRequestWithoutToken
   [junit4]   2> NOTE: leaving temporary files on disk at: /home/jenkins/workspace/Lucene-Solr-master-Linux/solr/build/solr-core/test/J2/temp/solr.security.JWTAuthPluginIntegrationTest_A9807A5850E309AA-001
   [junit4]   2> May 14, 2019 6:49:14 PM com.carrotsearch.randomizedtesting.ThreadLeakControl checkThreadLeaks
   [junit4]   2> WARNING: Will linger awaiting termination of 7 leaked thread(s).
   [junit4]   2> NOTE: test params are: codec=Lucene80, sim=Asserting(org.apache.lucene.search.similarities.AssertingSimilarity@d584b8b), locale=es-ES, timezone=America/Aruba
   [junit4]   2> NOTE: Linux 4.18.0-17-generic amd64/Aleksey Shipilev 13-testing (64-bit)/cpus=8,threads=1,free=257126960,total=468713472
   [junit4]   2> NOTE: All tests run in this JVM: [TestRandomRequestDistribution, TestNumericRangeQuery64, NestedShardedAtomicUpdateTest, TestCorePropertiesReload, TestInitQParser, PeerSyncWithIndexFingerprintCachingTest, CdcrOpsAndBoundariesTest, TestDynamicLoading, TestSimExecutePlanAction, TestConfigSets, SolrIndexConfigTest, SolrLogAuditLoggerPluginTest, SolrMetricManagerTest, OutputWriterTest, CacheHeaderTest, TestBinaryResponseWriter, BasicZkTest, TestStressLucene, HealthCheckHandlerTest, TestSimComputePlanAction, TestSchemaSimilarityResource, ActionThrottleTest, SolrTestCaseJ4Test, RequestHandlersTest, CachingDirectoryFactoryTest, PluginInfoTest, AnalyticsMergeStrategyTest, TestSearchPerf, TestBadConfig, SpatialFilterTest, TestMaxTokenLenTokenizer, HLLUtilTest, HighlighterConfigTest, BaseCdcrDistributedZkTest, CustomHighlightComponentTest, DistributedIntervalFacetingTest, NodeAddedTriggerIntegrationTest, TestDocumentBuilder, NoCacheHeaderTest, SplitShardTest, TestReplicaProperties, TestMacros, TestTolerantUpdateProcessorCloud, ClusterStateUpdateTest, DistributedQueryComponentCustomSortTest, TestSolrQueryParser, BufferStoreTest, TriggerIntegrationTest, UpdateParamsTest, TestJsonFacetsWithNestedObjects, ScheduledMaintenanceTriggerTest, DeleteInactiveReplicaTest, TestCloudPseudoReturnFields, CollectionsAPISolrJTest, TestLeaderElectionWithEmptyReplica, TestXmlQParserPlugin, MoveReplicaTest, HdfsBasicDistributedZk2Test, DateMathParserTest, BlobRepositoryCloudTest, TestCoreAdminApis, TestLegacyTerms, AutoAddReplicasPlanActionTest, ZkNodePropsTest, AddBlockUpdateTest, TestSimPolicyCloud, TestManagedSchemaThreadSafety, CurrencyFieldTypeTest, TestAnalyzedSuggestions, DistributedUpdateProcessorTest, TestJsonFacetRefinement, SolrCoreCheckLockOnStartupTest, SpatialHeatmapFacetsTest, TestScoreJoinQPScore, TestDistributedGrouping, ConvertedLegacyTest, TestSweetSpotSimilarityFactory, TestLuceneIndexBackCompat, ChaosMonkeySafeLeaderTest, ExecutePlanActionTest, AuthToolTest, TestJoin, V2ApiIntegrationTest, TestExportWriter, TestSolrCoreParser, TestReRankQParserPlugin, RequiredFieldsTest, OverriddenZkACLAndCredentialsProvidersTest, TestAtomicUpdateErrorCases, CollectionTooManyReplicasTest, TestUnInvertedFieldException, UUIDUpdateProcessorFallbackTest, TestSimpleTrackingShardHandler, TestChildDocTransformer, NumericFieldsTest, TestPhraseSuggestions, ZkCLITest, AssignTest, TestDownShardTolerantSearch, SolrCLIZkUtilsTest, LeaderElectionTest, RandomizedTaggerTest, TestLazyCores, TestCustomSort, TestInPlaceUpdatesStandalone, TestLegacyField, IndexSizeTriggerTest, BigEndianAscendingWordDeserializerTest, TestUniqueKeyFieldResource, DeleteReplicaTest, TestDeleteCollectionOnDownNodes, TestSolrDeletionPolicy1, TestFilteredDocIdSet, HdfsChaosMonkeySafeLeaderTest, OverseerRolesTest, TestSizeLimitedDistributedMap, ConcurrentDeleteAndCreateCollectionTest, TestSolrConfigHandlerCloud, TestDocBasedVersionConstraints, TriLevelCompositeIdRoutingTest, TestCloudSearcherWarming, DistributedQueueTest, JvmMetricsTest, JsonLoaderTest, TestPHPSerializedResponseWriter, DistributedFacetPivotSmallTest, TestRawTransformer, TestSimLargeCluster, TestLMDirichletSimilarityFactory, TestFreeTextSuggestions, BlockJoinFacetRandomTest, ShardRoutingTest, TestBlobHandler, TermsComponentTest, SubstringBytesRefFilterTest, InfoHandlerTest, ReturnFieldsTest, TestCloudInspectUtil, TestInfoStreamLogging, TestConfigSetsAPIExclusivity, TestConfigOverlay, CleanupOldIndexTest, CollectionPropsTest, CollectionStateFormat2Test, ConnectionManagerTest, CreateRoutedAliasTest, ForceLeaderTest, ForceLeaderWithTlogReplicasTest, FullSolrCloudDistribCmdsTest, HttpPartitionWithTlogReplicasTest, MissingSegmentRecoveryTest, MoveReplicaHDFSFailoverTest, MoveReplicaHDFSTest, NodeMutatorTest, OutOfBoxZkACLAndCredentialsProvidersTest, OverseerCollectionConfigSetProcessorTest, OverseerModifyCollectionTest, RecoveryAfterSoftCommitTest, RecoveryZkTest, ReplaceNodeNoTargetTest, ReplaceNodeTest, ReplicationFactorTest, TestCloudRecovery2, TestConfigSetsAPI, TestDistributedMap, TestExclusionRuleCollectionAccess, TestHashPartitioner, TestPullReplica, TestPullReplicaErrorHandling, TestStressInPlaceUpdates, TestUtilizeNode, TestWithCollection, AutoAddReplicasIntegrationTest, HdfsAutoAddReplicasIntegrationTest, HttpTriggerListenerTest, MetricTriggerIntegrationTest, NodeAddedTriggerTest, NodeLostTriggerIntegrationTest, ScheduledTriggerIntegrationTest, TestSimDistribStateManager, TestSimDistributedQueue, TestSimExtremeIndexing, TestSimGenericDistributedQueue, TestSimTriggerIntegration, CdcrBidirectionalTest, CdcrBootstrapTest, CoreSorterTest, DirectoryFactoryTest, RAMDirectoryFactoryTest, TestConfigSetImmutable, TestShardHandlerFactory, TestSimpleTextCodec, TestSolrConfigHandler, RequestLoggingTest, TestCSVLoader, TestCoreBackup, TestReplicationHandlerBackup, V2StandaloneTest, XmlUpdateRequestHandlerTest, XsltUpdateRequestHandlerTest, AdminHandlersProxyTest, AutoscalingHistoryHandlerTest, DistributedDebugComponentTest, DistributedFacetPivotLongTailTest, DistributedSuggestComponentTest, SearchHandlerTest, SuggestComponentTest, TestPostingsSolrHighlighter, UninvertDocValuesMergePolicyTest, SolrMetricReporterTest, SolrMetricsIntegrationTest, SolrJmxReporterCloudTest, SolrSlf4jReporterTest, SolrRrdBackendFactoryTest, TestWriterPerf, TestGeoJSONResponseWriter, TestSubQueryTransformerCrossCore, TestRestManager, TestCopyFieldCollectionResource, TestFieldCollectionResource, TestFieldTypeResource, TestSchemaResource, TestManagedSynonymGraphFilterFactory, DocValuesMissingTest, PreAnalyzedFieldTest, PrimitiveFieldTypeTest, TestBinaryField, TestHalfAndHalfDocValues, TestManagedSchema, TestManagedSchemaAPI, TestOmitPositions, TestPointFields, TestUseDocValuesAsStored2, UUIDFieldTest, CursorMarkTest, LargeFieldTest, MergeStrategyTest, QueryEqualityTest, TestAddFieldRealTimeGet, TestCollapseQParserPlugin, TestComplexPhraseLeadingWildcard, TestDocSet, TestElisionMultitermQuery, TestExtendedDismaxParser, TestFastLRUCache, TestFieldSortValues, TestGraphTermsQParserPlugin, TestLFUCache, TestNestedDocsSort, TestScoreJoinQPNoScore, AuditLoggerPluginTest, BasicAuthStandaloneTest, JWTAuthPluginIntegrationTest]
   [junit4] Completed [782/857 (1!)] on J2 in 21.30s, 3 tests, 1 error <<< FAILURES!

[...truncated 43399 lines...]
[repro] Jenkins log URL: https://jenkins.thetaphi.de/job/Lucene-Solr-master-Linux/24078/consoleText

[repro] Revision: 6f309dfa66bb788220af2568986893ab42916b14

[repro] Ant options: "-Dargs=-XX:+UseCompressedOops -XX:+UseG1GC"
[repro] Repro line:  ant test  -Dtestcase=JWTAuthPluginIntegrationTest -Dtests.method=testMetrics -Dtests.seed=A9807A5850E309AA -Dtests.multiplier=3 -Dtests.slow=true -Dtests.locale=es-ES -Dtests.timezone=America/Aruba -Dtests.asserts=true -Dtests.file.encoding=UTF-8

[repro] ant clean

[...truncated 6 lines...]
[repro] Test suites by module:
[repro]    solr/core
[repro]       JWTAuthPluginIntegrationTest
[repro] ant compile-test

[...truncated 3309 lines...]
[repro] ant test-nocompile -Dtests.dups=5 -Dtests.maxfailures=5 -Dtests.class="*.JWTAuthPluginIntegrationTest" -Dtests.showOutput=onerror "-Dargs=-XX:+UseCompressedOops -XX:+UseG1GC" -Dtests.seed=A9807A5850E309AA -Dtests.multiplier=3 -Dtests.slow=true -Dtests.locale=es-ES -Dtests.timezone=America/Aruba -Dtests.asserts=true -Dtests.file.encoding=UTF-8

[...truncated 85 lines...]
[repro] Failures:
[repro]   0/5 failed: org.apache.solr.security.JWTAuthPluginIntegrationTest
[repro] Exiting with code 0

[...truncated 43 lines...]

Mime
View raw message