lucene-dev mailing list archives

Site index · List index
Message view « Date » · « Thread »
Top « Date » · « Thread »
From Policeman Jenkins Server <jenk...@thetaphi.de>
Subject [JENKINS-EA] Lucene-Solr-master-Linux (64bit/jdk-13-ea+shipilev-fastdebug) - Build # 24016 - Still Failing!
Date Wed, 01 May 2019 16:49:58 GMT
Build: https://jenkins.thetaphi.de/job/Lucene-Solr-master-Linux/24016/
Java: 64bit/jdk-13-ea+shipilev-fastdebug -XX:+UseCompressedOops -XX:+UseSerialGC

5 tests failed.
FAILED:  junit.framework.TestSuite.org.apache.solr.update.processor.DistributedUpdateProcessorTest

Error Message:
SOLR-11606: ByteBuddy used by Mockito is not working with this JVM version.

Stack Trace:
org.junit.AssumptionViolatedException: SOLR-11606: ByteBuddy used by Mockito is not working with this JVM version.
	at __randomizedtesting.SeedInfo.seed([BC1306EA39B22B1E]:0)
	at com.carrotsearch.randomizedtesting.RandomizedTest.assumeNoException(RandomizedTest.java:742)
	at org.apache.solr.SolrTestCaseJ4.assumeWorkingMockito(SolrTestCaseJ4.java:374)
	at org.apache.solr.update.processor.DistributedUpdateProcessorTest.beforeClass(DistributedUpdateProcessorTest.java:60)
	at java.base/jdk.internal.reflect.NativeMethodAccessorImpl.invoke0(Native Method)
	at java.base/jdk.internal.reflect.NativeMethodAccessorImpl.invoke(NativeMethodAccessorImpl.java:62)
	at java.base/jdk.internal.reflect.DelegatingMethodAccessorImpl.invoke(DelegatingMethodAccessorImpl.java:43)
	at java.base/java.lang.reflect.Method.invoke(Method.java:567)
	at com.carrotsearch.randomizedtesting.RandomizedRunner.invoke(RandomizedRunner.java:1750)
	at com.carrotsearch.randomizedtesting.RandomizedRunner$6.evaluate(RandomizedRunner.java:878)
	at com.carrotsearch.randomizedtesting.RandomizedRunner$7.evaluate(RandomizedRunner.java:894)
	at com.carrotsearch.randomizedtesting.rules.StatementAdapter.evaluate(StatementAdapter.java:36)
	at com.carrotsearch.randomizedtesting.rules.SystemPropertiesRestoreRule$1.evaluate(SystemPropertiesRestoreRule.java:57)
	at org.apache.lucene.util.AbstractBeforeAfterRule$1.evaluate(AbstractBeforeAfterRule.java:45)
	at com.carrotsearch.randomizedtesting.rules.StatementAdapter.evaluate(StatementAdapter.java:36)
	at org.apache.lucene.util.TestRuleStoreClassName$1.evaluate(TestRuleStoreClassName.java:41)
	at com.carrotsearch.randomizedtesting.rules.NoShadowingOrOverridesOnMethodsRule$1.evaluate(NoShadowingOrOverridesOnMethodsRule.java:40)
	at com.carrotsearch.randomizedtesting.rules.NoShadowingOrOverridesOnMethodsRule$1.evaluate(NoShadowingOrOverridesOnMethodsRule.java:40)
	at com.carrotsearch.randomizedtesting.rules.StatementAdapter.evaluate(StatementAdapter.java:36)
	at com.carrotsearch.randomizedtesting.rules.StatementAdapter.evaluate(StatementAdapter.java:36)
	at org.apache.lucene.util.TestRuleAssertionsRequired$1.evaluate(TestRuleAssertionsRequired.java:53)
	at org.apache.lucene.util.TestRuleMarkFailure$1.evaluate(TestRuleMarkFailure.java:47)
	at org.apache.lucene.util.TestRuleIgnoreAfterMaxFailures$1.evaluate(TestRuleIgnoreAfterMaxFailures.java:64)
	at org.apache.lucene.util.TestRuleIgnoreTestSuites$1.evaluate(TestRuleIgnoreTestSuites.java:54)
	at com.carrotsearch.randomizedtesting.rules.StatementAdapter.evaluate(StatementAdapter.java:36)
	at com.carrotsearch.randomizedtesting.ThreadLeakControl$StatementRunner.run(ThreadLeakControl.java:368)
	at java.base/java.lang.Thread.run(Thread.java:830)
Caused by: java.lang.IllegalArgumentException: Unknown Java version: 13
	at net.bytebuddy.ClassFileVersion.ofJavaVersion(ClassFileVersion.java:210)
	at net.bytebuddy.ClassFileVersion$VersionLocator$ForJava9CapableVm.locate(ClassFileVersion.java:462)
	at net.bytebuddy.ClassFileVersion.ofThisVm(ClassFileVersion.java:223)
	at java.base/jdk.internal.reflect.NativeMethodAccessorImpl.invoke0(Native Method)
	at java.base/jdk.internal.reflect.NativeMethodAccessorImpl.invoke(NativeMethodAccessorImpl.java:62)
	at java.base/jdk.internal.reflect.DelegatingMethodAccessorImpl.invoke(DelegatingMethodAccessorImpl.java:43)
	at java.base/java.lang.reflect.Method.invoke(Method.java:567)
	at org.apache.solr.SolrTestCaseJ4.assumeWorkingMockito(SolrTestCaseJ4.java:372)
	... 24 more


FAILED:  junit.framework.TestSuite.org.apache.solr.update.processor.DistributedUpdateProcessorTest

Error Message:


Stack Trace:
java.lang.NullPointerException
	at __randomizedtesting.SeedInfo.seed([BC1306EA39B22B1E]:0)
	at org.apache.solr.update.processor.DistributedUpdateProcessorTest.AfterClass(DistributedUpdateProcessorTest.java:67)
	at java.base/jdk.internal.reflect.NativeMethodAccessorImpl.invoke0(Native Method)
	at java.base/jdk.internal.reflect.NativeMethodAccessorImpl.invoke(NativeMethodAccessorImpl.java:62)
	at java.base/jdk.internal.reflect.DelegatingMethodAccessorImpl.invoke(DelegatingMethodAccessorImpl.java:43)
	at java.base/java.lang.reflect.Method.invoke(Method.java:567)
	at com.carrotsearch.randomizedtesting.RandomizedRunner.invoke(RandomizedRunner.java:1750)
	at com.carrotsearch.randomizedtesting.RandomizedRunner$7.evaluate(RandomizedRunner.java:901)
	at com.carrotsearch.randomizedtesting.rules.StatementAdapter.evaluate(StatementAdapter.java:36)
	at com.carrotsearch.randomizedtesting.rules.SystemPropertiesRestoreRule$1.evaluate(SystemPropertiesRestoreRule.java:57)
	at org.apache.lucene.util.AbstractBeforeAfterRule$1.evaluate(AbstractBeforeAfterRule.java:45)
	at com.carrotsearch.randomizedtesting.rules.StatementAdapter.evaluate(StatementAdapter.java:36)
	at org.apache.lucene.util.TestRuleStoreClassName$1.evaluate(TestRuleStoreClassName.java:41)
	at com.carrotsearch.randomizedtesting.rules.NoShadowingOrOverridesOnMethodsRule$1.evaluate(NoShadowingOrOverridesOnMethodsRule.java:40)
	at com.carrotsearch.randomizedtesting.rules.NoShadowingOrOverridesOnMethodsRule$1.evaluate(NoShadowingOrOverridesOnMethodsRule.java:40)
	at com.carrotsearch.randomizedtesting.rules.StatementAdapter.evaluate(StatementAdapter.java:36)
	at com.carrotsearch.randomizedtesting.rules.StatementAdapter.evaluate(StatementAdapter.java:36)
	at org.apache.lucene.util.TestRuleAssertionsRequired$1.evaluate(TestRuleAssertionsRequired.java:53)
	at org.apache.lucene.util.TestRuleMarkFailure$1.evaluate(TestRuleMarkFailure.java:47)
	at org.apache.lucene.util.TestRuleIgnoreAfterMaxFailures$1.evaluate(TestRuleIgnoreAfterMaxFailures.java:64)
	at org.apache.lucene.util.TestRuleIgnoreTestSuites$1.evaluate(TestRuleIgnoreTestSuites.java:54)
	at com.carrotsearch.randomizedtesting.rules.StatementAdapter.evaluate(StatementAdapter.java:36)
	at com.carrotsearch.randomizedtesting.ThreadLeakControl$StatementRunner.run(ThreadLeakControl.java:368)
	at java.base/java.lang.Thread.run(Thread.java:830)


FAILED:  org.apache.solr.update.TestInPlaceUpdatesDistrib.test

Error Message:
Thread pool didn't terminate within 15 secs

Stack Trace:
java.lang.AssertionError: Thread pool didn't terminate within 15 secs
	at __randomizedtesting.SeedInfo.seed([BC1306EA39B22B1E:34473930974E46E6]:0)
	at org.junit.Assert.fail(Assert.java:88)
	at org.junit.Assert.assertTrue(Assert.java:41)
	at org.apache.solr.update.TestInPlaceUpdatesDistrib.reorderedDBQsResurrectionTest(TestInPlaceUpdatesDistrib.java:852)
	at org.apache.solr.update.TestInPlaceUpdatesDistrib.test(TestInPlaceUpdatesDistrib.java:179)
	at java.base/jdk.internal.reflect.NativeMethodAccessorImpl.invoke0(Native Method)
	at java.base/jdk.internal.reflect.NativeMethodAccessorImpl.invoke(NativeMethodAccessorImpl.java:62)
	at java.base/jdk.internal.reflect.DelegatingMethodAccessorImpl.invoke(DelegatingMethodAccessorImpl.java:43)
	at java.base/java.lang.reflect.Method.invoke(Method.java:567)
	at com.carrotsearch.randomizedtesting.RandomizedRunner.invoke(RandomizedRunner.java:1750)
	at com.carrotsearch.randomizedtesting.RandomizedRunner$8.evaluate(RandomizedRunner.java:938)
	at com.carrotsearch.randomizedtesting.RandomizedRunner$9.evaluate(RandomizedRunner.java:974)
	at com.carrotsearch.randomizedtesting.RandomizedRunner$10.evaluate(RandomizedRunner.java:988)
	at org.apache.solr.BaseDistributedSearchTestCase$ShardsRepeatRule$ShardsFixedStatement.callStatement(BaseDistributedSearchTestCase.java:1082)
	at org.apache.solr.BaseDistributedSearchTestCase$ShardsRepeatRule$ShardsStatement.evaluate(BaseDistributedSearchTestCase.java:1054)
	at com.carrotsearch.randomizedtesting.rules.SystemPropertiesRestoreRule$1.evaluate(SystemPropertiesRestoreRule.java:57)
	at org.apache.lucene.util.TestRuleSetupTeardownChained$1.evaluate(TestRuleSetupTeardownChained.java:49)
	at org.apache.lucene.util.AbstractBeforeAfterRule$1.evaluate(AbstractBeforeAfterRule.java:45)
	at org.apache.lucene.util.TestRuleThreadAndTestName$1.evaluate(TestRuleThreadAndTestName.java:48)
	at org.apache.lucene.util.TestRuleIgnoreAfterMaxFailures$1.evaluate(TestRuleIgnoreAfterMaxFailures.java:64)
	at org.apache.lucene.util.TestRuleMarkFailure$1.evaluate(TestRuleMarkFailure.java:47)
	at com.carrotsearch.randomizedtesting.rules.StatementAdapter.evaluate(StatementAdapter.java:36)
	at com.carrotsearch.randomizedtesting.ThreadLeakControl$StatementRunner.run(ThreadLeakControl.java:368)
	at com.carrotsearch.randomizedtesting.ThreadLeakControl.forkTimeoutingTask(ThreadLeakControl.java:817)
	at com.carrotsearch.randomizedtesting.ThreadLeakControl$3.evaluate(ThreadLeakControl.java:468)
	at com.carrotsearch.randomizedtesting.RandomizedRunner.runSingleTest(RandomizedRunner.java:947)
	at com.carrotsearch.randomizedtesting.RandomizedRunner$5.evaluate(RandomizedRunner.java:832)
	at com.carrotsearch.randomizedtesting.RandomizedRunner$6.evaluate(RandomizedRunner.java:883)
	at com.carrotsearch.randomizedtesting.RandomizedRunner$7.evaluate(RandomizedRunner.java:894)
	at com.carrotsearch.randomizedtesting.rules.StatementAdapter.evaluate(StatementAdapter.java:36)
	at com.carrotsearch.randomizedtesting.rules.SystemPropertiesRestoreRule$1.evaluate(SystemPropertiesRestoreRule.java:57)
	at org.apache.lucene.util.AbstractBeforeAfterRule$1.evaluate(AbstractBeforeAfterRule.java:45)
	at com.carrotsearch.randomizedtesting.rules.StatementAdapter.evaluate(StatementAdapter.java:36)
	at org.apache.lucene.util.TestRuleStoreClassName$1.evaluate(TestRuleStoreClassName.java:41)
	at com.carrotsearch.randomizedtesting.rules.NoShadowingOrOverridesOnMethodsRule$1.evaluate(NoShadowingOrOverridesOnMethodsRule.java:40)
	at com.carrotsearch.randomizedtesting.rules.NoShadowingOrOverridesOnMethodsRule$1.evaluate(NoShadowingOrOverridesOnMethodsRule.java:40)
	at com.carrotsearch.randomizedtesting.rules.StatementAdapter.evaluate(StatementAdapter.java:36)
	at com.carrotsearch.randomizedtesting.rules.StatementAdapter.evaluate(StatementAdapter.java:36)
	at org.apache.lucene.util.TestRuleAssertionsRequired$1.evaluate(TestRuleAssertionsRequired.java:53)
	at org.apache.lucene.util.TestRuleMarkFailure$1.evaluate(TestRuleMarkFailure.java:47)
	at org.apache.lucene.util.TestRuleIgnoreAfterMaxFailures$1.evaluate(TestRuleIgnoreAfterMaxFailures.java:64)
	at org.apache.lucene.util.TestRuleIgnoreTestSuites$1.evaluate(TestRuleIgnoreTestSuites.java:54)
	at com.carrotsearch.randomizedtesting.rules.StatementAdapter.evaluate(StatementAdapter.java:36)
	at com.carrotsearch.randomizedtesting.ThreadLeakControl$StatementRunner.run(ThreadLeakControl.java:368)
	at java.base/java.lang.Thread.run(Thread.java:830)


FAILED:  org.apache.solr.update.PeerSyncTest.test

Error Message:
Unexpected exception type, expected SolrException but got org.apache.solr.client.solrj.SolrServerException: Timeout occurred while waiting response from server at: http://127.0.0.1:33415/ld/collection1

Stack Trace:
junit.framework.AssertionFailedError: Unexpected exception type, expected SolrException but got org.apache.solr.client.solrj.SolrServerException: Timeout occurred while waiting response from server at: http://127.0.0.1:33415/ld/collection1
	at __randomizedtesting.SeedInfo.seed([BC1306EA39B22B1E:34473930974E46E6]:0)
	at org.apache.lucene.util.LuceneTestCase.expectThrows(LuceneTestCase.java:2699)
	at org.apache.lucene.util.LuceneTestCase.expectThrows(LuceneTestCase.java:2688)
	at org.apache.solr.update.PeerSyncTest.test(PeerSyncTest.java:279)
	at java.base/jdk.internal.reflect.NativeMethodAccessorImpl.invoke0(Native Method)
	at java.base/jdk.internal.reflect.NativeMethodAccessorImpl.invoke(NativeMethodAccessorImpl.java:62)
	at java.base/jdk.internal.reflect.DelegatingMethodAccessorImpl.invoke(DelegatingMethodAccessorImpl.java:43)
	at java.base/java.lang.reflect.Method.invoke(Method.java:567)
	at com.carrotsearch.randomizedtesting.RandomizedRunner.invoke(RandomizedRunner.java:1750)
	at com.carrotsearch.randomizedtesting.RandomizedRunner$8.evaluate(RandomizedRunner.java:938)
	at com.carrotsearch.randomizedtesting.RandomizedRunner$9.evaluate(RandomizedRunner.java:974)
	at com.carrotsearch.randomizedtesting.RandomizedRunner$10.evaluate(RandomizedRunner.java:988)
	at org.apache.solr.BaseDistributedSearchTestCase$ShardsRepeatRule$ShardsFixedStatement.callStatement(BaseDistributedSearchTestCase.java:1082)
	at org.apache.solr.BaseDistributedSearchTestCase$ShardsRepeatRule$ShardsStatement.evaluate(BaseDistributedSearchTestCase.java:1054)
	at com.carrotsearch.randomizedtesting.rules.SystemPropertiesRestoreRule$1.evaluate(SystemPropertiesRestoreRule.java:57)
	at org.apache.lucene.util.TestRuleSetupTeardownChained$1.evaluate(TestRuleSetupTeardownChained.java:49)
	at org.apache.lucene.util.AbstractBeforeAfterRule$1.evaluate(AbstractBeforeAfterRule.java:45)
	at org.apache.lucene.util.TestRuleThreadAndTestName$1.evaluate(TestRuleThreadAndTestName.java:48)
	at org.apache.lucene.util.TestRuleIgnoreAfterMaxFailures$1.evaluate(TestRuleIgnoreAfterMaxFailures.java:64)
	at org.apache.lucene.util.TestRuleMarkFailure$1.evaluate(TestRuleMarkFailure.java:47)
	at com.carrotsearch.randomizedtesting.rules.StatementAdapter.evaluate(StatementAdapter.java:36)
	at com.carrotsearch.randomizedtesting.ThreadLeakControl$StatementRunner.run(ThreadLeakControl.java:368)
	at com.carrotsearch.randomizedtesting.ThreadLeakControl.forkTimeoutingTask(ThreadLeakControl.java:817)
	at com.carrotsearch.randomizedtesting.ThreadLeakControl$3.evaluate(ThreadLeakControl.java:468)
	at com.carrotsearch.randomizedtesting.RandomizedRunner.runSingleTest(RandomizedRunner.java:947)
	at com.carrotsearch.randomizedtesting.RandomizedRunner$5.evaluate(RandomizedRunner.java:832)
	at com.carrotsearch.randomizedtesting.RandomizedRunner$6.evaluate(RandomizedRunner.java:883)
	at com.carrotsearch.randomizedtesting.RandomizedRunner$7.evaluate(RandomizedRunner.java:894)
	at com.carrotsearch.randomizedtesting.rules.StatementAdapter.evaluate(StatementAdapter.java:36)
	at com.carrotsearch.randomizedtesting.rules.SystemPropertiesRestoreRule$1.evaluate(SystemPropertiesRestoreRule.java:57)
	at org.apache.lucene.util.AbstractBeforeAfterRule$1.evaluate(AbstractBeforeAfterRule.java:45)
	at com.carrotsearch.randomizedtesting.rules.StatementAdapter.evaluate(StatementAdapter.java:36)
	at org.apache.lucene.util.TestRuleStoreClassName$1.evaluate(TestRuleStoreClassName.java:41)
	at com.carrotsearch.randomizedtesting.rules.NoShadowingOrOverridesOnMethodsRule$1.evaluate(NoShadowingOrOverridesOnMethodsRule.java:40)
	at com.carrotsearch.randomizedtesting.rules.NoShadowingOrOverridesOnMethodsRule$1.evaluate(NoShadowingOrOverridesOnMethodsRule.java:40)
	at com.carrotsearch.randomizedtesting.rules.StatementAdapter.evaluate(StatementAdapter.java:36)
	at com.carrotsearch.randomizedtesting.rules.StatementAdapter.evaluate(StatementAdapter.java:36)
	at org.apache.lucene.util.TestRuleAssertionsRequired$1.evaluate(TestRuleAssertionsRequired.java:53)
	at org.apache.lucene.util.TestRuleMarkFailure$1.evaluate(TestRuleMarkFailure.java:47)
	at org.apache.lucene.util.TestRuleIgnoreAfterMaxFailures$1.evaluate(TestRuleIgnoreAfterMaxFailures.java:64)
	at org.apache.lucene.util.TestRuleIgnoreTestSuites$1.evaluate(TestRuleIgnoreTestSuites.java:54)
	at com.carrotsearch.randomizedtesting.rules.StatementAdapter.evaluate(StatementAdapter.java:36)
	at com.carrotsearch.randomizedtesting.ThreadLeakControl$StatementRunner.run(ThreadLeakControl.java:368)
	at java.base/java.lang.Thread.run(Thread.java:830)
Caused by: org.apache.solr.client.solrj.SolrServerException: Timeout occurred while waiting response from server at: http://127.0.0.1:33415/ld/collection1
	at org.apache.solr.client.solrj.impl.HttpSolrClient.executeMethod(HttpSolrClient.java:660)
	at org.apache.solr.client.solrj.impl.HttpSolrClient.request(HttpSolrClient.java:255)
	at org.apache.solr.client.solrj.impl.HttpSolrClient.request(HttpSolrClient.java:244)
	at org.apache.solr.client.solrj.SolrRequest.process(SolrRequest.java:207)
	at org.apache.solr.client.solrj.SolrRequest.process(SolrRequest.java:224)
	at org.apache.solr.BaseDistributedSearchTestCase.add(BaseDistributedSearchTestCase.java:576)
	at org.apache.solr.update.PeerSyncTest.lambda$test$0(PeerSyncTest.java:281)
	at org.apache.lucene.util.LuceneTestCase.expectThrows(LuceneTestCase.java:2694)
	... 42 more
Caused by: java.net.SocketTimeoutException: Read timed out
	at java.base/java.net.SocketInputStream.socketRead0(Native Method)
	at java.base/java.net.SocketInputStream.socketRead(SocketInputStream.java:115)
	at java.base/java.net.SocketInputStream.read(SocketInputStream.java:168)
	at java.base/java.net.SocketInputStream.read(SocketInputStream.java:140)
	at java.base/java.net.Socket$SocketInputStream.read(Socket.java:972)
	at org.apache.http.impl.io.SessionInputBufferImpl.streamRead(SessionInputBufferImpl.java:137)
	at org.apache.http.impl.io.SessionInputBufferImpl.fillBuffer(SessionInputBufferImpl.java:153)
	at org.apache.http.impl.io.SessionInputBufferImpl.readLine(SessionInputBufferImpl.java:282)
	at org.apache.http.impl.conn.DefaultHttpResponseParser.parseHead(DefaultHttpResponseParser.java:138)
	at org.apache.http.impl.conn.DefaultHttpResponseParser.parseHead(DefaultHttpResponseParser.java:56)
	at org.apache.http.impl.io.AbstractMessageParser.parse(AbstractMessageParser.java:259)
	at org.apache.http.impl.DefaultBHttpClientConnection.receiveResponseHeader(DefaultBHttpClientConnection.java:163)
	at org.apache.http.impl.conn.CPoolProxy.receiveResponseHeader(CPoolProxy.java:165)
	at org.apache.http.protocol.HttpRequestExecutor.doReceiveResponse(HttpRequestExecutor.java:273)
	at org.apache.http.protocol.HttpRequestExecutor.execute(HttpRequestExecutor.java:125)
	at org.apache.http.impl.execchain.MainClientExec.execute(MainClientExec.java:272)
	at org.apache.http.impl.execchain.ProtocolExec.execute(ProtocolExec.java:185)
	at org.apache.http.impl.execchain.RetryExec.execute(RetryExec.java:89)
	at org.apache.http.impl.execchain.RedirectExec.execute(RedirectExec.java:110)
	at org.apache.http.impl.client.InternalHttpClient.doExecute(InternalHttpClient.java:185)
	at org.apache.http.impl.client.CloseableHttpClient.execute(CloseableHttpClient.java:83)
	at org.apache.http.impl.client.CloseableHttpClient.execute(CloseableHttpClient.java:56)
	at org.apache.solr.client.solrj.impl.HttpSolrClient.executeMethod(HttpSolrClient.java:548)
	... 49 more


FAILED:  org.apache.solr.update.PeerSyncWithLeaderTest.test

Error Message:
Unexpected exception type, expected SolrException but got org.apache.solr.client.solrj.SolrServerException: Timeout occurred while waiting response from server at: http://127.0.0.1:34531/collection1

Stack Trace:
junit.framework.AssertionFailedError: Unexpected exception type, expected SolrException but got org.apache.solr.client.solrj.SolrServerException: Timeout occurred while waiting response from server at: http://127.0.0.1:34531/collection1
	at __randomizedtesting.SeedInfo.seed([BC1306EA39B22B1E:34473930974E46E6]:0)
	at org.apache.lucene.util.LuceneTestCase.expectThrows(LuceneTestCase.java:2699)
	at org.apache.lucene.util.LuceneTestCase.expectThrows(LuceneTestCase.java:2688)
	at org.apache.solr.update.PeerSyncTest.test(PeerSyncTest.java:279)
	at java.base/jdk.internal.reflect.NativeMethodAccessorImpl.invoke0(Native Method)
	at java.base/jdk.internal.reflect.NativeMethodAccessorImpl.invoke(NativeMethodAccessorImpl.java:62)
	at java.base/jdk.internal.reflect.DelegatingMethodAccessorImpl.invoke(DelegatingMethodAccessorImpl.java:43)
	at java.base/java.lang.reflect.Method.invoke(Method.java:567)
	at com.carrotsearch.randomizedtesting.RandomizedRunner.invoke(RandomizedRunner.java:1750)
	at com.carrotsearch.randomizedtesting.RandomizedRunner$8.evaluate(RandomizedRunner.java:938)
	at com.carrotsearch.randomizedtesting.RandomizedRunner$9.evaluate(RandomizedRunner.java:974)
	at com.carrotsearch.randomizedtesting.RandomizedRunner$10.evaluate(RandomizedRunner.java:988)
	at org.apache.solr.BaseDistributedSearchTestCase$ShardsRepeatRule$ShardsFixedStatement.callStatement(BaseDistributedSearchTestCase.java:1082)
	at org.apache.solr.BaseDistributedSearchTestCase$ShardsRepeatRule$ShardsStatement.evaluate(BaseDistributedSearchTestCase.java:1054)
	at com.carrotsearch.randomizedtesting.rules.SystemPropertiesRestoreRule$1.evaluate(SystemPropertiesRestoreRule.java:57)
	at org.apache.lucene.util.TestRuleSetupTeardownChained$1.evaluate(TestRuleSetupTeardownChained.java:49)
	at org.apache.lucene.util.AbstractBeforeAfterRule$1.evaluate(AbstractBeforeAfterRule.java:45)
	at org.apache.lucene.util.TestRuleThreadAndTestName$1.evaluate(TestRuleThreadAndTestName.java:48)
	at org.apache.lucene.util.TestRuleIgnoreAfterMaxFailures$1.evaluate(TestRuleIgnoreAfterMaxFailures.java:64)
	at org.apache.lucene.util.TestRuleMarkFailure$1.evaluate(TestRuleMarkFailure.java:47)
	at com.carrotsearch.randomizedtesting.rules.StatementAdapter.evaluate(StatementAdapter.java:36)
	at com.carrotsearch.randomizedtesting.ThreadLeakControl$StatementRunner.run(ThreadLeakControl.java:368)
	at com.carrotsearch.randomizedtesting.ThreadLeakControl.forkTimeoutingTask(ThreadLeakControl.java:817)
	at com.carrotsearch.randomizedtesting.ThreadLeakControl$3.evaluate(ThreadLeakControl.java:468)
	at com.carrotsearch.randomizedtesting.RandomizedRunner.runSingleTest(RandomizedRunner.java:947)
	at com.carrotsearch.randomizedtesting.RandomizedRunner$5.evaluate(RandomizedRunner.java:832)
	at com.carrotsearch.randomizedtesting.RandomizedRunner$6.evaluate(RandomizedRunner.java:883)
	at com.carrotsearch.randomizedtesting.RandomizedRunner$7.evaluate(RandomizedRunner.java:894)
	at com.carrotsearch.randomizedtesting.rules.StatementAdapter.evaluate(StatementAdapter.java:36)
	at com.carrotsearch.randomizedtesting.rules.SystemPropertiesRestoreRule$1.evaluate(SystemPropertiesRestoreRule.java:57)
	at org.apache.lucene.util.AbstractBeforeAfterRule$1.evaluate(AbstractBeforeAfterRule.java:45)
	at com.carrotsearch.randomizedtesting.rules.StatementAdapter.evaluate(StatementAdapter.java:36)
	at org.apache.lucene.util.TestRuleStoreClassName$1.evaluate(TestRuleStoreClassName.java:41)
	at com.carrotsearch.randomizedtesting.rules.NoShadowingOrOverridesOnMethodsRule$1.evaluate(NoShadowingOrOverridesOnMethodsRule.java:40)
	at com.carrotsearch.randomizedtesting.rules.NoShadowingOrOverridesOnMethodsRule$1.evaluate(NoShadowingOrOverridesOnMethodsRule.java:40)
	at com.carrotsearch.randomizedtesting.rules.StatementAdapter.evaluate(StatementAdapter.java:36)
	at com.carrotsearch.randomizedtesting.rules.StatementAdapter.evaluate(StatementAdapter.java:36)
	at org.apache.lucene.util.TestRuleAssertionsRequired$1.evaluate(TestRuleAssertionsRequired.java:53)
	at org.apache.lucene.util.TestRuleMarkFailure$1.evaluate(TestRuleMarkFailure.java:47)
	at org.apache.lucene.util.TestRuleIgnoreAfterMaxFailures$1.evaluate(TestRuleIgnoreAfterMaxFailures.java:64)
	at org.apache.lucene.util.TestRuleIgnoreTestSuites$1.evaluate(TestRuleIgnoreTestSuites.java:54)
	at com.carrotsearch.randomizedtesting.rules.StatementAdapter.evaluate(StatementAdapter.java:36)
	at com.carrotsearch.randomizedtesting.ThreadLeakControl$StatementRunner.run(ThreadLeakControl.java:368)
	at java.base/java.lang.Thread.run(Thread.java:830)
Caused by: org.apache.solr.client.solrj.SolrServerException: Timeout occurred while waiting response from server at: http://127.0.0.1:34531/collection1
	at org.apache.solr.client.solrj.impl.HttpSolrClient.executeMethod(HttpSolrClient.java:660)
	at org.apache.solr.client.solrj.impl.HttpSolrClient.request(HttpSolrClient.java:255)
	at org.apache.solr.client.solrj.impl.HttpSolrClient.request(HttpSolrClient.java:244)
	at org.apache.solr.client.solrj.SolrRequest.process(SolrRequest.java:207)
	at org.apache.solr.client.solrj.SolrRequest.process(SolrRequest.java:224)
	at org.apache.solr.BaseDistributedSearchTestCase.add(BaseDistributedSearchTestCase.java:576)
	at org.apache.solr.update.PeerSyncTest.lambda$test$0(PeerSyncTest.java:281)
	at org.apache.lucene.util.LuceneTestCase.expectThrows(LuceneTestCase.java:2694)
	... 42 more
Caused by: java.net.SocketTimeoutException: Read timed out
	at java.base/java.net.SocketInputStream.socketRead0(Native Method)
	at java.base/java.net.SocketInputStream.socketRead(SocketInputStream.java:115)
	at java.base/java.net.SocketInputStream.read(SocketInputStream.java:168)
	at java.base/java.net.SocketInputStream.read(SocketInputStream.java:140)
	at java.base/java.net.Socket$SocketInputStream.read(Socket.java:972)
	at org.apache.http.impl.io.SessionInputBufferImpl.streamRead(SessionInputBufferImpl.java:137)
	at org.apache.http.impl.io.SessionInputBufferImpl.fillBuffer(SessionInputBufferImpl.java:153)
	at org.apache.http.impl.io.SessionInputBufferImpl.readLine(SessionInputBufferImpl.java:282)
	at org.apache.http.impl.conn.DefaultHttpResponseParser.parseHead(DefaultHttpResponseParser.java:138)
	at org.apache.http.impl.conn.DefaultHttpResponseParser.parseHead(DefaultHttpResponseParser.java:56)
	at org.apache.http.impl.io.AbstractMessageParser.parse(AbstractMessageParser.java:259)
	at org.apache.http.impl.DefaultBHttpClientConnection.receiveResponseHeader(DefaultBHttpClientConnection.java:163)
	at org.apache.http.impl.conn.CPoolProxy.receiveResponseHeader(CPoolProxy.java:165)
	at org.apache.http.protocol.HttpRequestExecutor.doReceiveResponse(HttpRequestExecutor.java:273)
	at org.apache.http.protocol.HttpRequestExecutor.execute(HttpRequestExecutor.java:125)
	at org.apache.http.impl.execchain.MainClientExec.execute(MainClientExec.java:272)
	at org.apache.http.impl.execchain.ProtocolExec.execute(ProtocolExec.java:185)
	at org.apache.http.impl.execchain.RetryExec.execute(RetryExec.java:89)
	at org.apache.http.impl.execchain.RedirectExec.execute(RedirectExec.java:110)
	at org.apache.http.impl.client.InternalHttpClient.doExecute(InternalHttpClient.java:185)
	at org.apache.http.impl.client.CloseableHttpClient.execute(CloseableHttpClient.java:83)
	at org.apache.http.impl.client.CloseableHttpClient.execute(CloseableHttpClient.java:56)
	at org.apache.solr.client.solrj.impl.HttpSolrClient.executeMethod(HttpSolrClient.java:548)
	... 49 more




Build Log:
[...truncated 12489 lines...]
   [junit4] Suite: org.apache.solr.update.PeerSyncTest
   [junit4]   2> Creating dataDir: /home/jenkins/workspace/Lucene-Solr-master-Linux/solr/build/solr-core/test/J1/temp/solr.update.PeerSyncTest_BC1306EA39B22B1E-001/init-core-data-001
   [junit4]   2> 8305 INFO  (SUITE-PeerSyncTest-seed#[BC1306EA39B22B1E]-worker) [    ] o.a.s.SolrTestCaseJ4 Using PointFields (NUMERIC_POINTS_SYSPROP=true) w/NUMERIC_DOCVALUES_SYSPROP=false
   [junit4]   2> 8609 INFO  (SUITE-PeerSyncTest-seed#[BC1306EA39B22B1E]-worker) [    ] o.e.j.u.log Logging initialized @8831ms to org.eclipse.jetty.util.log.Slf4jLog
   [junit4]   2> 8643 INFO  (SUITE-PeerSyncTest-seed#[BC1306EA39B22B1E]-worker) [    ] o.a.s.SolrTestCaseJ4 Randomized ssl (false) and clientAuth (false) via: @org.apache.solr.SolrTestCaseJ4$SuppressSSL(bugUrl="https://issues.apache.org/jira/browse/SOLR-5776")
   [junit4]   2> 8733 INFO  (SUITE-PeerSyncTest-seed#[BC1306EA39B22B1E]-worker) [    ] o.a.s.SolrTestCaseJ4 SecureRandom sanity checks: test.solr.allowed.securerandom=null & java.security.egd=file:/dev/./urandom
   [junit4]   2> 8778 INFO  (SUITE-PeerSyncTest-seed#[BC1306EA39B22B1E]-worker) [    ] o.a.s.BaseDistributedSearchTestCase Setting hostContext system property: /ld/
   [junit4]   2> 8799 INFO  (TEST-PeerSyncTest.test-seed#[BC1306EA39B22B1E]) [    ] o.a.s.SolrTestCaseJ4 ####initCore
   [junit4]   2> 9083 INFO  (TEST-PeerSyncTest.test-seed#[BC1306EA39B22B1E]) [    ] o.a.s.c.SolrResourceLoader Using system property solr.solr.home: /home/jenkins/workspace/Lucene-Solr-master-Linux/solr/core/src/test-files/solr
   [junit4]   2> 9096 INFO  (TEST-PeerSyncTest.test-seed#[BC1306EA39B22B1E]) [    ] o.a.s.c.SolrResourceLoader [null] Added 2 libs to classloader, from paths: [/home/jenkins/workspace/Lucene-Solr-master-Linux/solr/core/src/test-files/solr/collection1/lib, /home/jenkins/workspace/Lucene-Solr-master-Linux/solr/core/src/test-files/solr/collection1/lib/classes]
   [junit4]   2> 9900 INFO  (TEST-PeerSyncTest.test-seed#[BC1306EA39B22B1E]) [    ] o.a.s.c.SolrConfig Using Lucene MatchVersion: 9.0.0
   [junit4]   2> 10657 INFO  (TEST-PeerSyncTest.test-seed#[BC1306EA39B22B1E]) [    ] o.a.s.s.IndexSchema [null] Schema name=test
   [junit4]   2> 12158 WARN  (TEST-PeerSyncTest.test-seed#[BC1306EA39B22B1E]) [    ] o.a.s.c.SolrResourceLoader Solr loaded a deprecated plugin/analysis class [solr.WordDelimiterFilterFactory]. Please consult documentation how to replace it accordingly.
   [junit4]   2> 12406 WARN  (TEST-PeerSyncTest.test-seed#[BC1306EA39B22B1E]) [    ] o.a.s.c.SolrResourceLoader Solr loaded a deprecated plugin/analysis class [solr.GeoHashField]. Please consult documentation how to replace it accordingly.
   [junit4]   2> 12417 WARN  (TEST-PeerSyncTest.test-seed#[BC1306EA39B22B1E]) [    ] o.a.s.c.SolrResourceLoader Solr loaded a deprecated plugin/analysis class [solr.LatLonType]. Please consult documentation how to replace it accordingly.
   [junit4]   2> 12447 WARN  (TEST-PeerSyncTest.test-seed#[BC1306EA39B22B1E]) [    ] o.a.s.c.SolrResourceLoader Solr loaded a deprecated plugin/analysis class [solr.CurrencyField]. Please consult documentation how to replace it accordingly.
   [junit4]   2> 12814 INFO  (TEST-PeerSyncTest.test-seed#[BC1306EA39B22B1E]) [    ] o.a.s.s.IndexSchema Loaded schema test/1.0 with uniqueid field id
   [junit4]   2> 14700 INFO  (TEST-PeerSyncTest.test-seed#[BC1306EA39B22B1E]) [    ] o.a.s.h.c.HttpShardHandlerFactory Host whitelist initialized: WhitelistHostChecker [whitelistHosts=null, whitelistHostCheckingEnabled=false]
   [junit4]   2> 16524 WARN  (TEST-PeerSyncTest.test-seed#[BC1306EA39B22B1E]) [    ] o.e.j.u.s.S.config No Client EndPointIdentificationAlgorithm configured for SslContextFactory@7c068a74[provider=null,keyStore=null,trustStore=null]
   [junit4]   2> 17277 WARN  (TEST-PeerSyncTest.test-seed#[BC1306EA39B22B1E]) [    ] o.e.j.u.s.S.config No Client EndPointIdentificationAlgorithm configured for SslContextFactory@1fc7dd58[provider=null,keyStore=null,trustStore=null]
   [junit4]   2> 18632 INFO  (TEST-PeerSyncTest.test-seed#[BC1306EA39B22B1E]) [    ] o.a.s.c.TransientSolrCoreCacheDefault Allocating transient cache for 2147483647 transient cores
   [junit4]   2> 18641 INFO  (TEST-PeerSyncTest.test-seed#[BC1306EA39B22B1E]) [    ] o.a.s.h.a.MetricsHistoryHandler No .system collection, keeping metrics history in memory.
   [junit4]   2> 19102 INFO  (TEST-PeerSyncTest.test-seed#[BC1306EA39B22B1E]) [    ] o.a.s.m.r.SolrJmxReporter JMX monitoring for 'solr.node' (registry 'solr.node') enabled at server: com.sun.jmx.mbeanserver.JmxMBeanServer@2c52843e
   [junit4]   2> 19106 INFO  (TEST-PeerSyncTest.test-seed#[BC1306EA39B22B1E]) [    ] o.a.s.m.r.SolrJmxReporter JMX monitoring for 'solr.jvm' (registry 'solr.jvm') enabled at server: com.sun.jmx.mbeanserver.JmxMBeanServer@2c52843e
   [junit4]   2> 19107 INFO  (TEST-PeerSyncTest.test-seed#[BC1306EA39B22B1E]) [    ] o.a.s.m.r.SolrJmxReporter JMX monitoring for 'solr.jetty' (registry 'solr.jetty') enabled at server: com.sun.jmx.mbeanserver.JmxMBeanServer@2c52843e
   [junit4]   2> 19464 INFO  (coreLoadExecutor-10-thread-1) [    x:collection1] o.a.s.c.SolrResourceLoader [null] Added 2 libs to classloader, from paths: [/home/jenkins/workspace/Lucene-Solr-master-Linux/solr/core/src/test-files/solr/collection1/lib, /home/jenkins/workspace/Lucene-Solr-master-Linux/solr/core/src/test-files/solr/collection1/lib/classes]
   [junit4]   2> 19540 INFO  (coreLoadExecutor-10-thread-1) [    x:collection1] o.a.s.c.SolrConfig Using Lucene MatchVersion: 9.0.0
   [junit4]   2> 19764 INFO  (coreLoadExecutor-10-thread-1) [    x:collection1] o.a.s.s.IndexSchema [collection1] Schema name=test
   [junit4]   2> 20106 INFO  (coreLoadExecutor-10-thread-1) [    x:collection1] o.a.s.s.IndexSchema Loaded schema test/1.0 with uniqueid field id
   [junit4]   2> 20245 INFO  (coreLoadExecutor-10-thread-1) [    x:collection1] o.a.s.c.CoreContainer Creating SolrCore 'collection1' using configuration from instancedir /home/jenkins/workspace/Lucene-Solr-master-Linux/solr/core/src/test-files/solr/collection1, trusted=true
   [junit4]   2> 20411 INFO  (coreLoadExecutor-10-thread-1) [    x:collection1] o.a.s.m.r.SolrJmxReporter JMX monitoring for 'solr.core.collection1' (registry 'solr.core.collection1') enabled at server: com.sun.jmx.mbeanserver.JmxMBeanServer@2c52843e
   [junit4]   2> 20465 INFO  (coreLoadExecutor-10-thread-1) [    x:collection1] o.a.s.c.SolrCore [[collection1] ] Opening new SolrCore at [/home/jenkins/workspace/Lucene-Solr-master-Linux/solr/core/src/test-files/solr/collection1], dataDir=[/home/jenkins/workspace/Lucene-Solr-master-Linux/solr/build/solr-core/test/J1/temp/solr.update.PeerSyncTest_BC1306EA39B22B1E-001/init-core-data-001/]
   [junit4]   2> 20797 INFO  (coreLoadExecutor-10-thread-1) [    x:collection1] o.a.s.u.RandomMergePolicy RandomMergePolicy wrapping class org.apache.lucene.index.AlcoholicMergePolicy: [AlcoholicMergePolicy: minMergeSize=0, mergeFactor=10, maxMergeSize=766426678, maxMergeSizeForForcedMerge=9223372036854775807, calibrateSizeByDeletes=true, maxMergeDocs=2147483647, maxCFSSegmentSizeMB=8.796093022207999E12, noCFSRatio=0.1]
   [junit4]   2> 22390 WARN  (coreLoadExecutor-10-thread-1) [    x:collection1] o.a.s.c.RequestHandlers INVALID paramSet a in requestHandler {type = requestHandler,name = /dump,class = DumpRequestHandler,attributes = {initParams=a, name=/dump, class=DumpRequestHandler},args = {defaults={a=A,b=B}}}
   [junit4]   2> 23918 INFO  (coreLoadExecutor-10-thread-1) [    x:collection1] o.a.s.u.UpdateHandler Using UpdateLog implementation: org.apache.solr.update.UpdateLog
   [junit4]   2> 23919 INFO  (coreLoadExecutor-10-thread-1) [    x:collection1] o.a.s.u.UpdateLog Initializing UpdateLog: dataDir= defaultSyncLevel=FLUSH numRecordsToKeep=100 maxNumLogsToKeep=10 numVersionBuckets=65536
   [junit4]   2> 23980 INFO  (coreLoadExecutor-10-thread-1) [    x:collection1] o.a.s.u.CommitTracker Hard AutoCommit: disabled
   [junit4]   2> 23980 INFO  (coreLoadExecutor-10-thread-1) [    x:collection1] o.a.s.u.CommitTracker Soft AutoCommit: disabled
   [junit4]   2> 24004 INFO  (coreLoadExecutor-10-thread-1) [    x:collection1] o.a.s.u.RandomMergePolicy RandomMergePolicy wrapping class org.apache.lucene.index.AlcoholicMergePolicy: [AlcoholicMergePolicy: minMergeSize=0, mergeFactor=10, maxMergeSize=2026539303, maxMergeSizeForForcedMerge=9223372036854775807, calibrateSizeByDeletes=true, maxMergeDocs=2147483647, maxCFSSegmentSizeMB=8.796093022207999E12, noCFSRatio=0.1]
   [junit4]   2> 24072 INFO  (coreLoadExecutor-10-thread-1) [    x:collection1] o.a.s.s.SolrIndexSearcher Opening [Searcher@5ce0c9c9[collection1] main]
   [junit4]   2> 24188 WARN  (coreLoadExecutor-10-thread-1) [    x:collection1] o.a.s.r.ManagedResourceStorage Cannot write to config directory /home/jenkins/workspace/Lucene-Solr-master-Linux/solr/core/src/test-files/solr/collection1/conf; switching to use InMemory storage instead.
   [junit4]   2> 24396 INFO  (coreLoadExecutor-10-thread-1) [    x:collection1] o.a.s.h.ReplicationHandler Commits will be reserved for 10000ms.
   [junit4]   2> 24432 INFO  (coreLoadExecutor-10-thread-1) [    x:collection1] o.a.s.u.UpdateLog Could not find max version in index or recent updates, using new clock 1632344351590842368
   [junit4]   2> 24511 INFO  (TEST-PeerSyncTest.test-seed#[BC1306EA39B22B1E]) [    ] o.a.s.SolrTestCaseJ4 ####initCore end
   [junit4]   2> 24545 INFO  (searcherExecutor-11-thread-1-processing-x:collection1) [    x:collection1] o.a.s.c.SolrCore [collection1] Registered new searcher Searcher@5ce0c9c9[collection1] main{ExitableDirectoryReader(UninvertingDirectoryReader())}
   [junit4]   2> 25011 INFO  (TEST-PeerSyncTest.test-seed#[BC1306EA39B22B1E]) [    ] o.a.s.SolrTestCaseJ4 Writing core.properties file to /home/jenkins/workspace/Lucene-Solr-master-Linux/solr/build/solr-core/test/J1/temp/solr.update.PeerSyncTest_BC1306EA39B22B1E-001/tempDir-001/control/cores/collection1
   [junit4]   2> 25452 WARN  (TEST-PeerSyncTest.test-seed#[BC1306EA39B22B1E]) [    ] o.e.j.s.AbstractConnector Ignoring deprecated socket close linger time
   [junit4]   2> 25937 INFO  (TEST-PeerSyncTest.test-seed#[BC1306EA39B22B1E]) [    ] o.a.s.c.s.e.JettySolrRunner Start Jetty (original configured port=0)
   [junit4]   2> 25939 INFO  (TEST-PeerSyncTest.test-seed#[BC1306EA39B22B1E]) [    ] o.a.s.c.s.e.JettySolrRunner Trying to start Jetty on port 0 try number 1 ...
   [junit4]   2> 25955 INFO  (TEST-PeerSyncTest.test-seed#[BC1306EA39B22B1E]) [    ] o.e.j.s.Server jetty-9.4.14.v20181114; built: 2018-11-14T21:20:31.478Z; git: c4550056e785fb5665914545889f21dc136ad9e6; jvm 13-testing+0-builds.shipilev.net-openjdk-jdk-b845-20190430-jdk-1318
   [junit4]   2> 26034 INFO  (TEST-PeerSyncTest.test-seed#[BC1306EA39B22B1E]) [    ] o.e.j.s.session DefaultSessionIdManager workerName=node0
   [junit4]   2> 26034 INFO  (TEST-PeerSyncTest.test-seed#[BC1306EA39B22B1E]) [    ] o.e.j.s.session No SessionScavenger set, using defaults
   [junit4]   2> 26042 INFO  (TEST-PeerSyncTest.test-seed#[BC1306EA39B22B1E]) [    ] o.e.j.s.session node0 Scavenging every 600000ms
   [junit4]   2> 26141 INFO  (TEST-PeerSyncTest.test-seed#[BC1306EA39B22B1E]) [    ] o.e.j.s.h.ContextHandler Started o.e.j.s.ServletContextHandler@750de2ec{/ld,null,AVAILABLE}
   [junit4]   2> 26254 INFO  (TEST-PeerSyncTest.test-seed#[BC1306EA39B22B1E]) [    ] o.e.j.s.AbstractConnector Started ServerConnector@a647731{HTTP/1.1,[http/1.1, h2c]}{127.0.0.1:39213}
   [junit4]   2> 26254 INFO  (TEST-PeerSyncTest.test-seed#[BC1306EA39B22B1E]) [    ] o.e.j.s.Server Started @26488ms
   [junit4]   2> 26255 INFO  (TEST-PeerSyncTest.test-seed#[BC1306EA39B22B1E]) [    ] o.a.s.c.s.e.JettySolrRunner Jetty properties: {schema=schema.xml, hostContext=/ld, solrconfig=solrconfig-tlog.xml, hostPort=39213, coreRootDirectory=/home/jenkins/workspace/Lucene-Solr-master-Linux/solr/build/solr-core/test/J1/temp/solr.update.PeerSyncTest_BC1306EA39B22B1E-001/tempDir-001/control/cores}
   [junit4]   2> 26359 ERROR (TEST-PeerSyncTest.test-seed#[BC1306EA39B22B1E]) [    ] o.a.s.u.StartupLoggingUtils Missing Java Option solr.log.dir. Logging may be missing or incomplete.
   [junit4]   2> 26359 INFO  (TEST-PeerSyncTest.test-seed#[BC1306EA39B22B1E]) [    ] o.a.s.s.SolrDispatchFilter Using logger factory org.apache.logging.slf4j.Log4jLoggerFactory
   [junit4]   2> 26359 INFO  (TEST-PeerSyncTest.test-seed#[BC1306EA39B22B1E]) [    ] o.a.s.s.SolrDispatchFilter  ___      _       Welcome to Apache Solr? version 9.0.0
   [junit4]   2> 26363 INFO  (TEST-PeerSyncTest.test-seed#[BC1306EA39B22B1E]) [    ] o.a.s.s.SolrDispatchFilter / __| ___| |_ _   Starting in standalone mode on port null
   [junit4]   2> 26363 INFO  (TEST-PeerSyncTest.test-seed#[BC1306EA39B22B1E]) [    ] o.a.s.s.SolrDispatchFilter \__ \/ _ \ | '_|  Install dir: null
   [junit4]   2> 26363 INFO  (TEST-PeerSyncTest.test-seed#[BC1306EA39B22B1E]) [    ] o.a.s.s.SolrDispatchFilter |___/\___/_|_|    Start time: 2019-05-01T15:34:45.574526Z
   [junit4]   2> 26373 INFO  (TEST-PeerSyncTest.test-seed#[BC1306EA39B22B1E]) [    ] o.a.s.c.SolrXmlConfig Loading container configuration from /home/jenkins/workspace/Lucene-Solr-master-Linux/solr/build/solr-core/test/J1/temp/solr.update.PeerSyncTest_BC1306EA39B22B1E-001/tempDir-001/control/solr.xml
   [junit4]   2> 26415 INFO  (TEST-PeerSyncTest.test-seed#[BC1306EA39B22B1E]) [    ] o.a.s.c.SolrXmlConfig Configuration parameter autoReplicaFailoverWorkLoopDelay is ignored
   [junit4]   2> 26415 INFO  (TEST-PeerSyncTest.test-seed#[BC1306EA39B22B1E]) [    ] o.a.s.c.SolrXmlConfig Configuration parameter autoReplicaFailoverBadNodeExpiration is ignored
   [junit4]   2> 26430 INFO  (TEST-PeerSyncTest.test-seed#[BC1306EA39B22B1E]) [    ] o.a.s.c.SolrXmlConfig MBean server found: com.sun.jmx.mbeanserver.JmxMBeanServer@2c52843e, but no JMX reporters were configured - adding default JMX reporter.
   [junit4]   2> 26855 INFO  (TEST-PeerSyncTest.test-seed#[BC1306EA39B22B1E]) [    ] o.a.s.h.c.HttpShardHandlerFactory Host whitelist initialized: WhitelistHostChecker [whitelistHosts=null, whitelistHostCheckingEnabled=false]
   [junit4]   2> 26859 WARN  (TEST-PeerSyncTest.test-seed#[BC1306EA39B22B1E]) [    ] o.e.j.u.s.S.config No Client EndPointIdentificationAlgorithm configured for SslContextFactory@69774911[provider=null,keyStore=null,trustStore=null]
   [junit4]   2> 26902 WARN  (TEST-PeerSyncTest.test-seed#[BC1306EA39B22B1E]) [    ] o.e.j.u.s.S.config No Client EndPointIdentificationAlgorithm configured for SslContextFactory@3441e13a[provider=null,keyStore=null,trustStore=null]
   [junit4]   2> 26952 INFO  (TEST-PeerSyncTest.test-seed#[BC1306EA39B22B1E]) [    ] o.a.s.c.TransientSolrCoreCacheDefault Allocating transient cache for 4 transient cores
   [junit4]   2> 26953 INFO  (TEST-PeerSyncTest.test-seed#[BC1306EA39B22B1E]) [    ] o.a.s.h.a.MetricsHistoryHandler No .system collection, keeping metrics history in memory.
   [junit4]   2> 27019 INFO  (TEST-PeerSyncTest.test-seed#[BC1306EA39B22B1E]) [    ] o.a.s.m.r.SolrJmxReporter JMX monitoring for 'solr.node' (registry 'solr.node') enabled at server: com.sun.jmx.mbeanserver.JmxMBeanServer@2c52843e
   [junit4]   2> 27019 INFO  (TEST-PeerSyncTest.test-seed#[BC1306EA39B22B1E]) [    ] o.a.s.m.r.SolrJmxReporter JMX monitoring for 'solr.jvm' (registry 'solr.jvm') enabled at server: com.sun.jmx.mbeanserver.JmxMBeanServer@2c52843e
   [junit4]   2> 27020 INFO  (TEST-PeerSyncTest.test-seed#[BC1306EA39B22B1E]) [    ] o.a.s.m.r.SolrJmxReporter JMX monitoring for 'solr.jetty' (registry 'solr.jetty') enabled at server: com.sun.jmx.mbeanserver.JmxMBeanServer@2c52843e
   [junit4]   2> 27060 INFO  (TEST-PeerSyncTest.test-seed#[BC1306EA39B22B1E]) [    ] o.a.s.c.CorePropertiesLocator Found 1 core definitions underneath /home/jenkins/workspace/Lucene-Solr-master-Linux/solr/build/solr-core/test/J1/temp/solr.update.PeerSyncTest_BC1306EA39B22B1E-001/tempDir-001/control/cores
   [junit4]   2> 27064 INFO  (TEST-PeerSyncTest.test-seed#[BC1306EA39B22B1E]) [    ] o.a.s.c.CorePropertiesLocator Cores are: [collection1]
   [junit4]   2> 27085 INFO  (coreLoadExecutor-24-thread-1) [    x:collection1] o.a.s.c.SolrResourceLoader [null] Added 2 libs to classloader, from paths: [/home/jenkins/workspace/Lucene-Solr-master-Linux/solr/core/src/test-files/solr/collection1/lib, /home/jenkins/workspace/Lucene-Solr-master-Linux/solr/core/src/test-files/solr/collection1/lib/classes]
   [junit4]   2> 27171 INFO  (coreLoadExecutor-24-thread-1) [    x:collection1] o.a.s.c.SolrConfig Using Lucene MatchVersion: 9.0.0
   [junit4]   2> 27352 INFO  (coreLoadExecutor-24-thread-1) [    x:collection1] o.a.s.s.IndexSchema [collection1] Schema name=test
   [junit4]   2> 27757 INFO  (coreLoadExecutor-24-thread-1) [    x:collection1] o.a.s.s.IndexSchema Loaded schema test/1.0 with uniqueid field id
   [junit4]   2> 27875 INFO  (coreLoadExecutor-24-thread-1) [    x:collection1] o.a.s.c.CoreContainer Creating SolrCore 'collection1' using configuration from configset /home/jenkins/workspace/Lucene-Solr-master-Linux/solr/core/src/test-files/solr/collection1, trusted=true
   [junit4]   2> 27876 INFO  (coreLoadExecutor-24-thread-1) [    x:collection1] o.a.s.m.r.SolrJmxReporter JMX monitoring for 'solr.core.collection1' (registry 'solr.core.collection1') enabled at server: com.sun.jmx.mbeanserver.JmxMBeanServer@2c52843e
   [junit4]   2> 27877 INFO  (coreLoadExecutor-24-thread-1) [    x:collection1] o.a.s.c.SolrCore [[collection1] ] Opening new SolrCore at [/home/jenkins/workspace/Lucene-Solr-master-Linux/solr/core/src/test-files/solr/collection1], dataDir=[/home/jenkins/workspace/Lucene-Solr-master-Linux/solr/build/solr-core/test/J1/temp/solr.update.PeerSyncTest_BC1306EA39B22B1E-001/tempDir-001/control/cores/collection1/data/]
   [junit4]   2> 27900 INFO  (coreLoadExecutor-24-thread-1) [    x:collection1] o.a.s.u.RandomMergePolicy RandomMergePolicy wrapping class org.apache.lucene.index.AlcoholicMergePolicy: [AlcoholicMergePolicy: minMergeSize=0, mergeFactor=10, maxMergeSize=766426678, maxMergeSizeForForcedMerge=9223372036854775807, calibrateSizeByDeletes=true, maxMergeDocs=2147483647, maxCFSSegmentSizeMB=8.796093022207999E12, noCFSRatio=0.1]
   [junit4]   2> 27994 WARN  (coreLoadExecutor-24-thread-1) [    x:collection1] o.a.s.c.RequestHandlers INVALID paramSet a in requestHandler {type = requestHandler,name = /dump,class = DumpRequestHandler,attributes = {initParams=a, name=/dump, class=DumpRequestHandler},args = {defaults={a=A,b=B}}}
   [junit4]   2> 28193 INFO  (coreLoadExecutor-24-thread-1) [    x:collection1] o.a.s.u.UpdateHandler Using UpdateLog implementation: org.apache.solr.update.UpdateLog
   [junit4]   2> 28193 INFO  (coreLoadExecutor-24-thread-1) [    x:collection1] o.a.s.u.UpdateLog Initializing UpdateLog: dataDir= defaultSyncLevel=FLUSH numRecordsToKeep=100 maxNumLogsToKeep=10 numVersionBuckets=65536
   [junit4]   2> 28197 INFO  (coreLoadExecutor-24-thread-1) [    x:collection1] o.a.s.u.CommitTracker Hard AutoCommit: disabled
   [junit4]   2> 28197 INFO  (coreLoadExecutor-24-thread-1) [    x:collection1] o.a.s.u.CommitTracker Soft AutoCommit: disabled
   [junit4]   2> 28203 INFO  (coreLoadExecutor-24-thread-1) [    x:collection1] o.a.s.u.RandomMergePolicy RandomMergePolicy wrapping class org.apache.lucene.index.AlcoholicMergePolicy: [AlcoholicMergePolicy: minMergeSize=0, mergeFactor=10, maxMergeSize=2026539303, maxMergeSizeForForcedMerge=9223372036854775807, calibrateSizeByDeletes=true, maxMergeDocs=2147483647, maxCFSSegmentSizeMB=8.796093022207999E12, noCFSRatio=0.1]
   [junit4]   2> 28207 INFO  (coreLoadExecutor-24-thread-1) [    x:collection1] o.a.s.s.SolrIndexSearcher Opening [Searcher@5ba97259[collection1] main]
   [junit4]   2> 28208 WARN  (coreLoadExecutor-24-thread-1) [    x:collection1] o.a.s.r.ManagedResourceStorage Cannot write to config directory /home/jenkins/workspace/Lucene-Solr-master-Linux/solr/core/src/test-files/solr/collection1/conf; switching to use InMemory storage instead.
   [junit4]   2> 28210 INFO  (coreLoadExecutor-24-thread-1) [    x:collection1] o.a.s.h.ReplicationHandler Commits will be reserved for 10000ms.
   [junit4]   2> 28210 INFO  (coreLoadExecutor-24-thread-1) [    x:collection1] o.a.s.u.UpdateLog Could not find max version in index or recent updates, using new clock 1632344355552362496
   [junit4]   2> 28242 INFO  (searcherExecutor-25-thread-1-processing-x:collection1) [    x:collection1] o.a.s.c.SolrCore [collection1] Registered new searcher Searcher@5ba97259[collection1] main{ExitableDirectoryReader(UninvertingDirectoryReader())}
   [junit4]   2> 29037 INFO  (TEST-PeerSyncTest.test-seed#[BC1306EA39B22B1E]) [    ] o.a.s.SolrTestCaseJ4 Writing core.properties file to /home/jenkins/workspace/Lucene-Solr-master-Linux/solr/build/solr-core/test/J1/temp/solr.update.PeerSyncTest_BC1306EA39B22B1E-001/tempDir-001/shard0/cores/collection1
   [junit4]   2> 29039 WARN  (TEST-PeerSyncTest.test-seed#[BC1306EA39B22B1E]) [    ] o.e.j.s.AbstractConnector Ignoring deprecated socket close linger time
   [junit4]   2> 29040 INFO  (TEST-PeerSyncTest.test-seed#[BC1306EA39B22B1E]) [    ] o.a.s.c.s.e.JettySolrRunner Start Jetty (original configured port=0)
   [junit4]   2> 29040 INFO  (TEST-PeerSyncTest.test-seed#[BC1306EA39B22B1E]) [    ] o.a.s.c.s.e.JettySolrRunner Trying to start Jetty on port 0 try number 1 ...
   [junit4]   2> 29040 INFO  (TEST-PeerSyncTest.test-seed#[BC1306EA39B22B1E]) [    ] o.e.j.s.Server jetty-9.4.14.v20181114; built: 2018-11-14T21:20:31.478Z; git: c4550056e785fb5665914545889f21dc136ad9e6; jvm 13-testing+0-builds.shipilev.net-openjdk-jdk-b845-20190430-jdk-1318
   [junit4]   2> 29112 INFO  (TEST-PeerSyncTest.test-seed#[BC1306EA39B22B1E]) [    ] o.e.j.s.session DefaultSessionIdManager workerName=node0
   [junit4]   2> 29112 INFO  (TEST-PeerSyncTest.test-seed#[BC1306EA39B22B1E]) [    ] o.e.j.s.session No SessionScavenger set, using defaults
   [junit4]   2> 29113 INFO  (TEST-PeerSyncTest.test-seed#[BC1306EA39B22B1E]) [    ] o.e.j.s.session node0 Scavenging every 660000ms
   [junit4]   2> 29129 INFO  (TEST-PeerSyncTest.test-seed#[BC1306EA39B22B1E]) [    ] o.e.j.s.h.ContextHandler Started o.e.j.s.ServletContextHandler@4c7fefe1{/ld,null,AVAILABLE}
   [junit4]   2> 29138 INFO  (TEST-PeerSyncTest.test-seed#[BC1306EA39B22B1E]) [    ] o.e.j.s.AbstractConnector Started ServerConnector@2e0e3d0c{HTTP/1.1,[http/1.1, h2c]}{127.0.0.1:33415}
   [junit4]   2> 29138 INFO  (TEST-PeerSyncTest.test-seed#[BC1306EA39B22B1E]) [    ] o.e.j.s.Server Started @29372ms
   [junit4]   2> 29138 INFO  (TEST-PeerSyncTest.test-seed#[BC1306EA39B22B1E]) [    ] o.a.s.c.s.e.JettySolrRunner Jetty properties: {schema=schema.xml, hostContext=/ld, solrconfig=solrconfig-tlog.xml, hostPort=33415, coreRootDirectory=/home/jenkins/workspace/Lucene-Solr-master-Linux/solr/build/solr-core/test/J1/temp/solr.update.PeerSyncTest_BC1306EA39B22B1E-001/tempDir-001/shard0/cores}
   [junit4]   2> 29139 ERROR (TEST-PeerSyncTest.test-seed#[BC1306EA39B22B1E]) [    ] o.a.s.u.StartupLoggingUtils Missing Java Option solr.log.dir. Logging may be missing or incomplete.
   [junit4]   2> 29139 INFO  (TEST-PeerSyncTest.test-seed#[BC1306EA39B22B1E]) [    ] o.a.s.s.SolrDispatchFilter Using logger factory org.apache.logging.slf4j.Log4jLoggerFactory
   [junit4]   2> 29139 INFO  (TEST-PeerSyncTest.test-seed#[BC1306EA39B22B1E]) [    ] o.a.s.s.SolrDispatchFilter  ___      _       Welcome to Apache Solr? version 9.0.0
   [junit4]   2> 29140 INFO  (TEST-PeerSyncTest.test-seed#[BC1306EA39B22B1E]) [    ] o.a.s.s.SolrDispatchFilter / __| ___| |_ _   Starting in standalone mode on port null
   [junit4]   2> 29140 INFO  (TEST-PeerSyncTest.test-seed#[BC1306EA39B22B1E]) [    ] o.a.s.s.SolrDispatchFilter \__ \/ _ \ | '_|  Install dir: null
   [junit4]   2> 29140 INFO  (TEST-PeerSyncTest.test-seed#[BC1306EA39B22B1E]) [    ] o.a.s.s.SolrDispatchFilter |___/\___/_|_|    Start time: 2019-05-01T15:34:48.351221Z
   [junit4]   2> 29140 INFO  (TEST-PeerSyncTest.test-seed#[BC1306EA39B22B1E]) [    ] o.a.s.c.SolrXmlConfig Loading container configuration from /home/jenkins/workspace/Lucene-Solr-master-Linux/solr/build/solr-core/test/J1/temp/solr.update.PeerSyncTest_BC1306EA39B22B1E-001/tempDir-001/shard0/solr.xml
   [junit4]   2> 29163 INFO  (TEST-PeerSyncTest.test-seed#[BC1306EA39B22B1E]) [    ] o.a.s.c.SolrXmlConfig Configuration parameter autoReplicaFailoverWorkLoopDelay is ignored
   [junit4]   2> 29163 INFO  (TEST-PeerSyncTest.test-seed#[BC1306EA39B22B1E]) [    ] o.a.s.c.SolrXmlConfig Configuration parameter autoReplicaFailoverBadNodeExpiration is ignored
   [junit4]   2> 29182 INFO  (TEST-PeerSyncTest.test-seed#[BC1306EA39B22B1E]) [    ] o.a.s.c.SolrXmlConfig MBean server found: com.sun.jmx.mbeanserver.JmxMBeanServer@2c52843e, but no JMX reporters were configured - adding default JMX reporter.
   [junit4]   2> 29480 INFO  (TEST-PeerSyncTest.test-seed#[BC1306EA39B22B1E]) [    ] o.a.s.h.c.HttpShardHandlerFactory Host whitelist initialized: WhitelistHostChecker [whitelistHosts=null, whitelistHostCheckingEnabled=false]
   [junit4]   2> 29514 WARN  (TEST-PeerSyncTest.test-seed#[BC1306EA39B22B1E]) [    ] o.e.j.u.s.S.config No Client EndPointIdentificationAlgorithm configured for SslContextFactory@6958a465[provider=null,keyStore=null,trustStore=null]
   [junit4]   2> 29578 WARN  (TEST-PeerSyncTest.test-seed#[BC1306EA39B22B1E]) [    ] o.e.j.u.s.S.config No Client EndPointIdentificationAlgorithm configured for SslContextFactory@724ebb3d[provider=null,keyStore=null,trustStore=null]
   [junit4]   2> 29656 INFO  (TEST-PeerSyncTest.test-seed#[BC1306EA39B22B1E]) [    ] o.a.s.c.TransientSolrCoreCacheDefault Allocating transient cache for 4 transient cores
   [junit4]   2> 29657 INFO  (TEST-PeerSyncTest.test-seed#[BC1306EA39B22B1E]) [    ] o.a.s.h.a.MetricsHistoryHandler No .system collection, keeping metrics history in memory.
   [junit4]   2> 29891 INFO  (TEST-PeerSyncTest.test-seed#[BC1306EA39B22B1E]) [    ] o.a.s.m.r.SolrJmxReporter JMX monitoring for 'solr.node' (registry 'solr.node') enabled at server: com.sun.jmx.mbeanserver.JmxMBeanServer@2c52843e
   [junit4]   2> 29985 INFO  (TEST-PeerSyncTest.test-seed#[BC1306EA39B22B1E]) [    ] o.a.s.m.r.SolrJmxReporter JMX monitoring for 'solr.jvm' (registry 'solr.jvm') enabled at server: com.sun.jmx.mbeanserver.JmxMBeanServer@2c52843e
   [junit4]   2> 29987 INFO  (TEST-PeerSyncTest.test-seed#[BC1306EA39B22B1E]) [    ] o.a.s.m.r.SolrJmxReporter JMX monitoring for 'solr.jetty' (registry 'solr.jetty') enabled at server: com.sun.jmx.mbeanserver.JmxMBeanServer@2c52843e
   [junit4]   2> 30003 INFO  (TEST-PeerSyncTest.test-seed#[BC1306EA39B22B1E]) [    ] o.a.s.c.CorePropertiesLocator Found 1 core definitions underneath /home/jenkins/workspace/Lucene-Solr-master-Linux/solr/build/solr-core/test/J1/temp/solr.update.PeerSyncTest_BC1306EA39B22B1E-001/tempDir-001/shard0/cores
   [junit4]   2> 30003 INFO  (TEST-PeerSyncTest.test-seed#[BC1306EA39B22B1E]) [    ] o.a.s.c.CorePropertiesLocator Cores are: [collection1]
   [junit4]   2> 30017 INFO  (coreLoadExecutor-38-thread-1) [    x:collection1] o.a.s.c.SolrResourceLoader [null] Added 2 libs to classloader, from paths: [/home/jenkins/workspace/Lucene-Solr-master-Linux/solr/core/src/test-files/solr/collection1/lib, /home/jenkins/workspace/Lucene-Solr-master-Linux/solr/core/src/test-files/solr/collection1/lib/classes]
   [junit4]   2> 30130 INFO  (coreLoadExecutor-38-thread-1) [    x:collection1] o.a.s.c.SolrConfig Using Lucene MatchVersion: 9.0.0
   [junit4]   2> 30199 INFO  (coreLoadExecutor-38-thread-1) [    x:collection1] o.a.s.s.IndexSchema [collection1] Schema name=test
   [junit4]   2> 30710 INFO  (coreLoadExecutor-38-thread-1) [    x:collection1] o.a.s.s.IndexSchema Loaded schema test/1.0 with uniqueid field id
   [junit4]   2> 30793 INFO  (coreLoadExecutor-38-thread-1) [    x:collection1] o.a.s.c.CoreContainer Creating SolrCore 'collection1' using configuration from configset /home/jenkins/workspace/Lucene-Solr-master-Linux/solr/core/src/test-files/solr/collection1, trusted=true
   [junit4]   2> 30800 INFO  (coreLoadExecutor-38-thread-1) [    x:collection1] o.a.s.m.r.SolrJmxReporter JMX monitoring for 'solr.core.collection1' (registry 'solr.core.collection1') enabled at server: com.sun.jmx.mbeanserver.JmxMBeanServer@2c52843e
   [junit4]   2> 30801 INFO  (coreLoadExecutor-38-thread-1) [    x:collection1] o.a.s.c.SolrCore [[collection1] ] Opening new SolrCore at [/home/jenkins/workspace/Lucene-Solr-master-Linux/solr/core/src/test-files/solr/collection1], dataDir=[/home/jenkins/workspace/Lucene-Solr-master-Linux/solr/build/solr-core/test/J1/temp/solr.update.PeerSyncTest_BC1306EA39B22B1E-001/tempDir-001/shard0/cores/collection1/data/]
   [junit4]   2> 30809 INFO  (coreLoadExecutor-38-thread-1) [    x:collection1] o.a.s.u.RandomMergePolicy RandomMergePolicy wrapping class org.apache.lucene.index.AlcoholicMergePolicy: [AlcoholicMergePolicy: minMergeSize=0, mergeFactor=10, maxMergeSize=766426678, maxMergeSizeForForcedMerge=9223372036854775807, calibrateSizeByDeletes=true, maxMergeDocs=2147483647, maxCFSSegmentSizeMB=8.796093022207999E12, noCFSRatio=0.1]
   [junit4]   2> 30868 WARN  (coreLoadExecutor-38-thread-1) [    x:collection1] o.a.s.c.RequestHandlers INVALID paramSet a in requestHandler {type = requestHandler,name = /dump,class = DumpRequestHandler,attributes = {initParams=a, name=/dump, class=DumpRequestHandler},args = {defaults={a=A,b=B}}}
   [junit4]   2> 31161 INFO  (coreLoadExecutor-38-thread-1) [    x:collection1] o.a.s.u.UpdateHandler Using UpdateLog implementation: org.apache.solr.update.UpdateLog
   [junit4]   2> 31161 INFO  (coreLoadExecutor-38-thread-1) [    x:collection1] o.a.s.u.UpdateLog Initializing UpdateLog: dataDir= defaultSyncLevel=FLUSH numRecordsToKeep=100 maxNumLogsToKeep=10 numVersionBuckets=65536
   [junit4]   2> 31164 INFO  (coreLoadExecutor-38-thread-1) [    x:collection1] o.a.s.u.CommitTracker Hard AutoCommit: disabled
   [junit4]   2> 31164 INFO  (coreLoadExecutor-38-thread-1) [    x:collection1] o.a.s.u.CommitTracker Soft AutoCommit: disabled
   [junit4]   2> 31166 INFO  (coreLoadExecutor-38-thread-1) [    x:collection1] o.a.s.u.RandomMergePolicy RandomMergePolicy wrapping class org.apache.lucene.index.AlcoholicMergePolicy: [AlcoholicMergePolicy: minMergeSize=0, mergeFactor=10, maxMergeSize=2026539303, maxMergeSizeForForcedMerge=9223372036854775807, calibrateSizeByDeletes=true, maxMergeDocs=2147483647, maxCFSSegmentSizeMB=8.796093022207999E12, noCFSRatio=0.1]
   [junit4]   2> 31198 INFO  (coreLoadExecutor-38-thread-1) [    x:collection1] o.a.s.s.SolrIndexSearcher Opening [Searcher@657f34f5[collection1] main]
   [junit4]   2> 31199 WARN  (coreLoadExecutor-38-thread-1) [    x:collection1] o.a.s.r.ManagedResourceStorage Cannot write to config directory /home/jenkins/workspace/Lucene-Solr-master-Linux/solr/core/src/test-files/solr/collection1/conf; switching to use InMemory storage instead.
   [junit4]   2> 31200 INFO  (coreLoadExecutor-38-thread-1) [    x:collection1] o.a.s.h.ReplicationHandler Commits will be reserved for 10000ms.
   [junit4]   2> 31201 INFO  (coreLoadExecutor-38-thread-1) [    x:collection1] o.a.s.u.UpdateLog Could not find max version in index or recent updates, using new clock 1632344358688653312
   [junit4]   2> 31232 INFO  (searcherExecutor-39-thread-1-processing-x:collection1) [    x:collection1] o.a.s.c.SolrCore [collection1] Registered new searcher Searcher@657f34f5[collection1] main{ExitableDirectoryReader(UninvertingDirectoryReader())}
   [junit4]   2> 31760 INFO  (TEST-PeerSyncTest.test-seed#[BC1306EA39B22B1E]) [    ] o.a.s.SolrTestCaseJ4 Writing core.properties file to /home/jenkins/workspace/Lucene-Solr-master-Linux/solr/build/solr-core/test/J1/temp/solr.update.PeerSyncTest_BC1306EA39B22B1E-001/tempDir-001/shard1/cores/collection1
   [junit4]   2> 31761 WARN  (TEST-PeerSyncTest.test-seed#[BC1306EA39B22B1E]) [    ] o.e.j.s.AbstractConnector Ignoring deprecated socket close linger time
   [junit4]   2> 31762 INFO  (TEST-PeerSyncTest.test-seed#[BC1306EA39B22B1E]) [    ] o.a.s.c.s.e.JettySolrRunner Start Jetty (original configured port=0)
   [junit4]   2> 31762 INFO  (TEST-PeerSyncTest.test-seed#[BC1306EA39B22B1E]) [    ] o.a.s.c.s.e.JettySolrRunner Trying to start Jetty on port 0 try number 1 ...
   [junit4]   2> 31762 INFO  (TEST-PeerSyncTest.test-seed#[BC1306EA39B22B1E]) [    ] o.e.j.s.Server jetty-9.4.14.v20181114; built: 2018-11-14T21:20:31.478Z; git: c4550056e785fb5665914545889f21dc136ad9e6; jvm 13-testing+0-builds.shipilev.net-openjdk-jdk-b845-20190430-jdk-1318
   [junit4]   2> 31808 INFO  (TEST-PeerSyncTest.test-seed#[BC1306EA39B22B1E]) [    ] o.e.j.s.session DefaultSessionIdManager workerName=node0
   [junit4]   2> 31808 INFO  (TEST-PeerSyncTest.test-seed#[BC1306EA39B22B1E]) [    ] o.e.j.s.session No SessionScavenger set, using defaults
   [junit4]   2> 31808 INFO  (TEST-PeerSyncTest.test-seed#[BC1306EA39B22B1E]) [    ] o.e.j.s.session node0 Scavenging every 600000ms
   [junit4]   2> 31818 INFO  (TEST-PeerSyncTest.test-seed#[BC1306EA39B22B1E]) [    ] o.e.j.s.h.ContextHandler Started o.e.j.s.ServletContextHandler@19f53cb7{/ld,null,AVAILABLE}
   [junit4]   2> 31824 INFO  (TEST-PeerSyncTest.test-seed#[BC1306EA39B22B1E]) [    ] o.e.j.s.AbstractConnector Started ServerConnector@7aa10634{HTTP/1.1,[http/1.1, h2c]}{127.0.0.1:36761}
   [junit4]   2> 31824 INFO  (TEST-PeerSyncTest.test-seed#[BC1306EA39B22B1E]) [    ] o.e.j.s.Server Started @32058ms
   [junit4]   2> 31825 INFO  (TEST-PeerSyncTest.test-seed#[BC1306EA39B22B1E]) [    ] o.a.s.c.s.e.JettySolrRunner Jetty properties: {schema=schema.xml, hostContext=/ld, solrconfig=solrconfig-tlog.xml, hostPort=36761, coreRootDirectory=/home/jenkins/workspace/Lucene-Solr-master-Linux/solr/build/solr-core/test/J1/temp/solr.update.PeerSyncTest_BC1306EA39B22B1E-001/tempDir-001/shard1/cores}
   [junit4]   2> 31825 ERROR (TEST-PeerSyncTest.test-seed#[BC1306EA39B22B1E]) [    ] o.a.s.u.StartupLoggingUtils Missing Java Option solr.log.dir. Logging may be missing or incomplete.
   [junit4]   2> 31825 INFO  (TEST-PeerSyncTest.test-seed#[BC1306EA39B22B1E]) [    ] o.a.s.s.SolrDispatchFilter Using logger factory org.apache.logging.slf4j.Log4jLoggerFactory
   [junit4]   2> 31826 INFO  (TEST-PeerSyncTest.test-seed#[BC1306EA39B22B1E]) [    ] o.a.s.s.SolrDispatchFilter  ___      _       Welcome to Apache Solr? version 9.0.0
   [junit4]   2> 31826 INFO  (TEST-PeerSyncTest.test-seed#[BC1306EA39B22B1E]) [    ] o.a.s.s.SolrDispatchFilter / __| ___| |_ _   Starting in standalone mode on port null
   [junit4]   2> 31826 INFO  (TEST-PeerSyncTest.test-seed#[BC1306EA39B22B1E]) [    ] o.a.s.s.SolrDispatchFilter \__ \/ _ \ | '_|  Install dir: null
   [junit4]   2> 31826 INFO  (TEST-PeerSyncTest.test-seed#[BC1306EA39B22B1E]) [    ] o.a.s.s.SolrDispatchFilter |___/\___/_|_|    Start time: 2019-05-01T15:34:51.037311Z
   [junit4]   2> 31826 INFO  (TEST-PeerSyncTest.test-seed#[BC1306EA39B22B1E]) [    ] o.a.s.c.SolrXmlConfig Loading container configuration from /home/jenkins/workspace/Lucene-Solr-master-Linux/solr/build/solr-core/test/J1/temp/solr.update.PeerSyncTest_BC1306EA39B22B1E-001/tempDir-001/shard1/solr.xml
   [junit4]   2> 31846 INFO  (TEST-PeerSyncTest.test-seed#[BC1306EA39B22B1E]) [    ] o.a.s.c.SolrXmlConfig Configuration parameter autoReplicaFailoverWorkLoopDelay is ignored
   [junit4]   2> 31847 INFO  (TEST-PeerSyncTest.test-seed#[BC1306EA39B22B1E]) [    ] o.a.s.c.SolrXmlConfig Configuration parameter autoReplicaFailoverBadNodeExpiration is ignored
   [junit4]   2> 31869 INFO  (TEST-PeerSyncTest.test-seed#[BC1306EA39B22B1E]) [    ] o.a.s.c.SolrXmlConfig MBean server found: com.sun.jmx.mbeanserver.JmxMBeanServer@2c52843e, but no JMX reporters were configured - adding default JMX reporter.
   [junit4]   2> 32000 INFO  (TEST-PeerSyncTest.test-seed#[BC1306EA39B22B1E]) [    ] o.a.s.h.c.HttpShardHandlerFactory Host whitelist initialized: WhitelistHostChecker [whitelistHosts=null, whitelistHostCheckingEnabled=false]
   [junit4]   2> 32026 WARN  (TEST-PeerSyncTest.test-seed#[BC1306EA39B22B1E]) [    ] o.e.j.u.s.S.config No Client EndPointIdentificationAlgorithm configured for SslContextFactory@45ad1740[provider=null,keyStore=null,trustStore=null]
   [junit4]   2> 32072 WARN  (TEST-PeerSyncTest.test-seed#[BC1306EA39B22B1E]) [    ] o.e.j.u.s.S.config No Client EndPointIdentificationAlgorithm configured for SslContextFactory@165c3254[provider=null,keyStore=null,trustStore=null]
   [junit4]   2> 32153 INFO  (TEST-PeerSyncTest.test-seed#[BC1306EA39B22B1E]) [    ] o.a.s.c.TransientSolrCoreCacheDefault Allocating transient cache for 4 transient cores
   [junit4]   2> 32153 INFO  (TEST-PeerSyncTest.test-seed#[BC1306EA39B22B1E]) [    ] o.a.s.h.a.MetricsHistoryHandler No .system collection, keeping metrics history in memory.
   [junit4]   2> 32199 INFO  (TEST-PeerSyncTest.test-seed#[BC1306EA39B22B1E]) [    ] o.a.s.m.r.SolrJmxReporter JMX monitoring for 'solr.node' (registry 'solr.node') enabled at server: com.sun.jmx.mbeanserver.JmxMBeanServer@2c52843e
   [junit4]   2> 32267 INFO  (TEST-PeerSyncTest.test-seed#[BC1306EA39B22B1E]) [    ] o.a.s.m.r.SolrJmxReporter JMX monitoring for 'solr.jvm' (registry 'solr.jvm') enabled at server: com.sun.jmx.mbeanserver.JmxMBeanServer@2c52843e
   [junit4]   2> 32268 INFO  (TEST-PeerSyncTest.test-seed#[BC1306EA39B22B1E]) [    ] o.a.s.m.r.SolrJmxReporter JMX monitoring for 'solr.jetty' (registry 'solr.jetty') enabled at server: com.sun.jmx.mbeanserver.JmxMBeanServer@2c52843e
   [junit4]   2> 32276 INFO  (TEST-PeerSyncTest.test-seed#[BC1306EA39B22B1E]) [    ] o.a.s.c.CorePropertiesLocator Found 1 core definitions underneath /home/jenkins/workspace/Lucene-Solr-master-Linux/solr/build/solr-core/test/J1/temp/solr.update.PeerSyncTest_BC1306EA39B22B1E-001/tempDir-001/shard1/cores
   [junit4]   2> 32277 INFO  (TEST-PeerSyncTest.test-seed#[BC1306EA39B22B1E]) [    ] o.a.s.c.CorePropertiesLocator Cores are: [collection1]
   [junit4]   2> 32306 INFO  (coreLoadExecutor-52-thread-1) [    x:collection1] o.a.s.c.SolrResourceLoader [null] Added 2 libs to classloader, from paths: [/home/jenkins/workspace/Lucene-Solr-master-Linux/solr/core/src/test-files/solr/collection1/lib, /home/jenkins/workspace/Lucene-Solr-master-Linux/solr/core/src/test-files/solr/collection1/lib/classes]
   [junit4]   2> 32405 INFO  (coreLoadExecutor-52-thread-1) [    x:collection1] o.a.s.c.SolrConfig Using Lucene MatchVersion: 9.0.0
   [junit4]   2> 32576 INFO  (coreLoadExecutor-52-thread-1) [    x:collection1] o.a.s.s.IndexSchema [collection1] Schema name=test
   [junit4]   2> 32944 INFO  (coreLoadExecutor-52-thread-1) [    x:collection1] o.a.s.s.IndexSchema Loaded schema test/1.0 with uniqueid field id
   [junit4]   2> 32995 INFO  (coreLoadExecutor-52-thread-1) [    x:collection1] o.a.s.c.CoreContainer Creating SolrCore 'collection1' using configuration from configset /home/jenkins/workspace/Lucene-Solr-master-Linux/solr/core/src/test-files/solr/collection1, trusted=true
   [junit4]   2> 33001 INFO  (coreLoadExecutor-52-thread-1) [    x:collection1] o.a.s.m.r.SolrJmxReporter JMX monitoring for 'solr.core.collection1' (registry 'solr.core.collection1') enabled at server: com.sun.jmx.mbeanserver.JmxMBeanServer@2c52843e
   [junit4]   2> 33001 INFO  (coreLoadExecutor-52-thread-1) [    x:collection1] o.a.s.c.SolrCore [[collection1] ] Opening new SolrCore at [/home/jenkins/workspace/Lucene-Solr-master-Linux/solr/core/src/test-files/solr/collection1], dataDir=[/home/jenkins/workspace/Lucene-Solr-master-Linux/solr/build/solr-core/test/J1/temp/solr.update.PeerSyncTest_BC1306EA39B22B1E-001/tempDir-001/shard1/cores/collection1/data/]
   [junit4]   2> 33012 INFO  (coreLoadExecutor-52-thread-1) [    x:collection1] o.a.s.u.RandomMergePolicy RandomMergePolicy wrapping class org.apache.lucene.index.AlcoholicMergePolicy: [AlcoholicMergePolicy: minMergeSize=0, mergeFactor=10, maxMergeSize=766426678, maxMergeSizeForForcedMerge=9223372036854775807, calibrateSizeByDeletes=true, maxMergeDocs=2147483647, maxCFSSegmentSizeMB=8.796093022207999E12, noCFSRatio=0.1]
   [junit4]   2> 33050 WARN  (coreLoadExecutor-52-thread-1) [    x:collection1] o.a.s.c.RequestHandlers INVALID paramSet a in requestHandler {type = requestHandler,name = /dump,class = DumpRequestHandler,attributes = {initParams=a, name=/dump, class=DumpRequestHandler},args = {defaults={a=A,b=B}}}
   [junit4]   2> 33369 INFO  (coreLoadExecutor-52-thread-1) [    x:collection1] o.a.s.u.UpdateHandler Using UpdateLog implementation: org.apache.solr.update.UpdateLog
   [junit4]   2> 33369 INFO  (coreLoadExecutor-52-thread-1) [    x:collection1] o.a.s.u.UpdateLog Initializing UpdateLog: dataDir= defaultSyncLevel=FLUSH numRecordsToKeep=100 maxNumLogsToKeep=10 numVersionBuckets=65536
   [junit4]   2> 33372 INFO  (coreLoadExecutor-52-thread-1) [    x:collection1] o.a.s.u.CommitTracker Hard AutoCommit: disabled
   [junit4]   2> 33372 INFO  (coreLoadExecutor-52-thread-1) [    x:collection1] o.a.s.u.CommitTracker Soft AutoCommit: disabled
   [junit4]   2> 33376 INFO  (coreLoadExecutor-52-thread-1) [    x:collection1] o.a.s.u.RandomMergePolicy RandomMergePolicy wrapping class org.apache.lucene.index.AlcoholicMergePolicy: [AlcoholicMergePolicy: minMergeSize=0, mergeFactor=10, maxMergeSize=2026539303, maxMergeSizeForForcedMerge=9223372036854775807, calibrateSizeByDeletes=true, maxMergeDocs=2147483647, maxCFSSegmentSizeMB=8.796093022207999E12, noCFSRatio=0.1]
   [junit4]   2> 33397 INFO  (coreLoadExecutor-52-thread-1) [    x:collection1] o.a.s.s.SolrIndexSearcher Opening [Searcher@7aa66765[collection1] main]
   [junit4]   2> 33398 WARN  (coreLoadExecutor-52-thread-1) [    x:collection1] o.a.s.r.ManagedResourceStorage Cannot write to config directory /home/jenkins/workspace/Lucene-Solr-master-Linux/solr/core/src/test-files/solr/collection1/conf; switching to use InMemory storage instead.
   [junit4]   2> 33399 INFO  (coreLoadExecutor-52-thread-1) [    x:collection1] o.a.s.h.ReplicationHandler Commits will be reserved for 10000ms.
   [junit4]   2> 33399 INFO  (coreLoadExecutor-52-thread-1) [    x:collection1] o.a.s.u.UpdateLog Could not find max version in index or recent updates, using new clock 1632344360993423360
   [junit4]   2> 33405 INFO  (searcherExecutor-53-thread-1-processing-x:collection1) [    x:collection1] o.a.s.c.SolrCore [collection1] Registered new searcher Searcher@7aa66765[collection1] main{ExitableDirectoryReader(UninvertingDirectoryReader())}
   [junit4]   2> 33623 INFO  (TEST-PeerSyncTest.test-seed#[BC1306EA39B22B1E]) [    ] o.a.s.SolrTestCaseJ4 Writing core.properties file to /home/jenkins/workspace/Lucene-Solr-master-Linux/solr/build/solr-core/test/J1/temp/solr.update.PeerSyncTest_BC1306EA39B22B1E-001/tempDir-001/shard2/cores/collection1
   [junit4]   2> 33625 WARN  (TEST-PeerSyncTest.test-seed#[BC1306EA39B22B1E]) [    ] o.e.j.s.AbstractConnector Ignoring deprecated socket close linger time
   [junit4]   2> 33629 INFO  (TEST-PeerSyncTest.test-seed#[BC1306EA39B22B1E]) [    ] o.a.s.c.s.e.JettySolrRunner Start Jetty (original configured port=0)
   [junit4]   2> 33630 INFO  (TEST-PeerSyncTest.test-seed#[BC1306EA39B22B1E]) [    ] o.a.s.c.s.e.JettySolrRunner Trying to start Jetty on port 0 try number 1 ...
   [junit4]   2> 33630 INFO  (TEST-PeerSyncTest.test-seed#[BC1306EA39B22B1E]) [    ] o.e.j.s.Server jetty-9.4.14.v20181114; built: 2018-11-14T21:20:31.478Z; git: c4550056e785fb5665914545889f21dc136ad9e6; jvm 13-testing+0-builds.shipilev.net-openjdk-jdk-b845-20190430-jdk-1318
   [junit4]   2> 33647 INFO  (TEST-PeerSyncTest.test-seed#[BC1306EA39B22B1E]) [    ] o.e.j.s.session DefaultSessionIdManager workerName=node0
   [junit4]   2> 33648 INFO  (TEST-PeerSyncTest.test-seed#[BC1306EA39B22B1E]) [    ] o.e.j.s.session No SessionScavenger set, using defaults
   [junit4]   2> 33648 INFO  (TEST-PeerSyncTest.test-seed#[BC1306EA39B22B1E]) [    ] o.e.j.s.session node0 Scavenging every 600000ms
   [junit4]   2> 33649 INFO  (TEST-PeerSyncTest.test-seed#[BC1306EA39B22B1E]) [    ] o.e.j.s.h.ContextHandler Started o.e.j.s.ServletContextHandler@1ae56721{/ld,null,AVAILABLE}
   [junit4]   2> 33655 INFO  (TEST-PeerSyncTest.test-seed#[BC1306EA39B22B1E]) [    ] o.e.j.s.AbstractConnector Started ServerConnector@988488a{HTTP/1.1,[http/1.1, h2c]}{127.0.0.1:41205}
   [junit4]   2> 33656 INFO  (TEST-PeerSyncTest.test-seed#[BC1306EA39B22B1E]) [    ] o.e.j.s.Server Started @33889ms
   [junit4]   2> 33656 INFO  (TEST-PeerSyncTest.test-seed#[BC1306EA39B22B1E]) [    ] o.a.s.c.s.e.JettySolrRunner Jetty properties: {schema=schema.xml, hostContext=/ld, solrconfig=solrconfig-tlog.xml, hostPort=41205, coreRootDirectory=/home/jenkins/workspace/Lucene-Solr-master-Linux/solr/build/solr-core/test/J1/temp/solr.update.PeerSyncTest_BC1306EA39B22B1E-001/tempDir-001/shard2/cores}
   [junit4]   2> 33657 ERROR (TEST-PeerSyncTest.test-seed#[BC1306EA39B22B1E]) [    ] o.a.s.u.StartupLoggingUtils Missing Java Option solr.log.dir. Logging may be missing or incomplete.
   [junit4]   2> 33657 INFO  (TEST-PeerSyncTest.test-seed#[BC1306EA39B22B1E]) [    ] o.a.s.s.SolrDispatchFilter Using logger factory org.apache.logging.slf4j.Log4jLoggerFactory
   [junit4]   2> 33657 INFO  (TEST-PeerSyncTest.test-seed#[BC1306EA39B22B1E]) [    ] o.a.s.s.SolrDispatchFilter  ___      _       Welcome to Apache Solr? version 9.0.0
   [junit4]   2> 33657 INFO  (TEST-PeerSyncTest.test-seed#[BC1306EA39B22B1E]) [    ] o.a.s.s.SolrDispatchFilter / __| ___| |_ _   Starting in standalone mode on port null
   [junit4]   2> 33657 INFO  (TEST-PeerSyncTest.test-seed#[BC1306EA39B22B1E]) [    ] o.a.s.s.SolrDispatchFilter \__ \/ _ \ | '_|  Install dir: null
   [junit4]   2> 33657 INFO  (TEST-PeerSyncTest.test-seed#[BC1306EA39B22B1E]) [    ] o.a.s.s.SolrDispatchFilter |___/\___/_|_|    Start time: 2019-05-01T15:34:52.868578Z
   [junit4]   2> 33658 INFO  (TEST-PeerSyncTest.test-seed#[BC1306EA39B22B1E]) [    ] o.a.s.c.SolrXmlConfig Loading container configuration from /home/jenkins/workspace/Lucene-Solr-master-Linux/solr/build/solr-core/test/J1/temp/solr.update.PeerSyncTest_BC1306EA39B22B1E-001/tempDir-001/shard2/solr.xml
   [junit4]   2> 33729 INFO  (TEST-PeerSyncTest.test-seed#[BC1306EA39B22B1E]) [    ] o.a.s.c.SolrXmlConfig Configuration parameter autoReplicaFailoverWorkLoopDelay is ignored
   [junit4]   2> 33737 INFO  (TEST-PeerSyncTest.test-seed#[BC1306EA39B22B1E]) [    ] o.a.s.c.SolrXmlConfig Configuration parameter autoReplicaFailoverBadNodeExpiration is ignored
   [junit4]   2> 33748 INFO  (TEST-PeerSyncTest.test-seed#[BC1306EA39B22B1E]) [    ] o.a.s.c.SolrXmlConfig MBean server found: com.sun.jmx.mbeanserver.JmxMBeanServer@2c52843e, but no JMX reporters were configured - adding default JMX reporter.
   [junit4]   2> 33889 INFO  (TEST-PeerSyncTest.test-seed#[BC1306EA39B22B1E]) [    ] o.a.s.h.c.HttpShardHandlerFactory Host whitelist initialized: WhitelistHostChecker [whitelistHosts=null, whitelistHostCheckingEnabled=false]
   [junit4]   2> 33922 WARN  (TEST-PeerSyncTest.test-seed#[BC1306EA39B22B1E]) [    ] o.e.j.u.s.S.config No Client EndPointIdentificationAlgorithm configured for SslContextFactory@28d14be3[provider=null,keyStore=null,trustStore=null]
   [junit4]   2> 33958 WARN  (TEST-PeerSyncTest.test-seed#[BC1306EA39B22B1E]) [    ] o.e.j.u.s.S.config No Client EndPointIdentificationAlgorithm configured for SslContextFactory@1fdfa0bd[provider=null,keyStore=null,trustStore=null]
   [junit4]   2> 34036 INFO  (TEST-PeerSyncTest.test-seed#[BC1306EA39B22B1E]) [    ] o.a.s.c.TransientSolrCoreCacheDefault Allocating transient cache for 4 transient cores
   [junit4]   2> 34036 INFO  (TEST-PeerSyncTest.test-seed#[BC1306EA39B22B1E]) [    ] o.a.s.h.a.MetricsHistoryHandler No .system collection, keeping metrics history in memory.
   [junit4]   2> 34135 INFO  (TEST-PeerSyncTest.test-seed#[BC1306EA39B22B1E]) [    ] o.a.s.m.r.SolrJmxReporter JMX monitoring for 'solr.node' (registry 'solr.node') enabled at server: com.sun.jmx.mbeanserver.JmxMBeanServer@2c52843e
   [junit4]   2> 34575 INFO  (TEST-PeerSyncTest.test-seed#[BC1306EA39B22B1E]) [    ] o.a.s.m.r.SolrJmxReporter JMX monitoring for 'solr.jvm' (registry 'solr.jvm') enabled at server: com.sun.jmx.mbeanserver.JmxMBeanServer@2c52843e
   [junit4]   2> 34587 INFO  (TEST-PeerSyncTest.test-seed#[BC1306EA39B22B1E]) [    ] o.a.s.m.r.SolrJmxReporter JMX monitoring for 'solr.jetty' (registry 'solr.jetty') enabled at server: com.sun.jmx.mbeanserver.JmxMBeanServer@2c52843e
   [junit4]   2> 34611 INFO  (TEST-PeerSyncTest.test-seed#[BC1306EA39B22B1E]) [    ] o.a.s.c.CorePropertiesLocator Found 1 core definitions underneath /home/jenkins/workspace/Lucene-Solr-master-Linux/solr/build/solr-core/test/J1/temp/solr.update.PeerSyncTest_BC1306EA39B22B1E-001/tempDir-001/shard2/cores
   [junit4]   2> 34628 INFO  (TEST-PeerSyncTest.test-seed#[BC1306EA39B22B1E]) [    ] o.a.s.c.CorePropertiesLocator Cores are: [collection1]
   [junit4]   2> 34659 INFO  (coreLoadExecutor-66-thread-1) [    x:collection1] o.a.s.c.SolrResourceLoader [null] Added 2 libs to classloader, from paths: [/home/jenkins/workspace/Lucene-Solr-master-Linux/solr/core/src/test-files/solr/collection1/lib, /home/jenkins/workspace/Lucene-Solr-master-Linux/solr/core/src/test-files/solr/collection1/lib/classes]
   [junit4]   2> 34769 INFO  (coreLoadExecutor-66-thread-1) [    x:collection1] o.a.s.c.SolrConfig Using Lucene MatchVersion: 9.0.0
   [junit4]   2> 34965 INFO  (coreLoadExecutor-66-thread-1) [    x:collection1] o.a.s.s.IndexSchema [collection1] Schema name=test
   [junit4]   2> 35684 INFO  (coreLoadExecutor-66-thread-1) [    x:collection1] o.a.s.s.IndexSchema Loaded schema test/1.0 with uniqueid field id
   [junit4]   2> 35809 INFO  (coreLoadExecutor-66-thread-1) [    x:collection1] o.a.s.c.CoreContainer Creating SolrCore 'collection1' using configuration from configset /home/jenkins/workspace/Lucene-Solr-master-Linux/solr/core/src/test-files/solr/collection1, trusted=true
   [junit4]   2> 35822 INFO  (coreLoadExecutor-66-thread-1) [    x:collection1] o.a.s.m.r.SolrJmxReporter JMX monitoring for 'solr.core.collection1' (registry 'solr.core.collection1') enabled at server: com.sun.jmx.mbeanserver.JmxMBeanServer@2c52843e
   [junit4]   2> 35822 INFO  (coreLoadExecutor-66-thread-1) [    x:collection1] o.a.s.c.SolrCore [[collection1] ] Opening new SolrCore at [/home/jenkins/workspace/Lucene-Solr-master-Linux/solr/core/src/test-files/solr/collection1], dataDir=[/home/jenkins/workspace/Lucene-Solr-master-Linux/solr/build/solr-core/test/J1/temp/solr.update.PeerSyncTest_BC1306EA39B22B1E-001/tempDir-001/shard2/cores/collection1/data/]
   [junit4]   2> 35843 INFO  (coreLoadExecutor-66-thread-1) [    x:collection1] o.a.s.u.RandomMergePolicy RandomMergePolicy wrapping class org.apache.lucene.index.AlcoholicMergePolicy: [AlcoholicMergePolicy: minMergeSize=0, mergeFactor=10, maxMergeSize=766426678, maxMergeSizeForForcedMerge=9223372036854775807, calibrateSizeByDeletes=true, maxMergeDocs=2147483647, maxCFSSegmentSizeMB=8.796093022207999E12, noCFSRatio=0.1]
   [junit4]   2> 35866 WARN  (coreLoadExecutor-66-thread-1) [    x:collection1] o.a.s.c.RequestHandlers INVALID paramSet a in requestHandler {type = requestHandler,name = /dump,class = DumpRequestHandler,attributes = {initParams=a, name=/dump, class=DumpRequestHandler},args = {defaults={a=A,b=B}}}
   [junit4]   2> 36075 INFO  (coreLoadExecutor-66-thread-1) [    x:collection1] o.a.s.u.UpdateHandler Using UpdateLog implementation: org.apache.solr.update.UpdateLog
   [junit4]   2> 36076 INFO  (coreLoadExecutor-66-thread-1) [    x:collection1] o.a.s.u.UpdateLog Initializing UpdateLog: dataDir= defaultSyncLevel=FLUSH numRecordsToKeep=100 maxNumLogsToKeep=10 numVersionBuckets=65536
   [junit4]   2> 36078 INFO  (coreLoadExecutor-66-thread-1) [    x:collection1] o.a.s.u.CommitTracker Hard AutoCommit: disabled
   [junit4]   2> 36079 INFO  (coreLoadExecutor-66-thread-1) [    x:collection1] o.a.s.u.CommitTracker Soft AutoCommit: disabled
   [junit4]   2> 36090 INFO  (coreLoadExecutor-66-thread-1) [    x:collection1] o.a.s.u.RandomMergePolicy RandomMergePolicy wrapping class org.apache.lucene.index.AlcoholicMergePolicy: [AlcoholicMergePolicy: minMergeSize=0, mergeFactor=10, maxMergeSize=2026539303, maxMergeSizeForForcedMerge=9223372036854775807, calibrateSizeByDeletes=true, maxMergeDocs=2147483647, maxCFSSegmentSizeMB=8.796093022207999E12, noCFSRatio=0.1]
   [junit4]   2> 36107 INFO  (coreLoadExecutor-66-thread-1) [    x:collection1] o.a.s.s.SolrIndexSearcher Opening [Searcher@128b1d15[collection1] main]
   [junit4]   2> 36108 WARN  (coreLoadExecutor-66-thread-1) [    x:collection1] o.a.s.r.ManagedResourceStorage Cannot write to config directory /home/jenkins/workspace/Lucene-Solr-master-Linux/solr/core/src/test-files/solr/collection1/conf; switching to use InMemory storage instead.
   [junit4]   2> 36109 INFO  (coreLoadExecutor-66-thread-1) [    x:collection1] o.a.s.h.ReplicationHandler Commits will be reserved for 10000ms.
   [junit4]   2> 36109 INFO  (coreLoadExecutor-66-thread-1) [    x:collection1] o.a.s.u.UpdateLog Could not find max version in index or recent updates, using new clock 1632344363835064320
   [junit4]   2> 36137 INFO  (TEST-PeerSyncTest.test-seed#[BC1306EA39B22B1E]) [    ] o.a.s.SolrTestCaseJ4 ###Starting test
   [junit4]   2> 36138 INFO  (searcherExecutor-67-thread-1-processing-x:collection1) [    x:collection1] o.a.s.c.SolrCore [collection1] Registered new searcher Searcher@128b1d15[collection1] main{ExitableDirectoryReader(UninvertingDirectoryReader())}
   [junit4]   2> 38997 INFO  (qtp1788044732-55) [    x:collection1] o.a.s.u.p.LogUpdateProcessorFactory [collection1]  webapp=/ld path=/update params={update.distrib=FROMLEADER&wt=javabin&version=2}{add=[1 (1)]} 0 834
   [junit4]   2> 39430 INFO  (qtp1001689711-76) [    x:collection1] o.a.s.u.PeerSync PeerSync: core=collection1 url= START replicas=[http://127.0.0.1:33415/ld/collection1] nUpdates=100
   [junit4]   2> 41100 INFO  (qtp1788044732-54) [    x:collection1] o.a.s.s.SolrIndexSearcher Opening [Searcher@102610f4[collection1] realtime]
   [junit4]   2> 41247 INFO  (qtp1788044732-54) [    x:collection1] o.a.s.u.IndexFingerprint IndexFingerprint millis:1769.0 result:{maxVersionSpecified=9223372036854775807, maxVersionEncountered=1, maxInHash=1, versionsHash=-5451962507482445012, numVersions=1, numDocs=1, maxDoc=1}
   [junit4]   2> 41248 INFO  (qtp1788044732-54) [    x:collection1] o.a.s.c.S.Request [collection1]  webapp=/ld path=/get params={distrib=false&qt=/get&getFingerprint=9223372036854775807&wt=javabin&version=2} status=0 QTime=1777
   [junit4]   2> 41267 INFO  (qtp1001689711-76) [    x:collection1] o.a.s.u.IndexFingerprint IndexFingerprint millis:2.0 result:{maxVersionSpecified=9223372036854775807, maxVersionEncountered=0, maxInHash=0, versionsHash=0, numVersions=0, numDocs=0, maxDoc=0}
   [junit4]   2> 41268 INFO  (qtp1001689711-76) [    x:collection1] o.a.s.u.PeerSync PeerSync: core=collection1 url= DONE.  We have no versions.  sync failed.
   [junit4]   2> 41273 INFO  (qtp1788044732-55) [    x:collection1] o.a.s.u.IndexFingerprint IndexFingerprint millis:1.0 result:{maxVersionSpecified=9223372036854775807, maxVersionEncountered=1, maxInHash=1, versionsHash=-5451962507482445012, numVersions=1, numDocs=1, maxDoc=1}
   [junit4]   2> 41285 INFO  (qtp1788044732-55) [    x:collection1] o.a.s.c.S.Request [collection1]  webapp=/ld path=/get params={distrib=false&qt=/get&fingerprint=true&getVersions=100&wt=javabin&version=2} status=0 QTime=14
   [junit4]   2> 41292 INFO  (qtp1001689711-76) [    x:collection1] o.a.s.c.S.Request [collection1]  webapp=/ld path=/get params={qt=/get&getVersions=100&sync=http://127.0.0.1:33415/ld/collection1&wt=javabin&version=2} status=0 QTime=2024
   [junit4]   2> 41316 INFO  (qtp1001689711-77) [    x:collection1] o.a.s.u.p.LogUpdateProcessorFactory [collection1]  webapp=/ld path=/update params={update.distrib=FROMLEADER&wt=javabin&version=2}{add=[1 (1)]} 0 15
   [junit4]   2> 41320 INFO  (qtp1001689711-77) [    x:collection1] o.a.s.u.PeerSync PeerSync: core=collection1 url= START replicas=[http://127.0.0.1:33415/ld/collection1] nUpdates=100
   [junit4]   2> 41334 INFO  (qtp1788044732-56) [    x:collection1] o.a.s.u.IndexFingerprint IndexFingerprint millis:0.0 result:{maxVersionSpecified=9223372036854775807, maxVersionEncountered=1, maxInHash=1, versionsHash=-5451962507482445012, numVersions=1, numDocs=1, maxDoc=1}
   [junit4]   2> 41334 INFO  (qtp1788044732-56) [    x:collection1] o.a.s.c.S.Request [collection1]  webapp=/ld path=/get params={distrib=false&qt=/get&getFingerprint=9223372036854775807&wt=javabin&version=2} status=0 QTime=1
   [junit4]   2> 41421 INFO  (qtp1001689711-77) [    x:collection1] o.a.s.s.SolrIndexSearcher Opening [Searcher@157577f[collection1] realtime]
   [junit4]   2> 41422 INFO  (qtp1001689711-77) [    x:collection1] o.a.s.u.IndexFingerprint IndexFingerprint millis:81.0 result:{maxVersionSpecified=9223372036854775807, maxVersionEncountered=1, maxInHash=1, versionsHash=-5451962507482445012, numVersions=1, numDocs=1, maxDoc=1}
   [junit4]   2> 41422 INFO  (qtp1001689711-77) [    x:collection1] o.a.s.u.PeerSync We are already in sync. No need to do a PeerSync 
   [junit4]   2> 41422 INFO  (qtp1001689711-77) [    x:collection1] o.a.s.c.S.Request [collection1]  webapp=/ld path=/get params={qt=/get&getVersions=100&sync=http://127.0.0.1:33415/ld/collection1&wt=javabin&version=2} status=0 QTime=102
   [junit4]   2> 41630 INFO  (qtp1788044732-54) [    x:collection1] o.a.s.u.DirectUpdateHandler2 start commit{_version_=1632344369415585792,optimize=false,openSearcher=true,waitSearcher=true,expungeDeletes=false,softCommit=false,prepareCommit=false}
   [junit4]   2> 41631 INFO  (qtp1788044732-54) [    x:collection1] o.a.s.u.SolrIndexWriter Calling setCommitData with IW:org.apache.solr.update.SolrIndexWriter@1b9693d8 commitCommandVersion:1632344369415585792
   [junit4]   2> 41654 INFO  (qtp1788044732-54) [    x:collection1] o.a.s.s.SolrIndexSearcher Opening [Searcher@68ad9510[collection1] main]
   [junit4]   2> 41758 INFO  (qtp1788044732-54) [    x:collection1] o.a.s.u.DirectUpdateHandler2 end_commit_flush
   [junit4]   2> 41788 INFO  (searcherExecutor-39-thread-1-processing-x:collection1) [    x:collection1] o.a.s.c.SolrCore [collection1] Registered new searcher Searcher@68ad9510[collection1] main{ExitableDirectoryReader(UninvertingDirectoryReader(Uninverting(_0(9.0.0):C1:[diagnostics={lucene.version=9.0.0, source=flush, os.arch=amd64, java.runtime.version=13-testing+0-builds.shipilev.net-openjdk-jdk-b845-20190430-jdk-1318, os.version=4.18.0-17-generic, os=Linux, java.vendor=Aleksey Shipilev, timestamp=1556724899599, java.version=13-testing, java.vm.version=13-testing+0-builds.shipilev.net-openjdk-jdk-b845-20190430-jdk-1318}]:[attributes={Lucene50StoredFieldsFormat.mode=BEST_SPEED}])))}
   [junit4]   2> 41790 INFO  (qtp1788044732-54) [    x:collection1] o.a.s.u.p.LogUpdateProcessorFactory [collection1]  webapp=/ld path=/update params={waitSearcher=true&commit=true&softCommit=false&wt=javabin&version=2}{commit=} 0 360
   [junit4]   2> 41793 INFO  (qtp1001689711-75) [    x:collection1] o.a.s.u.DirectUpdateHandler2 start commit{_version_=1632344369795170304,optimize=false,openSearcher=true,waitSearcher=true,expungeDeletes=false,softCommit=false,prepareCommit=false}
   [junit4]   2> 41793 INFO  (qtp1001689711-75) [    x:collection1] o.a.s.u.SolrIndexWriter Calling setCommitData with IW:org.apache.solr.update.SolrIndexWriter@4aa1aaec commitCommandVersion:1632344369795170304
   [junit4]   2> 41811 INFO  (qtp1001689711-75) [    x:collection1] o.a.s.s.SolrIndexSearcher Opening [Searcher@4a8ef27e[collection1] main]
   [junit4]   2> 41814 INFO  (qtp1001689711-75) [    x:collection1] o.a.s.u.DirectUpdateHandler2 end_commit_flush
   [junit4]   2> 41824 INFO  (searcherExecutor-53-thread-1-processing-x:collection1) [    x:collection1] o.a.s.c.SolrCore [collection1] Registered new searcher Searcher@4a8ef27e[collection1] main{ExitableDirectoryReader(UninvertingDirectoryReader(Uninverting(_0(9.0.0):C1:[diagnostics={lucene.version=9.0.0, source=flush, os.arch=amd64, java.runtime.version=13-testing+0-builds.shipilev.net-openjdk-jdk-b845-20190430-jdk-1318, os.version=4.18.0-17-generic, os=Linux, java.vendor=Aleksey Shipilev, timestamp=1556724900591, java.version=13-testing, java.vm.version=13-testing+0-builds.shipilev.net-openjdk-jdk-b845-20190430-jdk-1318}]:[attributes={Lucene50StoredFieldsFormat.mode=BEST_SPEED}])))}
   [junit4]   2> 41825 INFO  (qtp1001689711-75) [    x:collection1] o.a.s.u.p.LogUpdateProcessorFactory [collection1]  webapp=/ld path=/update params={waitSearcher=true&commit=true&softCommit=false&wt=javabin&version=2}{commit=} 0 32
   [junit4]   2> 42200 INFO  (qtp1788044732-55) [    x:collection1] o.a.s.c.S.Request [collection1]  webapp=/ld path=/select params={q=*:*&wt=javabin&version=2} hits=1 status=0 QTime=372
   [junit4]   2> 42360 INFO  (qtp1001689711-76) [    x:collection1] o.a.s.c.S.Request [collection1]  webapp=/ld path=/select params={q=*:*&wt=javabin&version=2} hits=1 status=0 QTime=1
   [junit4]   2> 42498 INFO  (qtp1788044732-56) [    x:collection1] o.a.s.u.p.LogUpdateProcessorFactory [collection1]  webapp=/ld path=/update params={update.distrib=FROMLEADER&wt=javabin&version=2}{add=[2 (2)]} 0 120
   [junit4]   2> 42501 INFO  (qtp1001689711-77) [    x:collection1] o.a.s.u.PeerSync PeerSync: core=collection1 url= START replicas=[http://127.0.0.1:33415/ld/collection1] nUpdates=100
   [junit4]   2> 42685 INFO  (qtp1788044732-54) [    x:collection1] o.a.s.s.SolrIndexSearcher Opening [Searcher@77fb012f[collection1] realtime]
   [junit4]   2> 42685 INFO  (qtp1788044732-54) [    x:collection1] o.a.s.u.IndexFingerprint IndexFingerprint millis:181.0 result:{maxVersionSpecified=9223372036854775807, maxVersionEncountered=2, maxInHash=2, versionsHash=-1218814014108643565, numVersions=2, numDocs=2, maxDoc=1}
   [junit4]   2> 42686 INFO  (qtp1788044732-54) [    x:collection1] o.a.s.c.S.Request [collection1]  webapp=/ld path=/get params={distrib=false&qt=/get&getFingerprint=9223372036854775807&wt=javabin&version=2} status=0 QTime=182
   [junit4]   2> 42687 INFO  (qtp1001689711-77) [    x:collection1] o.a.s.u.IndexFingerprint IndexFingerprint millis:0.0 result:{maxVersionSpecified=9223372036854775807, maxVersionEncountered=1, maxInHash=1, versionsHash=-5451962507482445012, numVersions=1, numDocs=1, maxDoc=1}
   [junit4]   2> 42695 INFO  (qtp1788044732-55) [    x:collection1] o.a.s.u.IndexFingerprint IndexFingerprint millis:4.0 result:{maxVersionSpecified=9223372036854775807, maxVersionEncountered=2, maxInHash=2, versionsHash=-1218814014108643565, numVersions=2, numDocs=2, maxDoc=1}
   [junit4]   2> 42701 INFO  (qtp1788044732-55) [    x:collection1] o.a.s.c.S.Request [collection1]  webapp=/ld path=/get params={distrib=false&qt=/get&fingerprint=true&getVersions=100&wt=javabin&version=2} status=0 QTime=11
   [junit4]   2> 42802 INFO  (qtp1001689711-77) [    x:collection1] o.a.s.u.PeerSync PeerSync: core=collection1 url=  Received 2 versions from http://127.0.0.1:33415/ld/collection1 fingerprint:{maxVersionSpecified=9223372036854775807, maxVersionEncountered=2, maxInHash=2, versionsHash=-1218814014108643565, numVersions=2, numDocs=2, maxDoc=1}
   [junit4]   2> 42870 INFO  (qtp1001689711-77) [    x:collection1] 

[...truncated too long message...]

BC1306EA39B22B1E]-worker) [    ] o.a.s.m.r.SolrJmxReporter Closing reporter [org.apache.solr.metrics.reporters.SolrJmxReporter@505048ab: rootName = null, domain = solr.jetty, service url = null, agent id = null] for registry solr.jetty / com.codahale.metrics.MetricRegistry@35cada9e
   [junit4]   2> NOTE: leaving temporary files on disk at: /home/jenkins/workspace/Lucene-Solr-master-Linux/solr/build/solr-core/test/J1/temp/solr.update.TestInPlaceUpdatesDistrib_BC1306EA39B22B1E-001
   [junit4]   2> May 01, 2019 3:49:22 PM com.carrotsearch.randomizedtesting.ThreadLeakControl checkThreadLeaks
   [junit4]   2> WARNING: Will linger awaiting termination of 1 leaked thread(s).
   [junit4]   2> NOTE: test params are: codec=Asserting(Lucene80): {title_s=FSTOrd50, id=PostingsFormat(name=MockRandom), id_field_copy_that_does_not_support_in_place_update_s=FSTOrd50}, docValues:{inplace_updatable_float=DocValuesFormat(name=Asserting), id_i=DocValuesFormat(name=Lucene80), _version_=DocValuesFormat(name=Asserting), id=DocValuesFormat(name=Direct), inplace_updatable_int_with_default=DocValuesFormat(name=Asserting), inplace_updatable_int=DocValuesFormat(name=Lucene80), inplace_updatable_float_with_default=DocValuesFormat(name=Lucene80)}, maxPointsInLeafNode=894, maxMBSortInHeap=5.057534909265189, sim=Asserting(org.apache.lucene.search.similarities.AssertingSimilarity@163279e1), locale=zh-Hant-HK, timezone=Universal
   [junit4]   2> NOTE: Linux 4.18.0-17-generic amd64/Aleksey Shipilev 13-testing (64-bit)/cpus=8,threads=1,free=113377520,total=518979584
   [junit4]   2> NOTE: All tests run in this JVM: [PeerSyncTest, TestPolicyCloud, TestHashQParserPlugin, CoreAdminHandlerTest, DistributedExpandComponentTest, RulesTest, ExecutePlanActionTest, DisMaxRequestHandlerTest, TestTolerantSearch, TestBulkSchemaConcurrent, MoveReplicaHDFSTest, TestStressInPlaceUpdates, TermVectorComponentDistributedTest, TestReplicationHandlerDiskOverFlow, ClassificationUpdateProcessorFactoryTest, TestLeaderElectionWithEmptyReplica, TestDistributedSearch, TestSearcherReuse, CollectionStateFormat2Test, DistanceUnitsTest, DocumentAnalysisRequestHandlerTest, TestManagedStopFilterFactory, LeaderElectionIntegrationTest, TestRandomRequestDistribution, LegacyCloudClusterPropTest, V2StandaloneTest, ResponseBuilderTest, TestSimExecutePlanAction, WrapperMergePolicyFactoryTest, AliasIntegrationTest, TestMaxScoreQueryParser, SpellingQueryConverterTest, ReplicationFactorTest, AutoAddReplicasPlanActionTest, ProtectedTermFilterFactoryTest, TestDocSet, PeerSyncWithLeaderAndIndexFingerprintCachingTest, SolrJmxReporterCloudTest, TestInPlaceUpdatesDistrib]
   [junit4] Completed [134/855 (3!)] on J1 in 82.95s, 1 test, 1 failure <<< FAILURES!

[...truncated 21 lines...]
   [junit4] Suite: org.apache.solr.update.processor.DistributedUpdateProcessorTest
   [junit4]   2> 933823 INFO  (SUITE-DistributedUpdateProcessorTest-seed#[BC1306EA39B22B1E]-worker) [    ] o.a.s.SolrTestCaseJ4 SecureRandom sanity checks: test.solr.allowed.securerandom=null & java.security.egd=file:/dev/./urandom
   [junit4]   2> Creating dataDir: /home/jenkins/workspace/Lucene-Solr-master-Linux/solr/build/solr-core/test/J0/temp/solr.update.processor.DistributedUpdateProcessorTest_BC1306EA39B22B1E-001/init-core-data-001
   [junit4]   2> 933852 INFO  (SUITE-DistributedUpdateProcessorTest-seed#[BC1306EA39B22B1E]-worker) [    ] o.a.s.SolrTestCaseJ4 Using PointFields (NUMERIC_POINTS_SYSPROP=true) w/NUMERIC_DOCVALUES_SYSPROP=true
   [junit4]   2> 933853 INFO  (SUITE-DistributedUpdateProcessorTest-seed#[BC1306EA39B22B1E]-worker) [    ] o.a.s.SolrTestCaseJ4 Randomized ssl (false) and clientAuth (true) via: @org.apache.solr.util.RandomizeSSL(reason="", value=0.0/0.0, ssl=0.0/0.0, clientAuth=0.0/0.0)
   [junit4]   2> 934428 INFO  (SUITE-DistributedUpdateProcessorTest-seed#[BC1306EA39B22B1E]-worker) [    ] o.a.s.SolrTestCaseJ4 ------------------------------------------------------- Done waiting for tracked resources to be released
   [junit4]   2> NOTE: test params are: codec=DummyCompressingStoredFields(storedFieldsFormat=CompressingStoredFieldsFormat(compressionMode=DUMMY, chunkSize=3, maxDocsPerChunk=879, blockSize=4), termVectorsFormat=CompressingTermVectorsFormat(compressionMode=DUMMY, chunkSize=3, blockSize=4)), sim=Asserting(org.apache.lucene.search.similarities.AssertingSimilarity@52015449), locale=en-MU, timezone=Atlantic/Canary
   [junit4]   2> NOTE: Linux 4.18.0-17-generic amd64/Aleksey Shipilev 13-testing (64-bit)/cpus=8,threads=1,free=265193880,total=518979584
   [junit4]   2> NOTE: All tests run in this JVM: [MaxSizeAutoCommitTest, SystemLogListenerTest, TestGraphTermsQParserPlugin, CoreAdminCreateDiscoverTest, DistributedDebugComponentTest, RuleEngineTest, ComputePlanActionTest, CursorPagingTest, TestSolrCoreProperties, TestBinaryField, MoveReplicaHDFSFailoverTest, TestStressCloudBlindAtomicUpdates, SuggestComponentTest, TestReplicationHandlerBackup, CategoryRoutedAliasUpdateProcessorTest, TestHashPartitioner, TestDistributedMissingSort, TestSearchPerf, CollectionPropsTest, DateMathParserTest, CSVRequestHandlerTest, TestUniqueKeyFieldResource, LeaderElectionContextKeyTest, TestRandomFlRTGCloud, LeaderVoteWaitTimeoutTest, V2ApiIntegrationTest, RequestLoggingTest, TestSimDistributedQueue, UninvertDocValuesMergePolicyTest, AddReplicaTest, TestLegacyNumericRangeQueryBuilder, SpellPossibilityIteratorTest, ReplaceNodeTest, AutoAddReplicasIntegrationTest, PathHierarchyTokenizerFactoryTest, TestCustomSort, PeerSyncWithIndexFingerprintCachingTest, SolrGraphiteReporterTest, TestInPlaceUpdateWithRouteField, TestJsonFacetRefinement, TestMacros, DistributedSpellCheckComponentTest, TestImpersonationWithHadoopAuth, TestPhraseSuggestions, BigEndianAscendingWordDeserializerTest, NumberUtilsTest, DocValuesMissingTest, MetricsHistoryWithAuthIntegrationTest, TestNonDefinedSimilarityFactory, ZkFailoverTest, TestFreeTextSuggestions, TimeRoutedAliasUpdateProcessorTest, PropertiesRequestHandlerTest, ZkStateReaderTest, HdfsWriteToMultipleCollectionsTest, TestDocBasedVersionConstraints, HttpTriggerListenerTest, DistributedUpdateProcessorTest]
   [junit4]   2> NOTE: reproduce with: ant test  -Dtestcase=DistributedUpdateProcessorTest -Dtests.seed=BC1306EA39B22B1E -Dtests.multiplier=3 -Dtests.slow=true -Dtests.locale=en-MU -Dtests.timezone=Atlantic/Canary -Dtests.asserts=true -Dtests.file.encoding=ISO-8859-1
   [junit4] ERROR   0.00s J0 | DistributedUpdateProcessorTest (suite) <<<
   [junit4]    > Assumption #1: SOLR-11606: ByteBuddy used by Mockito is not working with this JVM version.Throwable #2: java.lang.NullPointerException
   [junit4]    > 	at __randomizedtesting.SeedInfo.seed([BC1306EA39B22B1E]:0)
   [junit4]    > 	at org.apache.solr.update.processor.DistributedUpdateProcessorTest.AfterClass(DistributedUpdateProcessorTest.java:67)
   [junit4]    > 	at java.base/jdk.internal.reflect.NativeMethodAccessorImpl.invoke0(Native Method)
   [junit4]    > 	at java.base/jdk.internal.reflect.NativeMethodAccessorImpl.invoke(NativeMethodAccessorImpl.java:62)
   [junit4]    > 	at java.base/jdk.internal.reflect.DelegatingMethodAccessorImpl.invoke(DelegatingMethodAccessorImpl.java:43)
   [junit4]    > 	at java.base/java.lang.reflect.Method.invoke(Method.java:567)
   [junit4]    > 	at java.base/java.lang.Thread.run(Thread.java:830)
   [junit4] Completed [141/855 (4!)] on J0 in 2.58s, 0 tests, 1 error <<< FAILURES!

[...truncated 22499 lines...]
-check-forbidden-all:
[forbidden-apis] Reading bundled API signatures: jdk-unsafe-11
[forbidden-apis] Reading bundled API signatures: jdk-deprecated-11
[forbidden-apis] Reading bundled API signatures: jdk-non-portable
[forbidden-apis] Reading bundled API signatures: jdk-reflection
[forbidden-apis] Reading API signatures: /home/jenkins/workspace/Lucene-Solr-master-Linux/lucene/tools/forbiddenApis/base.txt
[forbidden-apis] Reading API signatures: /home/jenkins/workspace/Lucene-Solr-master-Linux/lucene/tools/forbiddenApis/lucene.txt
[forbidden-apis] Loading classes to check...
[forbidden-apis] Scanning classes for violations...
[forbidden-apis] Forbidden method invocation: java.lang.String#format(java.lang.String,java.lang.Object[]) [Uses default locale]
[forbidden-apis]   in org.apache.lucene.queries.mlt.TestMoreLikeThis (TestMoreLikeThis.java:497)
[forbidden-apis] Scanned 239 class file(s) for forbidden API invocations (in 0.14s), 1 error(s).

BUILD FAILED
/home/jenkins/workspace/Lucene-Solr-master-Linux/build.xml:634: The following error occurred while executing this line:
/home/jenkins/workspace/Lucene-Solr-master-Linux/build.xml:117: The following error occurred while executing this line:
/home/jenkins/workspace/Lucene-Solr-master-Linux/lucene/build.xml:119: The following error occurred while executing this line:
/home/jenkins/workspace/Lucene-Solr-master-Linux/lucene/common-build.xml:2180: The following error occurred while executing this line:
/home/jenkins/workspace/Lucene-Solr-master-Linux/lucene/common-build.xml:2355: Check for forbidden API calls failed, see log.

Total time: 138 minutes 42 seconds
Build step 'Invoke Ant' marked build as failure
Archiving artifacts
Setting ANT_1_8_2_HOME=/home/jenkins/tools/hudson.tasks.Ant_AntInstallation/ANT_1.8.2
[WARNINGS] Skipping publisher since build result is FAILURE
Recording test results
Setting ANT_1_8_2_HOME=/home/jenkins/tools/hudson.tasks.Ant_AntInstallation/ANT_1.8.2
Email was triggered for: Failure - Any
Sending email for trigger: Failure - Any
Setting ANT_1_8_2_HOME=/home/jenkins/tools/hudson.tasks.Ant_AntInstallation/ANT_1.8.2
Setting ANT_1_8_2_HOME=/home/jenkins/tools/hudson.tasks.Ant_AntInstallation/ANT_1.8.2
Setting ANT_1_8_2_HOME=/home/jenkins/tools/hudson.tasks.Ant_AntInstallation/ANT_1.8.2
Setting ANT_1_8_2_HOME=/home/jenkins/tools/hudson.tasks.Ant_AntInstallation/ANT_1.8.2
Setting ANT_1_8_2_HOME=/home/jenkins/tools/hudson.tasks.Ant_AntInstallation/ANT_1.8.2
Setting ANT_1_8_2_HOME=/home/jenkins/tools/hudson.tasks.Ant_AntInstallation/ANT_1.8.2

Mime
View raw message