lucene-dev mailing list archives

Site index · List index
Message view « Date » · « Thread »
Top « Date » · « Thread »
From Apache Jenkins Server <jenk...@builds.apache.org>
Subject [JENKINS] Lucene-Solr-BadApples-Tests-8.x - Build # 92 - Still Failing
Date Thu, 02 May 2019 15:18:59 GMT
Build: https://builds.apache.org/job/Lucene-Solr-BadApples-Tests-8.x/92/

6 tests failed.
FAILED:  junit.framework.TestSuite.org.apache.solr.prometheus.exporter.SolrExporterIntegrationTest

Error Message:
Could not load collection from ZK: collection1

Stack Trace:
org.apache.solr.common.SolrException: Could not load collection from ZK: collection1
	at __randomizedtesting.SeedInfo.seed([3D0E3AF6F1D6DEB9]:0)
	at org.apache.solr.common.cloud.ZkStateReader.getCollectionLive(ZkStateReader.java:1384)
	at org.apache.solr.common.cloud.ZkStateReader$LazyCollectionRef.get(ZkStateReader.java:748)
	at org.apache.solr.common.cloud.ClusterState$CollectionRef.get(ClusterState.java:386)
	at org.apache.solr.client.solrj.impl.BaseCloudSolrClient.getDocCollection(BaseCloudSolrClient.java:1144)
	at org.apache.solr.client.solrj.impl.BaseCloudSolrClient.requestWithRetryOnStaleState(BaseCloudSolrClient.java:802)
	at org.apache.solr.client.solrj.impl.BaseCloudSolrClient.request(BaseCloudSolrClient.java:769)
	at org.apache.solr.prometheus.utils.Helpers.indexAllDocs(Helpers.java:52)
	at org.apache.solr.prometheus.PrometheusExporterTestBase.setupCluster(PrometheusExporterTestBase.java:75)
	at sun.reflect.NativeMethodAccessorImpl.invoke0(Native Method)
	at sun.reflect.NativeMethodAccessorImpl.invoke(NativeMethodAccessorImpl.java:62)
	at sun.reflect.DelegatingMethodAccessorImpl.invoke(DelegatingMethodAccessorImpl.java:43)
	at java.lang.reflect.Method.invoke(Method.java:498)
	at com.carrotsearch.randomizedtesting.RandomizedRunner.invoke(RandomizedRunner.java:1750)
	at com.carrotsearch.randomizedtesting.RandomizedRunner$6.evaluate(RandomizedRunner.java:878)
	at com.carrotsearch.randomizedtesting.RandomizedRunner$7.evaluate(RandomizedRunner.java:894)
	at com.carrotsearch.randomizedtesting.rules.StatementAdapter.evaluate(StatementAdapter.java:36)
	at com.carrotsearch.randomizedtesting.rules.SystemPropertiesRestoreRule$1.evaluate(SystemPropertiesRestoreRule.java:57)
	at org.apache.lucene.util.AbstractBeforeAfterRule$1.evaluate(AbstractBeforeAfterRule.java:45)
	at com.carrotsearch.randomizedtesting.rules.StatementAdapter.evaluate(StatementAdapter.java:36)
	at org.apache.lucene.util.TestRuleStoreClassName$1.evaluate(TestRuleStoreClassName.java:41)
	at com.carrotsearch.randomizedtesting.rules.NoShadowingOrOverridesOnMethodsRule$1.evaluate(NoShadowingOrOverridesOnMethodsRule.java:40)
	at com.carrotsearch.randomizedtesting.rules.NoShadowingOrOverridesOnMethodsRule$1.evaluate(NoShadowingOrOverridesOnMethodsRule.java:40)
	at com.carrotsearch.randomizedtesting.rules.StatementAdapter.evaluate(StatementAdapter.java:36)
	at com.carrotsearch.randomizedtesting.rules.StatementAdapter.evaluate(StatementAdapter.java:36)
	at com.carrotsearch.randomizedtesting.rules.StatementAdapter.evaluate(StatementAdapter.java:36)
	at org.apache.lucene.util.TestRuleAssertionsRequired$1.evaluate(TestRuleAssertionsRequired.java:53)
	at org.apache.lucene.util.TestRuleMarkFailure$1.evaluate(TestRuleMarkFailure.java:47)
	at org.apache.lucene.util.TestRuleIgnoreAfterMaxFailures$1.evaluate(TestRuleIgnoreAfterMaxFailures.java:64)
	at org.apache.lucene.util.TestRuleIgnoreTestSuites$1.evaluate(TestRuleIgnoreTestSuites.java:54)
	at com.carrotsearch.randomizedtesting.rules.StatementAdapter.evaluate(StatementAdapter.java:36)
	at com.carrotsearch.randomizedtesting.ThreadLeakControl$StatementRunner.run(ThreadLeakControl.java:368)
	at java.lang.Thread.run(Thread.java:748)
Caused by: org.apache.zookeeper.KeeperException$SessionExpiredException: KeeperErrorCode = Session expired for /collections/collection1/state.json
	at org.apache.zookeeper.KeeperException.create(KeeperException.java:130)
	at org.apache.zookeeper.KeeperException.create(KeeperException.java:54)
	at org.apache.zookeeper.ZooKeeper.getData(ZooKeeper.java:1221)
	at org.apache.solr.common.cloud.SolrZkClient.lambda$getData$5(SolrZkClient.java:358)
	at org.apache.solr.common.cloud.ZkCmdExecutor.retryOperation(ZkCmdExecutor.java:71)
	at org.apache.solr.common.cloud.SolrZkClient.getData(SolrZkClient.java:358)
	at org.apache.solr.common.cloud.ZkStateReader.fetchCollectionState(ZkStateReader.java:1396)
	at org.apache.solr.common.cloud.ZkStateReader.getCollectionLive(ZkStateReader.java:1382)
	... 31 more


FAILED:  org.apache.solr.common.cloud.SolrZkClientTest.testSimpleUpdateACLs

Error Message:
java.lang.InterruptedException: sleep interrupted

Stack Trace:
java.lang.RuntimeException: java.lang.InterruptedException: sleep interrupted
	at org.apache.solr.cloud.ZkTestServer.run(ZkTestServer.java:602)
	at org.apache.solr.cloud.ZkTestServer.run(ZkTestServer.java:526)
	at org.apache.solr.common.cloud.SolrZkClientTest.setUp(SolrZkClientTest.java:61)
	at sun.reflect.GeneratedMethodAccessor4.invoke(Unknown Source)
	at sun.reflect.DelegatingMethodAccessorImpl.invoke(DelegatingMethodAccessorImpl.java:43)
	at java.lang.reflect.Method.invoke(Method.java:498)
	at com.carrotsearch.randomizedtesting.RandomizedRunner.invoke(RandomizedRunner.java:1750)
	at com.carrotsearch.randomizedtesting.RandomizedRunner$9.evaluate(RandomizedRunner.java:972)
	at com.carrotsearch.randomizedtesting.RandomizedRunner$10.evaluate(RandomizedRunner.java:988)
	at com.carrotsearch.randomizedtesting.rules.SystemPropertiesRestoreRule$1.evaluate(SystemPropertiesRestoreRule.java:57)
	at org.apache.lucene.util.TestRuleSetupTeardownChained$1.evaluate(TestRuleSetupTeardownChained.java:49)
	at org.apache.lucene.util.AbstractBeforeAfterRule$1.evaluate(AbstractBeforeAfterRule.java:45)
	at org.apache.lucene.util.TestRuleThreadAndTestName$1.evaluate(TestRuleThreadAndTestName.java:48)
	at org.apache.lucene.util.TestRuleIgnoreAfterMaxFailures$1.evaluate(TestRuleIgnoreAfterMaxFailures.java:64)
	at org.apache.lucene.util.TestRuleMarkFailure$1.evaluate(TestRuleMarkFailure.java:47)
	at com.carrotsearch.randomizedtesting.rules.StatementAdapter.evaluate(StatementAdapter.java:36)
	at com.carrotsearch.randomizedtesting.ThreadLeakControl$StatementRunner.run(ThreadLeakControl.java:368)
	at com.carrotsearch.randomizedtesting.ThreadLeakControl.forkTimeoutingTask(ThreadLeakControl.java:817)
	at com.carrotsearch.randomizedtesting.ThreadLeakControl$3.evaluate(ThreadLeakControl.java:468)
	at com.carrotsearch.randomizedtesting.RandomizedRunner.runSingleTest(RandomizedRunner.java:947)
	at com.carrotsearch.randomizedtesting.RandomizedRunner$5.evaluate(RandomizedRunner.java:832)
	at com.carrotsearch.randomizedtesting.RandomizedRunner$6.evaluate(RandomizedRunner.java:883)
	at com.carrotsearch.randomizedtesting.RandomizedRunner$7.evaluate(RandomizedRunner.java:894)
	at com.carrotsearch.randomizedtesting.rules.StatementAdapter.evaluate(StatementAdapter.java:36)
	at com.carrotsearch.randomizedtesting.rules.SystemPropertiesRestoreRule$1.evaluate(SystemPropertiesRestoreRule.java:57)
	at org.apache.lucene.util.AbstractBeforeAfterRule$1.evaluate(AbstractBeforeAfterRule.java:45)
	at com.carrotsearch.randomizedtesting.rules.StatementAdapter.evaluate(StatementAdapter.java:36)
	at org.apache.lucene.util.TestRuleStoreClassName$1.evaluate(TestRuleStoreClassName.java:41)
	at com.carrotsearch.randomizedtesting.rules.NoShadowingOrOverridesOnMethodsRule$1.evaluate(NoShadowingOrOverridesOnMethodsRule.java:40)
	at com.carrotsearch.randomizedtesting.rules.NoShadowingOrOverridesOnMethodsRule$1.evaluate(NoShadowingOrOverridesOnMethodsRule.java:40)
	at com.carrotsearch.randomizedtesting.rules.StatementAdapter.evaluate(StatementAdapter.java:36)
	at com.carrotsearch.randomizedtesting.rules.StatementAdapter.evaluate(StatementAdapter.java:36)
	at com.carrotsearch.randomizedtesting.rules.StatementAdapter.evaluate(StatementAdapter.java:36)
	at org.apache.lucene.util.TestRuleAssertionsRequired$1.evaluate(TestRuleAssertionsRequired.java:53)
	at org.apache.lucene.util.TestRuleMarkFailure$1.evaluate(TestRuleMarkFailure.java:47)
	at org.apache.lucene.util.TestRuleIgnoreAfterMaxFailures$1.evaluate(TestRuleIgnoreAfterMaxFailures.java:64)
	at org.apache.lucene.util.TestRuleIgnoreTestSuites$1.evaluate(TestRuleIgnoreTestSuites.java:54)
	at com.carrotsearch.randomizedtesting.rules.StatementAdapter.evaluate(StatementAdapter.java:36)
	at com.carrotsearch.randomizedtesting.ThreadLeakControl$StatementRunner.run(ThreadLeakControl.java:368)
	at java.lang.Thread.run(Thread.java:748)
Caused by: java.lang.InterruptedException: sleep interrupted
	at java.lang.Thread.sleep(Native Method)
	at org.apache.solr.cloud.ZkTestServer.run(ZkTestServer.java:584)
	... 39 more


FAILED:  junit.framework.TestSuite.org.apache.solr.common.cloud.SolrZkClientTest

Error Message:
5 threads leaked from SUITE scope at org.apache.solr.common.cloud.SolrZkClientTest:     1) Thread[id=943, name=SyncThread:0, state=WAITING, group=TGRP-SolrZkClientTest]         at sun.misc.Unsafe.park(Native Method)         at java.util.concurrent.locks.LockSupport.park(LockSupport.java:175)         at java.util.concurrent.locks.AbstractQueuedSynchronizer$ConditionObject.await(AbstractQueuedSynchronizer.java:2039)         at java.util.concurrent.LinkedBlockingQueue.take(LinkedBlockingQueue.java:442)         at org.apache.zookeeper.server.SyncRequestProcessor.run(SyncRequestProcessor.java:127)    2) Thread[id=944, name=ProcessThread(sid:0 cport:44321):, state=WAITING, group=TGRP-SolrZkClientTest]         at sun.misc.Unsafe.park(Native Method)         at java.util.concurrent.locks.LockSupport.park(LockSupport.java:175)         at java.util.concurrent.locks.AbstractQueuedSynchronizer$ConditionObject.await(AbstractQueuedSynchronizer.java:2039)         at java.util.concurrent.LinkedBlockingQueue.take(LinkedBlockingQueue.java:442)         at org.apache.zookeeper.server.PrepRequestProcessor.run(PrepRequestProcessor.java:123)    3) Thread[id=942, name=SessionTracker, state=TIMED_WAITING, group=TGRP-SolrZkClientTest]         at java.lang.Object.wait(Native Method)         at org.apache.zookeeper.server.SessionTrackerImpl.run(SessionTrackerImpl.java:147)    4) Thread[id=941, name=NIOServerCxn.Factory:0.0.0.0/0.0.0.0:0, state=RUNNABLE, group=TGRP-SolrZkClientTest]         at sun.nio.ch.EPollArrayWrapper.epollWait(Native Method)         at sun.nio.ch.EPollArrayWrapper.poll(EPollArrayWrapper.java:269)         at sun.nio.ch.EPollSelectorImpl.doSelect(EPollSelectorImpl.java:93)         at sun.nio.ch.SelectorImpl.lockAndDoSelect(SelectorImpl.java:86)         at sun.nio.ch.SelectorImpl.select(SelectorImpl.java:97)         at org.apache.zookeeper.server.NIOServerCnxnFactory.run(NIOServerCnxnFactory.java:203)         at java.lang.Thread.run(Thread.java:748)    5) Thread[id=940, name=ZkTestServer Run Thread, state=WAITING, group=TGRP-SolrZkClientTest]         at java.lang.Object.wait(Native Method)         at java.lang.Thread.join(Thread.java:1252)         at java.lang.Thread.join(Thread.java:1326)         at org.apache.zookeeper.server.NIOServerCnxnFactory.join(NIOServerCnxnFactory.java:320)         at org.apache.solr.cloud.ZkTestServer$ZKServerMain.runFromConfig(ZkTestServer.java:343)         at org.apache.solr.cloud.ZkTestServer$2.run(ZkTestServer.java:566)

Stack Trace:
com.carrotsearch.randomizedtesting.ThreadLeakError: 5 threads leaked from SUITE scope at org.apache.solr.common.cloud.SolrZkClientTest: 
   1) Thread[id=943, name=SyncThread:0, state=WAITING, group=TGRP-SolrZkClientTest]
        at sun.misc.Unsafe.park(Native Method)
        at java.util.concurrent.locks.LockSupport.park(LockSupport.java:175)
        at java.util.concurrent.locks.AbstractQueuedSynchronizer$ConditionObject.await(AbstractQueuedSynchronizer.java:2039)
        at java.util.concurrent.LinkedBlockingQueue.take(LinkedBlockingQueue.java:442)
        at org.apache.zookeeper.server.SyncRequestProcessor.run(SyncRequestProcessor.java:127)
   2) Thread[id=944, name=ProcessThread(sid:0 cport:44321):, state=WAITING, group=TGRP-SolrZkClientTest]
        at sun.misc.Unsafe.park(Native Method)
        at java.util.concurrent.locks.LockSupport.park(LockSupport.java:175)
        at java.util.concurrent.locks.AbstractQueuedSynchronizer$ConditionObject.await(AbstractQueuedSynchronizer.java:2039)
        at java.util.concurrent.LinkedBlockingQueue.take(LinkedBlockingQueue.java:442)
        at org.apache.zookeeper.server.PrepRequestProcessor.run(PrepRequestProcessor.java:123)
   3) Thread[id=942, name=SessionTracker, state=TIMED_WAITING, group=TGRP-SolrZkClientTest]
        at java.lang.Object.wait(Native Method)
        at org.apache.zookeeper.server.SessionTrackerImpl.run(SessionTrackerImpl.java:147)
   4) Thread[id=941, name=NIOServerCxn.Factory:0.0.0.0/0.0.0.0:0, state=RUNNABLE, group=TGRP-SolrZkClientTest]
        at sun.nio.ch.EPollArrayWrapper.epollWait(Native Method)
        at sun.nio.ch.EPollArrayWrapper.poll(EPollArrayWrapper.java:269)
        at sun.nio.ch.EPollSelectorImpl.doSelect(EPollSelectorImpl.java:93)
        at sun.nio.ch.SelectorImpl.lockAndDoSelect(SelectorImpl.java:86)
        at sun.nio.ch.SelectorImpl.select(SelectorImpl.java:97)
        at org.apache.zookeeper.server.NIOServerCnxnFactory.run(NIOServerCnxnFactory.java:203)
        at java.lang.Thread.run(Thread.java:748)
   5) Thread[id=940, name=ZkTestServer Run Thread, state=WAITING, group=TGRP-SolrZkClientTest]
        at java.lang.Object.wait(Native Method)
        at java.lang.Thread.join(Thread.java:1252)
        at java.lang.Thread.join(Thread.java:1326)
        at org.apache.zookeeper.server.NIOServerCnxnFactory.join(NIOServerCnxnFactory.java:320)
        at org.apache.solr.cloud.ZkTestServer$ZKServerMain.runFromConfig(ZkTestServer.java:343)
        at org.apache.solr.cloud.ZkTestServer$2.run(ZkTestServer.java:566)
	at __randomizedtesting.SeedInfo.seed([75CAC804A7EF0637]:0)


FAILED:  junit.framework.TestSuite.org.apache.solr.common.cloud.SolrZkClientTest

Error Message:
There are still zombie threads that couldn't be terminated:    1) Thread[id=941, name=NIOServerCxn.Factory:0.0.0.0/0.0.0.0:0, state=RUNNABLE, group=TGRP-SolrZkClientTest]         at sun.nio.ch.IOUtil.drain(Native Method)         at sun.nio.ch.EPollSelectorImpl.doSelect(EPollSelectorImpl.java:104)         at sun.nio.ch.SelectorImpl.lockAndDoSelect(SelectorImpl.java:86)         at sun.nio.ch.SelectorImpl.select(SelectorImpl.java:97)         at org.apache.zookeeper.server.NIOServerCnxnFactory.run(NIOServerCnxnFactory.java:203)         at java.lang.Thread.run(Thread.java:748)

Stack Trace:
com.carrotsearch.randomizedtesting.ThreadLeakError: There are still zombie threads that couldn't be terminated:
   1) Thread[id=941, name=NIOServerCxn.Factory:0.0.0.0/0.0.0.0:0, state=RUNNABLE, group=TGRP-SolrZkClientTest]
        at sun.nio.ch.IOUtil.drain(Native Method)
        at sun.nio.ch.EPollSelectorImpl.doSelect(EPollSelectorImpl.java:104)
        at sun.nio.ch.SelectorImpl.lockAndDoSelect(SelectorImpl.java:86)
        at sun.nio.ch.SelectorImpl.select(SelectorImpl.java:97)
        at org.apache.zookeeper.server.NIOServerCnxnFactory.run(NIOServerCnxnFactory.java:203)
        at java.lang.Thread.run(Thread.java:748)
	at __randomizedtesting.SeedInfo.seed([75CAC804A7EF0637]:0)


FAILED:  org.apache.solr.update.PeerSyncTest.test

Error Message:
Unexpected exception type, expected SolrException but got org.apache.solr.client.solrj.SolrServerException: Timeout occurred while waiting response from server at: http://127.0.0.1:37734/nz_fyp/m/collection1

Stack Trace:
junit.framework.AssertionFailedError: Unexpected exception type, expected SolrException but got org.apache.solr.client.solrj.SolrServerException: Timeout occurred while waiting response from server at: http://127.0.0.1:37734/nz_fyp/m/collection1
	at __randomizedtesting.SeedInfo.seed([499F6D60B73D919C:C1CB52BA19C1FC64]:0)
	at org.apache.lucene.util.LuceneTestCase.expectThrows(LuceneTestCase.java:2700)
	at org.apache.lucene.util.LuceneTestCase.expectThrows(LuceneTestCase.java:2689)
	at org.apache.solr.update.PeerSyncTest.test(PeerSyncTest.java:279)
	at sun.reflect.NativeMethodAccessorImpl.invoke0(Native Method)
	at sun.reflect.NativeMethodAccessorImpl.invoke(NativeMethodAccessorImpl.java:62)
	at sun.reflect.DelegatingMethodAccessorImpl.invoke(DelegatingMethodAccessorImpl.java:43)
	at java.lang.reflect.Method.invoke(Method.java:498)
	at com.carrotsearch.randomizedtesting.RandomizedRunner.invoke(RandomizedRunner.java:1750)
	at com.carrotsearch.randomizedtesting.RandomizedRunner$8.evaluate(RandomizedRunner.java:938)
	at com.carrotsearch.randomizedtesting.RandomizedRunner$9.evaluate(RandomizedRunner.java:974)
	at com.carrotsearch.randomizedtesting.RandomizedRunner$10.evaluate(RandomizedRunner.java:988)
	at org.apache.solr.BaseDistributedSearchTestCase$ShardsRepeatRule$ShardsFixedStatement.callStatement(BaseDistributedSearchTestCase.java:1082)
	at org.apache.solr.BaseDistributedSearchTestCase$ShardsRepeatRule$ShardsStatement.evaluate(BaseDistributedSearchTestCase.java:1054)
	at com.carrotsearch.randomizedtesting.rules.SystemPropertiesRestoreRule$1.evaluate(SystemPropertiesRestoreRule.java:57)
	at org.apache.lucene.util.TestRuleSetupTeardownChained$1.evaluate(TestRuleSetupTeardownChained.java:49)
	at org.apache.lucene.util.AbstractBeforeAfterRule$1.evaluate(AbstractBeforeAfterRule.java:45)
	at org.apache.lucene.util.TestRuleThreadAndTestName$1.evaluate(TestRuleThreadAndTestName.java:48)
	at org.apache.lucene.util.TestRuleIgnoreAfterMaxFailures$1.evaluate(TestRuleIgnoreAfterMaxFailures.java:64)
	at org.apache.lucene.util.TestRuleMarkFailure$1.evaluate(TestRuleMarkFailure.java:47)
	at com.carrotsearch.randomizedtesting.rules.StatementAdapter.evaluate(StatementAdapter.java:36)
	at com.carrotsearch.randomizedtesting.ThreadLeakControl$StatementRunner.run(ThreadLeakControl.java:368)
	at com.carrotsearch.randomizedtesting.ThreadLeakControl.forkTimeoutingTask(ThreadLeakControl.java:817)
	at com.carrotsearch.randomizedtesting.ThreadLeakControl$3.evaluate(ThreadLeakControl.java:468)
	at com.carrotsearch.randomizedtesting.RandomizedRunner.runSingleTest(RandomizedRunner.java:947)
	at com.carrotsearch.randomizedtesting.RandomizedRunner$5.evaluate(RandomizedRunner.java:832)
	at com.carrotsearch.randomizedtesting.RandomizedRunner$6.evaluate(RandomizedRunner.java:883)
	at com.carrotsearch.randomizedtesting.RandomizedRunner$7.evaluate(RandomizedRunner.java:894)
	at com.carrotsearch.randomizedtesting.rules.StatementAdapter.evaluate(StatementAdapter.java:36)
	at com.carrotsearch.randomizedtesting.rules.SystemPropertiesRestoreRule$1.evaluate(SystemPropertiesRestoreRule.java:57)
	at org.apache.lucene.util.AbstractBeforeAfterRule$1.evaluate(AbstractBeforeAfterRule.java:45)
	at com.carrotsearch.randomizedtesting.rules.StatementAdapter.evaluate(StatementAdapter.java:36)
	at org.apache.lucene.util.TestRuleStoreClassName$1.evaluate(TestRuleStoreClassName.java:41)
	at com.carrotsearch.randomizedtesting.rules.NoShadowingOrOverridesOnMethodsRule$1.evaluate(NoShadowingOrOverridesOnMethodsRule.java:40)
	at com.carrotsearch.randomizedtesting.rules.NoShadowingOrOverridesOnMethodsRule$1.evaluate(NoShadowingOrOverridesOnMethodsRule.java:40)
	at com.carrotsearch.randomizedtesting.rules.StatementAdapter.evaluate(StatementAdapter.java:36)
	at com.carrotsearch.randomizedtesting.rules.StatementAdapter.evaluate(StatementAdapter.java:36)
	at com.carrotsearch.randomizedtesting.rules.StatementAdapter.evaluate(StatementAdapter.java:36)
	at org.apache.lucene.util.TestRuleAssertionsRequired$1.evaluate(TestRuleAssertionsRequired.java:53)
	at org.apache.lucene.util.TestRuleMarkFailure$1.evaluate(TestRuleMarkFailure.java:47)
	at org.apache.lucene.util.TestRuleIgnoreAfterMaxFailures$1.evaluate(TestRuleIgnoreAfterMaxFailures.java:64)
	at org.apache.lucene.util.TestRuleIgnoreTestSuites$1.evaluate(TestRuleIgnoreTestSuites.java:54)
	at com.carrotsearch.randomizedtesting.rules.StatementAdapter.evaluate(StatementAdapter.java:36)
	at com.carrotsearch.randomizedtesting.ThreadLeakControl$StatementRunner.run(ThreadLeakControl.java:368)
	at java.lang.Thread.run(Thread.java:748)
Caused by: org.apache.solr.client.solrj.SolrServerException: Timeout occurred while waiting response from server at: http://127.0.0.1:37734/nz_fyp/m/collection1
	at org.apache.solr.client.solrj.impl.HttpSolrClient.executeMethod(HttpSolrClient.java:660)
	at org.apache.solr.client.solrj.impl.HttpSolrClient.request(HttpSolrClient.java:255)
	at org.apache.solr.client.solrj.impl.HttpSolrClient.request(HttpSolrClient.java:244)
	at org.apache.solr.client.solrj.SolrRequest.process(SolrRequest.java:207)
	at org.apache.solr.client.solrj.SolrRequest.process(SolrRequest.java:224)
	at org.apache.solr.BaseDistributedSearchTestCase.add(BaseDistributedSearchTestCase.java:576)
	at org.apache.solr.update.PeerSyncTest.lambda$test$0(PeerSyncTest.java:281)
	at org.apache.lucene.util.LuceneTestCase.expectThrows(LuceneTestCase.java:2695)
	... 43 more
Caused by: java.net.SocketTimeoutException: Read timed out
	at java.net.SocketInputStream.socketRead0(Native Method)
	at java.net.SocketInputStream.socketRead(SocketInputStream.java:116)
	at java.net.SocketInputStream.read(SocketInputStream.java:171)
	at java.net.SocketInputStream.read(SocketInputStream.java:141)
	at org.apache.http.impl.io.SessionInputBufferImpl.streamRead(SessionInputBufferImpl.java:137)
	at org.apache.http.impl.io.SessionInputBufferImpl.fillBuffer(SessionInputBufferImpl.java:153)
	at org.apache.http.impl.io.SessionInputBufferImpl.readLine(SessionInputBufferImpl.java:282)
	at org.apache.http.impl.conn.DefaultHttpResponseParser.parseHead(DefaultHttpResponseParser.java:138)
	at org.apache.http.impl.conn.DefaultHttpResponseParser.parseHead(DefaultHttpResponseParser.java:56)
	at org.apache.http.impl.io.AbstractMessageParser.parse(AbstractMessageParser.java:259)
	at org.apache.http.impl.DefaultBHttpClientConnection.receiveResponseHeader(DefaultBHttpClientConnection.java:163)
	at org.apache.http.impl.conn.CPoolProxy.receiveResponseHeader(CPoolProxy.java:165)
	at org.apache.http.protocol.HttpRequestExecutor.doReceiveResponse(HttpRequestExecutor.java:273)
	at org.apache.http.protocol.HttpRequestExecutor.execute(HttpRequestExecutor.java:125)
	at org.apache.http.impl.execchain.MainClientExec.execute(MainClientExec.java:272)
	at org.apache.http.impl.execchain.ProtocolExec.execute(ProtocolExec.java:185)
	at org.apache.http.impl.execchain.RetryExec.execute(RetryExec.java:89)
	at org.apache.http.impl.execchain.RedirectExec.execute(RedirectExec.java:110)
	at org.apache.http.impl.client.InternalHttpClient.doExecute(InternalHttpClient.java:185)
	at org.apache.http.impl.client.CloseableHttpClient.execute(CloseableHttpClient.java:83)
	at org.apache.http.impl.client.CloseableHttpClient.execute(CloseableHttpClient.java:56)
	at org.apache.solr.client.solrj.impl.HttpSolrClient.executeMethod(HttpSolrClient.java:548)
	... 50 more


FAILED:  org.apache.solr.update.TestInPlaceUpdatesDistrib.test

Error Message:
Thread pool didn't terminate within 15 secs

Stack Trace:
java.lang.AssertionError: Thread pool didn't terminate within 15 secs
	at __randomizedtesting.SeedInfo.seed([499F6D60B73D919C:C1CB52BA19C1FC64]:0)
	at org.junit.Assert.fail(Assert.java:88)
	at org.junit.Assert.assertTrue(Assert.java:41)
	at org.apache.solr.update.TestInPlaceUpdatesDistrib.reorderedDeletesTest(TestInPlaceUpdatesDistrib.java:776)
	at org.apache.solr.update.TestInPlaceUpdatesDistrib.test(TestInPlaceUpdatesDistrib.java:175)
	at sun.reflect.NativeMethodAccessorImpl.invoke0(Native Method)
	at sun.reflect.NativeMethodAccessorImpl.invoke(NativeMethodAccessorImpl.java:62)
	at sun.reflect.DelegatingMethodAccessorImpl.invoke(DelegatingMethodAccessorImpl.java:43)
	at java.lang.reflect.Method.invoke(Method.java:498)
	at com.carrotsearch.randomizedtesting.RandomizedRunner.invoke(RandomizedRunner.java:1750)
	at com.carrotsearch.randomizedtesting.RandomizedRunner$8.evaluate(RandomizedRunner.java:938)
	at com.carrotsearch.randomizedtesting.RandomizedRunner$9.evaluate(RandomizedRunner.java:974)
	at com.carrotsearch.randomizedtesting.RandomizedRunner$10.evaluate(RandomizedRunner.java:988)
	at org.apache.solr.BaseDistributedSearchTestCase$ShardsRepeatRule$ShardsFixedStatement.callStatement(BaseDistributedSearchTestCase.java:1082)
	at org.apache.solr.BaseDistributedSearchTestCase$ShardsRepeatRule$ShardsStatement.evaluate(BaseDistributedSearchTestCase.java:1054)
	at com.carrotsearch.randomizedtesting.rules.SystemPropertiesRestoreRule$1.evaluate(SystemPropertiesRestoreRule.java:57)
	at org.apache.lucene.util.TestRuleSetupTeardownChained$1.evaluate(TestRuleSetupTeardownChained.java:49)
	at org.apache.lucene.util.AbstractBeforeAfterRule$1.evaluate(AbstractBeforeAfterRule.java:45)
	at org.apache.lucene.util.TestRuleThreadAndTestName$1.evaluate(TestRuleThreadAndTestName.java:48)
	at org.apache.lucene.util.TestRuleIgnoreAfterMaxFailures$1.evaluate(TestRuleIgnoreAfterMaxFailures.java:64)
	at org.apache.lucene.util.TestRuleMarkFailure$1.evaluate(TestRuleMarkFailure.java:47)
	at com.carrotsearch.randomizedtesting.rules.StatementAdapter.evaluate(StatementAdapter.java:36)
	at com.carrotsearch.randomizedtesting.ThreadLeakControl$StatementRunner.run(ThreadLeakControl.java:368)
	at com.carrotsearch.randomizedtesting.ThreadLeakControl.forkTimeoutingTask(ThreadLeakControl.java:817)
	at com.carrotsearch.randomizedtesting.ThreadLeakControl$3.evaluate(ThreadLeakControl.java:468)
	at com.carrotsearch.randomizedtesting.RandomizedRunner.runSingleTest(RandomizedRunner.java:947)
	at com.carrotsearch.randomizedtesting.RandomizedRunner$5.evaluate(RandomizedRunner.java:832)
	at com.carrotsearch.randomizedtesting.RandomizedRunner$6.evaluate(RandomizedRunner.java:883)
	at com.carrotsearch.randomizedtesting.RandomizedRunner$7.evaluate(RandomizedRunner.java:894)
	at com.carrotsearch.randomizedtesting.rules.StatementAdapter.evaluate(StatementAdapter.java:36)
	at com.carrotsearch.randomizedtesting.rules.SystemPropertiesRestoreRule$1.evaluate(SystemPropertiesRestoreRule.java:57)
	at org.apache.lucene.util.AbstractBeforeAfterRule$1.evaluate(AbstractBeforeAfterRule.java:45)
	at com.carrotsearch.randomizedtesting.rules.StatementAdapter.evaluate(StatementAdapter.java:36)
	at org.apache.lucene.util.TestRuleStoreClassName$1.evaluate(TestRuleStoreClassName.java:41)
	at com.carrotsearch.randomizedtesting.rules.NoShadowingOrOverridesOnMethodsRule$1.evaluate(NoShadowingOrOverridesOnMethodsRule.java:40)
	at com.carrotsearch.randomizedtesting.rules.NoShadowingOrOverridesOnMethodsRule$1.evaluate(NoShadowingOrOverridesOnMethodsRule.java:40)
	at com.carrotsearch.randomizedtesting.rules.StatementAdapter.evaluate(StatementAdapter.java:36)
	at com.carrotsearch.randomizedtesting.rules.StatementAdapter.evaluate(StatementAdapter.java:36)
	at com.carrotsearch.randomizedtesting.rules.StatementAdapter.evaluate(StatementAdapter.java:36)
	at org.apache.lucene.util.TestRuleAssertionsRequired$1.evaluate(TestRuleAssertionsRequired.java:53)
	at org.apache.lucene.util.TestRuleMarkFailure$1.evaluate(TestRuleMarkFailure.java:47)
	at org.apache.lucene.util.TestRuleIgnoreAfterMaxFailures$1.evaluate(TestRuleIgnoreAfterMaxFailures.java:64)
	at org.apache.lucene.util.TestRuleIgnoreTestSuites$1.evaluate(TestRuleIgnoreTestSuites.java:54)
	at com.carrotsearch.randomizedtesting.rules.StatementAdapter.evaluate(StatementAdapter.java:36)
	at com.carrotsearch.randomizedtesting.ThreadLeakControl$StatementRunner.run(ThreadLeakControl.java:368)
	at java.lang.Thread.run(Thread.java:748)




Build Log:
[...truncated 14007 lines...]
   [junit4] Suite: org.apache.solr.update.PeerSyncTest
   [junit4]   2> Creating dataDir: /home/jenkins/jenkins-slave/workspace/Lucene-Solr-BadApples-Tests-8.x/solr/build/solr-core/test/J1/temp/solr.update.PeerSyncTest_499F6D60B73D919C-001/init-core-data-001
   [junit4]   2> 1895476 INFO  (SUITE-PeerSyncTest-seed#[499F6D60B73D919C]-worker) [    ] o.a.s.SolrTestCaseJ4 Using PointFields (NUMERIC_POINTS_SYSPROP=true) w/NUMERIC_DOCVALUES_SYSPROP=false
   [junit4]   2> 1895477 INFO  (SUITE-PeerSyncTest-seed#[499F6D60B73D919C]-worker) [    ] o.a.s.SolrTestCaseJ4 Randomized ssl (false) and clientAuth (false) via: @org.apache.solr.SolrTestCaseJ4$SuppressSSL(bugUrl=https://issues.apache.org/jira/browse/SOLR-5776)
   [junit4]   2> 1895477 INFO  (SUITE-PeerSyncTest-seed#[499F6D60B73D919C]-worker) [    ] o.a.s.SolrTestCaseJ4 SecureRandom sanity checks: test.solr.allowed.securerandom=null & java.security.egd=file:/dev/./urandom
   [junit4]   2> 1895477 INFO  (SUITE-PeerSyncTest-seed#[499F6D60B73D919C]-worker) [    ] o.a.s.BaseDistributedSearchTestCase Setting hostContext system property: /nz_fyp/m
   [junit4]   2> 1895477 INFO  (TEST-PeerSyncTest.test-seed#[499F6D60B73D919C]) [    ] o.a.s.SolrTestCaseJ4 ####initCore
   [junit4]   2> 1895478 INFO  (TEST-PeerSyncTest.test-seed#[499F6D60B73D919C]) [    ] o.a.s.c.SolrResourceLoader [null] Added 2 libs to classloader, from paths: [/home/jenkins/jenkins-slave/workspace/Lucene-Solr-BadApples-Tests-8.x/solr/core/src/test-files/solr/collection1/lib, /home/jenkins/jenkins-slave/workspace/Lucene-Solr-BadApples-Tests-8.x/solr/core/src/test-files/solr/collection1/lib/classes]
   [junit4]   2> 1895495 INFO  (TEST-PeerSyncTest.test-seed#[499F6D60B73D919C]) [    ] o.a.s.c.SolrConfig Using Lucene MatchVersion: 8.2.0
   [junit4]   2> 1895516 INFO  (TEST-PeerSyncTest.test-seed#[499F6D60B73D919C]) [    ] o.a.s.s.IndexSchema [null] Schema name=test
   [junit4]   2> 1895597 INFO  (TEST-PeerSyncTest.test-seed#[499F6D60B73D919C]) [    ] o.a.s.s.IndexSchema Loaded schema test/1.0 with uniqueid field id
   [junit4]   2> 1895712 INFO  (TEST-PeerSyncTest.test-seed#[499F6D60B73D919C]) [    ] o.a.s.h.c.HttpShardHandlerFactory Host whitelist initialized: WhitelistHostChecker [whitelistHosts=null, whitelistHostCheckingEnabled=false]
   [junit4]   2> 1895717 WARN  (TEST-PeerSyncTest.test-seed#[499F6D60B73D919C]) [    ] o.e.j.u.s.S.config No Client EndPointIdentificationAlgorithm configured for SslContextFactory@5f268f2e[provider=null,keyStore=null,trustStore=null]
   [junit4]   2> 1895720 WARN  (TEST-PeerSyncTest.test-seed#[499F6D60B73D919C]) [    ] o.e.j.u.s.S.config No Client EndPointIdentificationAlgorithm configured for SslContextFactory@762721c0[provider=null,keyStore=null,trustStore=null]
   [junit4]   2> 1895744 INFO  (TEST-PeerSyncTest.test-seed#[499F6D60B73D919C]) [    ] o.a.s.c.TransientSolrCoreCacheDefault Allocating transient cache for 2147483647 transient cores
   [junit4]   2> 1895744 INFO  (TEST-PeerSyncTest.test-seed#[499F6D60B73D919C]) [    ] o.a.s.h.a.MetricsHistoryHandler No .system collection, keeping metrics history in memory.
   [junit4]   2> 1895756 INFO  (TEST-PeerSyncTest.test-seed#[499F6D60B73D919C]) [    ] o.a.s.m.r.SolrJmxReporter JMX monitoring for 'solr.node' (registry 'solr.node') enabled at server: com.sun.jmx.mbeanserver.JmxMBeanServer@6b8bc5d9
   [junit4]   2> 1895762 INFO  (TEST-PeerSyncTest.test-seed#[499F6D60B73D919C]) [    ] o.a.s.m.r.SolrJmxReporter JMX monitoring for 'solr.jvm' (registry 'solr.jvm') enabled at server: com.sun.jmx.mbeanserver.JmxMBeanServer@6b8bc5d9
   [junit4]   2> 1895762 INFO  (TEST-PeerSyncTest.test-seed#[499F6D60B73D919C]) [    ] o.a.s.m.r.SolrJmxReporter JMX monitoring for 'solr.jetty' (registry 'solr.jetty') enabled at server: com.sun.jmx.mbeanserver.JmxMBeanServer@6b8bc5d9
   [junit4]   2> 1895765 INFO  (coreLoadExecutor-5159-thread-1) [    x:collection1] o.a.s.c.SolrResourceLoader [null] Added 2 libs to classloader, from paths: [/home/jenkins/jenkins-slave/workspace/Lucene-Solr-BadApples-Tests-8.x/solr/core/src/test-files/solr/collection1/lib, /home/jenkins/jenkins-slave/workspace/Lucene-Solr-BadApples-Tests-8.x/solr/core/src/test-files/solr/collection1/lib/classes]
   [junit4]   2> 1895784 INFO  (coreLoadExecutor-5159-thread-1) [    x:collection1] o.a.s.c.SolrConfig Using Lucene MatchVersion: 8.2.0
   [junit4]   2> 1895803 INFO  (coreLoadExecutor-5159-thread-1) [    x:collection1] o.a.s.s.IndexSchema [collection1] Schema name=test
   [junit4]   2> 1895888 INFO  (coreLoadExecutor-5159-thread-1) [    x:collection1] o.a.s.s.IndexSchema Loaded schema test/1.0 with uniqueid field id
   [junit4]   2> 1895895 INFO  (coreLoadExecutor-5159-thread-1) [    x:collection1] o.a.s.c.CoreContainer Creating SolrCore 'collection1' using configuration from instancedir /home/jenkins/jenkins-slave/workspace/Lucene-Solr-BadApples-Tests-8.x/solr/core/src/test-files/solr/collection1, trusted=true
   [junit4]   2> 1895895 INFO  (coreLoadExecutor-5159-thread-1) [    x:collection1] o.a.s.m.r.SolrJmxReporter JMX monitoring for 'solr.core.collection1' (registry 'solr.core.collection1') enabled at server: com.sun.jmx.mbeanserver.JmxMBeanServer@6b8bc5d9
   [junit4]   2> 1895896 INFO  (coreLoadExecutor-5159-thread-1) [    x:collection1] o.a.s.c.SolrCore [[collection1] ] Opening new SolrCore at [/home/jenkins/jenkins-slave/workspace/Lucene-Solr-BadApples-Tests-8.x/solr/core/src/test-files/solr/collection1], dataDir=[/home/jenkins/jenkins-slave/workspace/Lucene-Solr-BadApples-Tests-8.x/solr/build/solr-core/test/J1/temp/solr.update.PeerSyncTest_499F6D60B73D919C-001/init-core-data-001/]
   [junit4]   2> 1895897 INFO  (coreLoadExecutor-5159-thread-1) [    x:collection1] o.a.s.u.RandomMergePolicy RandomMergePolicy wrapping class org.apache.lucene.index.TieredMergePolicy: [TieredMergePolicy: maxMergeAtOnce=16, maxMergeAtOnceExplicit=44, maxMergedSegmentMB=65.0947265625, floorSegmentMB=0.2548828125, forceMergeDeletesPctAllowed=6.127278454790977, segmentsPerTier=18.0, maxCFSSegmentSizeMB=8.796093022207999E12, noCFSRatio=1.0, deletesPctAllowed=25.397724187858408
   [junit4]   2> 1895900 WARN  (coreLoadExecutor-5159-thread-1) [    x:collection1] o.a.s.c.RequestHandlers INVALID paramSet a in requestHandler {type = requestHandler,name = /dump,class = DumpRequestHandler,attributes = {initParams=a, name=/dump, class=DumpRequestHandler},args = {defaults={a=A,b=B}}}
   [junit4]   2> 1895932 INFO  (coreLoadExecutor-5159-thread-1) [    x:collection1] o.a.s.u.UpdateHandler Using UpdateLog implementation: org.apache.solr.update.UpdateLog
   [junit4]   2> 1895932 INFO  (coreLoadExecutor-5159-thread-1) [    x:collection1] o.a.s.u.UpdateLog Initializing UpdateLog: dataDir= defaultSyncLevel=FLUSH numRecordsToKeep=100 maxNumLogsToKeep=10 numVersionBuckets=65536
   [junit4]   2> 1895932 INFO  (coreLoadExecutor-5159-thread-1) [    x:collection1] o.a.s.u.CommitTracker Hard AutoCommit: disabled
   [junit4]   2> 1895933 INFO  (coreLoadExecutor-5159-thread-1) [    x:collection1] o.a.s.u.CommitTracker Soft AutoCommit: disabled
   [junit4]   2> 1895933 INFO  (coreLoadExecutor-5159-thread-1) [    x:collection1] o.a.s.u.RandomMergePolicy RandomMergePolicy wrapping class org.apache.lucene.index.LogDocMergePolicy: [LogDocMergePolicy: minMergeSize=1000, mergeFactor=50, maxMergeSize=9223372036854775807, maxMergeSizeForForcedMerge=9223372036854775807, calibrateSizeByDeletes=false, maxMergeDocs=2147483647, maxCFSSegmentSizeMB=8.796093022207999E12, noCFSRatio=0.4474935552174236]
   [junit4]   2> 1895933 INFO  (coreLoadExecutor-5159-thread-1) [    x:collection1] o.a.s.s.SolrIndexSearcher Opening [Searcher@6bff989f[collection1] main]
   [junit4]   2> 1895934 WARN  (coreLoadExecutor-5159-thread-1) [    x:collection1] o.a.s.r.ManagedResourceStorage Cannot write to config directory /home/jenkins/jenkins-slave/workspace/Lucene-Solr-BadApples-Tests-8.x/solr/core/src/test-files/solr/collection1/conf; switching to use InMemory storage instead.
   [junit4]   2> 1895934 INFO  (coreLoadExecutor-5159-thread-1) [    x:collection1] o.a.s.h.ReplicationHandler Commits will be reserved for 10000ms.
   [junit4]   2> 1895934 INFO  (coreLoadExecutor-5159-thread-1) [    x:collection1] o.a.s.u.UpdateLog Could not find max version in index or recent updates, using new clock 1632429013598208000
   [junit4]   2> 1895936 INFO  (searcherExecutor-5160-thread-1-processing-x:collection1) [    x:collection1] o.a.s.c.SolrCore [collection1] Registered new searcher Searcher@6bff989f[collection1] main{ExitableDirectoryReader(UninvertingDirectoryReader())}
   [junit4]   2> 1895941 INFO  (TEST-PeerSyncTest.test-seed#[499F6D60B73D919C]) [    ] o.a.s.SolrTestCaseJ4 ####initCore end
   [junit4]   2> 1896050 INFO  (TEST-PeerSyncTest.test-seed#[499F6D60B73D919C]) [    ] o.a.s.SolrTestCaseJ4 Writing core.properties file to /home/jenkins/jenkins-slave/workspace/Lucene-Solr-BadApples-Tests-8.x/solr/build/solr-core/test/J1/temp/solr.update.PeerSyncTest_499F6D60B73D919C-001/tempDir-001/control/cores/collection1
   [junit4]   2> 1896051 WARN  (TEST-PeerSyncTest.test-seed#[499F6D60B73D919C]) [    ] o.e.j.s.AbstractConnector Ignoring deprecated socket close linger time
   [junit4]   2> 1896051 INFO  (TEST-PeerSyncTest.test-seed#[499F6D60B73D919C]) [    ] o.a.s.c.s.e.JettySolrRunner Start Jetty (original configured port=0)
   [junit4]   2> 1896051 INFO  (TEST-PeerSyncTest.test-seed#[499F6D60B73D919C]) [    ] o.a.s.c.s.e.JettySolrRunner Trying to start Jetty on port 0 try number 1 ...
   [junit4]   2> 1896051 INFO  (TEST-PeerSyncTest.test-seed#[499F6D60B73D919C]) [    ] o.e.j.s.Server jetty-9.4.14.v20181114; built: 2018-11-14T21:20:31.478Z; git: c4550056e785fb5665914545889f21dc136ad9e6; jvm 1.8.0_191-b12
   [junit4]   2> 1896052 INFO  (TEST-PeerSyncTest.test-seed#[499F6D60B73D919C]) [    ] o.e.j.s.session DefaultSessionIdManager workerName=node0
   [junit4]   2> 1896052 INFO  (TEST-PeerSyncTest.test-seed#[499F6D60B73D919C]) [    ] o.e.j.s.session No SessionScavenger set, using defaults
   [junit4]   2> 1896052 INFO  (TEST-PeerSyncTest.test-seed#[499F6D60B73D919C]) [    ] o.e.j.s.session node0 Scavenging every 600000ms
   [junit4]   2> 1896054 INFO  (TEST-PeerSyncTest.test-seed#[499F6D60B73D919C]) [    ] o.e.j.s.h.ContextHandler Started o.e.j.s.ServletContextHandler@4462a3e1{/nz_fyp/m,null,AVAILABLE}
   [junit4]   2> 1896054 INFO  (TEST-PeerSyncTest.test-seed#[499F6D60B73D919C]) [    ] o.e.j.s.AbstractConnector Started ServerConnector@50b048e6{HTTP/1.1,[http/1.1, h2c]}{127.0.0.1:45416}
   [junit4]   2> 1896054 INFO  (TEST-PeerSyncTest.test-seed#[499F6D60B73D919C]) [    ] o.e.j.s.Server Started @1896358ms
   [junit4]   2> 1896054 INFO  (TEST-PeerSyncTest.test-seed#[499F6D60B73D919C]) [    ] o.a.s.c.s.e.JettySolrRunner Jetty properties: {schema=schema.xml, solrconfig=solrconfig-tlog.xml, hostContext=/nz_fyp/m, hostPort=45416, coreRootDirectory=/home/jenkins/jenkins-slave/workspace/Lucene-Solr-BadApples-Tests-8.x/solr/build/solr-core/test/J1/temp/solr.update.PeerSyncTest_499F6D60B73D919C-001/tempDir-001/control/cores}
   [junit4]   2> 1896055 ERROR (TEST-PeerSyncTest.test-seed#[499F6D60B73D919C]) [    ] o.a.s.u.StartupLoggingUtils Missing Java Option solr.log.dir. Logging may be missing or incomplete.
   [junit4]   2> 1896055 INFO  (TEST-PeerSyncTest.test-seed#[499F6D60B73D919C]) [    ] o.a.s.s.SolrDispatchFilter Using logger factory org.apache.logging.slf4j.Log4jLoggerFactory
   [junit4]   2> 1896055 INFO  (TEST-PeerSyncTest.test-seed#[499F6D60B73D919C]) [    ] o.a.s.s.SolrDispatchFilter  ___      _       Welcome to Apache Solr™ version 8.2.0
   [junit4]   2> 1896055 INFO  (TEST-PeerSyncTest.test-seed#[499F6D60B73D919C]) [    ] o.a.s.s.SolrDispatchFilter / __| ___| |_ _   Starting in standalone mode on port null
   [junit4]   2> 1896055 INFO  (TEST-PeerSyncTest.test-seed#[499F6D60B73D919C]) [    ] o.a.s.s.SolrDispatchFilter \__ \/ _ \ | '_|  Install dir: null
   [junit4]   2> 1896055 INFO  (TEST-PeerSyncTest.test-seed#[499F6D60B73D919C]) [    ] o.a.s.s.SolrDispatchFilter |___/\___/_|_|    Start time: 2019-05-02T14:00:23.746Z
   [junit4]   2> 1896055 INFO  (TEST-PeerSyncTest.test-seed#[499F6D60B73D919C]) [    ] o.a.s.c.SolrXmlConfig Loading container configuration from /home/jenkins/jenkins-slave/workspace/Lucene-Solr-BadApples-Tests-8.x/solr/build/solr-core/test/J1/temp/solr.update.PeerSyncTest_499F6D60B73D919C-001/tempDir-001/control/solr.xml
   [junit4]   2> 1896059 INFO  (TEST-PeerSyncTest.test-seed#[499F6D60B73D919C]) [    ] o.a.s.c.SolrXmlConfig Configuration parameter autoReplicaFailoverWorkLoopDelay is ignored
   [junit4]   2> 1896059 INFO  (TEST-PeerSyncTest.test-seed#[499F6D60B73D919C]) [    ] o.a.s.c.SolrXmlConfig Configuration parameter autoReplicaFailoverBadNodeExpiration is ignored
   [junit4]   2> 1896060 INFO  (TEST-PeerSyncTest.test-seed#[499F6D60B73D919C]) [    ] o.a.s.c.SolrXmlConfig MBean server found: com.sun.jmx.mbeanserver.JmxMBeanServer@6b8bc5d9, but no JMX reporters were configured - adding default JMX reporter.
   [junit4]   2> 1896107 INFO  (TEST-PeerSyncTest.test-seed#[499F6D60B73D919C]) [    ] o.a.s.h.c.HttpShardHandlerFactory Host whitelist initialized: WhitelistHostChecker [whitelistHosts=null, whitelistHostCheckingEnabled=false]
   [junit4]   2> 1896108 WARN  (TEST-PeerSyncTest.test-seed#[499F6D60B73D919C]) [    ] o.e.j.u.s.S.config No Client EndPointIdentificationAlgorithm configured for SslContextFactory@673e5c38[provider=null,keyStore=null,trustStore=null]
   [junit4]   2> 1896112 WARN  (TEST-PeerSyncTest.test-seed#[499F6D60B73D919C]) [    ] o.e.j.u.s.S.config No Client EndPointIdentificationAlgorithm configured for SslContextFactory@7620ce96[provider=null,keyStore=null,trustStore=null]
   [junit4]   2> 1896127 INFO  (TEST-PeerSyncTest.test-seed#[499F6D60B73D919C]) [    ] o.a.s.c.TransientSolrCoreCacheDefault Allocating transient cache for 4 transient cores
   [junit4]   2> 1896127 INFO  (TEST-PeerSyncTest.test-seed#[499F6D60B73D919C]) [    ] o.a.s.h.a.MetricsHistoryHandler No .system collection, keeping metrics history in memory.
   [junit4]   2> 1896143 INFO  (TEST-PeerSyncTest.test-seed#[499F6D60B73D919C]) [    ] o.a.s.m.r.SolrJmxReporter JMX monitoring for 'solr.node' (registry 'solr.node') enabled at server: com.sun.jmx.mbeanserver.JmxMBeanServer@6b8bc5d9
   [junit4]   2> 1896151 INFO  (TEST-PeerSyncTest.test-seed#[499F6D60B73D919C]) [    ] o.a.s.m.r.SolrJmxReporter JMX monitoring for 'solr.jvm' (registry 'solr.jvm') enabled at server: com.sun.jmx.mbeanserver.JmxMBeanServer@6b8bc5d9
   [junit4]   2> 1896152 INFO  (TEST-PeerSyncTest.test-seed#[499F6D60B73D919C]) [    ] o.a.s.m.r.SolrJmxReporter JMX monitoring for 'solr.jetty' (registry 'solr.jetty') enabled at server: com.sun.jmx.mbeanserver.JmxMBeanServer@6b8bc5d9
   [junit4]   2> 1896153 INFO  (TEST-PeerSyncTest.test-seed#[499F6D60B73D919C]) [    ] o.a.s.c.CorePropertiesLocator Found 1 core definitions underneath /home/jenkins/jenkins-slave/workspace/Lucene-Solr-BadApples-Tests-8.x/solr/build/solr-core/test/J1/temp/solr.update.PeerSyncTest_499F6D60B73D919C-001/tempDir-001/control/cores
   [junit4]   2> 1896153 INFO  (TEST-PeerSyncTest.test-seed#[499F6D60B73D919C]) [    ] o.a.s.c.CorePropertiesLocator Cores are: [collection1]
   [junit4]   2> 1896154 INFO  (coreLoadExecutor-5173-thread-1) [    x:collection1] o.a.s.c.SolrResourceLoader [null] Added 2 libs to classloader, from paths: [/home/jenkins/jenkins-slave/workspace/Lucene-Solr-BadApples-Tests-8.x/solr/core/src/test-files/solr/collection1/lib, /home/jenkins/jenkins-slave/workspace/Lucene-Solr-BadApples-Tests-8.x/solr/core/src/test-files/solr/collection1/lib/classes]
   [junit4]   2> 1896190 INFO  (coreLoadExecutor-5173-thread-1) [    x:collection1] o.a.s.c.SolrConfig Using Lucene MatchVersion: 8.2.0
   [junit4]   2> 1896206 INFO  (coreLoadExecutor-5173-thread-1) [    x:collection1] o.a.s.s.IndexSchema [collection1] Schema name=test
   [junit4]   2> 1896290 INFO  (coreLoadExecutor-5173-thread-1) [    x:collection1] o.a.s.s.IndexSchema Loaded schema test/1.0 with uniqueid field id
   [junit4]   2> 1896297 INFO  (coreLoadExecutor-5173-thread-1) [    x:collection1] o.a.s.c.CoreContainer Creating SolrCore 'collection1' using configuration from configset /home/jenkins/jenkins-slave/workspace/Lucene-Solr-BadApples-Tests-8.x/solr/core/src/test-files/solr/collection1, trusted=true
   [junit4]   2> 1896297 INFO  (coreLoadExecutor-5173-thread-1) [    x:collection1] o.a.s.m.r.SolrJmxReporter JMX monitoring for 'solr.core.collection1' (registry 'solr.core.collection1') enabled at server: com.sun.jmx.mbeanserver.JmxMBeanServer@6b8bc5d9
   [junit4]   2> 1896297 INFO  (coreLoadExecutor-5173-thread-1) [    x:collection1] o.a.s.c.SolrCore [[collection1] ] Opening new SolrCore at [/home/jenkins/jenkins-slave/workspace/Lucene-Solr-BadApples-Tests-8.x/solr/core/src/test-files/solr/collection1], dataDir=[/home/jenkins/jenkins-slave/workspace/Lucene-Solr-BadApples-Tests-8.x/solr/build/solr-core/test/J1/temp/solr.update.PeerSyncTest_499F6D60B73D919C-001/tempDir-001/control/cores/collection1/data/]
   [junit4]   2> 1896299 INFO  (coreLoadExecutor-5173-thread-1) [    x:collection1] o.a.s.u.RandomMergePolicy RandomMergePolicy wrapping class org.apache.lucene.index.TieredMergePolicy: [TieredMergePolicy: maxMergeAtOnce=16, maxMergeAtOnceExplicit=44, maxMergedSegmentMB=65.0947265625, floorSegmentMB=0.2548828125, forceMergeDeletesPctAllowed=6.127278454790977, segmentsPerTier=18.0, maxCFSSegmentSizeMB=8.796093022207999E12, noCFSRatio=1.0, deletesPctAllowed=25.397724187858408
   [junit4]   2> 1896301 WARN  (coreLoadExecutor-5173-thread-1) [    x:collection1] o.a.s.c.RequestHandlers INVALID paramSet a in requestHandler {type = requestHandler,name = /dump,class = DumpRequestHandler,attributes = {initParams=a, name=/dump, class=DumpRequestHandler},args = {defaults={a=A,b=B}}}
   [junit4]   2> 1896334 INFO  (coreLoadExecutor-5173-thread-1) [    x:collection1] o.a.s.u.UpdateHandler Using UpdateLog implementation: org.apache.solr.update.UpdateLog
   [junit4]   2> 1896334 INFO  (coreLoadExecutor-5173-thread-1) [    x:collection1] o.a.s.u.UpdateLog Initializing UpdateLog: dataDir= defaultSyncLevel=FLUSH numRecordsToKeep=100 maxNumLogsToKeep=10 numVersionBuckets=65536
   [junit4]   2> 1896335 INFO  (coreLoadExecutor-5173-thread-1) [    x:collection1] o.a.s.u.CommitTracker Hard AutoCommit: disabled
   [junit4]   2> 1896335 INFO  (coreLoadExecutor-5173-thread-1) [    x:collection1] o.a.s.u.CommitTracker Soft AutoCommit: disabled
   [junit4]   2> 1896336 INFO  (coreLoadExecutor-5173-thread-1) [    x:collection1] o.a.s.u.RandomMergePolicy RandomMergePolicy wrapping class org.apache.lucene.index.LogDocMergePolicy: [LogDocMergePolicy: minMergeSize=1000, mergeFactor=50, maxMergeSize=9223372036854775807, maxMergeSizeForForcedMerge=9223372036854775807, calibrateSizeByDeletes=false, maxMergeDocs=2147483647, maxCFSSegmentSizeMB=8.796093022207999E12, noCFSRatio=0.4474935552174236]
   [junit4]   2> 1896336 INFO  (coreLoadExecutor-5173-thread-1) [    x:collection1] o.a.s.s.SolrIndexSearcher Opening [Searcher@3ed0e1[collection1] main]
   [junit4]   2> 1896336 WARN  (coreLoadExecutor-5173-thread-1) [    x:collection1] o.a.s.r.ManagedResourceStorage Cannot write to config directory /home/jenkins/jenkins-slave/workspace/Lucene-Solr-BadApples-Tests-8.x/solr/core/src/test-files/solr/collection1/conf; switching to use InMemory storage instead.
   [junit4]   2> 1896337 INFO  (coreLoadExecutor-5173-thread-1) [    x:collection1] o.a.s.h.ReplicationHandler Commits will be reserved for 10000ms.
   [junit4]   2> 1896337 INFO  (coreLoadExecutor-5173-thread-1) [    x:collection1] o.a.s.u.UpdateLog Could not find max version in index or recent updates, using new clock 1632429014020784128
   [junit4]   2> 1896339 INFO  (searcherExecutor-5174-thread-1-processing-x:collection1) [    x:collection1] o.a.s.c.SolrCore [collection1] Registered new searcher Searcher@3ed0e1[collection1] main{ExitableDirectoryReader(UninvertingDirectoryReader())}
   [junit4]   2> 1896440 INFO  (TEST-PeerSyncTest.test-seed#[499F6D60B73D919C]) [    ] o.a.s.SolrTestCaseJ4 Writing core.properties file to /home/jenkins/jenkins-slave/workspace/Lucene-Solr-BadApples-Tests-8.x/solr/build/solr-core/test/J1/temp/solr.update.PeerSyncTest_499F6D60B73D919C-001/tempDir-001/shard0/cores/collection1
   [junit4]   2> 1896440 WARN  (TEST-PeerSyncTest.test-seed#[499F6D60B73D919C]) [    ] o.e.j.s.AbstractConnector Ignoring deprecated socket close linger time
   [junit4]   2> 1896441 INFO  (TEST-PeerSyncTest.test-seed#[499F6D60B73D919C]) [    ] o.a.s.c.s.e.JettySolrRunner Start Jetty (original configured port=0)
   [junit4]   2> 1896441 INFO  (TEST-PeerSyncTest.test-seed#[499F6D60B73D919C]) [    ] o.a.s.c.s.e.JettySolrRunner Trying to start Jetty on port 0 try number 1 ...
   [junit4]   2> 1896441 INFO  (TEST-PeerSyncTest.test-seed#[499F6D60B73D919C]) [    ] o.e.j.s.Server jetty-9.4.14.v20181114; built: 2018-11-14T21:20:31.478Z; git: c4550056e785fb5665914545889f21dc136ad9e6; jvm 1.8.0_191-b12
   [junit4]   2> 1896441 INFO  (TEST-PeerSyncTest.test-seed#[499F6D60B73D919C]) [    ] o.e.j.s.session DefaultSessionIdManager workerName=node0
   [junit4]   2> 1896441 INFO  (TEST-PeerSyncTest.test-seed#[499F6D60B73D919C]) [    ] o.e.j.s.session No SessionScavenger set, using defaults
   [junit4]   2> 1896442 INFO  (TEST-PeerSyncTest.test-seed#[499F6D60B73D919C]) [    ] o.e.j.s.session node0 Scavenging every 600000ms
   [junit4]   2> 1896442 INFO  (TEST-PeerSyncTest.test-seed#[499F6D60B73D919C]) [    ] o.e.j.s.h.ContextHandler Started o.e.j.s.ServletContextHandler@9fef1f9{/nz_fyp/m,null,AVAILABLE}
   [junit4]   2> 1896442 INFO  (TEST-PeerSyncTest.test-seed#[499F6D60B73D919C]) [    ] o.e.j.s.AbstractConnector Started ServerConnector@30cefd67{HTTP/1.1,[http/1.1, h2c]}{127.0.0.1:37734}
   [junit4]   2> 1896442 INFO  (TEST-PeerSyncTest.test-seed#[499F6D60B73D919C]) [    ] o.e.j.s.Server Started @1896746ms
   [junit4]   2> 1896442 INFO  (TEST-PeerSyncTest.test-seed#[499F6D60B73D919C]) [    ] o.a.s.c.s.e.JettySolrRunner Jetty properties: {schema=schema.xml, solrconfig=solrconfig-tlog.xml, hostContext=/nz_fyp/m, hostPort=37734, coreRootDirectory=/home/jenkins/jenkins-slave/workspace/Lucene-Solr-BadApples-Tests-8.x/solr/build/solr-core/test/J1/temp/solr.update.PeerSyncTest_499F6D60B73D919C-001/tempDir-001/shard0/cores}
   [junit4]   2> 1896446 ERROR (TEST-PeerSyncTest.test-seed#[499F6D60B73D919C]) [    ] o.a.s.u.StartupLoggingUtils Missing Java Option solr.log.dir. Logging may be missing or incomplete.
   [junit4]   2> 1896446 INFO  (TEST-PeerSyncTest.test-seed#[499F6D60B73D919C]) [    ] o.a.s.s.SolrDispatchFilter Using logger factory org.apache.logging.slf4j.Log4jLoggerFactory
   [junit4]   2> 1896446 INFO  (TEST-PeerSyncTest.test-seed#[499F6D60B73D919C]) [    ] o.a.s.s.SolrDispatchFilter  ___      _       Welcome to Apache Solr™ version 8.2.0
   [junit4]   2> 1896446 INFO  (TEST-PeerSyncTest.test-seed#[499F6D60B73D919C]) [    ] o.a.s.s.SolrDispatchFilter / __| ___| |_ _   Starting in standalone mode on port null
   [junit4]   2> 1896446 INFO  (TEST-PeerSyncTest.test-seed#[499F6D60B73D919C]) [    ] o.a.s.s.SolrDispatchFilter \__ \/ _ \ | '_|  Install dir: null
   [junit4]   2> 1896447 INFO  (TEST-PeerSyncTest.test-seed#[499F6D60B73D919C]) [    ] o.a.s.s.SolrDispatchFilter |___/\___/_|_|    Start time: 2019-05-02T14:00:24.138Z
   [junit4]   2> 1896447 INFO  (TEST-PeerSyncTest.test-seed#[499F6D60B73D919C]) [    ] o.a.s.c.SolrXmlConfig Loading container configuration from /home/jenkins/jenkins-slave/workspace/Lucene-Solr-BadApples-Tests-8.x/solr/build/solr-core/test/J1/temp/solr.update.PeerSyncTest_499F6D60B73D919C-001/tempDir-001/shard0/solr.xml
   [junit4]   2> 1896450 INFO  (TEST-PeerSyncTest.test-seed#[499F6D60B73D919C]) [    ] o.a.s.c.SolrXmlConfig Configuration parameter autoReplicaFailoverWorkLoopDelay is ignored
   [junit4]   2> 1896450 INFO  (TEST-PeerSyncTest.test-seed#[499F6D60B73D919C]) [    ] o.a.s.c.SolrXmlConfig Configuration parameter autoReplicaFailoverBadNodeExpiration is ignored
   [junit4]   2> 1896451 INFO  (TEST-PeerSyncTest.test-seed#[499F6D60B73D919C]) [    ] o.a.s.c.SolrXmlConfig MBean server found: com.sun.jmx.mbeanserver.JmxMBeanServer@6b8bc5d9, but no JMX reporters were configured - adding default JMX reporter.
   [junit4]   2> 1896532 INFO  (TEST-PeerSyncTest.test-seed#[499F6D60B73D919C]) [    ] o.a.s.h.c.HttpShardHandlerFactory Host whitelist initialized: WhitelistHostChecker [whitelistHosts=null, whitelistHostCheckingEnabled=false]
   [junit4]   2> 1896533 WARN  (TEST-PeerSyncTest.test-seed#[499F6D60B73D919C]) [    ] o.e.j.u.s.S.config No Client EndPointIdentificationAlgorithm configured for SslContextFactory@7ef44f9[provider=null,keyStore=null,trustStore=null]
   [junit4]   2> 1896537 WARN  (TEST-PeerSyncTest.test-seed#[499F6D60B73D919C]) [    ] o.e.j.u.s.S.config No Client EndPointIdentificationAlgorithm configured for SslContextFactory@30b7518d[provider=null,keyStore=null,trustStore=null]
   [junit4]   2> 1896552 INFO  (TEST-PeerSyncTest.test-seed#[499F6D60B73D919C]) [    ] o.a.s.c.TransientSolrCoreCacheDefault Allocating transient cache for 4 transient cores
   [junit4]   2> 1896553 INFO  (TEST-PeerSyncTest.test-seed#[499F6D60B73D919C]) [    ] o.a.s.h.a.MetricsHistoryHandler No .system collection, keeping metrics history in memory.
   [junit4]   2> 1896568 INFO  (TEST-PeerSyncTest.test-seed#[499F6D60B73D919C]) [    ] o.a.s.m.r.SolrJmxReporter JMX monitoring for 'solr.node' (registry 'solr.node') enabled at server: com.sun.jmx.mbeanserver.JmxMBeanServer@6b8bc5d9
   [junit4]   2> 1896577 INFO  (TEST-PeerSyncTest.test-seed#[499F6D60B73D919C]) [    ] o.a.s.m.r.SolrJmxReporter JMX monitoring for 'solr.jvm' (registry 'solr.jvm') enabled at server: com.sun.jmx.mbeanserver.JmxMBeanServer@6b8bc5d9
   [junit4]   2> 1896577 INFO  (TEST-PeerSyncTest.test-seed#[499F6D60B73D919C]) [    ] o.a.s.m.r.SolrJmxReporter JMX monitoring for 'solr.jetty' (registry 'solr.jetty') enabled at server: com.sun.jmx.mbeanserver.JmxMBeanServer@6b8bc5d9
   [junit4]   2> 1896579 INFO  (TEST-PeerSyncTest.test-seed#[499F6D60B73D919C]) [    ] o.a.s.c.CorePropertiesLocator Found 1 core definitions underneath /home/jenkins/jenkins-slave/workspace/Lucene-Solr-BadApples-Tests-8.x/solr/build/solr-core/test/J1/temp/solr.update.PeerSyncTest_499F6D60B73D919C-001/tempDir-001/shard0/cores
   [junit4]   2> 1896579 INFO  (TEST-PeerSyncTest.test-seed#[499F6D60B73D919C]) [    ] o.a.s.c.CorePropertiesLocator Cores are: [collection1]
   [junit4]   2> 1896580 INFO  (coreLoadExecutor-5187-thread-1) [    x:collection1] o.a.s.c.SolrResourceLoader [null] Added 2 libs to classloader, from paths: [/home/jenkins/jenkins-slave/workspace/Lucene-Solr-BadApples-Tests-8.x/solr/core/src/test-files/solr/collection1/lib, /home/jenkins/jenkins-slave/workspace/Lucene-Solr-BadApples-Tests-8.x/solr/core/src/test-files/solr/collection1/lib/classes]
   [junit4]   2> 1896600 INFO  (coreLoadExecutor-5187-thread-1) [    x:collection1] o.a.s.c.SolrConfig Using Lucene MatchVersion: 8.2.0
   [junit4]   2> 1896622 INFO  (coreLoadExecutor-5187-thread-1) [    x:collection1] o.a.s.s.IndexSchema [collection1] Schema name=test
   [junit4]   2> 1896698 INFO  (coreLoadExecutor-5187-thread-1) [    x:collection1] o.a.s.s.IndexSchema Loaded schema test/1.0 with uniqueid field id
   [junit4]   2> 1896705 INFO  (coreLoadExecutor-5187-thread-1) [    x:collection1] o.a.s.c.CoreContainer Creating SolrCore 'collection1' using configuration from configset /home/jenkins/jenkins-slave/workspace/Lucene-Solr-BadApples-Tests-8.x/solr/core/src/test-files/solr/collection1, trusted=true
   [junit4]   2> 1896705 INFO  (coreLoadExecutor-5187-thread-1) [    x:collection1] o.a.s.m.r.SolrJmxReporter JMX monitoring for 'solr.core.collection1' (registry 'solr.core.collection1') enabled at server: com.sun.jmx.mbeanserver.JmxMBeanServer@6b8bc5d9
   [junit4]   2> 1896705 INFO  (coreLoadExecutor-5187-thread-1) [    x:collection1] o.a.s.c.SolrCore [[collection1] ] Opening new SolrCore at [/home/jenkins/jenkins-slave/workspace/Lucene-Solr-BadApples-Tests-8.x/solr/core/src/test-files/solr/collection1], dataDir=[/home/jenkins/jenkins-slave/workspace/Lucene-Solr-BadApples-Tests-8.x/solr/build/solr-core/test/J1/temp/solr.update.PeerSyncTest_499F6D60B73D919C-001/tempDir-001/shard0/cores/collection1/data/]
   [junit4]   2> 1896707 INFO  (coreLoadExecutor-5187-thread-1) [    x:collection1] o.a.s.u.RandomMergePolicy RandomMergePolicy wrapping class org.apache.lucene.index.TieredMergePolicy: [TieredMergePolicy: maxMergeAtOnce=16, maxMergeAtOnceExplicit=44, maxMergedSegmentMB=65.0947265625, floorSegmentMB=0.2548828125, forceMergeDeletesPctAllowed=6.127278454790977, segmentsPerTier=18.0, maxCFSSegmentSizeMB=8.796093022207999E12, noCFSRatio=1.0, deletesPctAllowed=25.397724187858408
   [junit4]   2> 1896708 WARN  (coreLoadExecutor-5187-thread-1) [    x:collection1] o.a.s.c.RequestHandlers INVALID paramSet a in requestHandler {type = requestHandler,name = /dump,class = DumpRequestHandler,attributes = {initParams=a, name=/dump, class=DumpRequestHandler},args = {defaults={a=A,b=B}}}
   [junit4]   2> 1896756 INFO  (coreLoadExecutor-5187-thread-1) [    x:collection1] o.a.s.u.UpdateHandler Using UpdateLog implementation: org.apache.solr.update.UpdateLog
   [junit4]   2> 1896756 INFO  (coreLoadExecutor-5187-thread-1) [    x:collection1] o.a.s.u.UpdateLog Initializing UpdateLog: dataDir= defaultSyncLevel=FLUSH numRecordsToKeep=100 maxNumLogsToKeep=10 numVersionBuckets=65536
   [junit4]   2> 1896758 INFO  (coreLoadExecutor-5187-thread-1) [    x:collection1] o.a.s.u.CommitTracker Hard AutoCommit: disabled
   [junit4]   2> 1896758 INFO  (coreLoadExecutor-5187-thread-1) [    x:collection1] o.a.s.u.CommitTracker Soft AutoCommit: disabled
   [junit4]   2> 1896758 INFO  (coreLoadExecutor-5187-thread-1) [    x:collection1] o.a.s.u.RandomMergePolicy RandomMergePolicy wrapping class org.apache.lucene.index.LogDocMergePolicy: [LogDocMergePolicy: minMergeSize=1000, mergeFactor=50, maxMergeSize=9223372036854775807, maxMergeSizeForForcedMerge=9223372036854775807, calibrateSizeByDeletes=false, maxMergeDocs=2147483647, maxCFSSegmentSizeMB=8.796093022207999E12, noCFSRatio=0.4474935552174236]
   [junit4]   2> 1896759 INFO  (coreLoadExecutor-5187-thread-1) [    x:collection1] o.a.s.s.SolrIndexSearcher Opening [Searcher@3bfd49f8[collection1] main]
   [junit4]   2> 1896759 WARN  (coreLoadExecutor-5187-thread-1) [    x:collection1] o.a.s.r.ManagedResourceStorage Cannot write to config directory /home/jenkins/jenkins-slave/workspace/Lucene-Solr-BadApples-Tests-8.x/solr/core/src/test-files/solr/collection1/conf; switching to use InMemory storage instead.
   [junit4]   2> 1896759 INFO  (coreLoadExecutor-5187-thread-1) [    x:collection1] o.a.s.h.ReplicationHandler Commits will be reserved for 10000ms.
   [junit4]   2> 1896759 INFO  (coreLoadExecutor-5187-thread-1) [    x:collection1] o.a.s.u.UpdateLog Could not find max version in index or recent updates, using new clock 1632429014463283200
   [junit4]   2> 1896762 INFO  (searcherExecutor-5188-thread-1-processing-x:collection1) [    x:collection1] o.a.s.c.SolrCore [collection1] Registered new searcher Searcher@3bfd49f8[collection1] main{ExitableDirectoryReader(UninvertingDirectoryReader())}
   [junit4]   2> 1896864 INFO  (TEST-PeerSyncTest.test-seed#[499F6D60B73D919C]) [    ] o.a.s.SolrTestCaseJ4 Writing core.properties file to /home/jenkins/jenkins-slave/workspace/Lucene-Solr-BadApples-Tests-8.x/solr/build/solr-core/test/J1/temp/solr.update.PeerSyncTest_499F6D60B73D919C-001/tempDir-001/shard1/cores/collection1
   [junit4]   2> 1896864 WARN  (TEST-PeerSyncTest.test-seed#[499F6D60B73D919C]) [    ] o.e.j.s.AbstractConnector Ignoring deprecated socket close linger time
   [junit4]   2> 1896865 INFO  (TEST-PeerSyncTest.test-seed#[499F6D60B73D919C]) [    ] o.a.s.c.s.e.JettySolrRunner Start Jetty (original configured port=0)
   [junit4]   2> 1896865 INFO  (TEST-PeerSyncTest.test-seed#[499F6D60B73D919C]) [    ] o.a.s.c.s.e.JettySolrRunner Trying to start Jetty on port 0 try number 1 ...
   [junit4]   2> 1896865 INFO  (TEST-PeerSyncTest.test-seed#[499F6D60B73D919C]) [    ] o.e.j.s.Server jetty-9.4.14.v20181114; built: 2018-11-14T21:20:31.478Z; git: c4550056e785fb5665914545889f21dc136ad9e6; jvm 1.8.0_191-b12
   [junit4]   2> 1896865 INFO  (TEST-PeerSyncTest.test-seed#[499F6D60B73D919C]) [    ] o.e.j.s.session DefaultSessionIdManager workerName=node0
   [junit4]   2> 1896865 INFO  (TEST-PeerSyncTest.test-seed#[499F6D60B73D919C]) [    ] o.e.j.s.session No SessionScavenger set, using defaults
   [junit4]   2> 1896865 INFO  (TEST-PeerSyncTest.test-seed#[499F6D60B73D919C]) [    ] o.e.j.s.session node0 Scavenging every 660000ms
   [junit4]   2> 1896866 INFO  (TEST-PeerSyncTest.test-seed#[499F6D60B73D919C]) [    ] o.e.j.s.h.ContextHandler Started o.e.j.s.ServletContextHandler@7595f57e{/nz_fyp/m,null,AVAILABLE}
   [junit4]   2> 1896866 INFO  (TEST-PeerSyncTest.test-seed#[499F6D60B73D919C]) [    ] o.e.j.s.AbstractConnector Started ServerConnector@356780d{HTTP/1.1,[http/1.1, h2c]}{127.0.0.1:34560}
   [junit4]   2> 1896866 INFO  (TEST-PeerSyncTest.test-seed#[499F6D60B73D919C]) [    ] o.e.j.s.Server Started @1897170ms
   [junit4]   2> 1896866 INFO  (TEST-PeerSyncTest.test-seed#[499F6D60B73D919C]) [    ] o.a.s.c.s.e.JettySolrRunner Jetty properties: {schema=schema.xml, solrconfig=solrconfig-tlog.xml, hostContext=/nz_fyp/m, hostPort=34560, coreRootDirectory=/home/jenkins/jenkins-slave/workspace/Lucene-Solr-BadApples-Tests-8.x/solr/build/solr-core/test/J1/temp/solr.update.PeerSyncTest_499F6D60B73D919C-001/tempDir-001/shard1/cores}
   [junit4]   2> 1896867 ERROR (TEST-PeerSyncTest.test-seed#[499F6D60B73D919C]) [    ] o.a.s.u.StartupLoggingUtils Missing Java Option solr.log.dir. Logging may be missing or incomplete.
   [junit4]   2> 1896867 INFO  (TEST-PeerSyncTest.test-seed#[499F6D60B73D919C]) [    ] o.a.s.s.SolrDispatchFilter Using logger factory org.apache.logging.slf4j.Log4jLoggerFactory
   [junit4]   2> 1896867 INFO  (TEST-PeerSyncTest.test-seed#[499F6D60B73D919C]) [    ] o.a.s.s.SolrDispatchFilter  ___      _       Welcome to Apache Solr™ version 8.2.0
   [junit4]   2> 1896867 INFO  (TEST-PeerSyncTest.test-seed#[499F6D60B73D919C]) [    ] o.a.s.s.SolrDispatchFilter / __| ___| |_ _   Starting in standalone mode on port null
   [junit4]   2> 1896867 INFO  (TEST-PeerSyncTest.test-seed#[499F6D60B73D919C]) [    ] o.a.s.s.SolrDispatchFilter \__ \/ _ \ | '_|  Install dir: null
   [junit4]   2> 1896867 INFO  (TEST-PeerSyncTest.test-seed#[499F6D60B73D919C]) [    ] o.a.s.s.SolrDispatchFilter |___/\___/_|_|    Start time: 2019-05-02T14:00:24.558Z
   [junit4]   2> 1896867 INFO  (TEST-PeerSyncTest.test-seed#[499F6D60B73D919C]) [    ] o.a.s.c.SolrXmlConfig Loading container configuration from /home/jenkins/jenkins-slave/workspace/Lucene-Solr-BadApples-Tests-8.x/solr/build/solr-core/test/J1/temp/solr.update.PeerSyncTest_499F6D60B73D919C-001/tempDir-001/shard1/solr.xml
   [junit4]   2> 1896870 INFO  (TEST-PeerSyncTest.test-seed#[499F6D60B73D919C]) [    ] o.a.s.c.SolrXmlConfig Configuration parameter autoReplicaFailoverWorkLoopDelay is ignored
   [junit4]   2> 1896870 INFO  (TEST-PeerSyncTest.test-seed#[499F6D60B73D919C]) [    ] o.a.s.c.SolrXmlConfig Configuration parameter autoReplicaFailoverBadNodeExpiration is ignored
   [junit4]   2> 1896872 INFO  (TEST-PeerSyncTest.test-seed#[499F6D60B73D919C]) [    ] o.a.s.c.SolrXmlConfig MBean server found: com.sun.jmx.mbeanserver.JmxMBeanServer@6b8bc5d9, but no JMX reporters were configured - adding default JMX reporter.
   [junit4]   2> 1896963 INFO  (TEST-PeerSyncTest.test-seed#[499F6D60B73D919C]) [    ] o.a.s.h.c.HttpShardHandlerFactory Host whitelist initialized: WhitelistHostChecker [whitelistHosts=null, whitelistHostCheckingEnabled=false]
   [junit4]   2> 1896965 WARN  (TEST-PeerSyncTest.test-seed#[499F6D60B73D919C]) [    ] o.e.j.u.s.S.config No Client EndPointIdentificationAlgorithm configured for SslContextFactory@6060e34d[provider=null,keyStore=null,trustStore=null]
   [junit4]   2> 1896968 WARN  (TEST-PeerSyncTest.test-seed#[499F6D60B73D919C]) [    ] o.e.j.u.s.S.config No Client EndPointIdentificationAlgorithm configured for SslContextFactory@3d523a6[provider=null,keyStore=null,trustStore=null]
   [junit4]   2> 1896984 INFO  (TEST-PeerSyncTest.test-seed#[499F6D60B73D919C]) [    ] o.a.s.c.TransientSolrCoreCacheDefault Allocating transient cache for 4 transient cores
   [junit4]   2> 1896984 INFO  (TEST-PeerSyncTest.test-seed#[499F6D60B73D919C]) [    ] o.a.s.h.a.MetricsHistoryHandler No .system collection, keeping metrics history in memory.
   [junit4]   2> 1897000 INFO  (TEST-PeerSyncTest.test-seed#[499F6D60B73D919C]) [    ] o.a.s.m.r.SolrJmxReporter JMX monitoring for 'solr.node' (registry 'solr.node') enabled at server: com.sun.jmx.mbeanserver.JmxMBeanServer@6b8bc5d9
   [junit4]   2> 1897009 INFO  (TEST-PeerSyncTest.test-seed#[499F6D60B73D919C]) [    ] o.a.s.m.r.SolrJmxReporter JMX monitoring for 'solr.jvm' (registry 'solr.jvm') enabled at server: com.sun.jmx.mbeanserver.JmxMBeanServer@6b8bc5d9
   [junit4]   2> 1897009 INFO  (TEST-PeerSyncTest.test-seed#[499F6D60B73D919C]) [    ] o.a.s.m.r.SolrJmxReporter JMX monitoring for 'solr.jetty' (registry 'solr.jetty') enabled at server: com.sun.jmx.mbeanserver.JmxMBeanServer@6b8bc5d9
   [junit4]   2> 1897011 INFO  (TEST-PeerSyncTest.test-seed#[499F6D60B73D919C]) [    ] o.a.s.c.CorePropertiesLocator Found 1 core definitions underneath /home/jenkins/jenkins-slave/workspace/Lucene-Solr-BadApples-Tests-8.x/solr/build/solr-core/test/J1/temp/solr.update.PeerSyncTest_499F6D60B73D919C-001/tempDir-001/shard1/cores
   [junit4]   2> 1897011 INFO  (TEST-PeerSyncTest.test-seed#[499F6D60B73D919C]) [    ] o.a.s.c.CorePropertiesLocator Cores are: [collection1]
   [junit4]   2> 1897011 INFO  (coreLoadExecutor-5201-thread-1) [    x:collection1] o.a.s.c.SolrResourceLoader [null] Added 2 libs to classloader, from paths: [/home/jenkins/jenkins-slave/workspace/Lucene-Solr-BadApples-Tests-8.x/solr/core/src/test-files/solr/collection1/lib, /home/jenkins/jenkins-slave/workspace/Lucene-Solr-BadApples-Tests-8.x/solr/core/src/test-files/solr/collection1/lib/classes]
   [junit4]   2> 1897035 INFO  (coreLoadExecutor-5201-thread-1) [    x:collection1] o.a.s.c.SolrConfig Using Lucene MatchVersion: 8.2.0
   [junit4]   2> 1897049 INFO  (coreLoadExecutor-5201-thread-1) [    x:collection1] o.a.s.s.IndexSchema [collection1] Schema name=test
   [junit4]   2> 1897133 INFO  (coreLoadExecutor-5201-thread-1) [    x:collection1] o.a.s.s.IndexSchema Loaded schema test/1.0 with uniqueid field id
   [junit4]   2> 1897140 INFO  (coreLoadExecutor-5201-thread-1) [    x:collection1] o.a.s.c.CoreContainer Creating SolrCore 'collection1' using configuration from configset /home/jenkins/jenkins-slave/workspace/Lucene-Solr-BadApples-Tests-8.x/solr/core/src/test-files/solr/collection1, trusted=true
   [junit4]   2> 1897140 INFO  (coreLoadExecutor-5201-thread-1) [    x:collection1] o.a.s.m.r.SolrJmxReporter JMX monitoring for 'solr.core.collection1' (registry 'solr.core.collection1') enabled at server: com.sun.jmx.mbeanserver.JmxMBeanServer@6b8bc5d9
   [junit4]   2> 1897140 INFO  (coreLoadExecutor-5201-thread-1) [    x:collection1] o.a.s.c.SolrCore [[collection1] ] Opening new SolrCore at [/home/jenkins/jenkins-slave/workspace/Lucene-Solr-BadApples-Tests-8.x/solr/core/src/test-files/solr/collection1], dataDir=[/home/jenkins/jenkins-slave/workspace/Lucene-Solr-BadApples-Tests-8.x/solr/build/solr-core/test/J1/temp/solr.update.PeerSyncTest_499F6D60B73D919C-001/tempDir-001/shard1/cores/collection1/data/]
   [junit4]   2> 1897142 INFO  (coreLoadExecutor-5201-thread-1) [    x:collection1] o.a.s.u.RandomMergePolicy RandomMergePolicy wrapping class org.apache.lucene.index.TieredMergePolicy: [TieredMergePolicy: maxMergeAtOnce=16, maxMergeAtOnceExplicit=44, maxMergedSegmentMB=65.0947265625, floorSegmentMB=0.2548828125, forceMergeDeletesPctAllowed=6.127278454790977, segmentsPerTier=18.0, maxCFSSegmentSizeMB=8.796093022207999E12, noCFSRatio=1.0, deletesPctAllowed=25.397724187858408
   [junit4]   2> 1897143 WARN  (coreLoadExecutor-5201-thread-1) [    x:collection1] o.a.s.c.RequestHandlers INVALID paramSet a in requestHandler {type = requestHandler,name = /dump,class = DumpRequestHandler,attributes = {initParams=a, name=/dump, class=DumpRequestHandler},args = {defaults={a=A,b=B}}}
   [junit4]   2> 1897176 INFO  (coreLoadExecutor-5201-thread-1) [    x:collection1] o.a.s.u.UpdateHandler Using UpdateLog implementation: org.apache.solr.update.UpdateLog
   [junit4]   2> 1897176 INFO  (coreLoadExecutor-5201-thread-1) [    x:collection1] o.a.s.u.UpdateLog Initializing UpdateLog: dataDir= defaultSyncLevel=FLUSH numRecordsToKeep=100 maxNumLogsToKeep=10 numVersionBuckets=65536
   [junit4]   2> 1897177 INFO  (coreLoadExecutor-5201-thread-1) [    x:collection1] o.a.s.u.CommitTracker Hard AutoCommit: disabled
   [junit4]   2> 1897177 INFO  (coreLoadExecutor-5201-thread-1) [    x:collection1] o.a.s.u.CommitTracker Soft AutoCommit: disabled
   [junit4]   2> 1897178 INFO  (coreLoadExecutor-5201-thread-1) [    x:collection1] o.a.s.u.RandomMergePolicy RandomMergePolicy wrapping class org.apache.lucene.index.LogDocMergePolicy: [LogDocMergePolicy: minMergeSize=1000, mergeFactor=50, maxMergeSize=9223372036854775807, maxMergeSizeForForcedMerge=9223372036854775807, calibrateSizeByDeletes=false, maxMergeDocs=2147483647, maxCFSSegmentSizeMB=8.796093022207999E12, noCFSRatio=0.4474935552174236]
   [junit4]   2> 1897178 INFO  (coreLoadExecutor-5201-thread-1) [    x:collection1] o.a.s.s.SolrIndexSearcher Opening [Searcher@2f9f4b27[collection1] main]
   [junit4]   2> 1897179 WARN  (coreLoadExecutor-5201-thread-1) [    x:collection1] o.a.s.r.ManagedResourceStorage Cannot write to config directory /home/jenkins/jenkins-slave/workspace/Lucene-Solr-BadApples-Tests-8.x/solr/core/src/test-files/solr/collection1/conf; switching to use InMemory storage instead.
   [junit4]   2> 1897179 INFO  (coreLoadExecutor-5201-thread-1) [    x:collection1] o.a.s.h.ReplicationHandler Commits will be reserved for 10000ms.
   [junit4]   2> 1897179 INFO  (coreLoadExecutor-5201-thread-1) [    x:collection1] o.a.s.u.UpdateLog Could not find max version in index or recent updates, using new clock 1632429014903685120
   [junit4]   2> 1897182 INFO  (searcherExecutor-5202-thread-1-processing-x:collection1) [    x:collection1] o.a.s.c.SolrCore [collection1] Registered new searcher Searcher@2f9f4b27[collection1] main{ExitableDirectoryReader(UninvertingDirectoryReader())}
   [junit4]   2> 1897288 INFO  (TEST-PeerSyncTest.test-seed#[499F6D60B73D919C]) [    ] o.a.s.SolrTestCaseJ4 Writing core.properties file to /home/jenkins/jenkins-slave/workspace/Lucene-Solr-BadApples-Tests-8.x/solr/build/solr-core/test/J1/temp/solr.update.PeerSyncTest_499F6D60B73D919C-001/tempDir-001/shard2/cores/collection1
   [junit4]   2> 1897292 WARN  (TEST-PeerSyncTest.test-seed#[499F6D60B73D919C]) [    ] o.e.j.s.AbstractConnector Ignoring deprecated socket close linger time
   [junit4]   2> 1897292 INFO  (TEST-PeerSyncTest.test-seed#[499F6D60B73D919C]) [    ] o.a.s.c.s.e.JettySolrRunner Start Jetty (original configured port=0)
   [junit4]   2> 1897292 INFO  (TEST-PeerSyncTest.test-seed#[499F6D60B73D919C]) [    ] o.a.s.c.s.e.JettySolrRunner Trying to start Jetty on port 0 try number 1 ...
   [junit4]   2> 1897292 INFO  (TEST-PeerSyncTest.test-seed#[499F6D60B73D919C]) [    ] o.e.j.s.Server jetty-9.4.14.v20181114; built: 2018-11-14T21:20:31.478Z; git: c4550056e785fb5665914545889f21dc136ad9e6; jvm 1.8.0_191-b12
   [junit4]   2> 1897293 INFO  (TEST-PeerSyncTest.test-seed#[499F6D60B73D919C]) [    ] o.e.j.s.session DefaultSessionIdManager workerName=node0
   [junit4]   2> 1897293 INFO  (TEST-PeerSyncTest.test-seed#[499F6D60B73D919C]) [    ] o.e.j.s.session No SessionScavenger set, using defaults
   [junit4]   2> 1897293 INFO  (TEST-PeerSyncTest.test-seed#[499F6D60B73D919C]) [    ] o.e.j.s.session node0 Scavenging every 660000ms
   [junit4]   2> 1897294 INFO  (TEST-PeerSyncTest.test-seed#[499F6D60B73D919C]) [    ] o.e.j.s.h.ContextHandler Started o.e.j.s.ServletContextHandler@14b3821b{/nz_fyp/m,null,AVAILABLE}
   [junit4]   2> 1897295 INFO  (TEST-PeerSyncTest.test-seed#[499F6D60B73D919C]) [    ] o.e.j.s.AbstractConnector Started ServerConnector@3b465097{HTTP/1.1,[http/1.1, h2c]}{127.0.0.1:41079}
   [junit4]   2> 1897295 INFO  (TEST-PeerSyncTest.test-seed#[499F6D60B73D919C]) [    ] o.e.j.s.Server Started @1897599ms
   [junit4]   2> 1897295 INFO  (TEST-PeerSyncTest.test-seed#[499F6D60B73D919C]) [    ] o.a.s.c.s.e.JettySolrRunner Jetty properties: {schema=schema.xml, solrconfig=solrconfig-tlog.xml, hostContext=/nz_fyp/m, hostPort=41079, coreRootDirectory=/home/jenkins/jenkins-slave/workspace/Lucene-Solr-BadApples-Tests-8.x/solr/build/solr-core/test/J1/temp/solr.update.PeerSyncTest_499F6D60B73D919C-001/tempDir-001/shard2/cores}
   [junit4]   2> 1897296 ERROR (TEST-PeerSyncTest.test-seed#[499F6D60B73D919C]) [    ] o.a.s.u.StartupLoggingUtils Missing Java Option solr.log.dir. Logging may be missing or incomplete.
   [junit4]   2> 1897296 INFO  (TEST-PeerSyncTest.test-seed#[499F6D60B73D919C]) [    ] o.a.s.s.SolrDispatchFilter Using logger factory org.apache.logging.slf4j.Log4jLoggerFactory
   [junit4]   2> 1897296 INFO  (TEST-PeerSyncTest.test-seed#[499F6D60B73D919C]) [    ] o.a.s.s.SolrDispatchFilter  ___      _       Welcome to Apache Solr™ version 8.2.0
   [junit4]   2> 1897296 INFO  (TEST-PeerSyncTest.test-seed#[499F6D60B73D919C]) [    ] o.a.s.s.SolrDispatchFilter / __| ___| |_ _   Starting in standalone mode on port null
   [junit4]   2> 1897296 INFO  (TEST-PeerSyncTest.test-seed#[499F6D60B73D919C]) [    ] o.a.s.s.SolrDispatchFilter \__ \/ _ \ | '_|  Install dir: null
   [junit4]   2> 1897296 INFO  (TEST-PeerSyncTest.test-seed#[499F6D60B73D919C]) [    ] o.a.s.s.SolrDispatchFilter |___/\___/_|_|    Start time: 2019-05-02T14:00:24.987Z
   [junit4]   2> 1897296 INFO  (TEST-PeerSyncTest.test-seed#[499F6D60B73D919C]) [    ] o.a.s.c.SolrXmlConfig Loading container configuration from /home/jenkins/jenkins-slave/workspace/Lucene-Solr-BadApples-Tests-8.x/solr/build/solr-core/test/J1/temp/solr.update.PeerSyncTest_499F6D60B73D919C-001/tempDir-001/shard2/solr.xml
   [junit4]   2> 1897299 INFO  (TEST-PeerSyncTest.test-seed#[499F6D60B73D919C]) [    ] o.a.s.c.SolrXmlConfig Configuration parameter autoReplicaFailoverWorkLoopDelay is ignored
   [junit4]   2> 1897299 INFO  (TEST-PeerSyncTest.test-seed#[499F6D60B73D919C]) [    ] o.a.s.c.SolrXmlConfig Configuration parameter autoReplicaFailoverBadNodeExpiration is ignored
   [junit4]   2> 1897327 INFO  (TEST-PeerSyncTest.test-seed#[499F6D60B73D919C]) [    ] o.a.s.c.SolrXmlConfig MBean server found: com.sun.jmx.mbeanserver.JmxMBeanServer@6b8bc5d9, but no JMX reporters were configured - adding default JMX reporter.
   [junit4]   2> 1897414 INFO  (TEST-PeerSyncTest.test-seed#[499F6D60B73D919C]) [    ] o.a.s.h.c.HttpShardHandlerFactory Host whitelist initialized: WhitelistHostChecker [whitelistHosts=null, whitelistHostCheckingEnabled=false]
   [junit4]   2> 1897416 WARN  (TEST-PeerSyncTest.test-seed#[499F6D60B73D919C]) [    ] o.e.j.u.s.S.config No Client EndPointIdentificationAlgorithm configured for SslContextFactory@18fbf35a[provider=null,keyStore=null,trustStore=null]
   [junit4]   2> 1897429 WARN  (TEST-PeerSyncTest.test-seed#[499F6D60B73D919C]) [    ] o.e.j.u.s.S.config No Client EndPointIdentificationAlgorithm configured for SslContextFactory@7311e12a[provider=null,keyStore=null,trustStore=null]
   [junit4]   2> 1897460 INFO  (TEST-PeerSyncTest.test-seed#[499F6D60B73D919C]) [    ] o.a.s.c.TransientSolrCoreCacheDefault Allocating transient cache for 4 transient cores
   [junit4]   2> 1897460 INFO  (TEST-PeerSyncTest.test-seed#[499F6D60B73D919C]) [    ] o.a.s.h.a.MetricsHistoryHandler No .system collection, keeping metrics history in memory.
   [junit4]   2> 1897477 INFO  (TEST-PeerSyncTest.test-seed#[499F6D60B73D919C]) [    ] o.a.s.m.r.SolrJmxReporter JMX monitoring for 'solr.node' (registry 'solr.node') enabled at server: com.sun.jmx.mbeanserver.JmxMBeanServer@6b8bc5d9
   [junit4]   2> 1897487 INFO  (TEST-PeerSyncTest.test-seed#[499F6D60B73D919C]) [    ] o.a.s.m.r.SolrJmxReporter JMX monitoring for 'solr.jvm' (registry 'solr.jvm') enabled at server: com.sun.jmx.mbeanserver.JmxMBeanServer@6b8bc5d9
   [junit4]   2> 1897487 INFO  (TEST-PeerSyncTest.test-seed#[499F6D60B73D919C]) [    ] o.a.s.m.r.SolrJmxReporter JMX monitoring for 'solr.jetty' (registry 'solr.jetty') enabled at server: com.sun.jmx.mbeanserver.JmxMBeanServer@6b8bc5d9
   [junit4]   2> 1897488 INFO  (TEST-PeerSyncTest.test-seed#[499F6D60B73D919C]) [    ] o.a.s.c.CorePropertiesLocator Found 1 core definitions underneath /home/jenkins/jenkins-slave/workspace/Lucene-Solr-BadApples-Tests-8.x/solr/build/solr-core/test/J1/temp/solr.update.PeerSyncTest_499F6D60B73D919C-001/tempDir-001/shard2/cores
   [junit4]   2> 1897488 INFO  (TEST-PeerSyncTest.test-seed#[499F6D60B73D919C]) [    ] o.a.s.c.CorePropertiesLocator Cores are: [collection1]
   [junit4]   2> 1897489 INFO  (coreLoadExecutor-5215-thread-1) [    x:collection1] o.a.s.c.SolrResourceLoader [null] Added 2 libs to classloader, from paths: [/home/jenkins/jenkins-slave/workspace/Lucene-Solr-BadApples-Tests-8.x/solr/core/src/test-files/solr/collection1/lib, /home/jenkins/jenkins-slave/workspace/Lucene-Solr-BadApples-Tests-8.x/solr/core/src/test-files/solr/collection1/lib/classes]
   [junit4]   2> 1897511 INFO  (coreLoadExecutor-5215-thread-1) [    x:collection1] o.a.s.c.SolrConfig Using Lucene MatchVersion: 8.2.0
   [junit4]   2> 1897527 INFO  (coreLoadExecutor-5215-thread-1) [    x:collection1] o.a.s.s.IndexSchema [collection1] Schema name=test
   [junit4]   2> 1897629 INFO  (coreLoadExecutor-5215-thread-1) [    x:collection1] o.a.s.s.IndexSchema Loaded schema test/1.0 with uniqueid field id
   [junit4]   2> 1897636 INFO  (coreLoadExecutor-5215-thread-1) [    x:collection1] o.a.s.c.CoreContainer Creating SolrCore 'collection1' using configuration from configset /home/jenkins/jenkins-slave/workspace/Lucene-Solr-BadApples-Tests-8.x/solr/core/src/test-files/solr/collection1, trusted=true
   [junit4]   2> 1897636 INFO  (coreLoadExecutor-5215-thread-1) [    x:collection1] o.a.s.m.r.SolrJmxReporter JMX monitoring for 'solr.core.collection1' (registry 'solr.core.collection1') enabled at server: com.sun.jmx.mbeanserver.JmxMBeanServer@6b8bc5d9
   [junit4]   2> 1897636 INFO  (coreLoadExecutor-5215-thread-1) [    x:collection1] o.a.s.c.SolrCore [[collection1] ] Opening new SolrCore at [/home/jenkins/jenkins-slave/workspace/Lucene-Solr-BadApples-Tests-8.x/solr/core/src/test-files/solr/collection1], dataDir=[/home/jenkins/jenkins-slave/workspace/Lucene-Solr-BadApples-Tests-8.x/solr/build/solr-core/test/J1/temp/solr.update.PeerSyncTest_499F6D60B73D919C-001/tempDir-001/shard2/cores/collection1/data/]
   [junit4]   2> 1897638 INFO  (coreLoadExecutor-5215-thread-1) [    x:collection1] o.a.s.u.RandomMergePolicy RandomMergePolicy wrapping class org.apache.lucene.index.TieredMergePolicy: [TieredMergePolicy: maxMergeAtOnce=16, maxMergeAtOnceExplicit=44, maxMergedSegmentMB=65.0947265625, floorSegmentMB=0.2548828125, forceMergeDeletesPctAllowed=6.127278454790977, segmentsPerTier=18.0, maxCFSSegmentSizeMB=8.796093022207999E12, noCFSRatio=1.0, deletesPctAllowed=25.397724187858408
   [junit4]   2> 1897639 WARN  (coreLoadExecutor-5215-thread-1) [    x:collection1] o.a.s.c.RequestHandlers INVALID paramSet a in requestHandler {type = requestHandler,name = /dump,class = DumpRequestHandler,attributes = {initParams=a, name=/dump, class=DumpRequestHandler},args = {defaults={a=A,b=B}}}
   [junit4]   2> 1897686 INFO  (coreLoadExecutor-5215-thread-1) [    x:collection1] o.a.s.u.UpdateHandler Using UpdateLog implementation: org.apache.solr.update.UpdateLog
   [junit4]   2> 1897686 INFO  (coreLoadExecutor-5215-thread-1) [    x:collection1] o.a.s.u.UpdateLog Initializing UpdateLog: dataDir= defaultSyncLevel=FLUSH numRecordsToKeep=100 maxNumLogsToKeep=10 numVersionBuckets=65536
   [junit4]   2> 1897693 INFO  (coreLoadExecutor-5215-thread-1) [    x:collection1] o.a.s.u.CommitTracker Hard AutoCommit: disabled
   [junit4]   2> 1897693 INFO  (coreLoadExecutor-5215-thread-1) [    x:collection1] o.a.s.u.CommitTracker Soft AutoCommit: disabled
   [junit4]   2> 1897707 INFO  (coreLoadExecutor-5215-thread-1) [    x:collection1] o.a.s.u.RandomMergePolicy RandomMergePolicy wrapping class org.apache.lucene.index.LogDocMergePolicy: [LogDocMergePolicy: minMergeSize=1000, mergeFactor=50, maxMergeSize=9223372036854775807, maxMergeSizeForForcedMerge=9223372036854775807, calibrateSizeByDeletes=false, maxMergeDocs=2147483647, maxCFSSegmentSizeMB=8.796093022207999E12, noCFSRatio=0.4474935552174236]
   [junit4]   2> 1897707 INFO  (coreLoadExecutor-5215-thread-1) [    x:collection1] o.a.s.s.SolrIndexSearcher Opening [Searcher@5c541e66[collection1] main]
   [junit4]   2> 1897707 WARN  (coreLoadExecutor-5215-thread-1) [    x:collection1] o.a.s.r.ManagedResourceStorage Cannot write to config directory /home/jenkins/jenkins-slave/workspace/Lucene-Solr-BadApples-Tests-8.x/solr/core/src/test-files/solr/collection1/conf; switching to use InMemory storage instead.
   [junit4]   2> 1897708 INFO  (coreLoadExecutor-5215-thread-1) [    x:collection1] o.a.s.h.ReplicationHandler Commits will be reserved for 10000ms.
   [junit4]   2> 1897708 INFO  (coreLoadExecutor-5215-thread-1) [    x:collection1] o.a.s.u.UpdateLog Could not find max version in index or recent updates, using new clock 1632429015458381824
   [junit4]   2> 1897710 INFO  (searcherExecutor-5216-thread-1-processing-x:collection1) [    x:collection1] o.a.s.c.SolrCore [collection1] Registered new searcher Searcher@5c541e66[collection1] main{ExitableDirectoryReader(UninvertingDirectoryReader())}
   [junit4]   2> 1898212 INFO  (TEST-PeerSyncTest.test-seed#[499F6D60B73D919C]) [    ] o.a.s.SolrTestCaseJ4 ###Starting test
   [junit4]   2> 1898225 INFO  (qtp1491728611-16176) [    x:collection1] o.a.s.u.p.LogUpdateProcessorFactory [collection1]  webapp=/nz_fyp/m path=/update params={update.distrib=FROMLEADER&wt=javabin&version=2}{add=[1 (1)]} 0 5
   [junit4]   2> 1898227 INFO  (qtp1819931047-16197) [    x:collection1] o.a.s.u.PeerSync PeerSync: core=collection1 url= START replicas=[http://127.0.0.1:37734/nz_fyp/m/collection1] nUpdates=100
   [junit4]   2> 1898230 INFO  (qtp1491728611-16178) [    x:collection1] o.a.s.s.SolrIndexSearcher Opening [Searcher@470d88fb[collection1] realtime]
   [junit4]   2> 1898231 INFO  (qtp1491728611-16178) [    x:collection1] o.a.s.u.IndexFingerprint IndexFingerprint millis:2.0 result:{maxVersionSpecified=9223372036854775807, maxVersionEncountered=1, maxInHash=1, versionsHash=-5451962507482445012, numVersions=1, numDocs=1, maxDoc=1}
   [junit4]   2> 1898231 INFO  (qtp1491728611-16178) [    x:collection1] o.a.s.c.S.Request [collection1]  webapp=/nz_fyp/m path=/get params={distrib=false&qt=/get&getFingerprint=9223372036854775807&wt=javabin&version=2} status=0 QTime=2
   [junit4]   2> 1898232 INFO  (qtp1819931047-16197) [    x:collection1] o.a.s.u.IndexFingerprint IndexFingerprint millis:0.0 result:{maxVersionSpecified=9223372036854775807, maxVersionEncountered=0, maxInHash=0, versionsHash=0, numVersions=0, numDocs=0, maxDoc=0}
   [junit4]   2> 1898232 INFO  (qtp1819931047-16197) [    x:collection1] o.a.s.u.PeerSync PeerSync: core=collection1 url= DONE.  We have no versions.  sync failed.
   [junit4]   2> 1898233 INFO  (qtp1491728611-16179) [    x:collection1] o.a.s.u.IndexFingerprint IndexFingerprint millis:0.0 result:{maxVersionSpecified=9223372036854775807, maxVersionEncountered=1, maxInHash=1, versionsHash=-5451962507482445012, numVersions=1, numDocs=1, maxDoc=1}
   [junit4]   2> 1898234 INFO  (qtp1491728611-16179) [    x:collection1] o.a.s.c.S.Request [collection1]  webapp=/nz_fyp/m path=/get params={distrib=false&qt=/get&fingerprint=true&getVersions=100&wt=javabin&version=2} status=0 QTime=1
   [junit4]   2> 1898234 INFO  (qtp1819931047-16197) [    x:collection1] o.a.s.c.S.Request [collection1]  webapp=/nz_fyp/m path=/get params={qt=/get&getVersions=100&sync=http://127.0.0.1:37734/nz_fyp/m/collection1&wt=javabin&version=2} status=0 QTime=7
   [junit4]   2> 1898235 INFO  (qtp1819931047-16198) [    x:collection1] o.a.s.u.p.LogUpdateProcessorFactory [collection1]  webapp=/nz_fyp/m path=/update params={update.distrib=FROMLEADER&wt=javabin&version=2}{add=[1 (1)]} 0 0
   [junit4]   2> 1898236 INFO  (qtp1819931047-16199) [    x:collection1] o.a.s.u.PeerSync PeerSync: core=collection1 url= START replicas=[http://127.0.0.1:37734/nz_fyp/m/collection1] nUpdates=100
   [junit4]   2> 1898237 INFO  (qtp1491728611-16175) [    x:collection1] o.a.s.u.IndexFingerprint IndexFingerprint millis:0.0 result:{maxVersionSpecified=9223372036854775807, maxVersionEncountered=1, maxInHash=1, versionsHash=-5451962507482445012, numVersions=1, numDocs=1, maxDoc=1}
   [junit4]   2> 1898237 INFO  (qtp1491728611-16175) [    x:collection1] o.a.s.c.S.Request [collection1]  webapp=/nz_fyp/m path=/get params={distrib=false&qt=/get&getFingerprint=9223372036854775807&wt=javabin&version=2} status=0 QTime=0
   [junit4]   2> 1898238 INFO  (qtp1819931047-16199) [    x:collection1] o.a.s.s.SolrIndexSearcher Opening [Searcher@34f6f31f[collection1] realtime]
   [junit4]   2> 1898239 INFO  (qtp1819931047-16199) [    x:collection1] o.a.s.u.IndexFingerprint IndexFingerprint millis:1.0 result:{maxVersionSpecified=9223372036854775807, maxVersionEncountered=1, maxInHash=1, versionsHash=-5451962507482445012, numVersions=1, numDocs=1, maxDoc=1}
   [junit4]   2> 1898239 INFO  (qtp1819931047-16199) [    x:collection1] o.a.s.u.PeerSync We are already in sync. No need to do a PeerSync 
   [junit4]   2> 1898239 INFO  (qtp1819931047-16199) [    x:collection1] o.a.s.c.S.Request [collection1]  webapp=/nz_fyp/m path=/get params={qt=/get&getVersions=100&sync=http://127.0.0.1:37734/nz_fyp/m/collection1&wt=javabin&version=2} status=0 QTime=2
   [junit4]   2> 1898239 INFO  (qtp1491728611-16176) [    x:collection1] o.a.s.u.DirectUpdateHandler2 start commit{_version_=1632429016015175680,optimize=false,openSearcher=true,waitSearcher=true,expungeDeletes=false,softCommit=false,prepareCommit=false}
   [junit4]   2> 1898239 INFO  (qtp1491728611-16176) [    x:collection1] o.a.s.u.SolrIndexWriter Calling setCommitData with IW:org.apache.solr.update.SolrIndexWriter@49cc245d commitCommandVersion:1632429016015175680
   [junit4]   2> 1898241 INFO  (qtp1491728611-16176) [    x:collection1] o.a.s.s.SolrIndexSearcher Opening [Searcher@ff6c27d[collection1] main]
   [junit4]   2> 1898241 INFO  (qtp1491728611-16176) [    x:collection1] o.a.s.u.DirectUpdateHandler2 end_commit_flush
   [junit4]   2> 1898242 INFO  (searcherExecutor-5188-thread-1-processing-x:collection1) [    x:collection1] o.a.s.c.SolrCore [collection1] Registered new searcher Searcher@ff6c27d[collection1] main{ExitableDirectoryReader(UninvertingDirectoryReader(Uninverting(_0(8.2.0):C1:[diagnostics={os=Linux, java.vendor=Oracle Corporation, java.version=1.8.0_191, java.vm.version=25.191-b12, lucene.version=8.2.0, os.arch=amd64, java.runtime.version=1.8.0_191-b12, source=flush, os.version=4.4.0-112-generic, timestamp=1556805625920}]:[attributes={Lucene50StoredFieldsFormat.mode=BEST_SPEED}])))}
   [junit4]   2> 1898243 INFO  (qtp1491728611-16176) [    x:collection1] o.a.s.u.p.LogUpdateProcessorFactory [collection1]  webapp=/nz_fyp/m path=/update params={waitSearcher=true&commit=true&softCommit=false&wt=javabin&version=2}{commit=} 0 3
   [junit4]   2> 1898243 INFO  (qtp1819931047-16200) [    x:collection1] o.a.s.u.DirectUpdateHandler2 start commit{_version_=1632429016019369984,optimize=false,openSearcher=true,waitSearcher=true,expungeDeletes=false,softCommit=false,prepareCommit=false}
   [junit4]   2> 1898243 INFO  (qtp1819931047-16200) [    x:collection1] o.a.s.u.SolrIndexWriter Calling setCommitData with IW:org.apache.solr.update.SolrIndexWriter@7ae84579 commitCommandVersion:1632429016019369984
   [junit4]   2> 1898244 INFO  (qtp1819931047-16200) [    x:collection1] o.a.s.s.SolrIndexSearcher Opening [Searcher@7cd77a7e[collection1] main]
   [junit4]   2> 1898246 INFO  (searcherExecutor-5202-thread-1-processing-x:collection1) [    x:collection1] o.a.s.c.SolrCore [collection1] Registered new searcher Searcher@7cd77a7e[collection1] main{ExitableDirectoryReader(UninvertingDirectoryReader(Uninverting(_0(8.2.0):C1:[diagnostics={os=Linux, java.vendor=Oracle Corporation, java.version=1.8.0_191, java.vm.version=25.191-b12, lucene.version=8.2.0, os.arch=amd64, java.runtime.version=1.8.0_191-b12, source=flush, os.version=4.4.0-112-generic, timestamp=1556805625929}]:[attributes={Lucene50StoredFieldsFormat.mode=BEST_SPEED}])))}
   [junit4]   2> 1898250 INFO  (qtp1819931047-16200) [    x:collection1] o.a.s.u.DirectUpdateHandler2 end_commit_flush
   [junit4]   2> 1898250 INFO  (qtp1819931047-16200) [    x:collection1] o.a.s.u.p.LogUpdateProcessorFactory [collection1]  webapp=/nz_fyp/m path=/update params={waitSearcher=true&commit=true&softCommit=false&wt=javabin&version=2}{commit=} 0 6
   [junit4]   2> 1898250 INFO  (qtp1491728611-16177) [    x:collection1] o.a.s.c.S.Request [collection1]  webapp=/nz_fyp/m path=/select params={q=*:*&wt=javabin&version=2} hits=1 status=0 QTime=0
   [junit4]   2> 1898251 INFO  (qtp1819931047-16196) [    x:collection1] o.a.s.c.S.Request [collection1]  webapp=/nz_fyp/m path=/select params={q=*:*&wt=javabin&version=2} hits=1 status=0 QTime=0
   [junit4]   2> 1898262 INFO  (qtp1491728611-16178) [    x:collection1] o.a.s.u.p.LogUpdateProcessorFactory [collection1]  webapp=/nz_fyp/m path=/update params={update.distrib=FROMLEADER&wt=javabin&version=2}{add=[2 (2)]} 0 2
   [junit4]   2> 1898263 INFO  (qtp1819931047-16197) [    x:collection1] o.a.s.u.PeerSync PeerSync: core=collection1 url= START replicas=[http://127.0.0.1:37734/nz_fyp/m/collection1] nUpdates=100
   [junit4]   2> 1898265 INFO  (qtp1491728611-16179) [    x:collection1] o.a.s.s.SolrIndexSearcher Opening [Searcher@3b7ad4f9[collection1] realtime]
   [junit4]   2> 1898265 INFO  (qtp1491728611-16179) [    x:collection1] o.a.s.u.IndexFingerprint IndexFingerprint millis:2.0 result:{maxVersionSpecified=9223372036854775807, maxVersionEncountered=2, maxInHash=2, versionsHash=-1218814014108643565, numVersions=2, numDocs=2, maxDo

[...truncated too long message...]

junit4]   1> 	at java.util.concurrent.ThreadPoolExecutor$Worker.run(ThreadPoolExecutor.java:624)
   [junit4]   1> 	at java.lang.Thread.run(Thread.java:748)
   [junit4]   1> Caused by: java.util.concurrent.TimeoutException: Could not connect to ZooKeeper 127.0.0.1:39083/solr within 9223372036854775807 ms
   [junit4]   1> 	at org.apache.solr.common.cloud.ConnectionManager.waitForConnected(ConnectionManager.java:250)
   [junit4]   1> 	at org.apache.solr.common.cloud.ConnectionManager$1.update(ConnectionManager.java:157)
   [junit4]   1> 	... 9 more
   [junit4]   1> 
   [junit4]   1> 15:17:16.857 [commitScheduler-59-thread-1] ERROR org.apache.solr.update.CommitTracker - auto commit error...:org.apache.solr.common.SolrException: Error opening new searcher
   [junit4]   1> 	at org.apache.solr.core.SolrCore.openNewSearcher(SolrCore.java:2152)
   [junit4]   1> 	at org.apache.solr.update.DirectUpdateHandler2.commit(DirectUpdateHandler2.java:711)
   [junit4]   1> 	at org.apache.solr.update.CommitTracker.run(CommitTracker.java:270)
   [junit4]   1> 	at java.util.concurrent.Executors$RunnableAdapter.call(Executors.java:511)
   [junit4]   1> 	at java.util.concurrent.FutureTask.run(FutureTask.java:266)
   [junit4]   1> 	at java.util.concurrent.ScheduledThreadPoolExecutor$ScheduledFutureTask.access$201(ScheduledThreadPoolExecutor.java:180)
   [junit4]   1> 	at java.util.concurrent.ScheduledThreadPoolExecutor$ScheduledFutureTask.run(ScheduledThreadPoolExecutor.java:293)
   [junit4]   1> 	at java.util.concurrent.ThreadPoolExecutor.runWorker(ThreadPoolExecutor.java:1149)
   [junit4]   1> 	at java.util.concurrent.ThreadPoolExecutor$Worker.run(ThreadPoolExecutor.java:624)
   [junit4]   1> 	at java.lang.Thread.run(Thread.java:748)
   [junit4]   1> Caused by: org.apache.solr.common.SolrException: openNewSearcher called on closed core
   [junit4]   1> 	at org.apache.solr.core.SolrCore.openNewSearcher(SolrCore.java:2139)
   [junit4]   1> 	... 9 more
   [junit4]   1> 
   [junit4]   1> 15:17:16.867 [commitScheduler-55-thread-1] ERROR org.apache.solr.update.CommitTracker - auto commit error...:org.apache.solr.common.SolrException: Error opening new searcher
   [junit4]   1> 	at org.apache.solr.core.SolrCore.openNewSearcher(SolrCore.java:2152)
   [junit4]   1> 	at org.apache.solr.update.DirectUpdateHandler2.commit(DirectUpdateHandler2.java:711)
   [junit4]   1> 	at org.apache.solr.update.CommitTracker.run(CommitTracker.java:270)
   [junit4]   1> 	at java.util.concurrent.Executors$RunnableAdapter.call(Executors.java:511)
   [junit4]   1> 	at java.util.concurrent.FutureTask.run(FutureTask.java:266)
   [junit4]   1> 	at java.util.concurrent.ScheduledThreadPoolExecutor$ScheduledFutureTask.access$201(ScheduledThreadPoolExecutor.java:180)
   [junit4]   1> 	at java.util.concurrent.ScheduledThreadPoolExecutor$ScheduledFutureTask.run(ScheduledThreadPoolExecutor.java:293)
   [junit4]   1> 	at java.util.concurrent.ThreadPoolExecutor.runWorker(ThreadPoolExecutor.java:1149)
   [junit4]   1> 	at java.util.concurrent.ThreadPoolExecutor$Worker.run(ThreadPoolExecutor.java:624)
   [junit4]   1> 	at java.lang.Thread.run(Thread.java:748)
   [junit4]   1> Caused by: org.apache.solr.common.SolrException: openNewSearcher called on closed core
   [junit4]   1> 	at org.apache.solr.core.SolrCore.openNewSearcher(SolrCore.java:2139)
   [junit4]   1> 	... 9 more
   [junit4]   1> 
   [junit4]   1> 15:17:16.910 [commitScheduler-53-thread-1] ERROR org.apache.solr.update.CommitTracker - auto commit error...:org.apache.solr.common.SolrException: Error opening new searcher
   [junit4]   1> 	at org.apache.solr.core.SolrCore.openNewSearcher(SolrCore.java:2152)
   [junit4]   1> 	at org.apache.solr.update.DirectUpdateHandler2.commit(DirectUpdateHandler2.java:711)
   [junit4]   1> 	at org.apache.solr.update.CommitTracker.run(CommitTracker.java:270)
   [junit4]   1> 	at java.util.concurrent.Executors$RunnableAdapter.call(Executors.java:511)
   [junit4]   1> 	at java.util.concurrent.FutureTask.run(FutureTask.java:266)
   [junit4]   1> 	at java.util.concurrent.ScheduledThreadPoolExecutor$ScheduledFutureTask.access$201(ScheduledThreadPoolExecutor.java:180)
   [junit4]   1> 	at java.util.concurrent.ScheduledThreadPoolExecutor$ScheduledFutureTask.run(ScheduledThreadPoolExecutor.java:293)
   [junit4]   1> 	at java.util.concurrent.ThreadPoolExecutor.runWorker(ThreadPoolExecutor.java:1149)
   [junit4]   1> 	at java.util.concurrent.ThreadPoolExecutor$Worker.run(ThreadPoolExecutor.java:624)
   [junit4]   1> 	at java.lang.Thread.run(Thread.java:748)
   [junit4]   1> Caused by: org.apache.solr.common.SolrException: openNewSearcher called on closed core
   [junit4]   1> 	at org.apache.solr.core.SolrCore.openNewSearcher(SolrCore.java:2139)
   [junit4]   1> 	... 9 more
   [junit4]   1> 
   [junit4]   1> 15:17:16.929 [commitScheduler-57-thread-1] ERROR org.apache.solr.update.CommitTracker - auto commit error...:org.apache.solr.common.SolrException: Error opening new searcher
   [junit4]   1> 	at org.apache.solr.core.SolrCore.openNewSearcher(SolrCore.java:2152)
   [junit4]   1> 	at org.apache.solr.update.DirectUpdateHandler2.commit(DirectUpdateHandler2.java:711)
   [junit4]   1> 	at org.apache.solr.update.CommitTracker.run(CommitTracker.java:270)
   [junit4]   1> 	at java.util.concurrent.Executors$RunnableAdapter.call(Executors.java:511)
   [junit4]   1> 	at java.util.concurrent.FutureTask.run(FutureTask.java:266)
   [junit4]   1> 	at java.util.concurrent.ScheduledThreadPoolExecutor$ScheduledFutureTask.access$201(ScheduledThreadPoolExecutor.java:180)
   [junit4]   1> 	at java.util.concurrent.ScheduledThreadPoolExecutor$ScheduledFutureTask.run(ScheduledThreadPoolExecutor.java:293)
   [junit4]   1> 	at java.util.concurrent.ThreadPoolExecutor.runWorker(ThreadPoolExecutor.java:1149)
   [junit4]   1> 	at java.util.concurrent.ThreadPoolExecutor$Worker.run(ThreadPoolExecutor.java:624)
   [junit4]   1> 	at java.lang.Thread.run(Thread.java:748)
   [junit4]   1> Caused by: org.apache.solr.common.SolrException: openNewSearcher called on closed core
   [junit4]   1> 	at org.apache.solr.core.SolrCore.openNewSearcher(SolrCore.java:2139)
   [junit4]   1> 	... 9 more
   [junit4]   1> 
   [junit4]   2> NOTE: test params are: codec=FastDecompressionCompressingStoredFields(storedFieldsFormat=CompressingStoredFieldsFormat(compressionMode=FAST_DECOMPRESSION, chunkSize=5, maxDocsPerChunk=7, blockSize=9), termVectorsFormat=CompressingTermVectorsFormat(compressionMode=FAST_DECOMPRESSION, chunkSize=5, blockSize=9)), sim=Asserting(org.apache.lucene.search.similarities.AssertingSimilarity@41f62906), locale=sl-SI, timezone=Asia/Almaty
   [junit4]   2> NOTE: Linux 4.4.0-112-generic amd64/Oracle Corporation 1.8.0_191 (64-bit)/cpus=4,threads=1,free=164065024,total=286785536
   [junit4]   2> NOTE: All tests run in this JVM: [SolrExporterIntegrationTest]
   [junit4]   2> NOTE: reproduce with: ant test  -Dtestcase=SolrExporterIntegrationTest -Dtests.seed=3D0E3AF6F1D6DEB9 -Dtests.multiplier=2 -Dtests.slow=true -Dtests.badapples=true -Dtests.locale=sl-SI -Dtests.timezone=Asia/Almaty -Dtests.asserts=true -Dtests.file.encoding=UTF-8
   [junit4] ERROR   0.00s J1 | SolrExporterIntegrationTest (suite) <<<
   [junit4]    > Throwable #1: org.apache.solr.common.SolrException: Could not load collection from ZK: collection1
   [junit4]    > 	at __randomizedtesting.SeedInfo.seed([3D0E3AF6F1D6DEB9]:0)
   [junit4]    > 	at org.apache.solr.common.cloud.ZkStateReader.getCollectionLive(ZkStateReader.java:1384)
   [junit4]    > 	at org.apache.solr.common.cloud.ZkStateReader$LazyCollectionRef.get(ZkStateReader.java:748)
   [junit4]    > 	at org.apache.solr.common.cloud.ClusterState$CollectionRef.get(ClusterState.java:386)
   [junit4]    > 	at org.apache.solr.client.solrj.impl.BaseCloudSolrClient.getDocCollection(BaseCloudSolrClient.java:1144)
   [junit4]    > 	at org.apache.solr.client.solrj.impl.BaseCloudSolrClient.requestWithRetryOnStaleState(BaseCloudSolrClient.java:802)
   [junit4]    > 	at org.apache.solr.client.solrj.impl.BaseCloudSolrClient.request(BaseCloudSolrClient.java:769)
   [junit4]    > 	at org.apache.solr.prometheus.utils.Helpers.indexAllDocs(Helpers.java:52)
   [junit4]    > 	at org.apache.solr.prometheus.PrometheusExporterTestBase.setupCluster(PrometheusExporterTestBase.java:75)
   [junit4]    > 	at java.lang.Thread.run(Thread.java:748)
   [junit4]    > Caused by: org.apache.zookeeper.KeeperException$SessionExpiredException: KeeperErrorCode = Session expired for /collections/collection1/state.json
   [junit4]    > 	at org.apache.zookeeper.KeeperException.create(KeeperException.java:130)
   [junit4]    > 	at org.apache.zookeeper.KeeperException.create(KeeperException.java:54)
   [junit4]    > 	at org.apache.zookeeper.ZooKeeper.getData(ZooKeeper.java:1221)
   [junit4]    > 	at org.apache.solr.common.cloud.SolrZkClient.lambda$getData$5(SolrZkClient.java:358)
   [junit4]    > 	at org.apache.solr.common.cloud.ZkCmdExecutor.retryOperation(ZkCmdExecutor.java:71)
   [junit4]    > 	at org.apache.solr.common.cloud.SolrZkClient.getData(SolrZkClient.java:358)
   [junit4]    > 	at org.apache.solr.common.cloud.ZkStateReader.fetchCollectionState(ZkStateReader.java:1396)
   [junit4]    > 	at org.apache.solr.common.cloud.ZkStateReader.getCollectionLive(ZkStateReader.java:1382)
   [junit4]    > 	... 31 more
   [junit4] Completed [4/5 (1!)] on J1 in 100.43s, 0 tests, 1 error <<< FAILURES!

[...truncated 608 lines...]
BUILD FAILED
/home/jenkins/jenkins-slave/workspace/Lucene-Solr-BadApples-Tests-8.x/build.xml:643: The following error occurred while executing this line:
/home/jenkins/jenkins-slave/workspace/Lucene-Solr-BadApples-Tests-8.x/build.xml:128: Found 1 violations in source files (File uses Mockito but has no assumeWorkingMockito() call).

Total time: 200 minutes 33 seconds
Build step 'Invoke Ant' marked build as failure
Archiving artifacts
Recording test results
Email was triggered for: Failure - Any
Sending email for trigger: Failure - Any

Mime
View raw message