lucene-dev mailing list archives

Site index · List index
Message view « Date » · « Thread »
Top « Date » · « Thread »
From Policeman Jenkins Server <jenk...@thetaphi.de>
Subject [JENKINS] Lucene-Solr-8.1-Linux (64bit/jdk1.8.0_201) - Build # 278 - Unstable!
Date Fri, 03 May 2019 23:35:42 GMT
Build: https://jenkins.thetaphi.de/job/Lucene-Solr-8.1-Linux/278/
Java: 64bit/jdk1.8.0_201 -XX:+UseCompressedOops -XX:+UseG1GC

4 tests failed.
FAILED:  org.apache.solr.cloud.OverseerRolesTest.testDesignatedOverseerRestarts

Error Message:
Timed out waiting for overseer state change. The current overseer is: 127.0.0.1:36309_solr

Stack Trace:
java.lang.AssertionError: Timed out waiting for overseer state change. The current overseer is: 127.0.0.1:36309_solr
	at __randomizedtesting.SeedInfo.seed([DA152185F662232C:D23436DAC83C3126]:0)
	at org.junit.Assert.fail(Assert.java:88)
	at org.apache.solr.cloud.OverseerRolesTest.waitForNewOverseer(OverseerRolesTest.java:70)
	at org.apache.solr.cloud.OverseerRolesTest.waitForNewOverseer(OverseerRolesTest.java:75)
	at org.apache.solr.cloud.OverseerRolesTest.testDesignatedOverseerRestarts(OverseerRolesTest.java:188)
	at sun.reflect.NativeMethodAccessorImpl.invoke0(Native Method)
	at sun.reflect.NativeMethodAccessorImpl.invoke(NativeMethodAccessorImpl.java:62)
	at sun.reflect.DelegatingMethodAccessorImpl.invoke(DelegatingMethodAccessorImpl.java:43)
	at java.lang.reflect.Method.invoke(Method.java:498)
	at com.carrotsearch.randomizedtesting.RandomizedRunner.invoke(RandomizedRunner.java:1750)
	at com.carrotsearch.randomizedtesting.RandomizedRunner$8.evaluate(RandomizedRunner.java:938)
	at com.carrotsearch.randomizedtesting.RandomizedRunner$9.evaluate(RandomizedRunner.java:974)
	at com.carrotsearch.randomizedtesting.RandomizedRunner$10.evaluate(RandomizedRunner.java:988)
	at com.carrotsearch.randomizedtesting.rules.SystemPropertiesRestoreRule$1.evaluate(SystemPropertiesRestoreRule.java:57)
	at org.apache.lucene.util.TestRuleSetupTeardownChained$1.evaluate(TestRuleSetupTeardownChained.java:49)
	at org.apache.lucene.util.AbstractBeforeAfterRule$1.evaluate(AbstractBeforeAfterRule.java:45)
	at org.apache.lucene.util.TestRuleThreadAndTestName$1.evaluate(TestRuleThreadAndTestName.java:48)
	at org.apache.lucene.util.TestRuleIgnoreAfterMaxFailures$1.evaluate(TestRuleIgnoreAfterMaxFailures.java:64)
	at org.apache.lucene.util.TestRuleMarkFailure$1.evaluate(TestRuleMarkFailure.java:47)
	at com.carrotsearch.randomizedtesting.rules.StatementAdapter.evaluate(StatementAdapter.java:36)
	at com.carrotsearch.randomizedtesting.ThreadLeakControl$StatementRunner.run(ThreadLeakControl.java:368)
	at com.carrotsearch.randomizedtesting.ThreadLeakControl.forkTimeoutingTask(ThreadLeakControl.java:817)
	at com.carrotsearch.randomizedtesting.ThreadLeakControl$3.evaluate(ThreadLeakControl.java:468)
	at com.carrotsearch.randomizedtesting.RandomizedRunner.runSingleTest(RandomizedRunner.java:947)
	at com.carrotsearch.randomizedtesting.RandomizedRunner$5.evaluate(RandomizedRunner.java:832)
	at com.carrotsearch.randomizedtesting.RandomizedRunner$6.evaluate(RandomizedRunner.java:883)
	at com.carrotsearch.randomizedtesting.RandomizedRunner$7.evaluate(RandomizedRunner.java:894)
	at com.carrotsearch.randomizedtesting.rules.StatementAdapter.evaluate(StatementAdapter.java:36)
	at com.carrotsearch.randomizedtesting.rules.SystemPropertiesRestoreRule$1.evaluate(SystemPropertiesRestoreRule.java:57)
	at org.apache.lucene.util.AbstractBeforeAfterRule$1.evaluate(AbstractBeforeAfterRule.java:45)
	at com.carrotsearch.randomizedtesting.rules.StatementAdapter.evaluate(StatementAdapter.java:36)
	at org.apache.lucene.util.TestRuleStoreClassName$1.evaluate(TestRuleStoreClassName.java:41)
	at com.carrotsearch.randomizedtesting.rules.NoShadowingOrOverridesOnMethodsRule$1.evaluate(NoShadowingOrOverridesOnMethodsRule.java:40)
	at com.carrotsearch.randomizedtesting.rules.NoShadowingOrOverridesOnMethodsRule$1.evaluate(NoShadowingOrOverridesOnMethodsRule.java:40)
	at com.carrotsearch.randomizedtesting.rules.StatementAdapter.evaluate(StatementAdapter.java:36)
	at com.carrotsearch.randomizedtesting.rules.StatementAdapter.evaluate(StatementAdapter.java:36)
	at com.carrotsearch.randomizedtesting.rules.StatementAdapter.evaluate(StatementAdapter.java:36)
	at org.apache.lucene.util.TestRuleAssertionsRequired$1.evaluate(TestRuleAssertionsRequired.java:53)
	at org.apache.lucene.util.TestRuleMarkFailure$1.evaluate(TestRuleMarkFailure.java:47)
	at org.apache.lucene.util.TestRuleIgnoreAfterMaxFailures$1.evaluate(TestRuleIgnoreAfterMaxFailures.java:64)
	at org.apache.lucene.util.TestRuleIgnoreTestSuites$1.evaluate(TestRuleIgnoreTestSuites.java:54)
	at com.carrotsearch.randomizedtesting.rules.StatementAdapter.evaluate(StatementAdapter.java:36)
	at com.carrotsearch.randomizedtesting.ThreadLeakControl$StatementRunner.run(ThreadLeakControl.java:368)
	at java.lang.Thread.run(Thread.java:748)


FAILED:  org.apache.solr.cloud.OverseerRolesTest.testDesignatedOverseerRestarts

Error Message:
Timed out waiting for overseer state change. The current overseer is: 127.0.0.1:40453_solr

Stack Trace:
java.lang.AssertionError: Timed out waiting for overseer state change. The current overseer is: 127.0.0.1:40453_solr
	at __randomizedtesting.SeedInfo.seed([DA152185F662232C:D23436DAC83C3126]:0)
	at org.junit.Assert.fail(Assert.java:88)
	at org.apache.solr.cloud.OverseerRolesTest.waitForNewOverseer(OverseerRolesTest.java:70)
	at org.apache.solr.cloud.OverseerRolesTest.waitForNewOverseer(OverseerRolesTest.java:75)
	at org.apache.solr.cloud.OverseerRolesTest.testDesignatedOverseerRestarts(OverseerRolesTest.java:188)
	at sun.reflect.NativeMethodAccessorImpl.invoke0(Native Method)
	at sun.reflect.NativeMethodAccessorImpl.invoke(NativeMethodAccessorImpl.java:62)
	at sun.reflect.DelegatingMethodAccessorImpl.invoke(DelegatingMethodAccessorImpl.java:43)
	at java.lang.reflect.Method.invoke(Method.java:498)
	at com.carrotsearch.randomizedtesting.RandomizedRunner.invoke(RandomizedRunner.java:1750)
	at com.carrotsearch.randomizedtesting.RandomizedRunner$8.evaluate(RandomizedRunner.java:938)
	at com.carrotsearch.randomizedtesting.RandomizedRunner$9.evaluate(RandomizedRunner.java:974)
	at com.carrotsearch.randomizedtesting.RandomizedRunner$10.evaluate(RandomizedRunner.java:988)
	at com.carrotsearch.randomizedtesting.rules.SystemPropertiesRestoreRule$1.evaluate(SystemPropertiesRestoreRule.java:57)
	at org.apache.lucene.util.TestRuleSetupTeardownChained$1.evaluate(TestRuleSetupTeardownChained.java:49)
	at org.apache.lucene.util.AbstractBeforeAfterRule$1.evaluate(AbstractBeforeAfterRule.java:45)
	at org.apache.lucene.util.TestRuleThreadAndTestName$1.evaluate(TestRuleThreadAndTestName.java:48)
	at org.apache.lucene.util.TestRuleIgnoreAfterMaxFailures$1.evaluate(TestRuleIgnoreAfterMaxFailures.java:64)
	at org.apache.lucene.util.TestRuleMarkFailure$1.evaluate(TestRuleMarkFailure.java:47)
	at com.carrotsearch.randomizedtesting.rules.StatementAdapter.evaluate(StatementAdapter.java:36)
	at com.carrotsearch.randomizedtesting.ThreadLeakControl$StatementRunner.run(ThreadLeakControl.java:368)
	at com.carrotsearch.randomizedtesting.ThreadLeakControl.forkTimeoutingTask(ThreadLeakControl.java:817)
	at com.carrotsearch.randomizedtesting.ThreadLeakControl$3.evaluate(ThreadLeakControl.java:468)
	at com.carrotsearch.randomizedtesting.RandomizedRunner.runSingleTest(RandomizedRunner.java:947)
	at com.carrotsearch.randomizedtesting.RandomizedRunner$5.evaluate(RandomizedRunner.java:832)
	at com.carrotsearch.randomizedtesting.RandomizedRunner$6.evaluate(RandomizedRunner.java:883)
	at com.carrotsearch.randomizedtesting.RandomizedRunner$7.evaluate(RandomizedRunner.java:894)
	at com.carrotsearch.randomizedtesting.rules.StatementAdapter.evaluate(StatementAdapter.java:36)
	at com.carrotsearch.randomizedtesting.rules.SystemPropertiesRestoreRule$1.evaluate(SystemPropertiesRestoreRule.java:57)
	at org.apache.lucene.util.AbstractBeforeAfterRule$1.evaluate(AbstractBeforeAfterRule.java:45)
	at com.carrotsearch.randomizedtesting.rules.StatementAdapter.evaluate(StatementAdapter.java:36)
	at org.apache.lucene.util.TestRuleStoreClassName$1.evaluate(TestRuleStoreClassName.java:41)
	at com.carrotsearch.randomizedtesting.rules.NoShadowingOrOverridesOnMethodsRule$1.evaluate(NoShadowingOrOverridesOnMethodsRule.java:40)
	at com.carrotsearch.randomizedtesting.rules.NoShadowingOrOverridesOnMethodsRule$1.evaluate(NoShadowingOrOverridesOnMethodsRule.java:40)
	at com.carrotsearch.randomizedtesting.rules.StatementAdapter.evaluate(StatementAdapter.java:36)
	at com.carrotsearch.randomizedtesting.rules.StatementAdapter.evaluate(StatementAdapter.java:36)
	at com.carrotsearch.randomizedtesting.rules.StatementAdapter.evaluate(StatementAdapter.java:36)
	at org.apache.lucene.util.TestRuleAssertionsRequired$1.evaluate(TestRuleAssertionsRequired.java:53)
	at org.apache.lucene.util.TestRuleMarkFailure$1.evaluate(TestRuleMarkFailure.java:47)
	at org.apache.lucene.util.TestRuleIgnoreAfterMaxFailures$1.evaluate(TestRuleIgnoreAfterMaxFailures.java:64)
	at org.apache.lucene.util.TestRuleIgnoreTestSuites$1.evaluate(TestRuleIgnoreTestSuites.java:54)
	at com.carrotsearch.randomizedtesting.rules.StatementAdapter.evaluate(StatementAdapter.java:36)
	at com.carrotsearch.randomizedtesting.ThreadLeakControl$StatementRunner.run(ThreadLeakControl.java:368)
	at java.lang.Thread.run(Thread.java:748)


FAILED:  org.apache.solr.cloud.OverseerRolesTest.testDesignatedOverseerRestarts

Error Message:
Timed out waiting for overseer state change. The current overseer is: 127.0.0.1:37963_solr

Stack Trace:
java.lang.AssertionError: Timed out waiting for overseer state change. The current overseer is: 127.0.0.1:37963_solr
	at __randomizedtesting.SeedInfo.seed([DA152185F662232C:D23436DAC83C3126]:0)
	at org.junit.Assert.fail(Assert.java:88)
	at org.apache.solr.cloud.OverseerRolesTest.waitForNewOverseer(OverseerRolesTest.java:70)
	at org.apache.solr.cloud.OverseerRolesTest.waitForNewOverseer(OverseerRolesTest.java:75)
	at org.apache.solr.cloud.OverseerRolesTest.testDesignatedOverseerRestarts(OverseerRolesTest.java:188)
	at sun.reflect.NativeMethodAccessorImpl.invoke0(Native Method)
	at sun.reflect.NativeMethodAccessorImpl.invoke(NativeMethodAccessorImpl.java:62)
	at sun.reflect.DelegatingMethodAccessorImpl.invoke(DelegatingMethodAccessorImpl.java:43)
	at java.lang.reflect.Method.invoke(Method.java:498)
	at com.carrotsearch.randomizedtesting.RandomizedRunner.invoke(RandomizedRunner.java:1750)
	at com.carrotsearch.randomizedtesting.RandomizedRunner$8.evaluate(RandomizedRunner.java:938)
	at com.carrotsearch.randomizedtesting.RandomizedRunner$9.evaluate(RandomizedRunner.java:974)
	at com.carrotsearch.randomizedtesting.RandomizedRunner$10.evaluate(RandomizedRunner.java:988)
	at com.carrotsearch.randomizedtesting.rules.SystemPropertiesRestoreRule$1.evaluate(SystemPropertiesRestoreRule.java:57)
	at org.apache.lucene.util.TestRuleSetupTeardownChained$1.evaluate(TestRuleSetupTeardownChained.java:49)
	at org.apache.lucene.util.AbstractBeforeAfterRule$1.evaluate(AbstractBeforeAfterRule.java:45)
	at org.apache.lucene.util.TestRuleThreadAndTestName$1.evaluate(TestRuleThreadAndTestName.java:48)
	at org.apache.lucene.util.TestRuleIgnoreAfterMaxFailures$1.evaluate(TestRuleIgnoreAfterMaxFailures.java:64)
	at org.apache.lucene.util.TestRuleMarkFailure$1.evaluate(TestRuleMarkFailure.java:47)
	at com.carrotsearch.randomizedtesting.rules.StatementAdapter.evaluate(StatementAdapter.java:36)
	at com.carrotsearch.randomizedtesting.ThreadLeakControl$StatementRunner.run(ThreadLeakControl.java:368)
	at com.carrotsearch.randomizedtesting.ThreadLeakControl.forkTimeoutingTask(ThreadLeakControl.java:817)
	at com.carrotsearch.randomizedtesting.ThreadLeakControl$3.evaluate(ThreadLeakControl.java:468)
	at com.carrotsearch.randomizedtesting.RandomizedRunner.runSingleTest(RandomizedRunner.java:947)
	at com.carrotsearch.randomizedtesting.RandomizedRunner$5.evaluate(RandomizedRunner.java:832)
	at com.carrotsearch.randomizedtesting.RandomizedRunner$6.evaluate(RandomizedRunner.java:883)
	at com.carrotsearch.randomizedtesting.RandomizedRunner$7.evaluate(RandomizedRunner.java:894)
	at com.carrotsearch.randomizedtesting.rules.StatementAdapter.evaluate(StatementAdapter.java:36)
	at com.carrotsearch.randomizedtesting.rules.SystemPropertiesRestoreRule$1.evaluate(SystemPropertiesRestoreRule.java:57)
	at org.apache.lucene.util.AbstractBeforeAfterRule$1.evaluate(AbstractBeforeAfterRule.java:45)
	at com.carrotsearch.randomizedtesting.rules.StatementAdapter.evaluate(StatementAdapter.java:36)
	at org.apache.lucene.util.TestRuleStoreClassName$1.evaluate(TestRuleStoreClassName.java:41)
	at com.carrotsearch.randomizedtesting.rules.NoShadowingOrOverridesOnMethodsRule$1.evaluate(NoShadowingOrOverridesOnMethodsRule.java:40)
	at com.carrotsearch.randomizedtesting.rules.NoShadowingOrOverridesOnMethodsRule$1.evaluate(NoShadowingOrOverridesOnMethodsRule.java:40)
	at com.carrotsearch.randomizedtesting.rules.StatementAdapter.evaluate(StatementAdapter.java:36)
	at com.carrotsearch.randomizedtesting.rules.StatementAdapter.evaluate(StatementAdapter.java:36)
	at com.carrotsearch.randomizedtesting.rules.StatementAdapter.evaluate(StatementAdapter.java:36)
	at org.apache.lucene.util.TestRuleAssertionsRequired$1.evaluate(TestRuleAssertionsRequired.java:53)
	at org.apache.lucene.util.TestRuleMarkFailure$1.evaluate(TestRuleMarkFailure.java:47)
	at org.apache.lucene.util.TestRuleIgnoreAfterMaxFailures$1.evaluate(TestRuleIgnoreAfterMaxFailures.java:64)
	at org.apache.lucene.util.TestRuleIgnoreTestSuites$1.evaluate(TestRuleIgnoreTestSuites.java:54)
	at com.carrotsearch.randomizedtesting.rules.StatementAdapter.evaluate(StatementAdapter.java:36)
	at com.carrotsearch.randomizedtesting.ThreadLeakControl$StatementRunner.run(ThreadLeakControl.java:368)
	at java.lang.Thread.run(Thread.java:748)


FAILED:  org.apache.solr.cloud.OverseerRolesTest.testDesignatedOverseerRestarts

Error Message:
Timed out waiting for overseer state change. The current overseer is: 127.0.0.1:33821_solr

Stack Trace:
java.lang.AssertionError: Timed out waiting for overseer state change. The current overseer is: 127.0.0.1:33821_solr
	at __randomizedtesting.SeedInfo.seed([DA152185F662232C:D23436DAC83C3126]:0)
	at org.junit.Assert.fail(Assert.java:88)
	at org.apache.solr.cloud.OverseerRolesTest.waitForNewOverseer(OverseerRolesTest.java:70)
	at org.apache.solr.cloud.OverseerRolesTest.waitForNewOverseer(OverseerRolesTest.java:75)
	at org.apache.solr.cloud.OverseerRolesTest.testDesignatedOverseerRestarts(OverseerRolesTest.java:188)
	at sun.reflect.NativeMethodAccessorImpl.invoke0(Native Method)
	at sun.reflect.NativeMethodAccessorImpl.invoke(NativeMethodAccessorImpl.java:62)
	at sun.reflect.DelegatingMethodAccessorImpl.invoke(DelegatingMethodAccessorImpl.java:43)
	at java.lang.reflect.Method.invoke(Method.java:498)
	at com.carrotsearch.randomizedtesting.RandomizedRunner.invoke(RandomizedRunner.java:1750)
	at com.carrotsearch.randomizedtesting.RandomizedRunner$8.evaluate(RandomizedRunner.java:938)
	at com.carrotsearch.randomizedtesting.RandomizedRunner$9.evaluate(RandomizedRunner.java:974)
	at com.carrotsearch.randomizedtesting.RandomizedRunner$10.evaluate(RandomizedRunner.java:988)
	at com.carrotsearch.randomizedtesting.rules.SystemPropertiesRestoreRule$1.evaluate(SystemPropertiesRestoreRule.java:57)
	at org.apache.lucene.util.TestRuleSetupTeardownChained$1.evaluate(TestRuleSetupTeardownChained.java:49)
	at org.apache.lucene.util.AbstractBeforeAfterRule$1.evaluate(AbstractBeforeAfterRule.java:45)
	at org.apache.lucene.util.TestRuleThreadAndTestName$1.evaluate(TestRuleThreadAndTestName.java:48)
	at org.apache.lucene.util.TestRuleIgnoreAfterMaxFailures$1.evaluate(TestRuleIgnoreAfterMaxFailures.java:64)
	at org.apache.lucene.util.TestRuleMarkFailure$1.evaluate(TestRuleMarkFailure.java:47)
	at com.carrotsearch.randomizedtesting.rules.StatementAdapter.evaluate(StatementAdapter.java:36)
	at com.carrotsearch.randomizedtesting.ThreadLeakControl$StatementRunner.run(ThreadLeakControl.java:368)
	at com.carrotsearch.randomizedtesting.ThreadLeakControl.forkTimeoutingTask(ThreadLeakControl.java:817)
	at com.carrotsearch.randomizedtesting.ThreadLeakControl$3.evaluate(ThreadLeakControl.java:468)
	at com.carrotsearch.randomizedtesting.RandomizedRunner.runSingleTest(RandomizedRunner.java:947)
	at com.carrotsearch.randomizedtesting.RandomizedRunner$5.evaluate(RandomizedRunner.java:832)
	at com.carrotsearch.randomizedtesting.RandomizedRunner$6.evaluate(RandomizedRunner.java:883)
	at com.carrotsearch.randomizedtesting.RandomizedRunner$7.evaluate(RandomizedRunner.java:894)
	at com.carrotsearch.randomizedtesting.rules.StatementAdapter.evaluate(StatementAdapter.java:36)
	at com.carrotsearch.randomizedtesting.rules.SystemPropertiesRestoreRule$1.evaluate(SystemPropertiesRestoreRule.java:57)
	at org.apache.lucene.util.AbstractBeforeAfterRule$1.evaluate(AbstractBeforeAfterRule.java:45)
	at com.carrotsearch.randomizedtesting.rules.StatementAdapter.evaluate(StatementAdapter.java:36)
	at org.apache.lucene.util.TestRuleStoreClassName$1.evaluate(TestRuleStoreClassName.java:41)
	at com.carrotsearch.randomizedtesting.rules.NoShadowingOrOverridesOnMethodsRule$1.evaluate(NoShadowingOrOverridesOnMethodsRule.java:40)
	at com.carrotsearch.randomizedtesting.rules.NoShadowingOrOverridesOnMethodsRule$1.evaluate(NoShadowingOrOverridesOnMethodsRule.java:40)
	at com.carrotsearch.randomizedtesting.rules.StatementAdapter.evaluate(StatementAdapter.java:36)
	at com.carrotsearch.randomizedtesting.rules.StatementAdapter.evaluate(StatementAdapter.java:36)
	at com.carrotsearch.randomizedtesting.rules.StatementAdapter.evaluate(StatementAdapter.java:36)
	at org.apache.lucene.util.TestRuleAssertionsRequired$1.evaluate(TestRuleAssertionsRequired.java:53)
	at org.apache.lucene.util.TestRuleMarkFailure$1.evaluate(TestRuleMarkFailure.java:47)
	at org.apache.lucene.util.TestRuleIgnoreAfterMaxFailures$1.evaluate(TestRuleIgnoreAfterMaxFailures.java:64)
	at org.apache.lucene.util.TestRuleIgnoreTestSuites$1.evaluate(TestRuleIgnoreTestSuites.java:54)
	at com.carrotsearch.randomizedtesting.rules.StatementAdapter.evaluate(StatementAdapter.java:36)
	at com.carrotsearch.randomizedtesting.ThreadLeakControl$StatementRunner.run(ThreadLeakControl.java:368)
	at java.lang.Thread.run(Thread.java:748)




Build Log:
[...truncated 13947 lines...]
   [junit4] Suite: org.apache.solr.cloud.OverseerRolesTest
   [junit4]   2> 659126 INFO  (SUITE-OverseerRolesTest-seed#[DA152185F662232C]-worker) [    ] o.a.s.SolrTestCaseJ4 SecureRandom sanity checks: test.solr.allowed.securerandom=null & java.security.egd=file:/dev/./urandom
   [junit4]   2> Creating dataDir: /home/jenkins/workspace/Lucene-Solr-8.1-Linux/solr/build/solr-core/test/J2/temp/solr.cloud.OverseerRolesTest_DA152185F662232C-001/init-core-data-001
   [junit4]   2> 659126 WARN  (SUITE-OverseerRolesTest-seed#[DA152185F662232C]-worker) [    ] o.a.s.SolrTestCaseJ4 startTrackingSearchers: numOpens=1 numCloses=1
   [junit4]   2> 659126 INFO  (SUITE-OverseerRolesTest-seed#[DA152185F662232C]-worker) [    ] o.a.s.SolrTestCaseJ4 Using PointFields (NUMERIC_POINTS_SYSPROP=true) w/NUMERIC_DOCVALUES_SYSPROP=true
   [junit4]   2> 659127 INFO  (SUITE-OverseerRolesTest-seed#[DA152185F662232C]-worker) [    ] o.a.s.SolrTestCaseJ4 Randomized ssl (true) and clientAuth (false) via: @org.apache.solr.util.RandomizeSSL(reason=, value=NaN, ssl=NaN, clientAuth=NaN)
   [junit4]   2> 659128 INFO  (SUITE-OverseerRolesTest-seed#[DA152185F662232C]-worker) [    ] o.a.s.c.MiniSolrCloudCluster Starting cluster of 6 servers in /home/jenkins/workspace/Lucene-Solr-8.1-Linux/solr/build/solr-core/test/J2/temp/solr.cloud.OverseerRolesTest_DA152185F662232C-001/tempDir-001
   [junit4]   2> 659128 INFO  (SUITE-OverseerRolesTest-seed#[DA152185F662232C]-worker) [    ] o.a.s.c.ZkTestServer STARTING ZK TEST SERVER
   [junit4]   2> 659128 INFO  (ZkTestServer Run Thread) [    ] o.a.s.c.ZkTestServer client port:0.0.0.0/0.0.0.0:0
   [junit4]   2> 659128 INFO  (ZkTestServer Run Thread) [    ] o.a.s.c.ZkTestServer Starting server
   [junit4]   2> 659228 INFO  (SUITE-OverseerRolesTest-seed#[DA152185F662232C]-worker) [    ] o.a.s.c.ZkTestServer start zk server on port:42919
   [junit4]   2> 659228 INFO  (SUITE-OverseerRolesTest-seed#[DA152185F662232C]-worker) [    ] o.a.s.c.ZkTestServer parse host and port list: 127.0.0.1:42919
   [junit4]   2> 659228 INFO  (SUITE-OverseerRolesTest-seed#[DA152185F662232C]-worker) [    ] o.a.s.c.ZkTestServer connecting to 127.0.0.1 42919
   [junit4]   2> 659231 INFO  (zkConnectionManagerCallback-6645-thread-1) [    ] o.a.s.c.c.ConnectionManager zkClient has connected
   [junit4]   2> 659233 INFO  (zkConnectionManagerCallback-6647-thread-1) [    ] o.a.s.c.c.ConnectionManager zkClient has connected
   [junit4]   2> 659234 INFO  (zkConnectionManagerCallback-6649-thread-1) [    ] o.a.s.c.c.ConnectionManager zkClient has connected
   [junit4]   2> 659237 WARN  (jetty-launcher-6650-thread-3) [    ] o.e.j.s.AbstractConnector Ignoring deprecated socket close linger time
   [junit4]   2> 659237 WARN  (jetty-launcher-6650-thread-1) [    ] o.e.j.s.AbstractConnector Ignoring deprecated socket close linger time
   [junit4]   2> 659237 WARN  (jetty-launcher-6650-thread-2) [    ] o.e.j.s.AbstractConnector Ignoring deprecated socket close linger time
   [junit4]   2> 659237 WARN  (jetty-launcher-6650-thread-4) [    ] o.e.j.s.AbstractConnector Ignoring deprecated socket close linger time
   [junit4]   2> 659237 INFO  (jetty-launcher-6650-thread-1) [    ] o.a.s.c.s.e.JettySolrRunner Start Jetty (original configured port=0)
   [junit4]   2> 659237 INFO  (jetty-launcher-6650-thread-2) [    ] o.a.s.c.s.e.JettySolrRunner Start Jetty (original configured port=0)
   [junit4]   2> 659237 INFO  (jetty-launcher-6650-thread-1) [    ] o.a.s.c.s.e.JettySolrRunner Trying to start Jetty on port 0 try number 1 ...
   [junit4]   2> 659237 INFO  (jetty-launcher-6650-thread-2) [    ] o.a.s.c.s.e.JettySolrRunner Trying to start Jetty on port 0 try number 1 ...
   [junit4]   2> 659237 INFO  (jetty-launcher-6650-thread-4) [    ] o.a.s.c.s.e.JettySolrRunner Start Jetty (original configured port=0)
   [junit4]   2> 659237 INFO  (jetty-launcher-6650-thread-4) [    ] o.a.s.c.s.e.JettySolrRunner Trying to start Jetty on port 0 try number 1 ...
   [junit4]   2> 659237 INFO  (jetty-launcher-6650-thread-2) [    ] o.e.j.s.Server jetty-9.4.14.v20181114; built: 2018-11-14T21:20:31.478Z; git: c4550056e785fb5665914545889f21dc136ad9e6; jvm 1.8.0_201-b09
   [junit4]   2> 659237 INFO  (jetty-launcher-6650-thread-4) [    ] o.e.j.s.Server jetty-9.4.14.v20181114; built: 2018-11-14T21:20:31.478Z; git: c4550056e785fb5665914545889f21dc136ad9e6; jvm 1.8.0_201-b09
   [junit4]   2> 659237 INFO  (jetty-launcher-6650-thread-1) [    ] o.e.j.s.Server jetty-9.4.14.v20181114; built: 2018-11-14T21:20:31.478Z; git: c4550056e785fb5665914545889f21dc136ad9e6; jvm 1.8.0_201-b09
   [junit4]   2> 659237 INFO  (jetty-launcher-6650-thread-3) [    ] o.a.s.c.s.e.JettySolrRunner Start Jetty (original configured port=0)
   [junit4]   2> 659237 INFO  (jetty-launcher-6650-thread-3) [    ] o.a.s.c.s.e.JettySolrRunner Trying to start Jetty on port 0 try number 1 ...
   [junit4]   2> 659237 INFO  (jetty-launcher-6650-thread-3) [    ] o.e.j.s.Server jetty-9.4.14.v20181114; built: 2018-11-14T21:20:31.478Z; git: c4550056e785fb5665914545889f21dc136ad9e6; jvm 1.8.0_201-b09
   [junit4]   2> 659237 WARN  (jetty-launcher-6650-thread-6) [    ] o.e.j.s.AbstractConnector Ignoring deprecated socket close linger time
   [junit4]   2> 659238 INFO  (jetty-launcher-6650-thread-6) [    ] o.a.s.c.s.e.JettySolrRunner Start Jetty (original configured port=0)
   [junit4]   2> 659238 INFO  (jetty-launcher-6650-thread-6) [    ] o.a.s.c.s.e.JettySolrRunner Trying to start Jetty on port 0 try number 1 ...
   [junit4]   2> 659238 INFO  (jetty-launcher-6650-thread-6) [    ] o.e.j.s.Server jetty-9.4.14.v20181114; built: 2018-11-14T21:20:31.478Z; git: c4550056e785fb5665914545889f21dc136ad9e6; jvm 1.8.0_201-b09
   [junit4]   2> 659238 WARN  (jetty-launcher-6650-thread-5) [    ] o.e.j.s.AbstractConnector Ignoring deprecated socket close linger time
   [junit4]   2> 659238 INFO  (jetty-launcher-6650-thread-5) [    ] o.a.s.c.s.e.JettySolrRunner Start Jetty (original configured port=0)
   [junit4]   2> 659238 INFO  (jetty-launcher-6650-thread-5) [    ] o.a.s.c.s.e.JettySolrRunner Trying to start Jetty on port 0 try number 1 ...
   [junit4]   2> 659238 INFO  (jetty-launcher-6650-thread-5) [    ] o.e.j.s.Server jetty-9.4.14.v20181114; built: 2018-11-14T21:20:31.478Z; git: c4550056e785fb5665914545889f21dc136ad9e6; jvm 1.8.0_201-b09
   [junit4]   2> 659248 INFO  (jetty-launcher-6650-thread-4) [    ] o.e.j.s.session DefaultSessionIdManager workerName=node0
   [junit4]   2> 659248 INFO  (jetty-launcher-6650-thread-4) [    ] o.e.j.s.session No SessionScavenger set, using defaults
   [junit4]   2> 659248 INFO  (jetty-launcher-6650-thread-4) [    ] o.e.j.s.session node0 Scavenging every 600000ms
   [junit4]   2> 659249 INFO  (jetty-launcher-6650-thread-5) [    ] o.e.j.s.session DefaultSessionIdManager workerName=node0
   [junit4]   2> 659249 INFO  (jetty-launcher-6650-thread-5) [    ] o.e.j.s.session No SessionScavenger set, using defaults
   [junit4]   2> 659249 INFO  (jetty-launcher-6650-thread-5) [    ] o.e.j.s.session node0 Scavenging every 660000ms
   [junit4]   2> 659249 INFO  (jetty-launcher-6650-thread-6) [    ] o.e.j.s.session DefaultSessionIdManager workerName=node0
   [junit4]   2> 659249 INFO  (jetty-launcher-6650-thread-6) [    ] o.e.j.s.session No SessionScavenger set, using defaults
   [junit4]   2> 659249 INFO  (jetty-launcher-6650-thread-6) [    ] o.e.j.s.session node0 Scavenging every 660000ms
   [junit4]   2> 659249 INFO  (jetty-launcher-6650-thread-4) [    ] o.e.j.s.h.ContextHandler Started o.e.j.s.ServletContextHandler@6958f361{/solr,null,AVAILABLE}
   [junit4]   2> 659249 INFO  (jetty-launcher-6650-thread-1) [    ] o.e.j.s.session DefaultSessionIdManager workerName=node0
   [junit4]   2> 659249 INFO  (jetty-launcher-6650-thread-1) [    ] o.e.j.s.session No SessionScavenger set, using defaults
   [junit4]   2> 659249 INFO  (jetty-launcher-6650-thread-1) [    ] o.e.j.s.session node0 Scavenging every 660000ms
   [junit4]   2> 659249 INFO  (jetty-launcher-6650-thread-2) [    ] o.e.j.s.session DefaultSessionIdManager workerName=node0
   [junit4]   2> 659249 INFO  (jetty-launcher-6650-thread-2) [    ] o.e.j.s.session No SessionScavenger set, using defaults
   [junit4]   2> 659249 INFO  (jetty-launcher-6650-thread-2) [    ] o.e.j.s.session node0 Scavenging every 660000ms
   [junit4]   2> 659249 INFO  (jetty-launcher-6650-thread-5) [    ] o.e.j.s.h.ContextHandler Started o.e.j.s.ServletContextHandler@44b2fd9c{/solr,null,AVAILABLE}
   [junit4]   2> 659249 WARN  (jetty-launcher-6650-thread-4) [    ] o.e.j.u.s.S.config No Client EndPointIdentificationAlgorithm configured for SslContextFactory@5eea7c80[provider=null,keyStore=null,trustStore=null]
   [junit4]   2> 659249 WARN  (jetty-launcher-6650-thread-5) [    ] o.e.j.u.s.S.config No Client EndPointIdentificationAlgorithm configured for SslContextFactory@2ffd42dc[provider=null,keyStore=null,trustStore=null]
   [junit4]   2> 659249 INFO  (jetty-launcher-6650-thread-6) [    ] o.e.j.s.h.ContextHandler Started o.e.j.s.ServletContextHandler@116b719a{/solr,null,AVAILABLE}
   [junit4]   2> 659250 WARN  (jetty-launcher-6650-thread-6) [    ] o.e.j.u.s.S.config No Client EndPointIdentificationAlgorithm configured for SslContextFactory@62861cad[provider=null,keyStore=null,trustStore=null]
   [junit4]   2> 659250 INFO  (jetty-launcher-6650-thread-1) [    ] o.e.j.s.h.ContextHandler Started o.e.j.s.ServletContextHandler@5893e68{/solr,null,AVAILABLE}
   [junit4]   2> 659250 WARN  (jetty-launcher-6650-thread-1) [    ] o.e.j.u.s.S.config No Client EndPointIdentificationAlgorithm configured for SslContextFactory@5d548f85[provider=null,keyStore=null,trustStore=null]
   [junit4]   2> 659251 INFO  (jetty-launcher-6650-thread-3) [    ] o.e.j.s.session DefaultSessionIdManager workerName=node0
   [junit4]   2> 659251 INFO  (jetty-launcher-6650-thread-3) [    ] o.e.j.s.session No SessionScavenger set, using defaults
   [junit4]   2> 659251 INFO  (jetty-launcher-6650-thread-3) [    ] o.e.j.s.session node0 Scavenging every 660000ms
   [junit4]   2> 659251 INFO  (jetty-launcher-6650-thread-2) [    ] o.e.j.s.h.ContextHandler Started o.e.j.s.ServletContextHandler@2bfb6b30{/solr,null,AVAILABLE}
   [junit4]   2> 659251 INFO  (jetty-launcher-6650-thread-6) [    ] o.e.j.s.AbstractConnector Started ServerConnector@5bcdd4fe{SSL,[ssl, http/1.1]}{127.0.0.1:33959}
   [junit4]   2> 659251 INFO  (jetty-launcher-6650-thread-6) [    ] o.e.j.s.Server Started @659296ms
   [junit4]   2> 659251 INFO  (jetty-launcher-6650-thread-5) [    ] o.e.j.s.AbstractConnector Started ServerConnector@6727d9dd{SSL,[ssl, http/1.1]}{127.0.0.1:36303}
   [junit4]   2> 659251 INFO  (jetty-launcher-6650-thread-3) [    ] o.e.j.s.h.ContextHandler Started o.e.j.s.ServletContextHandler@7c0c69f1{/solr,null,AVAILABLE}
   [junit4]   2> 659251 INFO  (jetty-launcher-6650-thread-5) [    ] o.e.j.s.Server Started @659296ms
   [junit4]   2> 659251 INFO  (jetty-launcher-6650-thread-6) [    ] o.a.s.c.s.e.JettySolrRunner Jetty properties: {hostContext=/solr, hostPort=33959}
   [junit4]   2> 659251 INFO  (jetty-launcher-6650-thread-5) [    ] o.a.s.c.s.e.JettySolrRunner Jetty properties: {hostContext=/solr, hostPort=36303}
   [junit4]   2> 659251 INFO  (jetty-launcher-6650-thread-4) [    ] o.e.j.s.AbstractConnector Started ServerConnector@258ff3e9{SSL,[ssl, http/1.1]}{127.0.0.1:45699}
   [junit4]   2> 659251 INFO  (jetty-launcher-6650-thread-4) [    ] o.e.j.s.Server Started @659296ms
   [junit4]   2> 659251 INFO  (jetty-launcher-6650-thread-4) [    ] o.a.s.c.s.e.JettySolrRunner Jetty properties: {hostContext=/solr, hostPort=45699}
   [junit4]   2> 659251 WARN  (jetty-launcher-6650-thread-3) [    ] o.e.j.u.s.S.config No Client EndPointIdentificationAlgorithm configured for SslContextFactory@4fa17d0c[provider=null,keyStore=null,trustStore=null]
   [junit4]   2> 659251 ERROR (jetty-launcher-6650-thread-5) [    ] o.a.s.u.StartupLoggingUtils Missing Java Option solr.log.dir. Logging may be missing or incomplete.
   [junit4]   2> 659251 INFO  (jetty-launcher-6650-thread-5) [    ] o.a.s.s.SolrDispatchFilter Using logger factory org.apache.logging.slf4j.Log4jLoggerFactory
   [junit4]   2> 659251 WARN  (jetty-launcher-6650-thread-2) [    ] o.e.j.u.s.S.config No Client EndPointIdentificationAlgorithm configured for SslContextFactory@2618584e[provider=null,keyStore=null,trustStore=null]
   [junit4]   2> 659251 ERROR (jetty-launcher-6650-thread-6) [    ] o.a.s.u.StartupLoggingUtils Missing Java Option solr.log.dir. Logging may be missing or incomplete.
   [junit4]   2> 659251 INFO  (jetty-launcher-6650-thread-6) [    ] o.a.s.s.SolrDispatchFilter Using logger factory org.apache.logging.slf4j.Log4jLoggerFactory
   [junit4]   2> 659251 ERROR (jetty-launcher-6650-thread-4) [    ] o.a.s.u.StartupLoggingUtils Missing Java Option solr.log.dir. Logging may be missing or incomplete.
   [junit4]   2> 659251 INFO  (jetty-launcher-6650-thread-4) [    ] o.a.s.s.SolrDispatchFilter Using logger factory org.apache.logging.slf4j.Log4jLoggerFactory
   [junit4]   2> 659251 INFO  (jetty-launcher-6650-thread-5) [    ] o.a.s.s.SolrDispatchFilter  ___      _       Welcome to Apache Solr? version 8.1.0
   [junit4]   2> 659251 INFO  (jetty-launcher-6650-thread-6) [    ] o.a.s.s.SolrDispatchFilter  ___      _       Welcome to Apache Solr? version 8.1.0
   [junit4]   2> 659251 INFO  (jetty-launcher-6650-thread-4) [    ] o.a.s.s.SolrDispatchFilter  ___      _       Welcome to Apache Solr? version 8.1.0
   [junit4]   2> 659251 INFO  (jetty-launcher-6650-thread-5) [    ] o.a.s.s.SolrDispatchFilter / __| ___| |_ _   Starting in cloud mode on port null
   [junit4]   2> 659251 INFO  (jetty-launcher-6650-thread-6) [    ] o.a.s.s.SolrDispatchFilter / __| ___| |_ _   Starting in cloud mode on port null
   [junit4]   2> 659251 INFO  (jetty-launcher-6650-thread-5) [    ] o.a.s.s.SolrDispatchFilter \__ \/ _ \ | '_|  Install dir: null
   [junit4]   2> 659251 INFO  (jetty-launcher-6650-thread-4) [    ] o.a.s.s.SolrDispatchFilter / __| ___| |_ _   Starting in cloud mode on port null
   [junit4]   2> 659251 INFO  (jetty-launcher-6650-thread-6) [    ] o.a.s.s.SolrDispatchFilter \__ \/ _ \ | '_|  Install dir: null
   [junit4]   2> 659251 INFO  (jetty-launcher-6650-thread-5) [    ] o.a.s.s.SolrDispatchFilter |___/\___/_|_|    Start time: 2019-05-03T22:51:20.590Z
   [junit4]   2> 659251 INFO  (jetty-launcher-6650-thread-4) [    ] o.a.s.s.SolrDispatchFilter \__ \/ _ \ | '_|  Install dir: null
   [junit4]   2> 659251 INFO  (jetty-launcher-6650-thread-6) [    ] o.a.s.s.SolrDispatchFilter |___/\___/_|_|    Start time: 2019-05-03T22:51:20.590Z
   [junit4]   2> 659251 INFO  (jetty-launcher-6650-thread-4) [    ] o.a.s.s.SolrDispatchFilter |___/\___/_|_|    Start time: 2019-05-03T22:51:20.590Z
   [junit4]   2> 659252 INFO  (jetty-launcher-6650-thread-1) [    ] o.e.j.s.AbstractConnector Started ServerConnector@4ba31221{SSL,[ssl, http/1.1]}{127.0.0.1:33821}
   [junit4]   2> 659252 INFO  (jetty-launcher-6650-thread-1) [    ] o.e.j.s.Server Started @659296ms
   [junit4]   2> 659252 INFO  (jetty-launcher-6650-thread-1) [    ] o.a.s.c.s.e.JettySolrRunner Jetty properties: {hostContext=/solr, hostPort=33821}
   [junit4]   2> 659252 ERROR (jetty-launcher-6650-thread-1) [    ] o.a.s.u.StartupLoggingUtils Missing Java Option solr.log.dir. Logging may be missing or incomplete.
   [junit4]   2> 659252 INFO  (jetty-launcher-6650-thread-1) [    ] o.a.s.s.SolrDispatchFilter Using logger factory org.apache.logging.slf4j.Log4jLoggerFactory
   [junit4]   2> 659252 INFO  (jetty-launcher-6650-thread-1) [    ] o.a.s.s.SolrDispatchFilter  ___      _       Welcome to Apache Solr? version 8.1.0
   [junit4]   2> 659252 INFO  (jetty-launcher-6650-thread-1) [    ] o.a.s.s.SolrDispatchFilter / __| ___| |_ _   Starting in cloud mode on port null
   [junit4]   2> 659252 INFO  (jetty-launcher-6650-thread-1) [    ] o.a.s.s.SolrDispatchFilter \__ \/ _ \ | '_|  Install dir: null
   [junit4]   2> 659252 INFO  (jetty-launcher-6650-thread-1) [    ] o.a.s.s.SolrDispatchFilter |___/\___/_|_|    Start time: 2019-05-03T22:51:20.591Z
   [junit4]   2> 659252 INFO  (jetty-launcher-6650-thread-2) [    ] o.e.j.s.AbstractConnector Started ServerConnector@6e681f7b{SSL,[ssl, http/1.1]}{127.0.0.1:44515}
   [junit4]   2> 659252 INFO  (jetty-launcher-6650-thread-2) [    ] o.e.j.s.Server Started @659297ms
   [junit4]   2> 659252 INFO  (jetty-launcher-6650-thread-2) [    ] o.a.s.c.s.e.JettySolrRunner Jetty properties: {hostContext=/solr, hostPort=44515}
   [junit4]   2> 659252 ERROR (jetty-launcher-6650-thread-2) [    ] o.a.s.u.StartupLoggingUtils Missing Java Option solr.log.dir. Logging may be missing or incomplete.
   [junit4]   2> 659252 INFO  (jetty-launcher-6650-thread-2) [    ] o.a.s.s.SolrDispatchFilter Using logger factory org.apache.logging.slf4j.Log4jLoggerFactory
   [junit4]   2> 659252 INFO  (jetty-launcher-6650-thread-2) [    ] o.a.s.s.SolrDispatchFilter  ___      _       Welcome to Apache Solr? version 8.1.0
   [junit4]   2> 659252 INFO  (jetty-launcher-6650-thread-2) [    ] o.a.s.s.SolrDispatchFilter / __| ___| |_ _   Starting in cloud mode on port null
   [junit4]   2> 659252 INFO  (jetty-launcher-6650-thread-2) [    ] o.a.s.s.SolrDispatchFilter \__ \/ _ \ | '_|  Install dir: null
   [junit4]   2> 659252 INFO  (jetty-launcher-6650-thread-2) [    ] o.a.s.s.SolrDispatchFilter |___/\___/_|_|    Start time: 2019-05-03T22:51:20.591Z
   [junit4]   2> 659254 INFO  (jetty-launcher-6650-thread-3) [    ] o.e.j.s.AbstractConnector Started ServerConnector@681d15e9{SSL,[ssl, http/1.1]}{127.0.0.1:45881}
   [junit4]   2> 659254 INFO  (jetty-launcher-6650-thread-3) [    ] o.e.j.s.Server Started @659299ms
   [junit4]   2> 659254 INFO  (jetty-launcher-6650-thread-3) [    ] o.a.s.c.s.e.JettySolrRunner Jetty properties: {hostContext=/solr, hostPort=45881}
   [junit4]   2> 659254 ERROR (jetty-launcher-6650-thread-3) [    ] o.a.s.u.StartupLoggingUtils Missing Java Option solr.log.dir. Logging may be missing or incomplete.
   [junit4]   2> 659254 INFO  (jetty-launcher-6650-thread-3) [    ] o.a.s.s.SolrDispatchFilter Using logger factory org.apache.logging.slf4j.Log4jLoggerFactory
   [junit4]   2> 659254 INFO  (jetty-launcher-6650-thread-3) [    ] o.a.s.s.SolrDispatchFilter  ___      _       Welcome to Apache Solr? version 8.1.0
   [junit4]   2> 659254 INFO  (jetty-launcher-6650-thread-3) [    ] o.a.s.s.SolrDispatchFilter / __| ___| |_ _   Starting in cloud mode on port null
   [junit4]   2> 659254 INFO  (jetty-launcher-6650-thread-3) [    ] o.a.s.s.SolrDispatchFilter \__ \/ _ \ | '_|  Install dir: null
   [junit4]   2> 659254 INFO  (jetty-launcher-6650-thread-3) [    ] o.a.s.s.SolrDispatchFilter |___/\___/_|_|    Start time: 2019-05-03T22:51:20.593Z
   [junit4]   2> 659255 INFO  (zkConnectionManagerCallback-6653-thread-1) [    ] o.a.s.c.c.ConnectionManager zkClient has connected
   [junit4]   2> 659255 INFO  (zkConnectionManagerCallback-6656-thread-1) [    ] o.a.s.c.c.ConnectionManager zkClient has connected
   [junit4]   2> 659255 INFO  (jetty-launcher-6650-thread-6) [    ] o.a.s.s.SolrDispatchFilter solr.xml found in ZooKeeper. Loading...
   [junit4]   2> 659255 INFO  (jetty-launcher-6650-thread-4) [    ] o.a.s.s.SolrDispatchFilter solr.xml found in ZooKeeper. Loading...
   [junit4]   2> 659255 INFO  (zkConnectionManagerCallback-6655-thread-1) [    ] o.a.s.c.c.ConnectionManager zkClient has connected
   [junit4]   2> 659255 INFO  (zkConnectionManagerCallback-6660-thread-1) [    ] o.a.s.c.c.ConnectionManager zkClient has connected
   [junit4]   2> 659255 INFO  (zkConnectionManagerCallback-6658-thread-1) [    ] o.a.s.c.c.ConnectionManager zkClient has connected
   [junit4]   2> 659255 INFO  (jetty-launcher-6650-thread-2) [    ] o.a.s.s.SolrDispatchFilter solr.xml found in ZooKeeper. Loading...
   [junit4]   2> 659255 INFO  (jetty-launcher-6650-thread-1) [    ] o.a.s.s.SolrDispatchFilter solr.xml found in ZooKeeper. Loading...
   [junit4]   2> 659256 INFO  (zkConnectionManagerCallback-6662-thread-1) [    ] o.a.s.c.c.ConnectionManager zkClient has connected
   [junit4]   2> 659256 INFO  (jetty-launcher-6650-thread-5) [    ] o.a.s.s.SolrDispatchFilter solr.xml found in ZooKeeper. Loading...
   [junit4]   2> 659256 INFO  (jetty-launcher-6650-thread-3) [    ] o.a.s.s.SolrDispatchFilter solr.xml found in ZooKeeper. Loading...
   [junit4]   2> 659259 WARN  (NIOServerCxn.Factory:0.0.0.0/0.0.0.0:0) [    ] o.a.z.s.NIOServerCnxn Unable to read additional data from client sessionid 0x100785ac9780004, likely client has closed socket
   [junit4]   2> 659260 WARN  (NIOServerCxn.Factory:0.0.0.0/0.0.0.0:0) [    ] o.a.z.s.NIOServerCnxn Unable to read additional data from client sessionid 0x100785ac9780006, likely client has closed socket
   [junit4]   2> 659338 INFO  (jetty-launcher-6650-thread-4) [    ] o.a.s.h.c.HttpShardHandlerFactory Host whitelist initialized: WhitelistHostChecker [whitelistHosts=null, whitelistHostCheckingEnabled=true]
   [junit4]   2> 659338 WARN  (jetty-launcher-6650-thread-4) [    ] o.a.s.c.s.i.Http2SolrClient Create Http2SolrClient with HTTP/1.1 transport since Java 8 or lower versions does not support SSL + HTTP/2
   [junit4]   2> 659341 WARN  (jetty-launcher-6650-thread-4) [    ] o.e.j.u.s.S.config No Client EndPointIdentificationAlgorithm configured for SslContextFactory@5318a3c3[provider=null,keyStore=null,trustStore=null]
   [junit4]   2> 659344 INFO  (jetty-launcher-6650-thread-6) [    ] o.a.s.h.c.HttpShardHandlerFactory Host whitelist initialized: WhitelistHostChecker [whitelistHosts=null, whitelistHostCheckingEnabled=true]
   [junit4]   2> 659344 WARN  (jetty-launcher-6650-thread-6) [    ] o.a.s.c.s.i.Http2SolrClient Create Http2SolrClient with HTTP/1.1 transport since Java 8 or lower versions does not support SSL + HTTP/2
   [junit4]   2> 659345 WARN  (jetty-launcher-6650-thread-6) [    ] o.e.j.u.s.S.config No Client EndPointIdentificationAlgorithm configured for SslContextFactory@3bf471a3[provider=null,keyStore=null,trustStore=null]
   [junit4]   2> 659348 WARN  (jetty-launcher-6650-thread-4) [    ] o.a.s.c.s.i.Http2SolrClient Create Http2SolrClient with HTTP/1.1 transport since Java 8 or lower versions does not support SSL + HTTP/2
   [junit4]   2> 659356 WARN  (jetty-launcher-6650-thread-6) [    ] o.a.s.c.s.i.Http2SolrClient Create Http2SolrClient with HTTP/1.1 transport since Java 8 or lower versions does not support SSL + HTTP/2
   [junit4]   2> 659360 WARN  (jetty-launcher-6650-thread-4) [    ] o.e.j.u.s.S.config No Client EndPointIdentificationAlgorithm configured for SslContextFactory@3f1ccda3[provider=null,keyStore=null,trustStore=null]
   [junit4]   2> 659360 WARN  (jetty-launcher-6650-thread-6) [    ] o.e.j.u.s.S.config No Client EndPointIdentificationAlgorithm configured for SslContextFactory@7cc247f5[provider=null,keyStore=null,trustStore=null]
   [junit4]   2> 659360 INFO  (jetty-launcher-6650-thread-4) [    ] o.a.s.c.ZkContainer Zookeeper client=127.0.0.1:42919/solr
   [junit4]   2> 659361 INFO  (jetty-launcher-6650-thread-6) [    ] o.a.s.c.ZkContainer Zookeeper client=127.0.0.1:42919/solr
   [junit4]   2> 659367 INFO  (jetty-launcher-6650-thread-2) [    ] o.a.s.h.c.HttpShardHandlerFactory Host whitelist initialized: WhitelistHostChecker [whitelistHosts=null, whitelistHostCheckingEnabled=true]
   [junit4]   2> 659367 WARN  (jetty-launcher-6650-thread-2) [    ] o.a.s.c.s.i.Http2SolrClient Create Http2SolrClient with HTTP/1.1 transport since Java 8 or lower versions does not support SSL + HTTP/2
   [junit4]   2> 659368 INFO  (zkConnectionManagerCallback-6677-thread-1) [    ] o.a.s.c.c.ConnectionManager zkClient has connected
   [junit4]   2> 659376 INFO  (zkConnectionManagerCallback-6680-thread-1) [    ] o.a.s.c.c.ConnectionManager zkClient has connected
   [junit4]   2> 659377 WARN  (jetty-launcher-6650-thread-2) [    ] o.e.j.u.s.S.config No Client EndPointIdentificationAlgorithm configured for SslContextFactory@5ec1a684[provider=null,keyStore=null,trustStore=null]
   [junit4]   2> 659379 INFO  (jetty-launcher-6650-thread-5) [    ] o.a.s.h.c.HttpShardHandlerFactory Host whitelist initialized: WhitelistHostChecker [whitelistHosts=null, whitelistHostCheckingEnabled=true]
   [junit4]   2> 659379 WARN  (jetty-launcher-6650-thread-5) [    ] o.a.s.c.s.i.Http2SolrClient Create Http2SolrClient with HTTP/1.1 transport since Java 8 or lower versions does not support SSL + HTTP/2
   [junit4]   2> 659384 INFO  (zkConnectionManagerCallback-6683-thread-1) [    ] o.a.s.c.c.ConnectionManager zkClient has connected
   [junit4]   2> 659385 WARN  (jetty-launcher-6650-thread-5) [    ] o.e.j.u.s.S.config No Client EndPointIdentificationAlgorithm configured for SslContextFactory@613c231c[provider=null,keyStore=null,trustStore=null]
   [junit4]   2> 659388 WARN  (jetty-launcher-6650-thread-2) [    ] o.a.s.c.s.i.Http2SolrClient Create Http2SolrClient with HTTP/1.1 transport since Java 8 or lower versions does not support SSL + HTTP/2
   [junit4]   2> 659404 WARN  (jetty-launcher-6650-thread-2) [    ] o.e.j.u.s.S.config No Client EndPointIdentificationAlgorithm configured for SslContextFactory@6e949c1e[provider=null,keyStore=null,trustStore=null]
   [junit4]   2> 659404 WARN  (jetty-launcher-6650-thread-5) [    ] o.a.s.c.s.i.Http2SolrClient Create Http2SolrClient with HTTP/1.1 transport since Java 8 or lower versions does not support SSL + HTTP/2
   [junit4]   2> 659405 INFO  (jetty-launcher-6650-thread-2) [    ] o.a.s.c.ZkContainer Zookeeper client=127.0.0.1:42919/solr
   [junit4]   2> 659407 INFO  (jetty-launcher-6650-thread-4) [n:127.0.0.1:45699_solr    ] o.a.s.c.OverseerElectionContext I am going to be the leader 127.0.0.1:45699_solr
   [junit4]   2> 659407 INFO  (jetty-launcher-6650-thread-4) [n:127.0.0.1:45699_solr    ] o.a.s.c.Overseer Overseer (id=72189925360402443-127.0.0.1:45699_solr-n_0000000000) starting
   [junit4]   2> 659408 INFO  (zkConnectionManagerCallback-6687-thread-1) [    ] o.a.s.c.c.ConnectionManager zkClient has connected
   [junit4]   2> 659411 INFO  (jetty-launcher-6650-thread-6) [n:127.0.0.1:33959_solr    ] o.a.s.c.ZkController Register node as live in ZooKeeper:/live_nodes/127.0.0.1:33959_solr
   [junit4]   2> 659416 INFO  (zkCallback-6686-thread-1) [    ] o.a.s.c.c.ZkStateReader Updated live nodes from ZooKeeper... (0) -> (1)
   [junit4]   2> 659421 INFO  (zkCallback-6682-thread-1) [    ] o.a.s.c.c.ZkStateReader Updated live nodes from ZooKeeper... (0) -> (1)
   [junit4]   2> 659429 WARN  (jetty-launcher-6650-thread-5) [    ] o.e.j.u.s.S.config No Client EndPointIdentificationAlgorithm configured for SslContextFactory@37a4e1ce[provider=null,keyStore=null,trustStore=null]
   [junit4]   2> 659429 INFO  (zkConnectionManagerCallback-6702-thread-1) [    ] o.a.s.c.c.ConnectionManager zkClient has connected
   [junit4]   2> 659429 INFO  (zkConnectionManagerCallback-6695-thread-1) [    ] o.a.s.c.c.ConnectionManager zkClient has connected
   [junit4]   2> 659430 INFO  (jetty-launcher-6650-thread-5) [    ] o.a.s.c.ZkContainer Zookeeper client=127.0.0.1:42919/solr
   [junit4]   2> 659430 INFO  (zkConnectionManagerCallback-6707-thread-1) [    ] o.a.s.c.c.ConnectionManager zkClient has connected
   [junit4]   2> 659430 INFO  (jetty-launcher-6650-thread-4) [n:127.0.0.1:45699_solr    ] o.a.s.c.c.ZkStateReader Updated live nodes from ZooKeeper... (0) -> (1)
   [junit4]   2> 659430 INFO  (jetty-launcher-6650-thread-6) [n:127.0.0.1:33959_solr    ] o.a.s.c.c.ZkStateReader Updated live nodes from ZooKeeper... (0) -> (1)
   [junit4]   2> 659430 INFO  (jetty-launcher-6650-thread-4) [n:127.0.0.1:45699_solr    ] o.a.s.c.s.i.ZkClientClusterStateProvider Cluster at 127.0.0.1:42919/solr ready
   [junit4]   2> 659430 INFO  (jetty-launcher-6650-thread-6) [n:127.0.0.1:33959_solr    ] o.a.s.c.s.i.ZkClientClusterStateProvider Cluster at 127.0.0.1:42919/solr ready
   [junit4]   2> 659432 WARN  (NIOServerCxn.Factory:0.0.0.0/0.0.0.0:0) [    ] o.a.z.s.NIOServerCnxn Unable to read additional data from client sessionid 0x100785ac978000d, likely client has closed socket
   [junit4]   2> 659436 INFO  (jetty-launcher-6650-thread-6) [n:127.0.0.1:33959_solr    ] o.a.s.h.a.MetricsHistoryHandler No .system collection, keeping metrics history in memory.
   [junit4]   2> 659443 INFO  (OverseerStateUpdate-72189925360402443-127.0.0.1:45699_solr-n_0000000000) [n:127.0.0.1:45699_solr    ] o.a.s.c.Overseer Starting to work on the main queue : 127.0.0.1:45699_solr
   [junit4]   2> 659443 INFO  (jetty-launcher-6650-thread-4) [n:127.0.0.1:45699_solr    ] o.a.s.c.ZkController Publish node=127.0.0.1:45699_solr as DOWN
   [junit4]   2> 659445 INFO  (jetty-launcher-6650-thread-4) [n:127.0.0.1:45699_solr    ] o.a.s.c.TransientSolrCoreCacheDefault Allocating transient cache for 2147483647 transient cores
   [junit4]   2> 659445 INFO  (jetty-launcher-6650-thread-4) [n:127.0.0.1:45699_solr    ] o.a.s.c.ZkController Register node as live in ZooKeeper:/live_nodes/127.0.0.1:45699_solr
   [junit4]   2> 659446 INFO  (zkConnectionManagerCallback-6710-thread-1) [    ] o.a.s.c.c.ConnectionManager zkClient has connected
   [junit4]   2> 659448 INFO  (zkConnectionManagerCallback-6713-thread-1) [    ] o.a.s.c.c.ConnectionManager zkClient has connected
   [junit4]   2> 659453 INFO  (jetty-launcher-6650-thread-2) [n:127.0.0.1:44515_solr    ] o.a.s.c.c.ZkStateReader Updated live nodes from ZooKeeper... (0) -> (2)
   [junit4]   2> 659454 INFO  (jetty-launcher-6650-thread-6) [n:127.0.0.1:33959_solr    ] o.a.s.m.r.SolrJmxReporter JMX monitoring for 'solr_33959.solr.node' (registry 'solr.node') enabled at server: com.sun.jmx.mbeanserver.JmxMBeanServer@41369b00
   [junit4]   2> 659455 INFO  (jetty-launcher-6650-thread-2) [n:127.0.0.1:44515_solr    ] o.a.s.c.ZkController Publish node=127.0.0.1:44515_solr as DOWN
   [junit4]   2> 659455 INFO  (jetty-launcher-6650-thread-2) [n:127.0.0.1:44515_solr    ] o.a.s.c.TransientSolrCoreCacheDefault Allocating transient cache for 2147483647 transient cores
   [junit4]   2> 659455 INFO  (jetty-launcher-6650-thread-2) [n:127.0.0.1:44515_solr    ] o.a.s.c.ZkController Register node as live in ZooKeeper:/live_nodes/127.0.0.1:44515_solr
   [junit4]   2> 659456 INFO  (zkCallback-6706-thread-1) [    ] o.a.s.c.c.ZkStateReader Updated live nodes from ZooKeeper... (1) -> (3)
   [junit4]   2> 659456 INFO  (zkCallback-6686-thread-1) [    ] o.a.s.c.c.ZkStateReader Updated live nodes from ZooKeeper... (1) -> (3)
   [junit4]   2> 659456 INFO  (zkCallback-6701-thread-1) [    ] o.a.s.c.c.ZkStateReader Updated live nodes from ZooKeeper... (1) -> (3)
   [junit4]   2> 659460 INFO  (jetty-launcher-6650-thread-6) [n:127.0.0.1:33959_solr    ] o.a.s.m.r.SolrJmxReporter JMX monitoring for 'solr_33959.solr.jvm' (registry 'solr.jvm') enabled at server: com.sun.jmx.mbeanserver.JmxMBeanServer@41369b00
   [junit4]   2> 659460 INFO  (jetty-launcher-6650-thread-6) [n:127.0.0.1:33959_solr    ] o.a.s.m.r.SolrJmxReporter JMX monitoring for 'solr_33959.solr.jetty' (registry 'solr.jetty') enabled at server: com.sun.jmx.mbeanserver.JmxMBeanServer@41369b00
   [junit4]   2> 659461 INFO  (jetty-launcher-6650-thread-6) [n:127.0.0.1:33959_solr    ] o.a.s.c.CorePropertiesLocator Found 0 core definitions underneath /home/jenkins/workspace/Lucene-Solr-8.1-Linux/solr/build/solr-core/test/J2/temp/solr.cloud.OverseerRolesTest_DA152185F662232C-001/tempDir-001/node6/.
   [junit4]   2> 659469 INFO  (zkCallback-6682-thread-2) [    ] o.a.s.c.c.ZkStateReader Updated live nodes from ZooKeeper... (1) -> (3)
   [junit4]   2> 659469 INFO  (zkCallback-6712-thread-1) [    ] o.a.s.c.c.ZkStateReader Updated live nodes from ZooKeeper... (2) -> (3)
   [junit4]   2> 659476 INFO  (jetty-launcher-6650-thread-4) [n:127.0.0.1:45699_solr    ] o.a.s.h.a.MetricsHistoryHandler No .system collection, keeping metrics history in memory.
   [junit4]   2> 659488 INFO  (zkConnectionManagerCallback-6723-thread-1) [    ] o.a.s.c.c.ConnectionManager zkClient has connected
   [junit4]   2> 659488 INFO  (jetty-launcher-6650-thread-2) [n:127.0.0.1:44515_solr    ] o.a.s.c.c.ZkStateReader Updated live nodes from ZooKeeper... (0) -> (3)
   [junit4]   2> 659489 INFO  (jetty-launcher-6650-thread-2) [n:127.0.0.1:44515_solr    ] o.a.s.c.s.i.ZkClientClusterStateProvider Cluster at 127.0.0.1:42919/solr ready
   [junit4]   2> 659489 INFO  (jetty-launcher-6650-thread-2) [n:127.0.0.1:44515_solr    ] o.a.s.h.a.MetricsHistoryHandler No .system collection, keeping metrics history in memory.
   [junit4]   2> 659497 INFO  (jetty-launcher-6650-thread-4) [n:127.0.0.1:45699_solr    ] o.a.s.m.r.SolrJmxReporter JMX monitoring for 'solr_45699.solr.node' (registry 'solr.node') enabled at server: com.sun.jmx.mbeanserver.JmxMBeanServer@41369b00
   [junit4]   2> 659503 INFO  (zkConnectionManagerCallback-6718-thread-1) [    ] o.a.s.c.c.ConnectionManager zkClient has connected
   [junit4]   2> 659505 INFO  (jetty-launcher-6650-thread-5) [n:127.0.0.1:36303_solr    ] o.a.s.c.c.ZkStateReader Updated live nodes from ZooKeeper... (0) -> (3)
   [junit4]   2> 659507 INFO  (jetty-launcher-6650-thread-5) [n:127.0.0.1:36303_solr    ] o.a.s.c.ZkController Publish node=127.0.0.1:36303_solr as DOWN
   [junit4]   2> 659507 INFO  (jetty-launcher-6650-thread-5) [n:127.0.0.1:36303_solr    ] o.a.s.c.TransientSolrCoreCacheDefault Allocating transient cache for 2147483647 transient cores
   [junit4]   2> 659507 INFO  (jetty-launcher-6650-thread-5) [n:127.0.0.1:36303_solr    ] o.a.s.c.ZkController Register node as live in ZooKeeper:/live_nodes/127.0.0.1:36303_solr
   [junit4]   2> 659509 INFO  (zkCallback-6686-thread-1) [    ] o.a.s.c.c.ZkStateReader Updated live nodes from ZooKeeper... (3) -> (4)
   [junit4]   2> 659510 INFO  (jetty-launcher-6650-thread-4) [n:127.0.0.1:45699_solr    ] o.a.s.m.r.SolrJmxReporter JMX monitoring for 'solr_45699.solr.jvm' (registry 'solr.jvm') enabled at server: com.sun.jmx.mbeanserver.JmxMBeanServer@41369b00
   [junit4]   2> 659510 INFO  (jetty-launcher-6650-thread-4) [n:127.0.0.1:45699_solr    ] o.a.s.m.r.SolrJmxReporter JMX monitoring for 'solr_45699.solr.jetty' (registry 'solr.jetty') enabled at server: com.sun.jmx.mbeanserver.JmxMBeanServer@41369b00
   [junit4]   2> 659511 INFO  (jetty-launcher-6650-thread-4) [n:127.0.0.1:45699_solr    ] o.a.s.c.CorePropertiesLocator Found 0 core definitions underneath /home/jenkins/workspace/Lucene-Solr-8.1-Linux/solr/build/solr-core/test/J2/temp/solr.cloud.OverseerRolesTest_DA152185F662232C-001/tempDir-001/node4/.
   [junit4]   2> 659514 INFO  (jetty-launcher-6650-thread-2) [n:127.0.0.1:44515_solr    ] o.a.s.m.r.SolrJmxReporter JMX monitoring for 'solr_44515.solr.node' (registry 'solr.node') enabled at server: com.sun.jmx.mbeanserver.JmxMBeanServer@41369b00
   [junit4]   2> 659520 INFO  (jetty-launcher-6650-thread-2) [n:127.0.0.1:44515_solr    ] o.a.s.m.r.SolrJmxReporter JMX monitoring for 'solr_44515.solr.jvm' (registry 'solr.jvm') enabled at server: com.sun.jmx.mbeanserver.JmxMBeanServer@41369b00
   [junit4]   2> 659520 INFO  (jetty-launcher-6650-thread-2) [n:127.0.0.1:44515_solr    ] o.a.s.m.r.SolrJmxReporter JMX monitoring for 'solr_44515.solr.jetty' (registry 'solr.jetty') enabled at server: com.sun.jmx.mbeanserver.JmxMBeanServer@41369b00
   [junit4]   2> 659521 INFO  (jetty-launcher-6650-thread-2) [n:127.0.0.1:44515_solr    ] o.a.s.c.CorePropertiesLocator Found 0 core definitions underneath /home/jenkins/workspace/Lucene-Solr-8.1-Linux/solr/build/solr-core/test/J2/temp/solr.cloud.OverseerRolesTest_DA152185F662232C-001/tempDir-001/node2/.
   [junit4]   2> 659524 INFO  (zkCallback-6701-thread-1) [    ] o.a.s.c.c.ZkStateReader Updated live nodes from ZooKeeper... (3) -> (4)
   [junit4]   2> 659524 INFO  (zkCallback-6712-thread-1) [    ] o.a.s.c.c.ZkStateReader Updated live nodes from ZooKeeper... (3) -> (4)
   [junit4]   2> 659524 INFO  (zkCallback-6682-thread-1) [    ] o.a.s.c.c.ZkStateReader Updated live nodes from ZooKeeper... (3) -> (4)
   [junit4]   2> 659525 INFO  (zkCallback-6706-thread-1) [    ] o.a.s.c.c.ZkStateReader Updated live nodes from ZooKeeper... (3) -> (4)
   [junit4]   2> 659528 INFO  (jetty-launcher-6650-thread-3) [    ] o.a.s.h.c.HttpShardHandlerFactory Host whitelist initialized: WhitelistHostChecker [whitelistHosts=null, whitelistHostCheckingEnabled=true]
   [junit4]   2> 659528 WARN  (jetty-launcher-6650-thread-3) [    ] o.a.s.c.s.i.Http2SolrClient Create Http2SolrClient with HTTP/1.1 transport since Java 8 or lower versions does not support SSL + HTTP/2
   [junit4]   2> 659528 INFO  (zkCallback-6717-thread-1) [    ] o.a.s.c.c.ZkStateReader Updated live nodes from ZooKeeper... (3) -> (4)
   [junit4]   2> 659532 INFO  (zkCallback-6722-thread-1) [    ] o.a.s.c.c.ZkStateReader Updated live nodes from ZooKeeper... (3) -> (4)
   [junit4]   2> 659537 WARN  (jetty-launcher-6650-thread-3) [    ] o.e.j.u.s.S.config No Client EndPointIdentificationAlgorithm configured for SslContextFactory@e787f3f[provider=null,keyStore=null,trustStore=null]
   [junit4]   2> 659544 INFO  (zkConnectionManagerCallback-6732-thread-1) [    ] o.a.s.c.c.ConnectionManager zkClient has connected
   [junit4]   2> 659544 WARN  (jetty-launcher-6650-thread-3) [    ] o.a.s.c.s.i.Http2SolrClient Create Http2SolrClient with HTTP/1.1 transport since Java 8 or lower versions does not support SSL + HTTP/2
   [junit4]   2> 659545 INFO  (jetty-launcher-6650-thread-5) [n:127.0.0.1:36303_solr    ] o.a.s.c.c.ZkStateReader Updated live nodes from ZooKeeper... (0) -> (4)
   [junit4]   2> 659545 INFO  (jetty-launcher-6650-thread-5) [n:127.0.0.1:36303_solr    ] o.a.s.c.s.i.ZkClientClusterStateProvider Cluster at 127.0.0.1:42919/solr ready
   [junit4]   2> 659556 INFO  (jetty-launcher-6650-thread-5) [n:127.0.0.1:36303_solr    ] o.a.s.h.a.MetricsHistoryHandler No .system collection, keeping metrics history in memory.
   [junit4]   2> 659560 WARN  (jetty-launcher-6650-thread-3) [    ] o.e.j.u.s.S.config No Client EndPointIdentificationAlgorithm configured for SslContextFactory@5ea47ef2[provider=null,keyStore=null,trustStore=null]
   [junit4]   2> 659561 INFO  (jetty-launcher-6650-thread-3) [    ] o.a.s.c.ZkContainer Zookeeper client=127.0.0.1:42919/solr
   [junit4]   2> 659579 INFO  (zkConnectionManagerCallback-6738-thread-1) [    ] o.a.s.c.c.ConnectionManager zkClient has connected
   [junit4]   2> 659580 INFO  (zkConnectionManagerCallback-6740-thread-1) [    ] o.a.s.c.c.ConnectionManager zkClient has connected
   [junit4]   2> 659582 INFO  (jetty-launcher-6650-thread-3) [n:127.0.0.1:45881_solr    ] o.a.s.c.c.ZkStateReader Updated live nodes from ZooKeeper... (0) -> (4)
   [junit4]   2> 659583 INFO  (jetty-launcher-6650-thread-5) [n:127.0.0.1:36303_solr    ] o.a.s.m.r.SolrJmxReporter JMX monitoring for 'solr_36303.solr.node' (registry 'solr.node') enabled at server: com.sun.jmx.mbeanserver.JmxMBeanServer@41369b00
   [junit4]   2> 659584 INFO  (jetty-launcher-6650-thread-3) [n:127.0.0.1:45881_solr    ] o.a.s.c.ZkController Publish node=127.0.0.1:45881_solr as DOWN
   [junit4]   2> 659584 INFO  (jetty-launcher-6650-thread-3) [n:127.0.0.1:45881_solr    ] o.a.s.c.TransientSolrCoreCacheDefault Allocating transient cache for 2147483647 transient cores
   [junit4]   2> 659584 INFO  (jetty-launcher-6650-thread-3) [n:127.0.0.1:45881_solr    ] o.a.s.c.ZkController Register node as live in ZooKeeper:/live_nodes/127.0.0.1:45881_solr
   [junit4]   2> 659585 INFO  (zkCallback-6712-thread-1) [    ] o.a.s.c.c.ZkStateReader Updated live nodes from ZooKeeper... (4) -> (5)
   [junit4]   2> 659585 INFO  (zkCallback-6686-thread-1) [    ] o.a.s.c.c.ZkStateReader Updated live nodes from ZooKeeper... (4) -> (5)
   [junit4]   2> 659585 INFO  (zkCallback-6706-thread-1) [    ] o.a.s.c.c.ZkStateReader Updated live nodes from ZooKeeper... (4) -> (5)
   [junit4]   2> 659585 INFO  (zkCallback-6701-thread-1) [    ] o.a.s.c.c.ZkStateReader Updated live nodes from ZooKeeper... (4) -> (5)
   [junit4]   2> 659585 INFO  (zkCallback-6682-thread-1) [    ] o.a.s.c.c.ZkStateReader Updated live nodes from ZooKeeper... (4) -> (5)
   [junit4]   2> 659585 INFO  (zkCallback-6717-thread-1) [    ] o.a.s.c.c.ZkStateReader Updated live nodes from ZooKeeper... (4) -> (5)
   [junit4]   2> 659585 INFO  (zkCallback-6739-thread-1) [    ] o.a.s.c.c.ZkStateReader Updated live nodes from ZooKeeper... (4) -> (5)
   [junit4]   2> 659588 INFO  (zkCallback-6722-thread-1) [    ] o.a.s.c.c.ZkStateReader Updated live nodes from ZooKeeper... (4) -> (5)
   [junit4]   2> 659589 INFO  (zkCallback-6731-thread-1) [    ] o.a.s.c.c.ZkStateReader Updated live nodes from ZooKeeper... (4) -> (5)
   [junit4]   2> 659590 INFO  (jetty-launcher-6650-thread-5) [n:127.0.0.1:36303_solr    ] o.a.s.m.r.SolrJmxReporter JMX monitoring for 'solr_36303.solr.jvm' (registry 'solr.jvm') enabled at server: com.sun.jmx.mbeanserver.JmxMBeanServer@41369b00
   [junit4]   2> 659590 INFO  (jetty-launcher-6650-thread-5) [n:127.0.0.1:36303_solr    ] o.a.s.m.r.SolrJmxReporter JMX monitoring for 'solr_36303.solr.jetty' (registry 'solr.jetty') enabled at server: com.sun.jmx.mbeanserver.JmxMBeanServer@41369b00
   [junit4]   2> 659590 INFO  (jetty-launcher-6650-thread-5) [n:127.0.0.1:36303_solr    ] o.a.s.c.CorePropertiesLocator Found 0 core definitions underneath /home/jenkins/workspace/Lucene-Solr-8.1-Linux/solr/build/solr-core/test/J2/temp/solr.cloud.OverseerRolesTest_DA152185F662232C-001/tempDir-001/node5/.
   [junit4]   2> 659599 INFO  (jetty-launcher-6650-thread-1) [    ] o.a.s.h.c.HttpShardHandlerFactory Host whitelist initialized: WhitelistHostChecker [whitelistHosts=null, whitelistHostCheckingEnabled=true]
   [junit4]   2> 659599 WARN  (jetty-launcher-6650-thread-1) [    ] o.a.s.c.s.i.Http2SolrClient Create Http2SolrClient with HTTP/1.1 transport since Java 8 or lower versions does not support SSL + HTTP/2
   [junit4]   2> 659599 WARN  (jetty-launcher-6650-thread-1) [    ] o.e.j.u.s.S.config No Client EndPointIdentificationAlgorithm configured for SslContextFactory@13b20aee[provider=null,keyStore=null,trustStore=null]
   [junit4]   2> 659600 INFO  (zkConnectionManagerCallback-6748-thread-1) [    ] o.a.s.c.c.ConnectionManager zkClient has connected
   [junit4]   2> 659601 INFO  (jetty-launcher-6650-thread-3) [n:127.0.0.1:45881_solr    ] o.a.s.c.c.ZkStateReader Updated live nodes from ZooKeeper... (0) -> (5)
   [junit4]   2> 659601 WARN  (jetty-launcher-6650-thread-1) [    ] o.a.s.c.s.i.Http2SolrClient Create Http2SolrClient with HTTP/1.1 transport since Java 8 or lower versions does not support SSL + HTTP/2
   [junit4]   2> 659601 INFO  (jetty-launcher-6650-thread-3) [n:127.0.0.1:45881_solr    ] o.a.s.c.s.i.ZkClientClusterStateProvider Cluster at 127.0.0.1:42919/solr ready
   [junit4]   2> 659602 WARN  (jetty-launcher-6650-thread-1) [    ] o.e.j.u.s.S.config No Client EndPointIdentificationAlgorithm configured for SslContextFactory@15ce3d71[provider=null,keyStore=null,trustStore=null]
   [junit4]   2> 659602 INFO  (jetty-launcher-6650-thread-1) [    ] o.a.s.c.ZkContainer Zookeeper client=127.0.0.1:42919/solr
   [junit4]   2> 659605 INFO  (jetty-launcher-6650-thread-3) [n:127.0.0.1:45881_solr    ] o.a.s.h.a.MetricsHistoryHandler No .system collection, keeping metrics history in memory.
   [junit4]   2> 659605 INFO  (zkConnectionManagerCallback-6754-thread-1) [    ] o.a.s.c.c.ConnectionManager zkClient has connected
   [junit4]   2> 659616 INFO  (zkConnectionManagerCallback-6756-thread-1) [    ] o.a.s.c.c.ConnectionManager zkClient has connected
   [junit4]   2> 659618 INFO  (jetty-launcher-6650-thread-3) [n:127.0.0.1:45881_solr    ] o.a.s.m.r.SolrJmxReporter JMX monitoring for 'solr_45881.solr.node' (registry 'solr.node') enabled at server: com.sun.jmx.mbeanserver.JmxMBeanServer@41369b00
   [junit4]   2> 659619 INFO  (jetty-launcher-6650-thread-1) [n:127.0.0.1:33821_solr    ] o.a.s.c.c.ZkStateReader Updated live nodes from ZooKeeper... (0) -> (5)
   [junit4]   2> 659621 INFO  (jetty-launcher-6650-thread-1) [n:127.0.0.1:33821_solr    ] o.a.s.c.ZkController Publish node=127.0.0.1:33821_solr as DOWN
   [junit4]   2> 659621 INFO  (jetty-launcher-6650-thread-1) [n:127.0.0.1:33821_solr    ] o.a.s.c.TransientSolrCoreCacheDefault Allocating transient cache for 2147483647 transient cores
   [junit4]   2> 659621 INFO  (jetty-launcher-6650-thread-1) [n:127.0.0.1:33821_solr    ] o.a.s.c.ZkController Register node as live in ZooKeeper:/live_nodes/127.0.0.1:33821_solr
   [junit4]   2> 659622 INFO  (zkCallback-6717-thread-1) [    ] o.a.s.c.c.ZkStateReader Updated live nodes from ZooKeeper... (5) -> (6)
   [junit4]   2> 659622 INFO  (zkCallback-6686-thread-1) [    ] o.a.s.c.c.ZkStateReader Updated live nodes from ZooKeeper... (5) -> (6)
   [junit4]   2> 659622 INFO  (zkCallback-6706-thread-1) [    ] o.a.s.c.c.ZkStateReader Updated live nodes from ZooKeeper... (5) -> (6)
   [junit4]   2> 659622 INFO  (zkCallback-6712-thread-1) [    ] o.a.s.c.c.ZkStateReader Updated live nodes from ZooKeeper... (5) -> (6)
   [junit4]   2> 659622 INFO  (zkCallback-6722-thread-1) [    ] o.a.s.c.c.ZkStateReader Updated live nodes from ZooKeeper... (5) -> (6)
   [junit4]   2> 659622 INFO  (zkCallback-6701-thread-1) [    ] o.a.s.c.c.ZkStateReader Updated live nodes from ZooKeeper... (5) -> (6)
   [junit4]   2> 659622 INFO  (zkCallback-6682-thread-1) [    ] o.a.s.c.c.ZkStateReader Updated live nodes from ZooKeeper... (5) -> (6)
   [junit4]   2> 659622 INFO  (zkCallback-6739-thread-1) [    ] o.a.s.c.c.ZkStateReader Updated live nodes from ZooKeeper... (5) -> (6)
   [junit4]   2> 659622 INFO  (zkCallback-6731-thread-1) [    ] o.a.s.c.c.ZkStateReader Updated live nodes from ZooKeeper... (5) -> (6)
   [junit4]   2> 659622 INFO  (zkCallback-6747-thread-1) [    ] o.a.s.c.c.ZkStateReader Updated live nodes from ZooKeeper... (5) -> (6)
   [junit4]   2> 659622 INFO  (zkCallback-6755-thread-1) [    ] o.a.s.c.c.ZkStateReader Updated live nodes from ZooKeeper... (5) -> (6)
   [junit4]   2> 659627 INFO  (jetty-launcher-6650-thread-3) [n:127.0.0.1:45881_solr    ] o.a.s.m.r.SolrJmxReporter JMX monitoring for 'solr_45881.solr.jvm' (registry 'solr.jvm') enabled at server: com.sun.jmx.mbeanserver.JmxMBeanServer@41369b00
   [junit4]   2> 659627 INFO  (jetty-launcher-6650-thread-3) [n:127.0.0.1:45881_solr    ] o.a.s.m.r.SolrJmxReporter JMX monitoring for 'solr_45881.solr.jetty' (registry 'solr.jetty') enabled at server: com.sun.jmx.mbeanserver.JmxMBeanServer@41369b00
   [junit4]   2> 659628 INFO  (jetty-launcher-6650-thread-3) [n:127.0.0.1:45881_solr    ] o.a.s.c.CorePropertiesLocator Found 0 core definitions underneath /home/jenkins/workspace/Lucene-Solr-8.1-Linux/solr/build/solr-core/test/J2/temp/solr.cloud.OverseerRolesTest_DA152185F662232C-001/tempDir-001/node3/.
   [junit4]   2> 659656 INFO  (zkConnectionManagerCallback-6763-thread-1) [    ] o.a.s.c.c.ConnectionManager zkClient has connected
   [junit4]   2> 659657 INFO  (jetty-launcher-6650-thread-1) [n:127.0.0.1:33821_solr    ] o.a.s.c.c.ZkStateReader Updated live nodes from ZooKeeper... (0) -> (6)
   [junit4]   2> 659657 INFO  (jetty-launcher-6650-thread-1) [n:127.0.0.1:33821_solr    ] o.a.s.c.s.i.ZkClientClusterStateProvider Cluster at 127.0.0.1:42919/solr ready
   [junit4]   2> 659660 INFO  (jetty-launcher-6650-thread-1) [n:127.0.0.1:33821_solr    ] o.a.s.h.a.MetricsHistoryHandler No .system collection, keeping metrics history in memory.
   [junit4]   2> 659675 INFO  (jetty-launcher-6650-thread-1) [n:127.0.0.1:33821_solr    ] o.a.s.m.r.SolrJmxReporter JMX monitoring for 'solr_33821.solr.node' (registry 'solr.node') enabled at server: com.sun.jmx.mbeanserver.JmxMBeanServer@41369b00
   [junit4]   2> 659683 INFO  (jetty-launcher-6650-thread-1) [n:127.0.0.1:33821_solr    ] o.a.s.m.r.SolrJmxReporter JMX monitoring for 'solr_33821.solr.jvm' (registry 'solr.jvm') enabled at server: com.sun.jmx.mbeanserver.JmxMBeanServer@41369b00
   [junit4]   2> 659683 INFO  (jetty-launcher-6650-thread-1) [n:127.0.0.1:33821_solr    ] o.a.s.m.r.SolrJmxReporter JMX monitoring for 'solr_33821.solr.jetty' (registry 'solr.jetty') enabled at server: com.sun.jmx.mbeanserver.JmxMBeanServer@41369b00
   [junit4]   2> 659684 INFO  (jetty-launcher-6650-thread-1) [n:127.0.0.1:33821_solr    ] o.a.s.c.CorePropertiesLocator Found 0 core definitions underneath /home/jenkins/workspace/Lucene-Solr-8.1-Linux/solr/build/solr-core/test/J2/temp/solr.cloud.OverseerRolesTest_DA152185F662232C-001/tempDir-001/node1/.
   [junit4]   2> 659725 INFO  (zkConnectionManagerCallback-6769-thread-1) [    ] o.a.s.c.c.ConnectionManager zkClient has connected
   [junit4]   2> 659725 INFO  (SUITE-OverseerRolesTest-seed#[DA152185F662232C]-worker) [    ] o.a.s.c.c.ZkStateReader Updated live nodes from ZooKeeper... (0) -> (6)
   [junit4]   2> 659726 INFO  (SUITE-OverseerRolesTest-seed#[DA152185F662232C]-worker) [    ] o.a.s.c.s.i.ZkClientClusterStateProvider Cluster at 127.0.0.1:42919/solr ready
   [junit4]   2> 659784 INFO  (TEST-OverseerRolesTest.testOverseerRole-seed#[DA152185F662232C]) [    ] o.a.s.SolrTestCaseJ4 ###Starting testOverseerRole
   [junit4]   2> 659784 INFO  (TEST-OverseerRolesTest.testOverseerRole-seed#[DA152185F662232C]) [    ] o.a.s.c.OverseerRolesTest Overseer: 127.0.0.1:45699_solr
   [junit4]   2> 659784 INFO  (TEST-OverseerRolesTest.testOverseerRole-seed#[DA152185F662232C]) [    ] o.a.s.c.OverseerRolesTest Election queue: 
   [junit4]   2> 659798 INFO  (qtp1859449043-18269) [n:127.0.0.1:33959_solr    ] o.a.s.h.a.CollectionsHandler Invoked Collection Action :removerole with params node=127.0.0.1:45699_solr&role=overseer&action=REMOVEROLE&wt=javabin&version=2 and sendToOCPQueue=true
   [junit4]   2> 659800 INFO  (OverseerThreadFactory-6027-thread-1-processing-n:127.0.0.1:45699_solr) [n:127.0.0.1:45699_solr    ] o.a.s.c.a.c.OverseerRoleCmd Overseer role removed from 127.0.0.1:45699_solr
   [junit4]   2> 659802 INFO  (qtp1859449043-18269) [n:127.0.0.1:33959_solr    ] o.a.s.s.HttpSolrCall [admin] webapp=null path=/admin/collections params={node=127.0.0.1:45699_solr&role=overseer&action=REMOVEROLE&wt=javabin&version=2} status=0 QTime=4
   [junit4]   2> 659803 INFO  (qtp1859449043-18272) [n:127.0.0.1:33959_solr    ] o.a.s.h.a.CollectionsHandler Invoked Collection Action :removerole with params node=127.0.0.1:33959_solr&role=overseer&action=REMOVEROLE&wt=javabin&version=2 and sendToOCPQueue=true
   [junit4]   2> 659804 INFO  (OverseerCollectionConfigSetProcessor-72189925360402443-127.0.0.1:45699_solr-n_0000000000) [n:127.0.0.1:45699_solr    ] o.a.s.c.OverseerTaskQueue Response ZK path: /overseer/collection-queue-work/qnr-0000000000 doesn't exist.  Requestor may have disconnected from ZooKeeper
   [junit4]   2> 659804 INFO  (OverseerThreadFactory-6027-thread-2-processing-n:127.0.0.1:45699_solr) [n:127.0.0.1:45699_solr    ] o.a.s.c.a.c.OverseerRoleCmd Overseer role removed from 127.0.0.1:33959_solr
   [junit4]   2> 659805 INFO  (qtp1859449043-18272) [n:127.0.0.1:33959_solr    ] o.a.s.s.HttpSolrCall [admin] webapp=null path=/admin/collections params={node=127.0.0.1:33959_solr&role=overseer&action=REMOVEROLE&wt=javabin&version=2} status=0 QTime=1
   [junit4]   2> 659805 INFO  (qtp1859449043-18285) [n:127.0.0.1:33959_solr    ] o.a.s.h.a.CollectionsHandler Invoked Collection Action :removerole with params node=127.0.0.1:44515_solr&role=overseer&action=REMOVEROLE&wt=javabin&version=2 and sendToOCPQueue=true
   [junit4]   2> 659806 INFO  (OverseerCollectionConfigSetProcessor-72189925360402443-127.0.0.1:45699_solr-n_0000000000) [n:127.0.0.1:45699_solr    ] o.a.s.c.OverseerTaskQueue Response ZK path: /overseer/collection-queue-work/qnr-0000000002 doesn't exist.  Requestor may have disconnected from ZooKeeper
   [junit4]   2> 659806 INFO  (OverseerThreadFactory-6027-thread-3-processing-n:127.0.0.1:45699_solr) [n:127.0.0.1:45699_solr    ] o.a.s.c.a.c.OverseerRoleCmd Overseer role removed from 127.0.0.1:44515_solr
   [junit4]   2> 659807 INFO  (qtp1859449043-18285) [n:127.0.0.1:33959_solr    ] o.a.s.s.HttpSolrCall [admin] webapp=null path=/admin/collections params={node=127.0.0.1:44515_solr&role=overseer&action=REMOVEROLE&wt=javabin&version=2} status=0 QTime=2
   [junit4]   2> 659808 INFO  (qtp1859449043-18269) [n:127.0.0.1:33959_solr    ] o.a.s.h.a.CollectionsHandler Invoked Collection Action :removerole with params node=127.0.0.1:36303_solr&role=overseer&action=REMOVEROLE&wt=javabin&version=2 and sendToOCPQueue=true
   [junit4]   2> 659814 INFO  (OverseerThreadFactory-6027-thread-4-processing-n:127.0.0.1:45699_solr) [n:127.0.0.1:45699_solr    ] o.a.s.c.a.c.OverseerRoleCmd Overseer role removed from 127.0.0.1:36303_solr
   [junit4]   2> 659814 INFO  (OverseerCollectionConfigSetProcessor-72189925360402443-127.0.0.1:45699_solr-n_0000000000) [n:127.0.0.1:45699_solr    ] o.a.s.c.OverseerTaskQueue Response ZK path: /overseer/collection-queue-work/qnr-0000000004 doesn't exist.  Requestor may have disconnected from ZooKeeper
   [junit4]   2> 659817 INFO  (qtp1859449043-18269) [n:127.0.0.1:33959_solr    ] o.a.s.s.HttpSolrCall [admin] webapp=null path=/admin/collections params={node=127.0.0.1:36303_solr&role=overseer&action=REMOVEROLE&wt=javabin&version=2} status=0 QTime=9
   [junit4]   2> 659818 INFO  (qtp1859449043-18272) [n:127.0.0.1:33959_solr    ] o.a.s.h.a.CollectionsHandler Invoked Collection Action :removerole with params node=127.0.0.1:45881_solr&role=overseer&action=REMOVEROLE&wt=javabin&version=2 and sendToOCPQueue=true
   [junit4]   2> 659819 INFO  (OverseerCollectionConfigSetProcessor-72189925360402443-127.0.0.1:45699_solr-n_0000000000) [n:127.0.0.1:45699_solr    ] o.a.s.c.OverseerTaskQueue Response ZK path: /overseer/collection-queue-work/qnr-0000000006 doesn't exist.  Requestor may have disconnected from ZooKeeper
   [junit4]   2> 659819 INFO  (OverseerThreadFactory-6027-thread-5-processing-n:127.0.0.1:45699_solr) [n:127.0.0.1:45699_solr    ] o.a.s.c.a.c.OverseerRoleCmd Overseer role removed from 127.0.0.1:45881_solr
   [junit4]   2> 659820 INFO  (qtp1859449043-18272) [n:127.0.0.1:33959_solr    ] o.a.s.s.HttpSolrCall [admin] webapp=null path=/admin/collections params={node=127.0.0.1:45881_solr&role=overseer&action=REMOVEROLE&wt=javabin&version=2} status=0 QTime=2
   [junit4]   2> 659821 INFO  (qtp1859449043-18285) [n:127.0.0.1:33959_solr    ] o.a.s.h.a.CollectionsHandler Invoked Collection Action :removerole with params node=127.0.0.1:33821_solr&role=overseer&action=REMOVEROLE&wt=javabin&version=2 and sendToOCPQueue=true
   [junit4]   2> 659822 INFO  (OverseerCollectionConfigSetProcessor-72189925360402443-127.0.0.1:45699_solr-n_0000000000) [n:127.0.0.1:45699_solr    ] o.a.s.c.OverseerTaskQueue Response ZK path: /overseer/collection-queue-work/qnr-0000000008 doesn't exist.  Requestor may have disconnected from ZooKeeper
   [junit4]   2> 659822 INFO  (OverseerThreadFactory-6027-thread-5-processing-n:127.0.0.1:45699_solr) [n:127.0.0.1:45699_solr    ] o.a.s.c.a.c.OverseerRoleCmd Overseer role removed from 127.0.0.1:33821_solr
   [junit4]   2> 659825 INFO  (qtp1859449043-18285) [n:127.0.0.1:33959_solr    ] o.a.s.s.HttpSolrCall [admin] webapp=null path=/admin/collections params={node=127.0.0.1:33821_solr&role=overseer&action=REMOVEROLE&wt=javabin&version=2} status=0 QTime=4
   [junit4]   2> 659825 INFO  (TEST-OverseerRolesTest.testOverseerRole-seed#[DA152185F662232C]) [    ] o.a.s.c.OverseerRolesTest ### Setting overseer designate 127.0.0.1:33959_solr
   [junit4]   2> 659827 INFO  (qtp1859449043-18269) [n:127.0.0.1:33959_solr    ] o.a.s.h.a.CollectionsHandler Invoked Collection Action :addrole with params node=127.0.0.1:33959_solr&role=overseer&action=ADDROLE&wt=javabin&version=2 and sendToOCPQueue=true
   [junit4]   2> 659828 INFO  (OverseerCollectionConfigSetProcessor-72189925360402443-127.0.0.1:45699_solr-n_0000000000) [n:127.0.0.1:45699_solr    ] o.a.s.c.OverseerTaskQueue Response ZK path: /overseer/collection-queue-work/qnr-0000000010 doesn't exist.  Requestor may have disconnected from ZooKeeper
   [junit4]   2> 659828 INFO  (OverseerThreadFactory-6027-thread-5-processing-n:127.0.0.1:45699_solr) [n:127.0.0.1:45699_solr    ] o.a.s.c.a.c.OverseerRoleCmd Overseer role added to 127.0.0.1:33959_solr
   [junit4]   2> 659829 INFO  (Thread-3021) [    ] o.a.s.c.OverseerNodePrioritizer prioritizing overseer nodes at 72189925360402443-127.0.0.1:45699_solr-n_0000000000 overseer designates are [127.0.0.1:33959_solr]
   [junit4]   2> 659830 INFO  (qtp1859449043-18269) [n:127.0.0.1:33959_solr    ] o.a.s.s.HttpSolrCall [admin] webapp=null path=/admin/collections params={node=127.0.0.1:33959_solr&role=overseer&action=ADDROLE&wt=javabin&version=2} status=0 QTime=2
   [junit4]   2> 659830 INFO  (TEST-OverseerRolesTest.testOverseerRole-seed#[DA152185F662232C]) [    ] o.a.s.c.OverseerRolesTest Expecting node: 127.0.0.1:33959_solr
   [junit4]   2> 659830 INFO  (Thread-3021) [    ] o.a.s.c.OverseerNodePrioritizer sorted nodes [72189925360402443-127.0.0.1:45699_solr-n_0000000000, 72189925360402444-127.0.0.1:33959_solr-n_0000000001, 72189925360402449-127.0.0.1:44515_solr-n_0000000002, 72189925360402451-127.0.0.1:36303_solr-n_0000000003, 72189925360402454-127.0.0.1:45881_solr-n_0000000004, 72189925360402457-127.0.0.1:33821_solr-n_0000000005]
   [junit4]   2> 659831 INFO  (OverseerStateUpdate-72189925360402443-127.0.0.1:45699_solr-n_0000000000) [n:127.0.0.1:45699_solr    ] o.a.s.c.Overseer Quit command received {
   [junit4]   2>   "operation":"quit",
   [junit4]   2>   "id":"72189925360402443-127.0.0.1:45699_solr-n_0000000000"} 127.0.0.1:45699_solr
   [junit4]   2> 659832 INFO  (OverseerStateUpdate-72189925360402443-127.0.0.1:45699_solr-n_0000000000) [n:127.0.0.1:45699_solr    ] o.a.s.c.Overseer Overseer Loop exiting : 127.0.0.1:45699_solr
   [junit4]   2> 659832 WARN  (OverseerExitThread) [    ] o.a.s.c.Overseer I (id=72189925360402443-127.0.0.1:45699_solr-n_0000000000) am exiting, but I'm still the leader
   [junit4]   2> 659833 INFO  (OverseerExitThread) [    ] o.a.s.c.Overseer Overseer (id=72189925360402443-127.0.0.1:45699_solr-n_0000000000) closing
   [junit4]   2> 659833 INFO  (OverseerAutoScalingTriggerThread-72189925360402443-127.0.0.1:45699_solr-n_0000000000) [    ] o.a.s.c.a.OverseerTriggerThread OverseerTriggerThread woken up but we are closed, exiting.
   [junit4]   2> 659834 INFO  (zkCallback-6686-thread-1) [    ] o.a.s.c.OverseerElectionContext I am going to be the leader 127.0.0.1:33959_solr
   [junit4]   2> 659835 INFO  (OverseerExitThread) [    ] o.a.s.c.Overseer Overseer (id=72189925360402443-127.0.0.1:45699_solr-n_0000000000) closing
   [junit4]   2> 659835 INFO  (OverseerExitThread) [    ] o.a.s.c.Overseer Overseer (id=72189925360402443-127.0.0.1:45699_solr-n_0000000000) closing
   [junit4]   2> 659836 INFO  (OverseerExitThread) [    ] o.a.s.c.Overseer Overseer (id=72189925360402443-127.0.0.1:45699_solr-n_0000000000) closing
   [junit4]   2> 659836 INFO  (zkCallback-6686-thread-1) [n:127.0.0.1:33959_solr    ] o.a.s.c.Overseer Overseer (id=72189925360402444-127.0.0.1:33959_solr-n_0000000001) starting
   [junit4]   2> 659837 INFO  (OverseerStateUpdate-72189925360402444-127.0.0.1:33959_solr-n_0000000001) [n:127.0.0.1:33959_solr    ] o.a.s.c.Overseer Starting to work on the main queue : 127.0.0.1:33959_solr
   [junit4]   2> 659931 INFO  (TEST-OverseerRolesTest.testOverseerRole-seed#[DA152185F662232C]) [    ] o.a.s.c.OverseerRolesTest ### Adding another overseer designate 127.0.0.1:44515_solr
   [junit4]   2> 659932 INFO  (qtp1859449043-18272) [n:127.0.0.1:33959_solr    ] o.a.s.h.a.CollectionsHandler Invoked Collection Action :addrole with params node=127.0.0.1:44515_solr&role=overseer&action=ADDROLE&wt=javabin&version=2 and sendToOCPQueue=true
   [junit4]   2> 659935 INFO  (OverseerThreadFactory-6058-thread-1-processing-n:127.0.0.1:33959_solr) [n:127.0.0.1:33959_solr    ] o.a.s.c.a.c.OverseerRoleCmd Overseer role added to 127.0.0.1:44515_solr
   [junit4]   2> 659937 INFO  (qtp1859449043-18272) [n:127.0.0.1:33959_solr    ] o.a.s.s.HttpSolrCall [admin] webapp=null path=/admin/collections params={node=127.0.0.1:44515_solr&role=overseer&action=ADDROLE&wt=javabin&version=2} status=0 QTime=4
   [junit4]   2> 659937 INFO  (TEST-OverseerRolesTest.testOverseerRole-seed#[DA152185F662232C]) [    ] o.a.s.c.OverseerRolesTest Overseer: 127.0.0.1:33959_solr
   [junit4]   2> 659937 INFO  (TEST-OverseerRolesTest.testOverseerRole-seed#[DA152185F662232C]) [    ] o.a.s.c.OverseerRolesTest Election queue: 
   [junit4]   2> 659937 INFO  (TEST-OverseerRolesTest.testOverseerRole-seed#[DA152185F662232C]) [    ] o.a.s.c.CoreContainer Shutting down CoreContainer instance=2132132318
   [junit4]   2> 659937 INFO  (TEST-OverseerRolesTest.testOverseerRole-seed#[DA152185F662232C]) [    ] o.a.s.c.ZkController Remove node as live in ZooKeeper:/live_nodes/127.0.0.1:33959_solr
   [junit4]   2> 659938 INFO  (TEST-OverseerRolesTest.testOverseerRole-seed#[DA152185F662232C]) [    ] o.a.s.c.ZkController Publish this node as DOWN...
   [junit4]   2> 659938 INFO  (TEST-OverseerRolesTest.testOverseerRole-seed#[DA152185F662232C]) [    ] o.a.s.c.ZkController Publish node=127.0.0.1:33959_solr as DOWN
   [junit4]   2> 659938 INFO  (TEST-OverseerRolesTest.testOverseerRole-seed#[DA152185F662232C]) [    ] o.a.s.c.TransientSolrCoreCacheDefault Allocating transient cache for 2147483647 transient cores
   [junit4]   2> 659939 INFO  (TEST-OverseerRolesTest.testOverseerRole-seed#[DA152185F662232C]) [    ] o.a.s.m.SolrMetricManager Closing metric reporters for registry=solr.node, tag=null
   [junit4]   2> 659939 INFO  (TEST-OverseerRolesTest.testOverseerRole-seed#[DA152185F662232C]) [    ] o.a.s.m.r.SolrJmxReporter Closing reporter [org.apache.solr.metrics.reporters.SolrJmxReporter@35552e72: rootName = solr_33959, domain = solr.node, service url = null, agent id = null] for registry solr.node / com.codahale.metrics.MetricRegistry@28c36992
   [junit4]   2> 659943 INFO  (TEST-OverseerRolesTest.testOverseerRole-seed#[DA152185F662232C]) [    ] o.a.s.m.SolrMetricManager Closing metric reporters for registry=solr.jvm, tag=null
   [junit4]   2> 659943 INFO  (TEST-OverseerRolesTest.testOverseerRole-seed#[DA152185F662232C]) [    ] o.a.s.m.r.SolrJmxReporter Closing reporter [org.apache.solr.metrics.reporters.SolrJmxReporter@26b60005: rootName = solr_33959, domain = solr.jvm, service url = null, agent id = null] for registry solr.jvm / com.codahale.metrics.MetricRegistry@45d9bbf5
   [junit4]   2> 659945 INFO  (TEST-OverseerRolesTest.testOverseerRole-seed#[DA152185F662232C]) [    ] o.a.s.m.SolrMetricManager Closing metric reporters for registry=solr.jetty, tag=null
   [junit4]   2> 659945 INFO  (TEST-OverseerRolesTest.testOverseerRole-seed#[DA152185F662232C]) [    ] o.a.s.m.r.SolrJmxReporter Closing reporter [org.apache.solr.metrics.reporters.SolrJmxReporter@afdc957: rootName = solr_33959, domain = solr.jetty, service url = null, agent id = null] for registry solr.jetty / com.codahale.metrics.MetricRegistry@5b33b777
   [junit4]   2> 659945 INFO  (TEST-OverseerRolesTest.testOverseerRole-seed#[DA152185F662232C]) [    ] o.a.s.m.SolrMetricManager Closing metric reporters for registry=solr.cluster, tag=null
   [junit4]   2> 659945 INFO  (closeThreadPool-6773-thread-2) [    ] o.a.s.c.Overseer Overseer (id=72189925360402444-127.0.0.1:33959_solr-n_0000000001) closing
   [junit4]   2> 659946 INFO  (OverseerStateUpdate-72189925360402444-127.0.0.1:33959_solr-n_0000000001) [n:127.0.0.1:33959_solr    ] o.a.s.c.Overseer Overseer Loop exiting : 127.0.0.1:33959_solr
   [junit4]   2> 659946 INFO  (OverseerAutoScalingTriggerThread-72189925360402444-127.0.0.1:33959_solr-n_0000000001) [    ] o.a.s.c.a.OverseerTriggerThread OverseerTriggerThread woken up but we are closed, exiting.
   [junit4]   2> 659948 INFO  (closeThreadPool-6773-thread-1) [    ] o.a.s.c.Overseer Overseer (id=72189925360402444-127.0.0.1:33959_solr-n_0000000001) closing
   [junit4]   2> 659948 INFO  (TEST-OverseerRolesTest.testOverseerRole-seed#[DA152185F662232C]) [    ] o.a.s.c.Overseer Overseer (id=72189925360402444-127.0.0.1:33959_solr-n_0000000001) closing
   [junit4]   2> 659948 WARN  (NIOServerCxn.Factory:0.0.0.0/0.0.0.0:0) [    ] o.a.z.s.NIOServerCnxn Unable to read additional data from client sessionid 0x100785ac978000c, likely client has closed socket
   [junit4]   2> 659948 INFO  (zkCallback-6712-thread-1) [    ] o.a.s.c.OverseerElectionContext I am going to be the leader 127.0.0.1:44515_solr
   [junit4]   2> 659948 INFO  (zkCallback-6722-thread-1) [    ] o.a.s.c.c.ZkStateReader Updated live nodes from ZooKeeper... (6) -> (5)
   [junit4]   2> 659948 INFO  (zkCallback-6701-thread-1) [    ] o.a.s.c.c.ZkStateReader Updated live nodes from ZooKeeper... (6) -> (5)
   [junit4]   2> 659948 INFO  (zkCallback-6717-thread-1) [    ] o.a.s.c.c.ZkStateReader Updated live nodes from ZooKeeper... (6) -> (5)
   [junit4]   2> 659948 INFO  (zkCallback-6739-thread-1) [    ] o.a.s.c.c.ZkStateReader Updated live nodes from ZooKeeper... (6) -> (5)
   [junit4]   2> 659948 INFO  (zkCallback-6755-thread-1) [    ] o.a.s.c.c.ZkStateReader Updated live nodes from ZooKeeper... (6) -> (5)
   [junit4]   2> 659948 INFO  (zkCallback-6682-thread-1) [    ] o.a.s.c.c.ZkStateReader Updated live nodes from ZooKeeper... (6) -> (5)
   [junit4]   2> 659948 INFO  (zkCallback-6712-thread-2) [    ] o.a.s.c.c.ZkStateReader Updated live nodes from ZooKeeper... (6) -> (5)
   [junit4]   2> 659948 INFO  (zkCallback-6731-thread-1) [    ] o.a.s.c.c.ZkStateReader Updated live nodes from ZooKeeper... (6) -> (5)
   [junit4]   2> 659948 INFO  (zkCallback-6768-thread-1) [    ] o.a.s.c.c.ZkStateReader Updated live nodes from ZooKeeper... (6) -> (5)
   [junit4]   2> 659948 INFO  (zkCallback-6712-thread-1) [n:127.0.0.1:44515_solr    ] o.a.s.c.Overseer Overseer (id=72189925360402449-127.0.0.1:44515_solr-n_0000000002) starting
   [junit4]   2> 659948 INFO  (zkCallback-6762-thread-1) [    ] o.a.s.c.c.ZkStateReader Updated live nodes from ZooKeeper... (6) -> (5)
   [junit4]   2> 659948 INFO  (zkCallback-6747-thread-1) [    ] o.a.s.c.c.ZkStateReader Updated live nodes from ZooKeeper... (6) -> (5)
   [junit4]   2> 659949 INFO  (TEST-OverseerRolesTest.testOverseerRole-seed#[DA152185F662232C]) [    ] o.e.j.s.AbstractConnector Stopped ServerConnector@5bcdd4fe{SSL,[ssl, http/1.1]}{127.0.0.1:0}
   [junit4]   2> 659949 INFO  (TEST-OverseerRolesTest.testOverseerRole-seed#[DA152185F662232C]) [    ] o.e.j.s.h.ContextHandler Stopped o.e.j.s.ServletContextHandler@116b719a{/solr,null,UNAVAILABLE}
   [junit4]   2> 659949 INFO  (TEST-OverseerRolesTest.testOverseerRole-seed#[DA152185F662232C]) [    ] o.e.j.s.session node0 Stopped scavenging
   [junit4]   2> 659949 INFO  (TEST-OverseerRolesTest.testOverseerRole-seed#[DA152185F662232C]) [    ] o.a.s.c.OverseerRolesTest Expecting node: 127.0.0.1:44515_solr
   [junit4]   2> 659949 INFO  (TEST-OverseerRolesTest.testOverseerRole-seed#[DA152185F662232C]) [    ] o.a.s.c.OverseerRolesTest ### Adding last overseer designate 127.0.0.1:45881_solr
   [junit4]   2> 659952 INFO  (OverseerStateUpdate-72189925360402449-127.0.0.1:44515_solr-n_0000000002) [n:127.0.0.1:44515_solr    ] o.a.s.c.Overseer Starting to work on the main queue : 127.0.0.1:44515_solr
   [junit4]   2> 659956 INFO  (qtp1374346505-18277) [n:127.0.0.1:33821_solr    ] o.a.s.h.a.CollectionsHandler Invoked Collection Action :addrole with params node=127.0.0.1:45881_solr&role=overseer&action=ADDROLE&wt=javabin&version=2 and sendToOCPQueue=true
   [junit4]   2> 659958 INFO  (OverseerThreadFactory-6063-thread-1-processing-n:127.0.0.1:44515_solr) [n:127.0.0.1:44515_solr    ] o.a.s.c.a.c.OverseerRoleCmd Overseer role added to 127.0.0.1:45881_solr
   [junit4]   2> 659959 INFO  (qtp1374346505-18277) [n:127.0.0.1:33821_solr    ] o.a.s.s.HttpSolrCall [admin] webapp=null path=/admin/collections params={node=127.0.0.1:45881_solr&role=overseer&action=ADDROLE&wt=javabin&version=2} status=0 QTime=2
   [junit4]   2> 659959 INFO  (TEST-OverseerRolesTest.testOverseerRole-seed#[DA152185F662232C]) [    ] o.a.s.c.OverseerRolesTest Overseer: 127.0.0.1:44515_solr
   [junit4]   2> 659959 INFO  (TEST-OverseerRolesTest.testOverseerRole-seed#[DA152185F662232C]) [    ] o.a.s.c.OverseerRolesTest Election queue: 
   [junit4]   2> 659960 INFO  (qtp1374346505-18281) [n:127.0.0.1:33821_solr    ] o.a.s.h.a.CollectionsHandler Invoked Collection Action :removerole with params node=127.0.0.1:44515_solr&role=overseer&action=REMOVEROLE&wt=javabin&version=2 and sendToOCPQueue=true
   [junit4]   2> 659961 INFO  (OverseerCollectionConfigSetProcessor-72189925360402449-127.0.0.1:44515_solr-n_0000000002) [n:127.0.0.1:44515_solr    ] o.a.s.c.OverseerTaskQueue Response ZK path: /overseer/collection-queue-work/qnr-0000000016 doesn't exist.  Requestor may have disconnected from ZooKeeper
   [junit4]   2> 659962 INFO  (OverseerThreadFactory-6063-thread-2-processing-n:127.0.0.1:44515_solr) [n:127.0.0.1:44515_solr    ] o.a.s.c.a.c.OverseerRoleCmd Overseer role removed from 127.0.0.1:44515_solr
   [junit4]   2> 659962 INFO  (Thread-3025) [    ] o.a.s.c.OverseerNodePrioritizer prioritizing overseer nodes at 72189925360402449-127.0.0.1:44515_solr-n_0000000002 overseer designates are [127.0.0.1:33959_solr, 127.0.0.1:45881_solr]
   [junit4]   2> 659962 INFO  (Thread-3025) [    ] o.a.s.c.OverseerNodePrioritizer sorted nodes [72189925360402449-127.0.0.1:44515_solr-n_0000000002, 72189925360402451-127.0.0.1:36303_solr-n_0000000003, 72189925360402454-127.0.0.1:45881_solr-n_0000000004, 72189925360402457-127.0.0.1:33821_solr-n_0000000005, 72189925360402443-127.0.0.1:45699_solr-n_0000000006]
   [junit4]   2> 659962 INFO  (Thread-3025) [    ] o.a.s.c.OverseerNodePrioritizer asking node 72189925360402454-127.0.0.1:45881_solr-n_0000000004 to come join election at head
   [junit4]   2> 659962 INFO  (qtp1374346505-18281) [n:127.0.0.1:33821_solr    ] o.a.s.s.HttpSolrCall [admin] webapp=null path=/admin/collections params={node=127.0.0.1:44515_solr&role=overseer&action=REMOVEROLE&wt=javabin&version=2} status=0 QTime=2
   [junit4]   2> 659962 INFO  (TEST-OverseerRolesTest.testOverseerRole-seed#[DA152185F662232C]) [    ] o.a.s.c.OverseerRolesTest Expecting node: 127.0.0.1:45881_solr
   [junit4]   2> 659971 INFO  (qtp1187596106-18283) [n:127.0.0.1:45881_solr    ] o.a.s.s.HttpSolrCall [admin] webapp=null path=/admin/cores params={op=rejoinAtHead&qt=/admin/cores&action=OVERSEEROP&electionNode=72189925360402454-127.0.0.1:45881_solr-n_0000000004&wt=javabin&version=2} status=0 QTime=1
   [junit4]   2> 659971 INFO  (Thread-3025) [    ] o.a.s.c.OverseerNodePrioritizer asking the old first in line 72189925360402451-127.0.0.1:36303_solr-n_0000000003 to rejoin election  
   [junit4]   2> 659983 INFO  (qtp916121926-18271) [n:127.0.0.1:36303_solr    ] o.a.s.s.HttpSolrCall [admin] webapp=null path=/admin/cores params={op=rejoin&qt=/admin/cores&action=OVERSEEROP&electionNode=72189925360402451-127.0.0.1:36303_solr-n_0000000003&wt=javabin&version=2} status=0 QTime=3
   [junit4]   2> 659983 INFO  (OverseerStateUpdate-72189925360402449-127.0.0.1:44515_solr-n_0000000002) [n:127.0.0.1:44515_solr    ] o.a.s.c.Overseer Quit command received {
   [junit4]   2>   "operation":"quit",
   [junit4]   2>   "id":"72189925360402449-127.0.0.1:44515_solr-n_0000000002"} 127.0.0.1:44515_solr
   [junit4]   2> 659984 INFO  (OverseerStateUpdate-72189925360402449-127.0.0.1:44515_solr-n_0000000002) [n:127.0.0.1:44515_solr    ] o.a.s.c.Overseer Overseer Loop exiting : 127.0.0.1:44515_solr
   [junit4]   2> 659984 WARN  (OverseerExitThread) [    ] o.a.s.c.Overseer I (id=72189925360402449-127.0.0.1:44515_solr-n_0000000002) am exiting, but I'm still the leader
   [junit4]   2> 659985 INFO  (OverseerExitThread) [    ] o.a.s.c.Overseer Overseer (id=72189925360402449-127.0.0.1:44515_solr-n_0000000002) closing
   [junit4]   2> 659985 INFO  (OverseerAutoScalingTriggerThread-72189925360402449-127.0.0.1:44515_solr-n_0000000002) [    ] o.a.s.c.a.OverseerTriggerThread OverseerTriggerThread woken up but we are closed, exit

[...truncated too long message...]

8 INFO  (closeThreadPool-350-thread-2) [    ] o.a.s.c.Overseer Overseer (id=72190096259350546-127.0.0.1:34537_solr-n_0000000017) closing
   [junit4]   2> 45060 INFO  (closeThreadPool-349-thread-2) [    ] o.a.s.c.Overseer Overseer (id=72190096259350551-127.0.0.1:37963_solr-n_0000000024) closing
   [junit4]   2> 45066 WARN  (NIOServerCxn.Factory:0.0.0.0/0.0.0.0:0) [    ] o.a.z.s.NIOServerCnxn Unable to read additional data from client sessionid 0x100788293d7001a, likely client has closed socket
   [junit4]   2> 45066 WARN  (NIOServerCxn.Factory:0.0.0.0/0.0.0.0:0) [    ] o.a.z.s.NIOServerCnxn Unable to read additional data from client sessionid 0x100788293d70019, likely client has closed socket
   [junit4]   2> 45067 INFO  (jetty-closer-330-thread-3) [    ] o.e.j.s.AbstractConnector Stopped ServerConnector@3ef4e88c{SSL,[ssl, http/1.1]}{127.0.0.1:0}
   [junit4]   2> 45068 INFO  (jetty-closer-330-thread-1) [    ] o.a.s.c.Overseer Overseer (id=72190096259350546-127.0.0.1:34537_solr-n_0000000017) closing
   [junit4]   2> 45068 INFO  (jetty-closer-330-thread-5) [    ] o.a.s.c.Overseer Overseer (id=72190096259350548-127.0.0.1:41137_solr-n_0000000008) closing
   [junit4]   2> 45068 INFO  (jetty-closer-330-thread-3) [    ] o.e.j.s.h.ContextHandler Stopped o.e.j.s.ServletContextHandler@50b69465{/solr,null,UNAVAILABLE}
   [junit4]   2> 45068 WARN  (NIOServerCxn.Factory:0.0.0.0/0.0.0.0:0) [    ] o.a.z.s.NIOServerCnxn Unable to read additional data from client sessionid 0x100788293d70012, likely client has closed socket
   [junit4]   2> 45069 INFO  (jetty-closer-330-thread-4) [    ] o.a.s.c.Overseer Overseer (id=72190096259350551-127.0.0.1:37963_solr-n_0000000024) closing
   [junit4]   2> 45069 WARN  (NIOServerCxn.Factory:0.0.0.0/0.0.0.0:0) [    ] o.a.z.s.NIOServerCnxn Unable to read additional data from client sessionid 0x100788293d70017, likely client has closed socket
   [junit4]   2> 45070 INFO  (jetty-closer-330-thread-3) [    ] o.e.j.s.session node0 Stopped scavenging
   [junit4]   2> 45071 INFO  (jetty-closer-330-thread-1) [    ] o.e.j.s.AbstractConnector Stopped ServerConnector@6fac959{SSL,[ssl, http/1.1]}{127.0.0.1:0}
   [junit4]   2> 45071 INFO  (jetty-closer-330-thread-5) [    ] o.e.j.s.AbstractConnector Stopped ServerConnector@7a1549b1{SSL,[ssl, http/1.1]}{127.0.0.1:0}
   [junit4]   2> 45071 INFO  (jetty-closer-330-thread-1) [    ] o.e.j.s.h.ContextHandler Stopped o.e.j.s.ServletContextHandler@1d5a2327{/solr,null,UNAVAILABLE}
   [junit4]   2> 45071 INFO  (jetty-closer-330-thread-5) [    ] o.e.j.s.h.ContextHandler Stopped o.e.j.s.ServletContextHandler@40992ed5{/solr,null,UNAVAILABLE}
   [junit4]   2> 45071 INFO  (jetty-closer-330-thread-1) [    ] o.e.j.s.session node0 Stopped scavenging
   [junit4]   2> 45071 INFO  (jetty-closer-330-thread-5) [    ] o.e.j.s.session node0 Stopped scavenging
   [junit4]   2> 45075 INFO  (jetty-closer-330-thread-4) [    ] o.e.j.s.AbstractConnector Stopped ServerConnector@5ab36d84{SSL,[ssl, http/1.1]}{127.0.0.1:0}
   [junit4]   2> 45075 INFO  (jetty-closer-330-thread-4) [    ] o.e.j.s.h.ContextHandler Stopped o.e.j.s.ServletContextHandler@11491f90{/solr,null,UNAVAILABLE}
   [junit4]   2> 45075 INFO  (jetty-closer-330-thread-4) [    ] o.e.j.s.session node0 Stopped scavenging
   [junit4]   2> 45075 INFO  (SUITE-OverseerRolesTest-seed#[DA152185F662232C]-worker) [    ] o.a.s.c.ZkTestServer Shutting down ZkTestServer.
   [junit4]   2> 45077 WARN  (ZkTestServer Run Thread) [    ] o.a.s.c.ZkTestServer Watch limit violations: 
   [junit4]   2> Maximum concurrent create/delete watches above limit:
   [junit4]   2> 
   [junit4]   2> 	15	/solr/aliases.json
   [junit4]   2> 	7	/solr/security.json
   [junit4]   2> 
   [junit4]   2> Maximum concurrent data watches above limit:
   [junit4]   2> 
   [junit4]   2> 	15	/solr/clusterprops.json
   [junit4]   2> 	15	/solr/clusterstate.json
   [junit4]   2> 	10	/solr/autoscaling.json
   [junit4]   2> 	4	/solr/overseer_elect/election/72190096259350539-127.0.0.1:40359_solr-n_0000000008
   [junit4]   2> 	3	/solr/overseer_elect/election/72190096259350546-127.0.0.1:34537_solr-n_0000000017
   [junit4]   2> 	3	/solr/overseer_elect/election/72190096259350542-127.0.0.1:34055_solr-n_0000000022
   [junit4]   2> 	3	/solr/overseer_elect/election/72190096259350539-127.0.0.1:40359_solr-n_0000000003
   [junit4]   2> 	3	/solr/overseer_elect/election/72190096259350542-127.0.0.1:34055_solr-n_0000000012
   [junit4]   2> 	2	/solr/overseer_elect/election/72190096259350542-127.0.0.1:34055_solr-n_0000000006
   [junit4]   2> 	2	/solr/overseer_elect/election/72190096259350551-127.0.0.1:37963_solr-n_0000000013
   [junit4]   2> 	2	/solr/overseer_elect/election/72190096259350546-127.0.0.1:34537_solr-n_0000000006
   [junit4]   2> 	2	/solr/overseer_elect/election/72190096259350546-127.0.0.1:34537_solr-n_0000000002
   [junit4]   2> 	2	/solr/overseer_elect/election/72190096259350548-127.0.0.1:41137_solr-n_0000000026
   [junit4]   2> 	2	/solr/overseer_elect/election/72190096259350548-127.0.0.1:41137_solr-n_0000000020
   [junit4]   2> 	2	/solr/overseer_elect/election/72190096259350551-127.0.0.1:37963_solr-n_0000000024
   [junit4]   2> 	2	/solr/overseer_elect/election/72190096259350551-127.0.0.1:37963_solr-n_0000000005
   [junit4]   2> 
   [junit4]   2> Maximum concurrent children watches above limit:
   [junit4]   2> 
   [junit4]   2> 	15	/solr/collections
   [junit4]   2> 	13	/solr/live_nodes
   [junit4]   2> 	10	/solr/autoscaling/events/.scheduled_maintenance
   [junit4]   2> 	10	/solr/autoscaling/events/.auto_add_replicas
   [junit4]   2> 	10	/solr/overseer/queue-work
   [junit4]   2> 	4	/solr/overseer/collection-queue-work
   [junit4]   2> 	3	/solr/overseer/queue
   [junit4]   2> 
   [junit4]   2> 45080 INFO  (SUITE-OverseerRolesTest-seed#[DA152185F662232C]-worker) [    ] o.a.s.c.ZkTestServer parse host and port list: 127.0.0.1:37001
   [junit4]   2> 45080 INFO  (SUITE-OverseerRolesTest-seed#[DA152185F662232C]-worker) [    ] o.a.s.c.ZkTestServer connecting to 127.0.0.1 37001
   [junit4]   2> NOTE: leaving temporary files on disk at: /home/jenkins/workspace/Lucene-Solr-8.1-Linux/solr/build/solr-core/test/J0/temp/solr.cloud.OverseerRolesTest_DA152185F662232C-002
   [junit4]   2> May 03, 2019 11:35:05 PM com.carrotsearch.randomizedtesting.ThreadLeakControl checkThreadLeaks
   [junit4]   2> WARNING: Will linger awaiting termination of 1 leaked thread(s).
   [junit4]   2> NOTE: test params are: codec=FastCompressingStoredFields(storedFieldsFormat=CompressingStoredFieldsFormat(compressionMode=FAST, chunkSize=5, maxDocsPerChunk=169, blockSize=2), termVectorsFormat=CompressingTermVectorsFormat(compressionMode=FAST, chunkSize=5, blockSize=2)), sim=Asserting(org.apache.lucene.search.similarities.AssertingSimilarity@32789cad), locale=tr-TR, timezone=Asia/Brunei
   [junit4]   2> NOTE: Linux 4.18.0-17-generic amd64/Oracle Corporation 1.8.0_201 (64-bit)/cpus=8,threads=1,free=230613432,total=536870912
   [junit4]   2> NOTE: All tests run in this JVM: [OverseerRolesTest, OverseerRolesTest]
   [junit4] Completed [5/5 (5!)] on J0 in 17.85s, 2 tests, 1 failure <<< FAILURES!
   [junit4] 
   [junit4] 
   [junit4] Tests with failures [seed: DA152185F662232C]:
   [junit4]   - org.apache.solr.cloud.OverseerRolesTest.testDesignatedOverseerRestarts
   [junit4]   - org.apache.solr.cloud.OverseerRolesTest.testDesignatedOverseerRestarts
   [junit4]   - org.apache.solr.cloud.OverseerRolesTest.testDesignatedOverseerRestarts
   [junit4]   - org.apache.solr.cloud.OverseerRolesTest.testDesignatedOverseerRestarts
   [junit4]   - org.apache.solr.cloud.OverseerRolesTest.testDesignatedOverseerRestarts
   [junit4] 
   [junit4] 
   [junit4] JVM J0:     0.66 ..    46.71 =    46.05s
   [junit4] JVM J1:     0.69 ..    44.45 =    43.76s
   [junit4] JVM J2:     0.66 ..    28.55 =    27.89s
   [junit4] Execution time total: 46 seconds
   [junit4] Tests summary: 5 suites, 10 tests, 5 failures

BUILD FAILED
/home/jenkins/workspace/Lucene-Solr-8.1-Linux/lucene/common-build.xml:1573: The following error occurred while executing this line:
/home/jenkins/workspace/Lucene-Solr-8.1-Linux/lucene/common-build.xml:1100: There were test failures: 5 suites, 10 tests, 5 failures [seed: DA152185F662232C]

Total time: 48 seconds

[repro] Setting last failure code to 256

[repro] Failures:
[repro]   5/5 failed: org.apache.solr.cloud.OverseerRolesTest
[repro] Exiting with code 256
+ mv lucene/build lucene/build.repro
+ mv solr/build solr/build.repro
+ mv lucene/build.orig lucene/build
+ mv solr/build.orig solr/build
Archiving artifacts
Setting ANT_1_8_2_HOME=/home/jenkins/tools/hudson.tasks.Ant_AntInstallation/ANT_1.8.2
[WARNINGS] Parsing warnings in console log with parser Java Compiler (javac)
Setting ANT_1_8_2_HOME=/home/jenkins/tools/hudson.tasks.Ant_AntInstallation/ANT_1.8.2
No credentials specified
Setting ANT_1_8_2_HOME=/home/jenkins/tools/hudson.tasks.Ant_AntInstallation/ANT_1.8.2
<Git Blamer> Using GitBlamer to create author and commit information for all warnings.
<Git Blamer> GIT_COMMIT=85b4f2634bd2a04fe2771b7f6cafd87296b0100e, workspace=/home/jenkins/workspace/Lucene-Solr-8.1-Linux
[WARNINGS] Computing warning deltas based on reference build #277
Recording test results
Setting ANT_1_8_2_HOME=/home/jenkins/tools/hudson.tasks.Ant_AntInstallation/ANT_1.8.2
Build step 'Publish JUnit test result report' changed build result to UNSTABLE
Email was triggered for: Unstable (Test Failures)
Sending email for trigger: Unstable (Test Failures)
Setting ANT_1_8_2_HOME=/home/jenkins/tools/hudson.tasks.Ant_AntInstallation/ANT_1.8.2
Setting ANT_1_8_2_HOME=/home/jenkins/tools/hudson.tasks.Ant_AntInstallation/ANT_1.8.2
Setting ANT_1_8_2_HOME=/home/jenkins/tools/hudson.tasks.Ant_AntInstallation/ANT_1.8.2
Setting ANT_1_8_2_HOME=/home/jenkins/tools/hudson.tasks.Ant_AntInstallation/ANT_1.8.2
Setting ANT_1_8_2_HOME=/home/jenkins/tools/hudson.tasks.Ant_AntInstallation/ANT_1.8.2
Setting ANT_1_8_2_HOME=/home/jenkins/tools/hudson.tasks.Ant_AntInstallation/ANT_1.8.2

Mime
View raw message