lucene-dev mailing list archives

Site index · List index
Message view « Date » · « Thread »
Top « Date » · « Thread »
From Apache Jenkins Server <jenk...@builds.apache.org>
Subject [JENKINS] Lucene-Solr-BadApples-Tests-8.x - Build # 94 - Still Unstable
Date Mon, 06 May 2019 01:36:20 GMT
Build: https://builds.apache.org/job/Lucene-Solr-BadApples-Tests-8.x/94/

1 tests failed.
FAILED:  org.apache.solr.security.AuditLoggerIntegrationTest.testQueuedTimeMetric

Error Message:
Expecting mean time on queue >10ms, got 1.0000000000000002

Stack Trace:
java.lang.AssertionError: Expecting mean time on queue >10ms, got 1.0000000000000002
	at __randomizedtesting.SeedInfo.seed([41B4EB377A4CD73:2DA8565B3BD1FE2]:0)
	at org.junit.Assert.fail(Assert.java:88)
	at org.junit.Assert.assertTrue(Assert.java:41)
	at org.apache.solr.security.AuditLoggerIntegrationTest.testQueuedTimeMetric(AuditLoggerIntegrationTest.java:121)
	at sun.reflect.NativeMethodAccessorImpl.invoke0(Native Method)
	at sun.reflect.NativeMethodAccessorImpl.invoke(NativeMethodAccessorImpl.java:62)
	at sun.reflect.DelegatingMethodAccessorImpl.invoke(DelegatingMethodAccessorImpl.java:43)
	at java.lang.reflect.Method.invoke(Method.java:498)
	at com.carrotsearch.randomizedtesting.RandomizedRunner.invoke(RandomizedRunner.java:1750)
	at com.carrotsearch.randomizedtesting.RandomizedRunner$8.evaluate(RandomizedRunner.java:938)
	at com.carrotsearch.randomizedtesting.RandomizedRunner$9.evaluate(RandomizedRunner.java:974)
	at com.carrotsearch.randomizedtesting.RandomizedRunner$10.evaluate(RandomizedRunner.java:988)
	at com.carrotsearch.randomizedtesting.rules.SystemPropertiesRestoreRule$1.evaluate(SystemPropertiesRestoreRule.java:57)
	at org.apache.lucene.util.TestRuleSetupTeardownChained$1.evaluate(TestRuleSetupTeardownChained.java:49)
	at org.apache.lucene.util.AbstractBeforeAfterRule$1.evaluate(AbstractBeforeAfterRule.java:45)
	at org.apache.lucene.util.TestRuleThreadAndTestName$1.evaluate(TestRuleThreadAndTestName.java:48)
	at org.apache.lucene.util.TestRuleIgnoreAfterMaxFailures$1.evaluate(TestRuleIgnoreAfterMaxFailures.java:64)
	at org.apache.lucene.util.TestRuleMarkFailure$1.evaluate(TestRuleMarkFailure.java:47)
	at com.carrotsearch.randomizedtesting.rules.StatementAdapter.evaluate(StatementAdapter.java:36)
	at com.carrotsearch.randomizedtesting.ThreadLeakControl$StatementRunner.run(ThreadLeakControl.java:368)
	at com.carrotsearch.randomizedtesting.ThreadLeakControl.forkTimeoutingTask(ThreadLeakControl.java:817)
	at com.carrotsearch.randomizedtesting.ThreadLeakControl$3.evaluate(ThreadLeakControl.java:468)
	at com.carrotsearch.randomizedtesting.RandomizedRunner.runSingleTest(RandomizedRunner.java:947)
	at com.carrotsearch.randomizedtesting.RandomizedRunner$5.evaluate(RandomizedRunner.java:832)
	at com.carrotsearch.randomizedtesting.RandomizedRunner$6.evaluate(RandomizedRunner.java:883)
	at com.carrotsearch.randomizedtesting.RandomizedRunner$7.evaluate(RandomizedRunner.java:894)
	at com.carrotsearch.randomizedtesting.rules.StatementAdapter.evaluate(StatementAdapter.java:36)
	at com.carrotsearch.randomizedtesting.rules.SystemPropertiesRestoreRule$1.evaluate(SystemPropertiesRestoreRule.java:57)
	at org.apache.lucene.util.AbstractBeforeAfterRule$1.evaluate(AbstractBeforeAfterRule.java:45)
	at com.carrotsearch.randomizedtesting.rules.StatementAdapter.evaluate(StatementAdapter.java:36)
	at org.apache.lucene.util.TestRuleStoreClassName$1.evaluate(TestRuleStoreClassName.java:41)
	at com.carrotsearch.randomizedtesting.rules.NoShadowingOrOverridesOnMethodsRule$1.evaluate(NoShadowingOrOverridesOnMethodsRule.java:40)
	at com.carrotsearch.randomizedtesting.rules.NoShadowingOrOverridesOnMethodsRule$1.evaluate(NoShadowingOrOverridesOnMethodsRule.java:40)
	at com.carrotsearch.randomizedtesting.rules.StatementAdapter.evaluate(StatementAdapter.java:36)
	at com.carrotsearch.randomizedtesting.rules.StatementAdapter.evaluate(StatementAdapter.java:36)
	at com.carrotsearch.randomizedtesting.rules.StatementAdapter.evaluate(StatementAdapter.java:36)
	at org.apache.lucene.util.TestRuleAssertionsRequired$1.evaluate(TestRuleAssertionsRequired.java:53)
	at org.apache.lucene.util.TestRuleMarkFailure$1.evaluate(TestRuleMarkFailure.java:47)
	at org.apache.lucene.util.TestRuleIgnoreAfterMaxFailures$1.evaluate(TestRuleIgnoreAfterMaxFailures.java:64)
	at org.apache.lucene.util.TestRuleIgnoreTestSuites$1.evaluate(TestRuleIgnoreTestSuites.java:54)
	at com.carrotsearch.randomizedtesting.rules.StatementAdapter.evaluate(StatementAdapter.java:36)
	at com.carrotsearch.randomizedtesting.ThreadLeakControl$StatementRunner.run(ThreadLeakControl.java:368)
	at java.lang.Thread.run(Thread.java:748)




Build Log:
[...truncated 12914 lines...]
   [junit4] Suite: org.apache.solr.security.AuditLoggerIntegrationTest
   [junit4]   2> Creating dataDir: /home/jenkins/jenkins-slave/workspace/Lucene-Solr-BadApples-Tests-8.x/solr/build/solr-core/test/J1/temp/solr.security.AuditLoggerIntegrationTest_41B4EB377A4CD73-001/init-core-data-001
   [junit4]   2> 111137 INFO  (SUITE-AuditLoggerIntegrationTest-seed#[41B4EB377A4CD73]-worker) [    ] o.a.s.SolrTestCaseJ4 SecureRandom sanity checks: test.solr.allowed.securerandom=null & java.security.egd=file:/dev/./urandom
   [junit4]   2> 111138 INFO  (SUITE-AuditLoggerIntegrationTest-seed#[41B4EB377A4CD73]-worker) [    ] o.a.s.SolrTestCaseJ4 Using PointFields (NUMERIC_POINTS_SYSPROP=true) w/NUMERIC_DOCVALUES_SYSPROP=false
   [junit4]   2> 111156 INFO  (SUITE-AuditLoggerIntegrationTest-seed#[41B4EB377A4CD73]-worker) [    ] o.a.s.SolrTestCaseJ4 Randomized ssl (false) and clientAuth (false) via: @org.apache.solr.SolrTestCaseJ4$SuppressSSL(bugUrl=None)
   [junit4]   2> 111249 INFO  (TEST-AuditLoggerIntegrationTest.testMuteAdminListCollections-seed#[41B4EB377A4CD73]) [    ] o.a.s.SolrTestCaseJ4 ###Starting testMuteAdminListCollections
   [junit4]   2> 111271 INFO  (auditTestCallback-26-thread-1) [    ] o.a.s.s.AuditLoggerIntegrationTest Listening for audit callbacks on on port 43653
   [junit4]   2> 111308 INFO  (TEST-AuditLoggerIntegrationTest.testMuteAdminListCollections-seed#[41B4EB377A4CD73]) [    ] o.a.s.c.MiniSolrCloudCluster Starting cluster of 1 servers in /home/jenkins/jenkins-slave/workspace/Lucene-Solr-BadApples-Tests-8.x/solr/build/solr-core/test/J1/temp/solr.security.AuditLoggerIntegrationTest_41B4EB377A4CD73-001/tempDir-001
   [junit4]   2> 111342 INFO  (TEST-AuditLoggerIntegrationTest.testMuteAdminListCollections-seed#[41B4EB377A4CD73]) [    ] o.a.s.c.ZkTestServer STARTING ZK TEST SERVER
   [junit4]   2> 111379 INFO  (ZkTestServer Run Thread) [    ] o.a.s.c.ZkTestServer client port:0.0.0.0/0.0.0.0:0
   [junit4]   2> 111379 INFO  (ZkTestServer Run Thread) [    ] o.a.s.c.ZkTestServer Starting server
   [junit4]   2> 111484 INFO  (TEST-AuditLoggerIntegrationTest.testMuteAdminListCollections-seed#[41B4EB377A4CD73]) [    ] o.a.s.c.ZkTestServer start zk server on port:42931
   [junit4]   2> 111484 INFO  (TEST-AuditLoggerIntegrationTest.testMuteAdminListCollections-seed#[41B4EB377A4CD73]) [    ] o.a.s.c.ZkTestServer parse host and port list: 127.0.0.1:42931
   [junit4]   2> 111484 INFO  (TEST-AuditLoggerIntegrationTest.testMuteAdminListCollections-seed#[41B4EB377A4CD73]) [    ] o.a.s.c.ZkTestServer connecting to 127.0.0.1 42931
   [junit4]   2> 111772 INFO  (zkConnectionManagerCallback-70-thread-1) [    ] o.a.s.c.c.ConnectionManager zkClient has connected
   [junit4]   2> 111868 INFO  (zkConnectionManagerCallback-72-thread-1) [    ] o.a.s.c.c.ConnectionManager zkClient has connected
   [junit4]   2> 111961 INFO  (zkConnectionManagerCallback-74-thread-1) [    ] o.a.s.c.c.ConnectionManager zkClient has connected
   [junit4]   2> 112104 WARN  (jetty-launcher-75-thread-1) [    ] o.e.j.s.AbstractConnector Ignoring deprecated socket close linger time
   [junit4]   2> 112105 INFO  (jetty-launcher-75-thread-1) [    ] o.a.s.c.s.e.JettySolrRunner Start Jetty (original configured port=0)
   [junit4]   2> 112105 INFO  (jetty-launcher-75-thread-1) [    ] o.a.s.c.s.e.JettySolrRunner Trying to start Jetty on port 0 try number 1 ...
   [junit4]   2> 112105 INFO  (jetty-launcher-75-thread-1) [    ] o.e.j.s.Server jetty-9.4.14.v20181114; built: 2018-11-14T21:20:31.478Z; git: c4550056e785fb5665914545889f21dc136ad9e6; jvm 1.8.0_191-b12
   [junit4]   2> 112106 INFO  (jetty-launcher-75-thread-1) [    ] o.e.j.s.session DefaultSessionIdManager workerName=node0
   [junit4]   2> 112106 INFO  (jetty-launcher-75-thread-1) [    ] o.e.j.s.session No SessionScavenger set, using defaults
   [junit4]   2> 112106 INFO  (jetty-launcher-75-thread-1) [    ] o.e.j.s.session node0 Scavenging every 660000ms
   [junit4]   2> 112107 INFO  (jetty-launcher-75-thread-1) [    ] o.e.j.s.h.ContextHandler Started o.e.j.s.ServletContextHandler@6263aa76{/solr,null,AVAILABLE}
   [junit4]   2> 112158 INFO  (jetty-launcher-75-thread-1) [    ] o.e.j.s.AbstractConnector Started ServerConnector@722e6954{HTTP/1.1,[http/1.1, h2c]}{127.0.0.1:46246}
   [junit4]   2> 112158 INFO  (jetty-launcher-75-thread-1) [    ] o.e.j.s.Server Started @112456ms
   [junit4]   2> 112158 INFO  (jetty-launcher-75-thread-1) [    ] o.a.s.c.s.e.JettySolrRunner Jetty properties: {hostContext=/solr, hostPort=46246}
   [junit4]   2> 112159 ERROR (jetty-launcher-75-thread-1) [    ] o.a.s.u.StartupLoggingUtils Missing Java Option solr.log.dir. Logging may be missing or incomplete.
   [junit4]   2> 112159 INFO  (jetty-launcher-75-thread-1) [    ] o.a.s.s.SolrDispatchFilter Using logger factory org.apache.logging.slf4j.Log4jLoggerFactory
   [junit4]   2> 112159 INFO  (jetty-launcher-75-thread-1) [    ] o.a.s.s.SolrDispatchFilter  ___      _       Welcome to Apache Solr? version 8.2.0
   [junit4]   2> 112159 INFO  (jetty-launcher-75-thread-1) [    ] o.a.s.s.SolrDispatchFilter / __| ___| |_ _   Starting in cloud mode on port null
   [junit4]   2> 112159 INFO  (jetty-launcher-75-thread-1) [    ] o.a.s.s.SolrDispatchFilter \__ \/ _ \ | '_|  Install dir: null
   [junit4]   2> 112159 INFO  (jetty-launcher-75-thread-1) [    ] o.a.s.s.SolrDispatchFilter |___/\___/_|_|    Start time: 2019-05-05T23:18:06.459Z
   [junit4]   2> 112236 INFO  (zkConnectionManagerCallback-77-thread-1) [    ] o.a.s.c.c.ConnectionManager zkClient has connected
   [junit4]   2> 112250 INFO  (jetty-launcher-75-thread-1) [    ] o.a.s.s.SolrDispatchFilter solr.xml found in ZooKeeper. Loading...
   [junit4]   2> 114950 INFO  (jetty-launcher-75-thread-1) [    ] o.a.s.h.c.HttpShardHandlerFactory Host whitelist initialized: WhitelistHostChecker [whitelistHosts=null, whitelistHostCheckingEnabled=true]
   [junit4]   2> 115059 WARN  (jetty-launcher-75-thread-1) [    ] o.e.j.u.s.S.config No Client EndPointIdentificationAlgorithm configured for SslContextFactory@68d7defb[provider=null,keyStore=null,trustStore=null]
   [junit4]   2> 115096 WARN  (jetty-launcher-75-thread-1) [    ] o.e.j.u.s.S.config No Client EndPointIdentificationAlgorithm configured for SslContextFactory@472af22[provider=null,keyStore=null,trustStore=null]
   [junit4]   2> 115097 INFO  (jetty-launcher-75-thread-1) [    ] o.a.s.c.ZkContainer Zookeeper client=127.0.0.1:42931/solr
   [junit4]   2> 115258 INFO  (zkConnectionManagerCallback-84-thread-1) [    ] o.a.s.c.c.ConnectionManager zkClient has connected
   [junit4]   2> 115511 INFO  (zkConnectionManagerCallback-86-thread-1) [    ] o.a.s.c.c.ConnectionManager zkClient has connected
   [junit4]   2> 116733 INFO  (jetty-launcher-75-thread-1) [n:127.0.0.1:46246_solr    ] o.a.s.c.OverseerElectionContext I am going to be the leader 127.0.0.1:46246_solr
   [junit4]   2> 116784 INFO  (jetty-launcher-75-thread-1) [n:127.0.0.1:46246_solr    ] o.a.s.c.Overseer Overseer (id=74642051197042693-127.0.0.1:46246_solr-n_0000000000) starting
   [junit4]   2> 117201 INFO  (zkConnectionManagerCallback-93-thread-1) [    ] o.a.s.c.c.ConnectionManager zkClient has connected
   [junit4]   2> 117221 INFO  (jetty-launcher-75-thread-1) [n:127.0.0.1:46246_solr    ] o.a.s.c.s.i.ZkClientClusterStateProvider Cluster at 127.0.0.1:42931/solr ready
   [junit4]   2> 117830 INFO  (OverseerStateUpdate-74642051197042693-127.0.0.1:46246_solr-n_0000000000) [n:127.0.0.1:46246_solr    ] o.a.s.c.Overseer Starting to work on the main queue : 127.0.0.1:46246_solr
   [junit4]   2> 117846 INFO  (jetty-launcher-75-thread-1) [n:127.0.0.1:46246_solr    ] o.a.s.c.ZkController Register node as live in ZooKeeper:/live_nodes/127.0.0.1:46246_solr
   [junit4]   2> 118031 INFO  (zkCallback-92-thread-1) [    ] o.a.s.c.c.ZkStateReader Updated live nodes from ZooKeeper... (0) -> (1)
   [junit4]   2> 118046 INFO  (zkCallback-85-thread-1) [    ] o.a.s.c.c.ZkStateReader Updated live nodes from ZooKeeper... (0) -> (1)
   [junit4]   2> 118168 INFO  (jetty-launcher-75-thread-1) [n:127.0.0.1:46246_solr    ] o.a.s.c.CoreContainer Initializing auditlogger plugin: solr.CallbackAuditLoggerPlugin
   [junit4]   2> 119142 INFO  (jetty-launcher-75-thread-1) [n:127.0.0.1:46246_solr    ] o.a.s.h.a.MetricsHistoryHandler No .system collection, keeping metrics history in memory.
   [junit4]   2> 119614 INFO  (jetty-launcher-75-thread-1) [n:127.0.0.1:46246_solr    ] o.a.s.m.r.SolrJmxReporter JMX monitoring for 'solr_46246.solr.node' (registry 'solr.node') enabled at server: com.sun.jmx.mbeanserver.JmxMBeanServer@4671c6f8
   [junit4]   2> 119760 INFO  (jetty-launcher-75-thread-1) [n:127.0.0.1:46246_solr    ] o.a.s.m.r.SolrJmxReporter JMX monitoring for 'solr_46246.solr.jvm' (registry 'solr.jvm') enabled at server: com.sun.jmx.mbeanserver.JmxMBeanServer@4671c6f8
   [junit4]   2> 119761 INFO  (jetty-launcher-75-thread-1) [n:127.0.0.1:46246_solr    ] o.a.s.m.r.SolrJmxReporter JMX monitoring for 'solr_46246.solr.jetty' (registry 'solr.jetty') enabled at server: com.sun.jmx.mbeanserver.JmxMBeanServer@4671c6f8
   [junit4]   2> 119796 INFO  (jetty-launcher-75-thread-1) [n:127.0.0.1:46246_solr    ] o.a.s.c.CorePropertiesLocator Found 0 core definitions underneath /home/jenkins/jenkins-slave/workspace/Lucene-Solr-BadApples-Tests-8.x/solr/build/solr-core/test/J1/temp/solr.security.AuditLoggerIntegrationTest_41B4EB377A4CD73-001/tempDir-001/node1/.
   [junit4]   2> 120625 INFO  (zkConnectionManagerCallback-99-thread-1) [    ] o.a.s.c.c.ConnectionManager zkClient has connected
   [junit4]   2> 120908 INFO  (TEST-AuditLoggerIntegrationTest.testMuteAdminListCollections-seed#[41B4EB377A4CD73]) [    ] o.a.s.c.c.ZkStateReader Updated live nodes from ZooKeeper... (0) -> (1)
   [junit4]   2> 120978 INFO  (TEST-AuditLoggerIntegrationTest.testMuteAdminListCollections-seed#[41B4EB377A4CD73]) [    ] o.a.s.c.s.i.ZkClientClusterStateProvider Cluster at 127.0.0.1:42931/solr ready
   [junit4]   2> 121266 INFO  (qtp1305307175-204) [n:127.0.0.1:46246_solr    ] o.a.s.h.a.CollectionsHandler Invoked Collection Action :list with params action=LIST&wt=javabin&version=2 and sendToOCPQueue=true
   [junit4]   2> 121266 INFO  (qtp1305307175-204) [n:127.0.0.1:46246_solr    ] o.a.s.s.HttpSolrCall [admin] webapp=null path=/admin/collections params={action=LIST&wt=javabin&version=2} status=0 QTime=34
   [junit4]   2> 121331 INFO  (qtp1305307175-205) [n:127.0.0.1:46246_solr    ] o.a.s.h.a.CollectionsHandler Invoked Collection Action :clusterstatus with params action=CLUSTERSTATUS&wt=javabin&version=2 and sendToOCPQueue=true
   [junit4]   2> 121363 INFO  (qtp1305307175-205) [n:127.0.0.1:46246_solr    ] o.a.s.s.HttpSolrCall [admin] webapp=null path=/admin/collections params={action=CLUSTERSTATUS&wt=javabin&version=2} status=0 QTime=31
   [junit4]   2> 124925 INFO  (qtp1305307175-205) [n:127.0.0.1:46246_solr    ] o.a.s.s.CallbackAuditLoggerPlugin Sent audit callback {"requestUrl":"http://127.0.0.1:46246/solr/admin/collections","nodeName":"n:127.0.0.1:46246_solr","message":"Completed","level":"INFO","date":1557098295663,"clientIp":"127.0.0.1","collections":[],"headers":{"User-Agent":"Solr[org.apache.solr.client.solrj.impl.HttpSolrClient] 1.0","Connection":"keep-alive","Host":"127.0.0.1:46246"},"solrParams":{"action":["CLUSTERSTATUS"],"wt":["javabin"],"version":["2"]},"solrHost":"127.0.0.1","solrPort":46246,"solrIp":"127.0.0.1","resource":"/admin/collections","httpMethod":"GET","httpQueryString":"action=CLUSTERSTATUS&wt=javabin&version=2","eventType":"COMPLETED","requestType":"ADMIN","status":200,"qtime":32.0} to localhost:43653
   [junit4]   2> 124952 INFO  (qtp1305307175-206) [n:127.0.0.1:46246_solr    ] o.a.s.h.a.CollectionsHandler Invoked Collection Action :overseerstatus with params action=OVERSEERSTATUS&wt=javabin&version=2 and sendToOCPQueue=true
   [junit4]   2> 125330 INFO  (qtp1305307175-206) [n:127.0.0.1:46246_solr    ] o.a.s.s.HttpSolrCall [admin] webapp=null path=/admin/collections params={action=OVERSEERSTATUS&wt=javabin&version=2} status=0 QTime=377
   [junit4]   2> 125674 INFO  (qtp1305307175-206) [n:127.0.0.1:46246_solr    ] o.a.s.s.CallbackAuditLoggerPlugin Sent audit callback {"requestUrl":"http://127.0.0.1:46246/solr/admin/collections","nodeName":"n:127.0.0.1:46246_solr","message":"Completed","level":"INFO","date":1557098299630,"clientIp":"127.0.0.1","collections":[],"headers":{"User-Agent":"Solr[org.apache.solr.client.solrj.impl.HttpSolrClient] 1.0","Connection":"keep-alive","Host":"127.0.0.1:46246"},"solrParams":{"action":["OVERSEERSTATUS"],"wt":["javabin"],"version":["2"]},"solrHost":"127.0.0.1","solrPort":46246,"solrIp":"127.0.0.1","resource":"/admin/collections","httpMethod":"GET","httpQueryString":"action=OVERSEERSTATUS&wt=javabin&version=2","eventType":"COMPLETED","requestType":"ADMIN","status":200,"qtime":378.0} to localhost:43653
   [junit4]   2> 125763 INFO  (jetty-closer-100-thread-1) [    ] o.a.s.c.CoreContainer Shutting down CoreContainer instance=369947385
   [junit4]   2> 125763 INFO  (jetty-closer-100-thread-1) [    ] o.a.s.c.ZkController Remove node as live in ZooKeeper:/live_nodes/127.0.0.1:46246_solr
   [junit4]   2> 125892 INFO  (jetty-closer-100-thread-1) [    ] o.a.s.c.ZkController Publish this node as DOWN...
   [junit4]   2> 125892 INFO  (jetty-closer-100-thread-1) [    ] o.a.s.c.ZkController Publish node=127.0.0.1:46246_solr as DOWN
   [junit4]   2> 125927 INFO  (auditTestCallback-26-thread-1) [    ] o.a.s.s.AuditLoggerIntegrationTest Received audit event for path /admin/collections
   [junit4]   2> 125999 INFO  (auditTestCallback-26-thread-1) [    ] o.a.s.s.AuditLoggerIntegrationTest Received audit event for path /admin/collections
   [junit4]   2> 126037 INFO  (jetty-closer-100-thread-1) [    ] o.a.s.c.TransientSolrCoreCacheDefault Allocating transient cache for 2147483647 transient cores
   [junit4]   2> 126094 INFO  (jetty-closer-100-thread-1) [    ] o.a.s.m.SolrMetricManager Closing metric reporters for registry=solr.node, tag=null
   [junit4]   2> 126094 INFO  (jetty-closer-100-thread-1) [    ] o.a.s.m.r.SolrJmxReporter Closing reporter [org.apache.solr.metrics.reporters.SolrJmxReporter@68c489fb: rootName = solr_46246, domain = solr.node, service url = null, agent id = null] for registry solr.node / com.codahale.metrics.MetricRegistry@1d9c2d0e
   [junit4]   2> 126186 INFO  (jetty-closer-100-thread-1) [    ] o.a.s.m.SolrMetricManager Closing metric reporters for registry=solr.jvm, tag=null
   [junit4]   2> 126187 INFO  (jetty-closer-100-thread-1) [    ] o.a.s.m.r.SolrJmxReporter Closing reporter [org.apache.solr.metrics.reporters.SolrJmxReporter@6cda0192: rootName = solr_46246, domain = solr.jvm, service url = null, agent id = null] for registry solr.jvm / com.codahale.metrics.MetricRegistry@4f81ac1f
   [junit4]   2> 126223 INFO  (jetty-closer-100-thread-1) [    ] o.a.s.m.SolrMetricManager Closing metric reporters for registry=solr.jetty, tag=null
   [junit4]   2> 126240 INFO  (jetty-closer-100-thread-1) [    ] o.a.s.m.r.SolrJmxReporter Closing reporter [org.apache.solr.metrics.reporters.SolrJmxReporter@79803c74: rootName = solr_46246, domain = solr.jetty, service url = null, agent id = null] for registry solr.jetty / com.codahale.metrics.MetricRegistry@7d5d195d
   [junit4]   2> 126240 INFO  (jetty-closer-100-thread-1) [    ] o.a.s.m.SolrMetricManager Closing metric reporters for registry=solr.cluster, tag=null
   [junit4]   2> 126318 INFO  (closeThreadPool-104-thread-2) [    ] o.a.s.c.Overseer Overseer (id=74642051197042693-127.0.0.1:46246_solr-n_0000000000) closing
   [junit4]   2> 126407 INFO  (OverseerAutoScalingTriggerThread-74642051197042693-127.0.0.1:46246_solr-n_0000000000) [    ] o.a.s.c.a.OverseerTriggerThread OverseerTriggerThread woken up but we are closed, exiting.
   [junit4]   2> 126457 INFO  (zkCallback-92-thread-1) [    ] o.a.s.c.c.ZkStateReader Updated live nodes from ZooKeeper... (1) -> (0)
   [junit4]   2> 126510 INFO  (OverseerStateUpdate-74642051197042693-127.0.0.1:46246_solr-n_0000000000) [n:127.0.0.1:46246_solr    ] o.a.s.c.Overseer Overseer Loop exiting : 127.0.0.1:46246_solr
   [junit4]   2> 126567 WARN  (NIOServerCxn.Factory:0.0.0.0/0.0.0.0:0) [    ] o.a.z.s.NIOServerCnxn Unable to read additional data from client sessionid 0x1092e8cd2e80006, likely client has closed socket
   [junit4]   2> 126617 INFO  (jetty-closer-100-thread-1) [    ] o.a.s.c.Overseer Overseer (id=74642051197042693-127.0.0.1:46246_solr-n_0000000000) closing
   [junit4]   2> 126617 INFO  (closeThreadPool-104-thread-1) [    ] o.a.s.c.Overseer Overseer (id=74642051197042693-127.0.0.1:46246_solr-n_0000000000) closing
   [junit4]   2> 126638 INFO  (jetty-closer-100-thread-1) [    ] o.e.j.s.AbstractConnector Stopped ServerConnector@722e6954{HTTP/1.1,[http/1.1, h2c]}{127.0.0.1:0}
   [junit4]   2> 126638 INFO  (jetty-closer-100-thread-1) [    ] o.e.j.s.h.ContextHandler Stopped o.e.j.s.ServletContextHandler@6263aa76{/solr,null,UNAVAILABLE}
   [junit4]   2> 126638 INFO  (jetty-closer-100-thread-1) [    ] o.e.j.s.session node0 Stopped scavenging
   [junit4]   2> 126747 INFO  (TEST-AuditLoggerIntegrationTest.testMuteAdminListCollections-seed#[41B4EB377A4CD73]) [    ] o.a.s.c.ZkTestServer Shutting down ZkTestServer.
   [junit4]   2> 126951 INFO  (TEST-AuditLoggerIntegrationTest.testMuteAdminListCollections-seed#[41B4EB377A4CD73]) [    ] o.a.s.c.ZkTestServer parse host and port list: 127.0.0.1:42931
   [junit4]   2> 126951 INFO  (TEST-AuditLoggerIntegrationTest.testMuteAdminListCollections-seed#[41B4EB377A4CD73]) [    ] o.a.s.c.ZkTestServer connecting to 127.0.0.1 42931
   [junit4]   2> 126960 WARN  (ZkTestServer Run Thread) [    ] o.a.s.c.ZkTestServer Watch limit violations: 
   [junit4]   2> Maximum concurrent create/delete watches above limit:
   [junit4]   2> 
   [junit4]   2> 	3	/solr/aliases.json
   [junit4]   2> 	3	/solr/clusterprops.json
   [junit4]   2> 
   [junit4]   2> Maximum concurrent data watches above limit:
   [junit4]   2> 
   [junit4]   2> 	3	/solr/clusterstate.json
   [junit4]   2> 
   [junit4]   2> Maximum concurrent children watches above limit:
   [junit4]   2> 
   [junit4]   2> 	3	/solr/live_nodes
   [junit4]   2> 	3	/solr/collections
   [junit4]   2> 
   [junit4]   2> 126973 INFO  (TEST-AuditLoggerIntegrationTest.testMuteAdminListCollections-seed#[41B4EB377A4CD73]) [    ] o.a.s.c.ZkTestServer Shutting down ZkTestServer.
   [junit4]   2> 126973 INFO  (TEST-AuditLoggerIntegrationTest.testMuteAdminListCollections-seed#[41B4EB377A4CD73]) [    ] o.a.s.c.ZkTestServer parse host and port list: 127.0.0.1:42931
   [junit4]   2> 126973 INFO  (TEST-AuditLoggerIntegrationTest.testMuteAdminListCollections-seed#[41B4EB377A4CD73]) [    ] o.a.s.c.ZkTestServer connecting to 127.0.0.1 42931
   [junit4]   2> 126974 INFO  (TEST-AuditLoggerIntegrationTest.testMuteAdminListCollections-seed#[41B4EB377A4CD73]) [    ] o.a.s.SolrTestCaseJ4 ###Ending testMuteAdminListCollections
   [junit4]   2> 127055 INFO  (TEST-AuditLoggerIntegrationTest.testAsync-seed#[41B4EB377A4CD73]) [    ] o.a.s.SolrTestCaseJ4 ###Starting testAsync
   [junit4]   2> 127070 INFO  (auditTestCallback-41-thread-1) [    ] o.a.s.s.AuditLoggerIntegrationTest Listening for audit callbacks on on port 44050
   [junit4]   2> 127071 INFO  (TEST-AuditLoggerIntegrationTest.testAsync-seed#[41B4EB377A4CD73]) [    ] o.a.s.c.MiniSolrCloudCluster Starting cluster of 1 servers in /home/jenkins/jenkins-slave/workspace/Lucene-Solr-BadApples-Tests-8.x/solr/build/solr-core/test/J1/temp/solr.security.AuditLoggerIntegrationTest_41B4EB377A4CD73-001/tempDir-002
   [junit4]   2> 127072 INFO  (TEST-AuditLoggerIntegrationTest.testAsync-seed#[41B4EB377A4CD73]) [    ] o.a.s.c.ZkTestServer STARTING ZK TEST SERVER
   [junit4]   2> 127086 INFO  (ZkTestServer Run Thread) [    ] o.a.s.c.ZkTestServer client port:0.0.0.0/0.0.0.0:0
   [junit4]   2> 127086 INFO  (ZkTestServer Run Thread) [    ] o.a.s.c.ZkTestServer Starting server
   [junit4]   2> 127196 INFO  (TEST-AuditLoggerIntegrationTest.testAsync-seed#[41B4EB377A4CD73]) [    ] o.a.s.c.ZkTestServer start zk server on port:44713
   [junit4]   2> 127196 INFO  (TEST-AuditLoggerIntegrationTest.testAsync-seed#[41B4EB377A4CD73]) [    ] o.a.s.c.ZkTestServer parse host and port list: 127.0.0.1:44713
   [junit4]   2> 127196 INFO  (TEST-AuditLoggerIntegrationTest.testAsync-seed#[41B4EB377A4CD73]) [    ] o.a.s.c.ZkTestServer connecting to 127.0.0.1 44713
   [junit4]   2> 127367 INFO  (zkConnectionManagerCallback-107-thread-1) [    ] o.a.s.c.c.ConnectionManager zkClient has connected
   [junit4]   2> 127443 INFO  (zkConnectionManagerCallback-109-thread-1) [    ] o.a.s.c.c.ConnectionManager zkClient has connected
   [junit4]   2> 127461 INFO  (zkConnectionManagerCallback-111-thread-1) [    ] o.a.s.c.c.ConnectionManager zkClient has connected
   [junit4]   2> 127477 WARN  (NIOServerCxn.Factory:0.0.0.0/0.0.0.0:0) [    ] o.a.z.s.NIOServerCnxn Unable to read additional data from client sessionid 0x1092e8d10360002, likely client has closed socket
   [junit4]   2> 127545 WARN  (jetty-launcher-112-thread-1) [    ] o.e.j.s.AbstractConnector Ignoring deprecated socket close linger time
   [junit4]   2> 127546 INFO  (jetty-launcher-112-thread-1) [    ] o.a.s.c.s.e.JettySolrRunner Start Jetty (original configured port=0)
   [junit4]   2> 127546 INFO  (jetty-launcher-112-thread-1) [    ] o.a.s.c.s.e.JettySolrRunner Trying to start Jetty on port 0 try number 1 ...
   [junit4]   2> 127546 INFO  (jetty-launcher-112-thread-1) [    ] o.e.j.s.Server jetty-9.4.14.v20181114; built: 2018-11-14T21:20:31.478Z; git: c4550056e785fb5665914545889f21dc136ad9e6; jvm 1.8.0_191-b12
   [junit4]   2> 127633 INFO  (jetty-launcher-112-thread-1) [    ] o.e.j.s.session DefaultSessionIdManager workerName=node0
   [junit4]   2> 127634 INFO  (jetty-launcher-112-thread-1) [    ] o.e.j.s.session No SessionScavenger set, using defaults
   [junit4]   2> 127634 INFO  (jetty-launcher-112-thread-1) [    ] o.e.j.s.session node0 Scavenging every 660000ms
   [junit4]   2> 127635 INFO  (jetty-launcher-112-thread-1) [    ] o.e.j.s.h.ContextHandler Started o.e.j.s.ServletContextHandler@3ee0b68f{/solr,null,AVAILABLE}
   [junit4]   2> 127666 INFO  (jetty-launcher-112-thread-1) [    ] o.e.j.s.AbstractConnector Started ServerConnector@54fe415c{HTTP/1.1,[http/1.1, h2c]}{127.0.0.1:34553}
   [junit4]   2> 127666 INFO  (jetty-launcher-112-thread-1) [    ] o.e.j.s.Server Started @127964ms
   [junit4]   2> 127666 INFO  (jetty-launcher-112-thread-1) [    ] o.a.s.c.s.e.JettySolrRunner Jetty properties: {hostContext=/solr, hostPort=34553}
   [junit4]   2> 127667 ERROR (jetty-launcher-112-thread-1) [    ] o.a.s.u.StartupLoggingUtils Missing Java Option solr.log.dir. Logging may be missing or incomplete.
   [junit4]   2> 127667 INFO  (jetty-launcher-112-thread-1) [    ] o.a.s.s.SolrDispatchFilter Using logger factory org.apache.logging.slf4j.Log4jLoggerFactory
   [junit4]   2> 127667 INFO  (jetty-launcher-112-thread-1) [    ] o.a.s.s.SolrDispatchFilter  ___      _       Welcome to Apache Solr? version 8.2.0
   [junit4]   2> 127667 INFO  (jetty-launcher-112-thread-1) [    ] o.a.s.s.SolrDispatchFilter / __| ___| |_ _   Starting in cloud mode on port null
   [junit4]   2> 127667 INFO  (jetty-launcher-112-thread-1) [    ] o.a.s.s.SolrDispatchFilter \__ \/ _ \ | '_|  Install dir: null
   [junit4]   2> 127667 INFO  (jetty-launcher-112-thread-1) [    ] o.a.s.s.SolrDispatchFilter |___/\___/_|_|    Start time: 2019-05-05T23:18:21.967Z
   [junit4]   2> 127711 INFO  (zkConnectionManagerCallback-114-thread-1) [    ] o.a.s.c.c.ConnectionManager zkClient has connected
   [junit4]   2> 127719 INFO  (jetty-launcher-112-thread-1) [    ] o.a.s.s.SolrDispatchFilter solr.xml found in ZooKeeper. Loading...
   [junit4]   2> 129754 INFO  (jetty-launcher-112-thread-1) [    ] o.a.s.h.c.HttpShardHandlerFactory Host whitelist initialized: WhitelistHostChecker [whitelistHosts=null, whitelistHostCheckingEnabled=true]
   [junit4]   2> 129765 WARN  (jetty-launcher-112-thread-1) [    ] o.e.j.u.s.S.config No Client EndPointIdentificationAlgorithm configured for SslContextFactory@70291f81[provider=null,keyStore=null,trustStore=null]
   [junit4]   2> 129789 WARN  (jetty-launcher-112-thread-1) [    ] o.e.j.u.s.S.config No Client EndPointIdentificationAlgorithm configured for SslContextFactory@7d0295f4[provider=null,keyStore=null,trustStore=null]
   [junit4]   2> 129790 INFO  (jetty-launcher-112-thread-1) [    ] o.a.s.c.ZkContainer Zookeeper client=127.0.0.1:44713/solr
   [junit4]   2> 129792 INFO  (zkConnectionManagerCallback-121-thread-1) [    ] o.a.s.c.c.ConnectionManager zkClient has connected
   [junit4]   2> 129845 INFO  (zkConnectionManagerCallback-123-thread-1) [    ] o.a.s.c.c.ConnectionManager zkClient has connected
   [junit4]   2> 130895 INFO  (jetty-launcher-112-thread-1) [n:127.0.0.1:34553_solr    ] o.a.s.c.OverseerElectionContext I am going to be the leader 127.0.0.1:34553_solr
   [junit4]   2> 130895 INFO  (jetty-launcher-112-thread-1) [n:127.0.0.1:34553_solr    ] o.a.s.c.Overseer Overseer (id=74642052225564677-127.0.0.1:34553_solr-n_0000000000) starting
   [junit4]   2> 131024 INFO  (zkConnectionManagerCallback-130-thread-1) [    ] o.a.s.c.c.ConnectionManager zkClient has connected
   [junit4]   2> 131099 INFO  (jetty-launcher-112-thread-1) [n:127.0.0.1:34553_solr    ] o.a.s.c.s.i.ZkClientClusterStateProvider Cluster at 127.0.0.1:44713/solr ready
   [junit4]   2> 131134 INFO  (OverseerStateUpdate-74642052225564677-127.0.0.1:34553_solr-n_0000000000) [n:127.0.0.1:34553_solr    ] o.a.s.c.Overseer Starting to work on the main queue : 127.0.0.1:34553_solr
   [junit4]   2> 131134 INFO  (jetty-launcher-112-thread-1) [n:127.0.0.1:34553_solr    ] o.a.s.c.ZkController Register node as live in ZooKeeper:/live_nodes/127.0.0.1:34553_solr
   [junit4]   2> 131172 INFO  (OverseerStateUpdate-74642052225564677-127.0.0.1:34553_solr-n_0000000000) [n:127.0.0.1:34553_solr    ] o.a.s.c.c.ZkStateReader Updated live nodes from ZooKeeper... (0) -> (1)
   [junit4]   2> 131174 INFO  (jetty-launcher-112-thread-1) [n:127.0.0.1:34553_solr    ] o.a.s.c.CoreContainer Initializing auditlogger plugin: solr.CallbackAuditLoggerPlugin
   [junit4]   2> 131283 INFO  (zkCallback-129-thread-1) [    ] o.a.s.c.c.ZkStateReader Updated live nodes from ZooKeeper... (0) -> (1)
   [junit4]   2> 131480 INFO  (jetty-launcher-112-thread-1) [n:127.0.0.1:34553_solr    ] o.a.s.h.a.MetricsHistoryHandler No .system collection, keeping metrics history in memory.
   [junit4]   2> 132010 INFO  (jetty-launcher-112-thread-1) [n:127.0.0.1:34553_solr    ] o.a.s.m.r.SolrJmxReporter JMX monitoring for 'solr_34553.solr.node' (registry 'solr.node') enabled at server: com.sun.jmx.mbeanserver.JmxMBeanServer@4671c6f8
   [junit4]   2> 132136 INFO  (jetty-launcher-112-thread-1) [n:127.0.0.1:34553_solr    ] o.a.s.m.r.SolrJmxReporter JMX monitoring for 'solr_34553.solr.jvm' (registry 'solr.jvm') enabled at server: com.sun.jmx.mbeanserver.JmxMBeanServer@4671c6f8
   [junit4]   2> 132137 INFO  (jetty-launcher-112-thread-1) [n:127.0.0.1:34553_solr    ] o.a.s.m.r.SolrJmxReporter JMX monitoring for 'solr_34553.solr.jetty' (registry 'solr.jetty') enabled at server: com.sun.jmx.mbeanserver.JmxMBeanServer@4671c6f8
   [junit4]   2> 132187 INFO  (jetty-launcher-112-thread-1) [n:127.0.0.1:34553_solr    ] o.a.s.c.CorePropertiesLocator Found 0 core definitions underneath /home/jenkins/jenkins-slave/workspace/Lucene-Solr-BadApples-Tests-8.x/solr/build/solr-core/test/J1/temp/solr.security.AuditLoggerIntegrationTest_41B4EB377A4CD73-001/tempDir-002/node1/.
   [junit4]   2> 132661 INFO  (zkConnectionManagerCallback-137-thread-1) [    ] o.a.s.c.c.ConnectionManager zkClient has connected
   [junit4]   2> 132682 INFO  (TEST-AuditLoggerIntegrationTest.testAsync-seed#[41B4EB377A4CD73]) [    ] o.a.s.c.c.ZkStateReader Updated live nodes from ZooKeeper... (0) -> (1)
   [junit4]   2> 132683 INFO  (TEST-AuditLoggerIntegrationTest.testAsync-seed#[41B4EB377A4CD73]) [    ] o.a.s.c.s.i.ZkClientClusterStateProvider Cluster at 127.0.0.1:44713/solr ready
   [junit4]   2> 132731 INFO  (qtp1861949057-276) [n:127.0.0.1:34553_solr    ] o.a.s.h.a.CollectionsHandler Invoked Collection Action :list with params action=LIST&wt=javabin&version=2 and sendToOCPQueue=true
   [junit4]   2> 132731 INFO  (qtp1861949057-276) [n:127.0.0.1:34553_solr    ] o.a.s.s.HttpSolrCall [admin] webapp=null path=/admin/collections params={action=LIST&wt=javabin&version=2} status=0 QTime=0
   [junit4]   2> 132733 INFO  (qtp1861949057-277) [n:127.0.0.1:34553_solr    ] o.a.s.h.a.CollectionsHandler Invoked Collection Action :clusterstatus with params action=CLUSTERSTATUS&wt=javabin&version=2 and sendToOCPQueue=true
   [junit4]   2> 132766 INFO  (qtp1861949057-277) [n:127.0.0.1:34553_solr    ] o.a.s.s.HttpSolrCall [admin] webapp=null path=/admin/collections params={action=CLUSTERSTATUS&wt=javabin&version=2} status=0 QTime=33
   [junit4]   2> 132768 INFO  (qtp1861949057-279) [n:127.0.0.1:34553_solr    ] o.a.s.h.a.CollectionsHandler Invoked Collection Action :overseerstatus with params action=OVERSEERSTATUS&wt=javabin&version=2 and sendToOCPQueue=true
   [junit4]   2> 133194 INFO  (audit-131-thread-1-processing-n:127.0.0.1:34553_solr) [n:127.0.0.1:34553_solr    ] o.a.s.s.CallbackAuditLoggerPlugin Sent audit callback {"requestUrl":"http://127.0.0.1:34553/solr/admin/collections","nodeName":"n:127.0.0.1:34553_solr","message":"Completed","level":"INFO","date":1557098307031,"clientIp":"127.0.0.1","collections":[],"headers":{"User-Agent":"Solr[org.apache.solr.client.solrj.impl.HttpSolrClient] 1.0","Connection":"keep-alive","Host":"127.0.0.1:34553"},"solrParams":{"action":["LIST"],"wt":["javabin"],"version":["2"]},"solrHost":"127.0.0.1","solrPort":34553,"solrIp":"127.0.0.1","resource":"/admin/collections","httpMethod":"GET","httpQueryString":"action=LIST&wt=javabin&version=2","eventType":"COMPLETED","requestType":"ADMIN","status":200,"qtime":0.0} to localhost:44050
   [junit4]   2> 133268 INFO  (qtp1861949057-279) [n:127.0.0.1:34553_solr    ] o.a.s.s.HttpSolrCall [admin] webapp=null path=/admin/collections params={action=OVERSEERSTATUS&wt=javabin&version=2} status=0 QTime=500
   [junit4]   2> 133430 INFO  (audit-131-thread-1-processing-n:127.0.0.1:34553_solr) [n:127.0.0.1:34553_solr    ] o.a.s.s.CallbackAuditLoggerPlugin Sent audit callback {"requestUrl":"http://127.0.0.1:34553/solr/admin/collections","nodeName":"n:127.0.0.1:34553_solr","message":"Completed","level":"INFO","date":1557098307066,"clientIp":"127.0.0.1","collections":[],"headers":{"User-Agent":"Solr[org.apache.solr.client.solrj.impl.HttpSolrClient] 1.0","Connection":"keep-alive","Host":"127.0.0.1:34553"},"solrParams":{"action":["CLUSTERSTATUS"],"wt":["javabin"],"version":["2"]},"solrHost":"127.0.0.1","solrPort":34553,"solrIp":"127.0.0.1","resource":"/admin/collections","httpMethod":"GET","httpQueryString":"action=CLUSTERSTATUS&wt=javabin&version=2","eventType":"COMPLETED","requestType":"ADMIN","status":200,"qtime":33.0} to localhost:44050
   [junit4]   2> 133524 INFO  (auditTestCallback-41-thread-1) [    ] o.a.s.s.AuditLoggerIntegrationTest Received audit event for path /admin/collections
   [junit4]   2> 133607 INFO  (auditTestCallback-41-thread-1) [    ] o.a.s.s.AuditLoggerIntegrationTest Received audit event for path /admin/collections
   [junit4]   2> 133611 INFO  (audit-131-thread-1-processing-n:127.0.0.1:34553_solr) [n:127.0.0.1:34553_solr    ] o.a.s.s.CallbackAuditLoggerPlugin Sent audit callback {"requestUrl":"http://127.0.0.1:34553/solr/admin/collections","nodeName":"n:127.0.0.1:34553_solr","message":"Completed","level":"INFO","date":1557098307731,"clientIp":"127.0.0.1","collections":[],"headers":{"User-Agent":"Solr[org.apache.solr.client.solrj.impl.HttpSolrClient] 1.0","Connection":"keep-alive","Host":"127.0.0.1:34553"},"solrParams":{"action":["OVERSEERSTATUS"],"wt":["javabin"],"version":["2"]},"solrHost":"127.0.0.1","solrPort":34553,"solrIp":"127.0.0.1","resource":"/admin/collections","httpMethod":"GET","httpQueryString":"action=OVERSEERSTATUS&wt=javabin&version=2","eventType":"COMPLETED","requestType":"ADMIN","status":200,"qtime":662.0} to localhost:44050
   [junit4]   2> 133681 INFO  (auditTestCallback-41-thread-1) [    ] o.a.s.s.AuditLoggerIntegrationTest Received audit event for path /admin/collections
   [junit4]   2> 133890 INFO  (jetty-closer-138-thread-1) [    ] o.a.s.c.CoreContainer Shutting down CoreContainer instance=668945944
   [junit4]   2> 133890 INFO  (jetty-closer-138-thread-1) [    ] o.a.s.c.ZkController Remove node as live in ZooKeeper:/live_nodes/127.0.0.1:34553_solr
   [junit4]   2> 133942 INFO  (jetty-closer-138-thread-1) [    ] o.a.s.c.ZkController Publish this node as DOWN...
   [junit4]   2> 133942 INFO  (jetty-closer-138-thread-1) [    ] o.a.s.c.ZkController Publish node=127.0.0.1:34553_solr as DOWN
   [junit4]   2> 133974 INFO  (jetty-closer-138-thread-1) [    ] o.a.s.c.TransientSolrCoreCacheDefault Allocating transient cache for 2147483647 transient cores
   [junit4]   2> 134051 INFO  (jetty-closer-138-thread-1) [    ] o.a.s.m.SolrMetricManager Closing metric reporters for registry=solr.node, tag=null
   [junit4]   2> 134051 INFO  (jetty-closer-138-thread-1) [    ] o.a.s.m.r.SolrJmxReporter Closing reporter [org.apache.solr.metrics.reporters.SolrJmxReporter@31498190: rootName = solr_34553, domain = solr.node, service url = null, agent id = null] for registry solr.node / com.codahale.metrics.MetricRegistry@33c6c37
   [junit4]   2> 134106 INFO  (jetty-closer-138-thread-1) [    ] o.a.s.m.SolrMetricManager Closing metric reporters for registry=solr.jvm, tag=null
   [junit4]   2> 134106 INFO  (jetty-closer-138-thread-1) [    ] o.a.s.m.r.SolrJmxReporter Closing reporter [org.apache.solr.metrics.reporters.SolrJmxReporter@70edb0b5: rootName = solr_34553, domain = solr.jvm, service url = null, agent id = null] for registry solr.jvm / com.codahale.metrics.MetricRegistry@4f81ac1f
   [junit4]   2> 134142 INFO  (jetty-closer-138-thread-1) [    ] o.a.s.m.SolrMetricManager Closing metric reporters for registry=solr.jetty, tag=null
   [junit4]   2> 134142 INFO  (jetty-closer-138-thread-1) [    ] o.a.s.m.r.SolrJmxReporter Closing reporter [org.apache.solr.metrics.reporters.SolrJmxReporter@30bfbe3f: rootName = solr_34553, domain = solr.jetty, service url = null, agent id = null] for registry solr.jetty / com.codahale.metrics.MetricRegistry@7d5d195d
   [junit4]   2> 134142 INFO  (jetty-closer-138-thread-1) [    ] o.a.s.m.SolrMetricManager Closing metric reporters for registry=solr.cluster, tag=null
   [junit4]   2> 134213 INFO  (closeThreadPool-142-thread-2) [    ] o.a.s.c.Overseer Overseer (id=74642052225564677-127.0.0.1:34553_solr-n_0000000000) closing
   [junit4]   2> 134270 INFO  (OverseerStateUpdate-74642052225564677-127.0.0.1:34553_solr-n_0000000000) [n:127.0.0.1:34553_solr    ] o.a.s.c.Overseer Overseer Loop exiting : 127.0.0.1:34553_solr
   [junit4]   2> 134298 INFO  (OverseerAutoScalingTriggerThread-74642052225564677-127.0.0.1:34553_solr-n_0000000000) [    ] o.a.s.c.a.OverseerTriggerThread OverseerTriggerThread woken up but we are closed, exiting.
   [junit4]   2> 134302 INFO  (jetty-closer-138-thread-1) [    ] o.a.s.c.Overseer Overseer (id=74642052225564677-127.0.0.1:34553_solr-n_0000000000) closing
   [junit4]   2> 134302 INFO  (closeThreadPool-142-thread-1) [    ] o.a.s.c.Overseer Overseer (id=74642052225564677-127.0.0.1:34553_solr-n_0000000000) closing
   [junit4]   2> 134303 INFO  (jetty-closer-138-thread-1) [    ] o.a.s.s.AuditLoggerPlugin Shutting down async Auditlogger background thread(s)
   [junit4]   2> 134303 WARN  (audit-131-thread-1-processing-n:127.0.0.1:34553_solr) [n:127.0.0.1:34553_solr    ] o.a.s.s.AuditLoggerPlugin Interrupted while waiting for next audit log event
   [junit4]   2> 134339 INFO  (jetty-closer-138-thread-1) [    ] o.e.j.s.AbstractConnector Stopped ServerConnector@54fe415c{HTTP/1.1,[http/1.1, h2c]}{127.0.0.1:0}
   [junit4]   2> 134340 INFO  (jetty-closer-138-thread-1) [    ] o.e.j.s.h.ContextHandler Stopped o.e.j.s.ServletContextHandler@3ee0b68f{/solr,null,UNAVAILABLE}
   [junit4]   2> 134340 INFO  (jetty-closer-138-thread-1) [    ] o.e.j.s.session node0 Stopped scavenging
   [junit4]   2> 134488 INFO  (TEST-AuditLoggerIntegrationTest.testAsync-seed#[41B4EB377A4CD73]) [    ] o.a.s.c.ZkTestServer Shutting down ZkTestServer.
   [junit4]   2> 134598 WARN  (NIOServerCxn.Factory:0.0.0.0/0.0.0.0:0) [    ] o.a.z.s.NIOServerCnxn Unable to read additional data from client sessionid 0x1092e8d10360001, likely client has closed socket
   [junit4]   2> 134623 WARN  (ZkTestServer Run Thread) [    ] o.a.s.c.ZkTestServer Watch limit violations: 
   [junit4]   2> Maximum concurrent create/delete watches above limit:
   [junit4]   2> 
   [junit4]   2> 	3	/solr/aliases.json
   [junit4]   2> 	3	/solr/clusterprops.json
   [junit4]   2> 
   [junit4]   2> Maximum concurrent data watches above limit:
   [junit4]   2> 
   [junit4]   2> 	3	/solr/clusterstate.json
   [junit4]   2> 
   [junit4]   2> Maximum concurrent children watches above limit:
   [junit4]   2> 
   [junit4]   2> 	3	/solr/live_nodes
   [junit4]   2> 	3	/solr/collections
   [junit4]   2> 
   [junit4]   2> 134849 INFO  (TEST-AuditLoggerIntegrationTest.testAsync-seed#[41B4EB377A4CD73]) [    ] o.a.s.c.ZkTestServer parse host and port list: 127.0.0.1:44713
   [junit4]   2> 134849 INFO  (TEST-AuditLoggerIntegrationTest.testAsync-seed#[41B4EB377A4CD73]) [    ] o.a.s.c.ZkTestServer connecting to 127.0.0.1 44713
   [junit4]   2> 134870 INFO  (TEST-AuditLoggerIntegrationTest.testAsync-seed#[41B4EB377A4CD73]) [    ] o.a.s.SolrTestCaseJ4 ###Ending testAsync
   [junit4]   2> 134886 INFO  (TEST-AuditLoggerIntegrationTest.testSynchronous-seed#[41B4EB377A4CD73]) [    ] o.a.s.SolrTestCaseJ4 ###Starting testSynchronous
   [junit4]   2> 134903 INFO  (TEST-AuditLoggerIntegrationTest.testSynchronous-seed#[41B4EB377A4CD73]) [    ] o.a.s.c.MiniSolrCloudCluster Starting cluster of 1 servers in /home/jenkins/jenkins-slave/workspace/Lucene-Solr-BadApples-Tests-8.x/solr/build/solr-core/test/J1/temp/solr.security.AuditLoggerIntegrationTest_41B4EB377A4CD73-001/tempDir-003
   [junit4]   2> 134904 INFO  (TEST-AuditLoggerIntegrationTest.testSynchronous-seed#[41B4EB377A4CD73]) [    ] o.a.s.c.ZkTestServer STARTING ZK TEST SERVER
   [junit4]   2> 134904 INFO  (auditTestCallback-56-thread-1) [    ] o.a.s.s.AuditLoggerIntegrationTest Listening for audit callbacks on on port 35580
   [junit4]   2> 134904 INFO  (ZkTestServer Run Thread) [    ] o.a.s.c.ZkTestServer client port:0.0.0.0/0.0.0.0:0
   [junit4]   2> 134905 INFO  (ZkTestServer Run Thread) [    ] o.a.s.c.ZkTestServer Starting server
   [junit4]   2> 135010 INFO  (TEST-AuditLoggerIntegrationTest.testSynchronous-seed#[41B4EB377A4CD73]) [    ] o.a.s.c.ZkTestServer start zk server on port:43791
   [junit4]   2> 135011 INFO  (TEST-AuditLoggerIntegrationTest.testSynchronous-seed#[41B4EB377A4CD73]) [    ] o.a.s.c.ZkTestServer parse host and port list: 127.0.0.1:43791
   [junit4]   2> 135011 INFO  (TEST-AuditLoggerIntegrationTest.testSynchronous-seed#[41B4EB377A4CD73]) [    ] o.a.s.c.ZkTestServer connecting to 127.0.0.1 43791
   [junit4]   2> 135142 INFO  (zkConnectionManagerCallback-144-thread-1) [    ] o.a.s.c.c.ConnectionManager zkClient has connected
   [junit4]   2> 135258 INFO  (zkConnectionManagerCallback-146-thread-1) [    ] o.a.s.c.c.ConnectionManager zkClient has connected
   [junit4]   2> 135319 INFO  (zkConnectionManagerCallback-148-thread-1) [    ] o.a.s.c.c.ConnectionManager zkClient has connected
   [junit4]   2> 135376 WARN  (jetty-launcher-149-thread-1) [    ] o.e.j.s.AbstractConnector Ignoring deprecated socket close linger time
   [junit4]   2> 135376 INFO  (jetty-launcher-149-thread-1) [    ] o.a.s.c.s.e.JettySolrRunner Start Jetty (original configured port=0)
   [junit4]   2> 135376 INFO  (jetty-launcher-149-thread-1) [    ] o.a.s.c.s.e.JettySolrRunner Trying to start Jetty on port 0 try number 1 ...
   [junit4]   2> 135377 INFO  (jetty-launcher-149-thread-1) [    ] o.e.j.s.Server jetty-9.4.14.v20181114; built: 2018-11-14T21:20:31.478Z; git: c4550056e785fb5665914545889f21dc136ad9e6; jvm 1.8.0_191-b12
   [junit4]   2> 135378 INFO  (jetty-launcher-149-thread-1) [    ] o.e.j.s.session DefaultSessionIdManager workerName=node0
   [junit4]   2> 135378 INFO  (jetty-launcher-149-thread-1) [    ] o.e.j.s.session No SessionScavenger set, using defaults
   [junit4]   2> 135378 INFO  (jetty-launcher-149-thread-1) [    ] o.e.j.s.session node0 Scavenging every 660000ms
   [junit4]   2> 135379 INFO  (jetty-launcher-149-thread-1) [    ] o.e.j.s.h.ContextHandler Started o.e.j.s.ServletContextHandler@225675fc{/solr,null,AVAILABLE}
   [junit4]   2> 135458 INFO  (jetty-launcher-149-thread-1) [    ] o.e.j.s.AbstractConnector Started ServerConnector@7dfe6f51{HTTP/1.1,[http/1.1, h2c]}{127.0.0.1:37317}
   [junit4]   2> 135459 INFO  (jetty-launcher-149-thread-1) [    ] o.e.j.s.Server Started @135756ms
   [junit4]   2> 135459 INFO  (jetty-launcher-149-thread-1) [    ] o.a.s.c.s.e.JettySolrRunner Jetty properties: {hostContext=/solr, hostPort=37317}
   [junit4]   2> 135460 ERROR (jetty-launcher-149-thread-1) [    ] o.a.s.u.StartupLoggingUtils Missing Java Option solr.log.dir. Logging may be missing or incomplete.
   [junit4]   2> 135460 INFO  (jetty-launcher-149-thread-1) [    ] o.a.s.s.SolrDispatchFilter Using logger factory org.apache.logging.slf4j.Log4jLoggerFactory
   [junit4]   2> 135460 INFO  (jetty-launcher-149-thread-1) [    ] o.a.s.s.SolrDispatchFilter  ___      _       Welcome to Apache Solr? version 8.2.0
   [junit4]   2> 135495 INFO  (jetty-launcher-149-thread-1) [    ] o.a.s.s.SolrDispatchFilter / __| ___| |_ _   Starting in cloud mode on port null
   [junit4]   2> 135495 INFO  (jetty-launcher-149-thread-1) [    ] o.a.s.s.SolrDispatchFilter \__ \/ _ \ | '_|  Install dir: null
   [junit4]   2> 135495 INFO  (jetty-launcher-149-thread-1) [    ] o.a.s.s.SolrDispatchFilter |___/\___/_|_|    Start time: 2019-05-05T23:18:29.795Z
   [junit4]   2> 135542 INFO  (zkConnectionManagerCallback-151-thread-1) [    ] o.a.s.c.c.ConnectionManager zkClient has connected
   [junit4]   2> 135562 INFO  (jetty-launcher-149-thread-1) [    ] o.a.s.s.SolrDispatchFilter solr.xml found in ZooKeeper. Loading...
   [junit4]   2> 136725 INFO  (jetty-launcher-149-thread-1) [    ] o.a.s.h.c.HttpShardHandlerFactory Host whitelist initialized: WhitelistHostChecker [whitelistHosts=null, whitelistHostCheckingEnabled=true]
   [junit4]   2> 136738 WARN  (jetty-launcher-149-thread-1) [    ] o.e.j.u.s.S.config No Client EndPointIdentificationAlgorithm configured for SslContextFactory@19afafd8[provider=null,keyStore=null,trustStore=null]
   [junit4]   2> 136771 WARN  (jetty-launcher-149-thread-1) [    ] o.e.j.u.s.S.config No Client EndPointIdentificationAlgorithm configured for SslContextFactory@d38a006[provider=null,keyStore=null,trustStore=null]
   [junit4]   2> 136772 INFO  (jetty-launcher-149-thread-1) [    ] o.a.s.c.ZkContainer Zookeeper client=127.0.0.1:43791/solr
   [junit4]   2> 136821 INFO  (zkConnectionManagerCallback-158-thread-1) [    ] o.a.s.c.c.ConnectionManager zkClient has connected
   [junit4]   2> 136850 INFO  (zkConnectionManagerCallback-160-thread-1) [    ] o.a.s.c.c.ConnectionManager zkClient has connected
   [junit4]   2> 137439 INFO  (jetty-launcher-149-thread-1) [n:127.0.0.1:37317_solr    ] o.a.s.c.OverseerElectionContext I am going to be the leader 127.0.0.1:37317_solr
   [junit4]   2> 137440 INFO  (jetty-launcher-149-thread-1) [n:127.0.0.1:37317_solr    ] o.a.s.c.Overseer Overseer (id=74642052741267461-127.0.0.1:37317_solr-n_0000000000) starting
   [junit4]   2> 137522 INFO  (zkConnectionManagerCallback-167-thread-1) [    ] o.a.s.c.c.ConnectionManager zkClient has connected
   [junit4]   2> 137582 INFO  (jetty-launcher-149-thread-1) [n:127.0.0.1:37317_solr    ] o.a.s.c.s.i.ZkClientClusterStateProvider Cluster at 127.0.0.1:43791/solr ready
   [junit4]   2> 137609 INFO  (OverseerStateUpdate-74642052741267461-127.0.0.1:37317_solr-n_0000000000) [n:127.0.0.1:37317_solr    ] o.a.s.c.Overseer Starting to work on the main queue : 127.0.0.1:37317_solr
   [junit4]   2> 137615 INFO  (jetty-launcher-149-thread-1) [n:127.0.0.1:37317_solr    ] o.a.s.c.ZkController Register node as live in ZooKeeper:/live_nodes/127.0.0.1:37317_solr
   [junit4]   2> 137697 INFO  (jetty-launcher-149-thread-1) [n:127.0.0.1:37317_solr    ] o.a.s.c.CoreContainer Initializing auditlogger plugin: solr.CallbackAuditLoggerPlugin
   [junit4]   2> 137725 INFO  (zkCallback-166-thread-1) [    ] o.a.s.c.c.ZkStateReader Updated live nodes from ZooKeeper... (0) -> (1)
   [junit4]   2> 137725 INFO  (zkCallback-159-thread-1) [    ] o.a.s.c.c.ZkStateReader Updated live nodes from ZooKeeper... (0) -> (1)
   [junit4]   2> 137815 INFO  (jetty-launcher-149-thread-1) [n:127.0.0.1:37317_solr    ] o.a.s.h.a.MetricsHistoryHandler No .system collection, keeping metrics history in memory.
   [junit4]   2> 137941 INFO  (jetty-launcher-149-thread-1) [n:127.0.0.1:37317_solr    ] o.a.s.m.r.SolrJmxReporter JMX monitoring for 'solr_37317.solr.node' (registry 'solr.node') enabled at server: com.sun.jmx.mbeanserver.JmxMBeanServer@4671c6f8
   [junit4]   2> 138104 INFO  (jetty-launcher-149-thread-1) [n:127.0.0.1:37317_solr    ] o.a.s.m.r.SolrJmxReporter JMX monitoring for 'solr_37317.solr.jvm' (registry 'solr.jvm') enabled at server: com.sun.jmx.mbeanserver.JmxMBeanServer@4671c6f8
   [junit4]   2> 138105 INFO  (jetty-launcher-149-thread-1) [n:127.0.0.1:37317_solr    ] o.a.s.m.r.SolrJmxReporter JMX monitoring for 'solr_37317.solr.jetty' (registry 'solr.jetty') enabled at server: com.sun.jmx.mbeanserver.JmxMBeanServer@4671c6f8
   [junit4]   2> 138160 INFO  (jetty-launcher-149-thread-1) [n:127.0.0.1:37317_solr    ] o.a.s.c.CorePropertiesLocator Found 0 core definitions underneath /home/jenkins/jenkins-slave/workspace/Lucene-Solr-BadApples-Tests-8.x/solr/build/solr-core/test/J1/temp/solr.security.AuditLoggerIntegrationTest_41B4EB377A4CD73-001/tempDir-003/node1/.
   [junit4]   2> 138494 INFO  (zkConnectionManagerCallback-173-thread-1) [    ] o.a.s.c.c.ConnectionManager zkClient has connected
   [junit4]   2> 138625 INFO  (TEST-AuditLoggerIntegrationTest.testSynchronous-seed#[41B4EB377A4CD73]) [    ] o.a.s.c.c.ZkStateReader Updated live nodes from ZooKeeper... (0) -> (1)
   [junit4]   2> 138628 INFO  (TEST-AuditLoggerIntegrationTest.testSynchronous-seed#[41B4EB377A4CD73]) [    ] o.a.s.c.s.i.ZkClientClusterStateProvider Cluster at 127.0.0.1:43791/solr ready
   [junit4]   2> 138664 INFO  (qtp365277704-349) [n:127.0.0.1:37317_solr    ] o.a.s.h.a.CollectionsHandler Invoked Collection Action :list with params action=LIST&wt=javabin&version=2 and sendToOCPQueue=true
   [junit4]   2> 138664 INFO  (qtp365277704-349) [n:127.0.0.1:37317_solr    ] o.a.s.s.HttpSolrCall [admin] webapp=null path=/admin/collections params={action=LIST&wt=javabin&version=2} status=0 QTime=0
   [junit4]   2> 138761 INFO  (qtp365277704-349) [n:127.0.0.1:37317_solr    ] o.a.s.s.CallbackAuditLoggerPlugin Sent audit callback {"requestUrl":"http://127.0.0.1:37317/solr/admin/collections","nodeName":"n:127.0.0.1:37317_solr","message":"Completed","level":"INFO","date":1557098312964,"clientIp":"127.0.0.1","collections":[],"headers":{"User-Agent":"Solr[org.apache.solr.client.solrj.impl.HttpSolrClient] 1.0","Connection":"keep-alive","Host":"127.0.0.1:37317"},"solrParams":{"action":["LIST"],"wt":["javabin"],"version":["2"]},"solrHost":"127.0.0.1","solrPort":37317,"solrIp":"127.0.0.1","resource":"/admin/collections","httpMethod":"GET","httpQueryString":"action=LIST&wt=javabin&version=2","eventType":"COMPLETED","requestType":"ADMIN","status":200,"qtime":0.0} to localhost:35580
   [junit4]   2> 138815 INFO  (auditTestCallback-56-thread-1) [    ] o.a.s.s.AuditLoggerIntegrationTest Received audit event for path /admin/collections
   [junit4]   2> 138873 INFO  (qtp365277704-350) [n:127.0.0.1:37317_solr    ] o.a.s.h.a.CollectionsHandler Invoked Collection Action :clusterstatus with params action=CLUSTERSTATUS&wt=javabin&version=2 and sendToOCPQueue=true
   [junit4]   2> 138874 INFO  (qtp365277704-350) [n:127.0.0.1:37317_solr    ] o.a.s.s.HttpSolrCall [admin] webapp=null path=/admin/collections params={action=CLUSTERSTATUS&wt=javabin&version=2} status=0 QTime=1
   [junit4]   2> 138997 INFO  (qtp365277704-350) [n:127.0.0.1:37317_solr    ] o.a.s.s.CallbackAuditLoggerPlugin Sent audit callback {"requestUrl":"http://127.0.0.1:37317/solr/admin/collections","nodeName":"n:127.0.0.1:37317_solr","message":"Completed","level":"INFO","date":1557098313175,"clientIp":"127.0.0.1","collections":[],"headers":{"User-Agent":"Solr[org.apache.solr.client.solrj.impl.HttpSolrClient] 1.0","Connection":"keep-alive","Host":"127.0.0.1:37317"},"solrParams":{"action":["CLUSTERSTATUS"],"wt":["javabin"],"version":["2"]},"solrHost":"127.0.0.1","solrPort":37317,"solrIp":"127.0.0.1","resource":"/admin/collections","httpMethod":"GET","httpQueryString":"action=CLUSTERSTATUS&wt=javabin&version=2","eventType":"COMPLETED","requestType":"ADMIN","status":200,"qtime":1.0} to localhost:35580
   [junit4]   2> 138999 INFO  (qtp365277704-350) [n:127.0.0.1:37317_solr    ] o.a.s.h.a.CollectionsHandler Invoked Collection Action :overseerstatus with params action=OVERSEERSTATUS&wt=javabin&version=2 and sendToOCPQueue=true
   [junit4]   2> 139002 INFO  (auditTestCallback-56-thread-1) [    ] o.a.s.s.AuditLoggerIntegrationTest Received audit event for path /admin/collections
   [junit4]   2> 139384 INFO  (qtp365277704-350) [n:127.0.0.1:37317_solr    ] o.a.s.s.HttpSolrCall [admin] webapp=null path=/admin/collections params={action=OVERSEERSTATUS&wt=javabin&version=2} status=0 QTime=384
   [junit4]   2> 139492 INFO  (auditTestCallback-56-thread-1) [    ] o.a.s.s.AuditLoggerIntegrationTest Received audit event for path /admin/collections
   [junit4]   2> 139514 INFO  (qtp365277704-350) [n:127.0.0.1:37317_solr    ] o.a.s.s.CallbackAuditLoggerPlugin Sent audit callback {"requestUrl":"http://127.0.0.1:37317/solr/admin/collections","nodeName":"n:127.0.0.1:37317_solr","message":"Completed","level":"INFO","date":1557098313684,"clientIp":"127.0.0.1","collections":[],"headers":{"User-Agent":"Solr[org.apache.solr.client.solrj.impl.HttpSolrClient] 1.0","Connection":"keep-alive","Host":"127.0.0.1:37317"},"solrParams":{"action":["OVERSEERSTATUS"],"wt":["javabin"],"version":["2"]},"solrHost":"127.0.0.1","solrPort":37317,"solrIp":"127.0.0.1","resource":"/admin/collections","httpMethod":"GET","httpQueryString":"action=OVERSEERSTATUS&wt=javabin&version=2","eventType":"COMPLETED","requestType":"ADMIN","status":200,"qtime":385.0} to localhost:35580
   [junit4]   2> 139695 INFO  (jetty-closer-174-thread-1) [    ] o.a.s.c.CoreContainer Shutting down CoreContainer instance=788687106
   [junit4]   2> 139695 INFO  (jetty-closer-174-thread-1) [    ] o.a.s.c.ZkController Remove node as live in ZooKeeper:/live_nodes/127.0.0.1:37317_solr
   [junit4]   2> 139767 INFO  (jetty-closer-174-thread-1) [    ] o.a.s.c.ZkController Publish this node as DOWN...
   [junit4]   2> 139767 INFO  (jetty-closer-174-thread-1) [    ] o.a.s.c.ZkController Publish node=127.0.0.1:37317_solr as DOWN
   [junit4]   2> 140072 INFO  (jetty-closer-174-thread-1) [    ] o.a.s.c.TransientSolrCoreCacheDefault Allocating transient cache for 2147483647 transient cores
   [junit4]   2> 140073 INFO  (jetty-closer-174-thread-1) [    ] o.a.s.m.SolrMetricManager Closing metric reporters for registry=solr.node, tag=null
   [junit4]   2> 140073 INFO  (jetty-closer-174-thread-1) [    ] o.a.s.m.r.SolrJmxReporter Closing reporter [org.apache.solr.metrics.reporters.SolrJmxReporter@339047c1: rootName = solr_37317, domain = solr.node, service url = null, agent id = null] for registry solr.node / com.codahale.metrics.MetricRegistry@41d6cb4d
   [junit4]   2> 140587 INFO  (jetty-closer-174-thread-1) [    ] o.a.s.m.SolrMetricManager Closing metric reporters for registry=solr.jvm, tag=null
   [junit4]   2> 140606 INFO  (jetty-closer-174-thread-1) [    ] o.a.s.m.r.SolrJmxReporter Closing reporter [org.apache.solr.metrics.reporters.SolrJmxReporter@25bd786b: rootName = solr_37317, domain = solr.jvm, service url = null, agent id = null] for registry solr.jvm / com.codahale.metrics.MetricRegistry@4f81ac1f
   [junit4]   2> 140608 INFO  (jetty-closer-174-thread-1) [    ] o.a.s.m.SolrMetricManager Closing metric reporters for registry=solr.jetty, tag=null
   [junit4]   2> 140608 INFO  (jetty-closer-174-thread-1) [    ] o.a.s.m.r.SolrJmxReporter Closing reporter [org.apache.solr.metrics.reporters.SolrJmxReporter@40d6ed1c: rootName = solr_37317, domain = solr.jetty, service url = null, agent id = null] for registry solr.jetty / com.codahale.metrics.MetricRegistry@7d5d195d
   [junit4]   2> 140609 INFO  (jetty-closer-174-thread-1) [    ] o.a.s.m.SolrMetricManager Closing metric reporters for registry=solr.cluster, tag=null
   [junit4]   2> 140659 INFO  (closeThreadPool-178-thread-2) [    ] o.a.s.c.Overseer Overseer (id=74642052741267461-127.0.0.1:37317_solr-n_0000000000) closing
   [junit4]   2> 140660 INFO  (OverseerStateUpdate-74642052741267461-127.0.0.1:37317_solr-n_0000000000) [n:127.0.0.1:37317_solr    ] o.a.s.c.Overseer Overseer Loop exiting : 127.0.0.1:37317_solr
   [junit4]   2> 140670 INFO  (OverseerAutoScalingTriggerThread-74642052741267461-127.0.0.1:37317_solr-n_0000000000) [    ] o.a.s.c.a.OverseerTriggerThread OverseerTriggerThread woken up but we are closed, exiting.
   [junit4]   2> 140739 WARN  (NIOServerCxn.Factory:0.0.0.0/0.0.0.0:0) [    ] o.a.z.s.NIOServerCnxn Unable to read additional data from client sessionid 0x1092e8d2ef30005, likely client has closed socket
   [junit4]   2> 140747 INFO  (jetty-closer-174-thread-1) [    ] o.a.s.c.Overseer Overseer (id=74642052741267461-127.0.0.1:37317_solr-n_0000000000) closing
   [junit4]   2> 140747 INFO  (closeThreadPool-178-thread-1) [    ] o.a.s.c.Overseer Overseer (id=74642052741267461-127.0.0.1:37317_solr-n_0000000000) closing
   [junit4]   2> 140889 INFO  (jetty-closer-174-thread-1) [    ] o.e.j.s.AbstractConnector Stopped ServerConnector@7dfe6f51{HTTP/1.1,[http/1.1, h2c]}{127.0.0.1:0}
   [junit4]   2> 140889 INFO  (jetty-closer-174-thread-1) [    ] o.e.j.s.h.ContextHandler Stopped o.e.j.s.ServletContextHandler@225675fc{/solr,null,UNAVAILABLE}
   [junit4]   2> 140890 INFO  (jetty-closer-174-thread-1) [    ] o.e.j.s.session node0 Stopped scavenging
   [junit4]   2> 140892 INFO  (TEST-AuditLoggerIntegrationTest.testSynchronous-seed#[41B4EB377A4CD73]) [    ] o.a.s.c.ZkTestServer Shutting down ZkTestServer.
   [junit4]   2> 140927 WARN  (ZkTestServer Run Thread) [    ] o.a.s.c.ZkTestServer Watch limit violations: 
   [junit4]   2> Maximum concurrent create/delete watches above limit:
   [junit4]   2> 
   [junit4]   2> 	3	/solr/aliases.json
   [junit4]   2> 	3	/solr/clusterprops.json
   [junit4]   2> 
   [junit4]   2> Maximum concurrent data watches above limit:
   [junit4]   2> 
   [junit4]   2> 	3	/solr/clusterstate.json
   [junit4]   2> 
   [junit4]   2> Maximum concurrent children watches above limit:
   [junit4]   2> 
   [junit4]   2> 	3	/solr/live_nodes
   [junit4]   2> 	3	/solr/collections
   [junit4]   2> 
   [junit4]   2> 140971 INFO  (TEST-AuditLoggerIntegrationTest.testSynchronous-seed#[41B4EB377A4CD73]) [    ] o.a.s.c.ZkTestServer parse host and port list: 127.0.0.1:43791
   [junit4]   2> 140971 INFO  (TEST-AuditLoggerIntegrationTest.testSynchronous-seed#[41B4EB377A4CD73]) [    ] o.a.s.c.ZkTestServer connecting to 127.0.0.1 43791
   [junit4]   2> 140972 INFO  (TEST-AuditLoggerIntegrationTest.testSynchronous-seed#[41B4EB377A4CD73]) [    ] o.a.s.SolrTestCaseJ4 ###Ending testSynchronous
   [junit4]   2> 140987 INFO  (TEST-AuditLoggerIntegrationTest.searchWithException-seed#[41B4EB377A4CD73]) [    ] o.a.s.SolrTestCaseJ4 ###Starting searchWithException
   [junit4]   2> 140988 INFO  (auditTestCallback-71-thread-1) [    ] o.a.s.s.AuditLoggerIntegrationTest Listening for audit callbacks on on port 37840
   [junit4]   2> 141003 INFO  (TEST-AuditLoggerIntegrationTest.searchWithException-seed#[41B4EB377A4CD73]) [    ] o.a.s.c.MiniSolrCloudCluster Starting cluster of 1 servers in /home/jenkins/jenkins-slave/workspace/Lucene-Solr-BadApples-Tests-8.x/solr/build/solr-core/test/J1/temp/solr.security.AuditLoggerIntegrationTest_41B4EB377A4CD73-001/tempDir-004
   [junit4]   2> 141003 INFO  (TEST-AuditLoggerIntegrationTest.searchWithException-seed#[41B4EB377A4CD73]) [    ] o.a.s.c.ZkTestServer STARTING ZK TEST SERVER
   [junit4]   2> 141031 INFO  (ZkTestServer Run Thread) [    ] o.a.s.c.ZkTestServer client port:0.0.0.0/0.0.0.0:0
   [junit4]   2> 141031 INFO  (ZkTestServer Run Thread) [    ] o.a.s.c.ZkTestServer Starting server
   [junit4]   2> 141136 INFO  (TEST-AuditLoggerIntegrationTest.searchWithException-seed#[41B4EB377A4CD73]) [    ] o.a.s.c.ZkTestServer start zk server on port:40497
   [junit4]   2> 141136 INFO  (TEST-AuditLoggerIntegrationTest.searchWithException-seed#[41B4EB377A4CD73]) [    ] o.a.s.c.ZkTestServer parse host and port list: 127.0.0.1:40497
   [junit4]   2> 141136 INFO  (TEST-AuditLoggerIntegrationTest.searchWithException-seed#[41B4EB377A4CD73]) [    ] o.a.s.c.ZkTestServer connecting to 127.0.0.1 40497
   [junit4]   2> 141284 INFO  (zkConnectionManagerCallback-180-thread-1) [    ] o.a.s.c.c.ConnectionManager zkClient has connected
   [junit4]   2> 141379 INFO  (zkConnectionManagerCallback-182-thread-1) [    ] o.a.s.c.c.ConnectionManager zkClient has connected
   [junit4]   2> 141434 INFO  (zkConnectionManagerCallback-184-thread-1) [    ] o.a.s.c.c.ConnectionManager zkClient has connected
   [junit4]   2> 141473 WARN  (jetty-launcher-185-thread-1) [    ] o.e.j.s.AbstractConnector Ignoring deprecated socket close linger time
   [junit4]   2> 141473 INFO  (jetty-launcher-185-thread-1) [    ] o.a.s.c.s.e.JettySolrRunner Start Jetty (original configured port=0)
   [junit4]   2> 141473 INFO  (jetty-launcher-185-thread-1) [    ] o.a.s.c.s.e.JettySolrRunner Trying to start Jetty on port 0 try number 1 ...
   [junit4]   2> 141473 INFO  (jetty-launcher-185-thread-1) [    ] o.e.j.s.Server jetty-9.4.14.v20181114; built: 2018-11-14T21:20:31.478Z; git: c4550056e785fb5665914545889f21dc136ad9e6; jvm 1.8.0_191-b12
   [junit4]   2> 141475 INFO  (jetty-launcher-185-thread-1) [    ] o.e.j.s.session DefaultSessionIdManager workerName=node0
   [junit4]   2> 141475 INFO  (jetty-launcher-185-thread-1) [    ] o.e.j.s.session No SessionScavenger set, using defaults
   [junit4]   2> 141475 INFO  (jetty-launcher-185-thread-1) [    ] o.e.j.s.session node0 Scavenging every 600000ms
   [junit4]   2> 141475 INFO  (jetty-launcher-185-thread-1) [    ] o.e.j.s.h.ContextHandler Started o.e.j.s.ServletContextHandler@27486f10{/solr,null,AVAILABLE}
   [junit4]   2> 141513 INFO  (jetty-launcher-185-thread-1) [    ] o.e.j.s.AbstractConnector Started ServerConnector@2a2be344{HTTP/1.1,[http/1.1, h2c]}{127.0.0.1:39088}
   [junit4]   2> 141513 INFO  (jetty-launcher-185-thread-1) [    ] o.e.j.s.Server Started @141810ms
   [junit4]   2> 141513 INFO  (jetty-launcher-185-thread-1) [    ] o.a.s.c.s.e.JettySolrRunner Jetty properties: {hostContext=/solr, hostPort=39088}
   [junit4]   2> 141513 ERROR (jetty-launcher-185-thread-1) [    ] o.a.s.u.StartupLoggingUtils Missing Java Option solr.log.dir. Logging may be missing or incomplete.
   [junit4]   2> 141513 INFO  (jetty-launcher-185-thread-1) [    ] o.a.s.s.SolrDispatchFilter Using logger factory org.apache.logging.slf4j.Log4jLoggerFactory
   [junit4]   2> 141514 INFO  (jetty-launcher-185-thread-1) [    ] o.a.s.s.SolrDispatchFilter  ___      _       Welcome to Apache Solr? version 8.2.0
   [junit4]   2> 141514 INFO  (jetty-launcher-185-thread-1) [    ] o.a.s.s.SolrDispatchFilter / __| ___| |_ _   Starting in cloud mode on port null
   [junit4]   2> 141514 INFO  (jetty-launcher-185-thread-1) [    ] o.a.s.s.SolrDispatchFilter \__ \/ _ \ | '_|  Install dir: null
   [junit4]   2> 141514 INFO  (jetty-launcher-185-thread-1) [    ] o.a.s.s.SolrDispatchFilter |___/\___/_|_|    Start time: 2019-05-05T23:18:35.814Z
   [junit4]   2> 141543 INFO  (zkConnectionManagerCallback-187-thread-1) [    ] o.a.s.c.c.ConnectionManager zkClient has connected
   [junit4]   2> 141545 INFO  (jetty-launcher-185-thread-1) [    ] o.a.s.s.SolrDispatchFilter solr.xml found in ZooKeeper. Loading...
   [junit4]   2> 142045 INFO  (jetty-launcher-185-thread-1) [    ] o.a.s.h.c.HttpShardHandlerFactory Host whitelist initialized: WhitelistHostChecker [whitelistHosts=null, whitelistHostCheckingEnabled=true]
   [junit4]   2> 142081 WARN  (jetty-launcher-185-thread-1) [    ] o.e.j.u.s.S.config No Client EndPointIdentificationAlgorithm configured for SslContextFactory@49512cd6[provider=null,keyStore=null,trustStore=null]
   [junit4]   2> 142103 WARN  (jetty-launcher-185-thread-1) [    ] o.e.j.u.s.S.config No Client EndPointIdentificationAlgorithm configured for SslContextFactory@3ebbf3df[provider=null,keyStore=null,trustStore=null]
   [junit4]   2> 142104 INFO  (jetty-launcher-185-thread-1) [    ] o.a.s.c.ZkContainer Zookeeper client=127.0.0.1:40497/solr
   [junit4]   2> 142157 INFO  (zkConnectionManagerCallback-194-thread-1) [    ] o.a.s.c.c.ConnectionManager zkClient has connected
   [junit4]   2> 142270 INFO  (zkConnectionManagerCallback-196-thread-1) [    ] o.a.s.c.c.ConnectionManager zkClient has connected
   [junit4]   2> 142854 INFO  (jetty-launcher-185-thread-1) [n:127.0.0.1:39088_solr    ] o.a.s.c.OverseerElectionContext I am going to be the leader 127.0.0.1:39088_solr
   [junit4]   2> 142855 INFO  (jetty-launcher-185-thread-1) [n:127.0.0.1:39088_solr    ] o.a.s.c.Overseer Overseer (id=74642053139333125-127.0.0.1:39088_solr-n_0000000000) starting
   [junit4]   2> 142926 INFO  (zkConnectionManagerCallback-203-thread-1) [    ] o.a.s.c.c.ConnectionManager zkClient has connected
   [junit4]   2> 143001 INFO  (jetty-launcher-185-thread-1) [n:127.0.0.1:39088_solr    ] o.a.s.c.s.i.ZkClientClusterStateProvider Cluster at 127.0.0.1:40497/solr ready
   [junit4]   2> 143056 INFO  (jetty-launcher-185-thread-1) [n:127.0.0.1:39088_solr    ] o.a.s.c.ZkController Register node as live in ZooKeeper:/live_nodes/127.0.0.1:39088_solr
   [junit4]   2> 143056 INFO  (OverseerStateUpdate-74642053139333125-127.0.0.1:39088_solr-n_0000000000) [n:127.0.0.1:39088_solr    ] o.a.s.c.Overseer Starting to work on the main queue : 127.0.0.1:39088_solr
   [junit4]   2> 143091 INFO  (OverseerStateUpdate-74642053139333125-127.0.0.1:39088_solr-n_0000000000) [n:127.0.0.1:39088_solr    ] o.a.s.c.c.ZkStateReader Updated live nodes from ZooKeeper... (0) -> (1)
   [junit4]   2> 143093 INFO  (zkCallback-202-thread-1) [    ] o.a.s.c.c.ZkStateReader Updated live nodes from ZooKeeper... (0) -> (1)
   [junit4]   2> 143130 INFO  (jetty-launcher-185-thread-1) [n:127.0.0.1:39088_solr    ] o.a.s.c.CoreContainer Initializing auditlogger plugin: solr.CallbackAuditLoggerPlugin
   [junit4]   2> 143417 INFO  (jetty-launcher-185-thread-1) [n:127.0.0.1:39088_solr    ] o.a.s.h.a.MetricsHistoryHandler No .system collection, keeping metrics history in memory.
   [junit4]   2> 143653 INFO  (jetty-launcher-185-thread-1) [n:127.0.0.1:39088_solr    ] o.a.s.m.r.SolrJmxReporter JMX monitoring for 'solr_39088.solr.node' (registry 'solr.node') enabled at server: com.sun.jmx.mbeanserver.JmxMBeanServer@4671c6f8
   [junit4]   2> 143728 INFO  (jetty-launcher-185-thread-1) [n:127.0.0.1:39088_solr    ] o.a.s.m.r.SolrJmxReporter JMX monitoring for 'solr_39088.solr.jvm' (registry 'solr.jvm') enabled at server: com.sun.jmx.mbeanserver.JmxMBeanServer@4671c6f8
   [junit4]   2> 143728 INFO  (jetty-launcher-185-thread-1) [n:127.0.0.1:39088_solr    ] o.a.s.m.r.SolrJmxReporter JMX monitoring for 'solr_39088.solr.jetty' (registry 'solr.jetty') enabled at server: com.sun.jmx.mbeanserver.JmxMBeanServer@4671c6f8
   [junit4]   2> 143763 INFO  (jetty-launcher-185-thread-1) [n:127.0.0.1:39088_solr    ] o.a.s.c.CorePropertiesLocator Found 0 core definitions underneath /home/jenkins/jenkins-slave/workspace/Lucene-Solr-BadApples-Tests-8.x/solr/build/solr-core/test/J1/temp/solr.security.AuditLoggerIntegrationTest_41B4EB377A4CD73-001/tempDir-004/node1/.
   [junit4]   2> 144389 INFO  (zkConnectionManagerCallback-209-thread-1) [    ] o.a.s.c.c.ConnectionManager zkClient has connected
   [junit4]   2> 144481 INFO  (TEST-AuditLoggerIntegrationTest.searchWithException-seed#[41B4EB377A4CD73]) [    ] o.a.s.c.c.ZkStateReader Updated live nodes from ZooKeeper... (0) -> (1)
   [junit4]   2> 144482 INFO  (TEST-AuditLoggerIntegrationTest.searchWithException-seed#[41B4EB377A4CD73]) [    ] o.a.s.c.s.i.ZkClientClusterStateProvider Cluster at 127.0.0.1:40497/solr ready
   [junit4]   2> 144554 INFO  (qtp1346482457-421) [n:127.0.0.1:39088_solr    ] o.a.s.h.a.CollectionsHandler Invoked Collection Action :create with params pullReplicas=0&name=test&nrtReplicas=1&action=CREATE&numShards=1&tlogReplicas=0&wt=javabin&version=2 and sendToOCPQueue=true
   [junit4]   2> 144700 INFO  (OverseerThreadFactory-80-thread-1-processing-n:127.0.0.1:39088_solr) [n:127.0.0.1:39088_solr    ] o.a.s.c.a.c.CreateCollectionCmd Create collection test
   [junit4]   2> 144702 INFO  (OverseerThreadFactory-80-thread-1-processing-n:127.0.0.1:39088_solr) [n:127.0.0.1:39088_solr    ] o.a.s.c.c.ZkConfigManager Copying zk node /configs/_default/protwords.txt to /configs/test.AUTOCREATED/protwords.txt
   [junit4]   2> 144726 INFO  (OverseerThreadFactory-80-thread-1-processing-n:127.0.0.1:39088_solr) [n:127.0.0.1:39088_solr    ] o.a.s.c.c.ZkConfigManager Copying zk node /configs/_default/managed-schema to /configs/test.AUTOCREATED/managed-schema
   [junit4]   2> 144728 INFO  (OverseerThreadFactory-80-thread-1-processing-n:127.0.0.1:39088_solr) [n:127.0.0.1:39088_solr    ] o.a.s.c.c.ZkConfigManager Copying zk node /configs/_default/solrconfig.xml to /configs/test.AUTOCREATED/solrconfig.xml
   [junit4]   2> 144746 INFO  (OverseerThreadFactory-80-thread-1-processing-n:127.0.0.1:39088_solr) [n:127.0.0.1:39088_solr    ] o.a.s.c.c.ZkConfigManager Copying zk node /configs/_default/synonyms.txt to /configs/test.AUTOCREATED/synonyms.txt
   [junit4]   2> 144748 INFO  (OverseerThreadFactory-80-thread-1-processing-n:127.0.0.1:39088_solr) [n:127.0.0.1:39088_solr    ] o.a.s.c.c.ZkConfigManager Copying zk node /configs/_default/stopwords.txt to /configs/test.AUTOCREATED/stopwords.txt
   [junit4]   2> 144749 INFO  (OverseerThreadFactory-80-thread-1-processing-n:127.0.0.1:39088_solr) [n:127.0.0.1:39088_solr    ] o.a.s.c.c.ZkConfigManager Copying zk node /configs/_default/params.json to /configs/test.AUTOCREATED/params.json
   [junit4]   2> 144784 INFO  (OverseerThreadFactory-80-thread-1-processing-n:127.0.0.1:39088_solr) [n:127.0.0.1:39088_solr    ] o.a.s.c.c.ZkConfigManager Copying zk node /configs/_default/lang/contractions_it.txt to /configs/test.AUTOCREATED/lang/contractions_it.txt
   [junit4]   2> 144785 INFO  (OverseerThreadFactory-80-thread-1-processing-n:127.0.0.1:39088_solr) [n:127.0.0.1:39088_solr    ] o.a.s.c.c.ZkConfigManager Copying zk node /configs/_default/lang/stopwords_no.txt to /configs/test.AUTOCREATED/lang/stopwords_no.txt
   [junit4]   2> 144799 INFO  (OverseerThreadFactory-80-thread-1-processing-n:127.0.0.1:39088_solr) [n:127.0.0.1:39088_solr    ] o.a.s.c.c.ZkConfigManager Copying zk node /configs/_default/lang/stopwords_hy.txt to /configs/test.AUTOCREATED/lang/stopwords_hy.txt
   [junit4]   2> 144801 INFO  (OverseerThreadFactory-80-thread-1-processing-n:127.0.0.1:39088_solr) [n:127.0.0.1:39088_solr    ] o.a.s.c.c.ZkConfigManager Copying zk node /configs/_default/lang/stemdict_nl.txt to /configs/test.AUTOCREATED/lang/stemdict_nl.txt
   [junit4]   2> 144819 INFO  (OverseerThreadFactory-80-thread-1-processing-n:127.0.0.1:39088_solr) [n:127.0.0.1:39088_solr    ] o.a.s.c.c.ZkConfigManager Copying zk node /configs/_default/lang/contractions_ca.txt to /configs/test.AUTOCREATED/lang/contractions_ca.txt
   [junit4]   2> 144824 INFO  (OverseerThreadFactory-80-thread-1-processing-n:127.0.0.1:39088_solr) [n:127.0.0.1:39088_solr    ] o.a.s.c.c.ZkConfigManager Copying zk node /configs/_default/lang/stopwords_id.txt to /configs/test.AUTOCREATED/lang/stopwords_id.txt
   [junit4]   2> 144825 INFO  (OverseerThreadFactory-80-thread-1-processing-n:127.0.0.1:39088_solr) [n:127.0.0.1:39088_solr    ] o.a.s.c.c.ZkConfigManager Copying zk node /configs/_default/lang/stopwords_ga.txt to /configs/test.AUTOCREATED/lang/stopwords_ga.txt
   [junit4]   2> 144847 INFO  (OverseerThreadFactory-80-thread-1-processing-n:127.0.0.1:39088_solr) [n:127.0.0.1:39088_solr    ] o.a.s.c.c.ZkConfigManager Copying zk node /configs/_default/lang/stopwords_da.txt to /configs/test.AUTOCREATED/lang/stopwords_da.txt
   [junit4]   2> 144882 INFO  (OverseerThreadFactory-80-thread-1-processing-n:127.0.0.1:39088_solr) [n:127.0.0.1:39088_solr    ] o.a.s.c.c.ZkConfigManager Copying zk node /configs/_default/lang/stopwords_hi.txt to /configs/test.AUTOCREATED/lang/stopwords_hi.txt
   [junit4]   2> 144917 INFO  (OverseerThreadFactory-80-thread-1-processing-n:127.0.0.1:39088_solr) [n:127.0.0.1:39088_solr    ] o.a.s.c.c.ZkConfigManager Copying zk node /configs/_default/lang/stopwords_ja.txt to /configs/test.AUTOCREATED/lang/stopwords_ja.txt
   [junit4]   2> 144919 INFO  (OverseerThreadFactory-80-thread-1-processing-n:127.0.0.1:39088_solr) [n:127.0.0.1:39088_solr    ] o.a.s.c.c.ZkConfigManager Copying zk node /configs/_default/lang/stopwords_pt.txt to /configs/test.AUTOCREATED/lang/stopwords_pt.txt
   [junit4]   2> 144935 INFO  (OverseerThreadFactory-80-thread-1-processing-n:127.0.0.1:39088_solr) [n:127.0.0.1:39088_solr    ] o.a.s.c.c.ZkConfigManager Copying zk node /configs/_default/lang/stopwords_hu.txt to /configs/test.AUTOCREATED/lang/stopwords_hu.txt
   [junit4]   2> 144950 INFO  (OverseerThreadFactory-80-thread-1-processing-n:127.0.0.1:39088_solr) [n:127.0.0.1:39088_solr    ] o.a.s.c.c.ZkConfigManager Copying zk node /configs/_default/lang/stopwords_el.txt to /configs/test.AUTOCREATED/lang/stopwords_el.txt
   [junit4]   2> 144951 INFO  (OverseerThreadFactory-80-thread-1-processing-n:127.0.0.1:39088_solr) [n:127.0.0.1:39088_solr    ] o.a.s.c.c.ZkConfigManager Copying zk node /configs/_default/lang/stopwords_ru.txt to /configs/test.AUTOCREATED/lang/stopwords_ru.txt
   [junit4]   2> 145058 INFO  (OverseerThreadFactory-80-thread-1-processing-n:127.0.0.1:39088_solr) [n:127.0.0.1:39088_solr    ] o.a.s.c.c.ZkConfigManager Copying zk node /configs/_default/lang/stopwords_tr.txt to /configs/test.AUTOCREATED/lang/stopwords_tr.txt
   [junit4]   2> 145131 INFO  (OverseerThreadFactory-80-thread-1-processing-n:127.0.0.1:39088_solr) [n:127.0.0.1:39088_solr    ] o.a.s.c.c.ZkConfigManager Copying zk node /configs/_default/lang/stopwords_ar.txt to /configs/test.AUTOCREATED/lang/stopwords_ar.txt
   [junit4]   2> 145133 INFO  (OverseerThreadFactory-80-thread-1-processing-n:127.0.0.1:39088_solr) [n:127.0.0.1:39088_solr    ] o.a.s.c.c.ZkConfigManager Copying zk node /configs/_default/lang/userdict_ja.txt to /configs/test.AUTOCREATED/lang/userdict_ja.txt
   [junit4]   2> 145134 INFO  (OverseerThreadFactory-80-thread-1-processing-n:127.0.0.1:39088_solr) [n:127.0.0.1:39088_solr    ] o.a.s.c.c.ZkConfigManager Copying zk node /configs/_default/lang/stopwords_it.txt to /configs/test.AUTOCREATED/lang/stopwords_it.txt
   [junit4]   2> 145361 INFO  (OverseerThreadFactory-80-thread-1-processing-n:127.0.0.1:39088_solr) [n:127.0.0.1:39088_solr    ] o.a.s.c.c.ZkConfigManager Copying zk node /configs/_default/lang/stopwords_eu.txt to /configs/test.AUTOCREATED/lang/stopwords_eu.txt
   [junit4]   2> 145379 INFO  (OverseerThreadFactory-80-thread-1-processing-n:127.0.0.1:39088_solr) [n:127.0.0.1:39088_solr    ] o.a.s.c.c.ZkConfigManager Copying zk node /configs/_default/lang/stopwords_cz.txt to /configs/test.AUTOCREATED/lang/stopwords_cz.txt
   [junit4]   2> 145399 INFO  (OverseerThreadFactory-80-thread-1-processing-n:127.0.0.1:39088_solr) [n:127.0.0.1:39088_solr    ] o.a.s.c.c.ZkConfigManager Copying zk node /configs/_default/lang/stoptags_ja.txt to /configs/test.AUTOCREATED/lang/stoptags_ja.txt
   [junit4]   2> 145400 INFO  (OverseerThreadFactory-80-thread-1-processing-n:127.0.0.1:39088_solr) [n:127.0.0.1:39088_solr    ] o.a.s.c.c.ZkConfigManager Copying zk node /configs/_default/lang/contractions_fr.txt to /configs/test.AUTOCREATED/lang/contractions_fr.txt
   [junit4]   2> 145414 INFO  (OverseerThreadFactory-80-thread-1-processing-n:127.0.0.1:39088_solr) [n:127.0.0.1:39088_solr    ] o.a.s.c.c.ZkConfigManager Copying zk node /configs/_default/lang/stopwords_fa.txt to /configs/test.AUTOCREATED/lang/stopwords_fa.txt
   [junit4]   2> 145416 INFO  (OverseerThreadFactory-80-thread-1-processing-n:127.0.0.1:39088_solr) [n:127.0.0.1:39088_solr    ] o.a.s.c.c.ZkConfigManager Copying zk node /configs/_default/lang/stopwords_de.txt to /configs/test.AUTOCREATED/lang/stopwords_de.txt
   [junit4]   2> 145417 INFO  (OverseerThreadFactory-80-thread-1-processing-n:127.0.0.1:39088_solr) [n:127.0.0.1:39088_solr    ] o.a.s.c.c.ZkConfigManager Copying zk node /configs/_default/lang/contractions_ga.txt to /configs/test.AUTOCREATED/lang/contractions_ga.txt
   [junit4]   2> 145452 INFO  (OverseerThreadFactory-80-thread-1-processing-n:127.0.0.1:39088_solr) [n:127.0.0.1:39088_solr    ] o.a.s.c.c.ZkConfigManager Copying zk node /configs/_default/lang/stopwords_ca.txt to /configs/test.AUTOCREATED/lang/stopwords_ca.txt
   [junit4]   2> 145453 INFO  (OverseerThreadFactory-80-thread-1-processing-n:127.0.0.1:39088_solr) [n:127.0.0.1:39088_solr    ] o.a.s.c.c.ZkConfigManager Copying zk node /configs/_default/lang/stopwords_nl.txt to /configs/test.AUTOCREATED/lang/stopwords_nl.txt
   [junit4]   2> 145487 INFO  (OverseerThreadFactory-80-thread-1-processing-n:127.0.0.1:39088_solr) [n:127.0.0.1:39088_solr    ] o.a.s.c.c.ZkConfigManager Copying zk node /configs/_default/lang/stopwords_bg.txt to /configs/test.AUTOCREATED/lang/stopwords_bg.txt
   [junit4]   2> 145489 INFO  (OverseerThreadFactory-80-thread-1-processing-n:127.0.0.1:39088_solr) [n:127.0.0.1:39088_solr    ] o.a.s.c.c.ZkConfigManager Copying zk node /configs/_default/lang/stopwords_es.txt to /configs/test.AUTOCREATED/lang/stopwords_es.txt
   [junit4]   2> 145491 INFO  (OverseerThreadFactory-80-thread-1-processing-n:127.0.0.1:39088_solr) [n:127.0.0.1:39088_solr    ] o.a.s.c.c.ZkConfigManager Copying zk node /configs/_default/lang/stopwords_en.txt to /configs/test.AUTOCREATED/lang/stopwords_en.txt
   [junit4]   2> 145510 INFO  (OverseerThreadFactory-80-thread-1-processing-n:127.0.0.1:39088_solr) [n:127.0.0.1:39088_solr    ] o.a.s.c.c.ZkConfigManager Copying zk node /configs/_default/lang/stopwords_lv.txt to /configs/test.AUTOCREATED/lang/stopwords_lv.txt
   [junit4]   2> 145524 INFO  (OverseerThreadFactory-80-thread-1-processing-n:127.0.0.1:39088_solr) [n:127.0.0.1:39088_solr    ] o.a.s.c.c.ZkConfigManager Copying zk node /configs/_default/lang/stopwords_th.txt to /configs/test.AUTOCREATED/lang/stopwords_th.txt
   [junit4]   2> 145525 INFO  (OverseerThreadFactory-80-thread-1-processing-n:127.0.0.1:39088_solr) [n:127.0.0.1:39088_solr    ] o.a.s.c.c.ZkConfigManager Copying zk node /configs/_default/lang/stopwords_ro.txt to /configs/test.AUTOCREATED/lang/stopwords_ro.txt
   [junit4]   2> 145544 INFO  (OverseerThreadFactory-80-thread-1-processing-n:127.0.0.1:39088_solr) [n:127.0.0.1:39088_solr    ] o.a.s.c.c.ZkConfigManager Copying zk node /configs/_default/lang/stopwords_fr.txt to /configs/test.AUTOCREATED/lang/stopwords_fr.txt
   [junit4]   2> 145560 INFO  (OverseerThreadFactory-80-thread-1-processing-n:127.0.0.1:39088_solr) [n:127.0.0.1:39088_solr    ] o.a.s.c.c.ZkConfigManager Copying zk node /configs/_default/lang/stopwords_sv.txt to /configs/test.AUTOCREATED/lang/stopwords_sv.txt
   [junit4]   2> 145562 INFO  (OverseerThreadFactory-80-thread-1-processing-n:127.0.0.1:39088_solr) [n:127.0.0.1:39088_solr    ] o.a.s.c.c.ZkConfigManager Copying zk node /configs/_default/lang/stopwords_fi.txt to /configs/test.AUTOCREATED/lang/stopwords_fi.txt
   [junit4]   2> 145563 INFO  (OverseerThreadFactory-80-thread-1-processing-n:127.0.0.1:39088_solr) [n:127.0.0.1:39088_solr    ] o.a.s.c.c.ZkConfigManager Copying zk node /configs/_default/lang/hyphenations_ga.txt to /configs/test.AUTOCREATED/lang/hyphenations_ga.txt
   [junit4]   2> 145618 INFO  (OverseerThreadFactory-80-thread-1-processing-n:127.0.0.1:39088_solr) [n:127.0.0.1:39088_solr    ] o.a.s.c.c.ZkConfigManager Copying zk node /configs/_default/lang/stopwords_gl.txt to /configs/test.AUTOCREATED/lang/stopwords_gl.txt
   [junit4]   2> 146135 INFO  (OverseerStateUpdate-74642053139333125-127.0.0.1:39088_solr-n_0000000000) [n:127.0.0.1:39088_solr    ] o.a.s.c.o.SliceMutator createReplica() {
   [junit4]   2>   "operation":"ADDREPLICA",
   [junit4]   2>   "collection":"test",
   [junit4]   2>   "shard":"shard1",
   [junit4]   2>   "core":"test_shard1_replica_n1",
   [junit4]   2>   "state":"down",
   [junit4]   2>   "base_url":"http://127.0.0.1:39088/solr",
   [junit4]   2>   "type":"NRT",
   [junit4]   2>   "waitForFinalState":"false"} 
   [junit4]   2> 146520 INFO  (qtp1346482457-424) [n:127.0.0.1:39088_solr    x:test_shard1_replica_n1] o.a.s.h.a.CoreAdminOperation core create command qt=/admin/cores&coreNodeName=core_node2&collection.configName=test.AUTOCREATED&newCollection=true&name=test_shard1_replica_n1&action=CREATE&numShards=1&collection=test&shard=shard1&wt=javabin&version=2&replicaType=NRT
   [junit4]   2> 146535 INFO  (qtp1346482457-424) [n:127.0.0.1:39088_solr    x:test_shard1_replica_n1] o.a.s.c.TransientSolrCoreCacheDefault Allocating transient cache for 2147483647 transient cores
   [junit4]   2> 148202 INFO  (qtp1346482457-424) [n:127.0.0.1:39088_solr c:test s:shard1 r:core_node2 x:test_shard1_replica_n1] o.a.s.c.RequestParams conf resource params.json loaded . version : 0 
   [junit4]   2> 148203 INFO  (qtp1346482457-424) [n:127.0.0.1:39088_solr c:test s:shard1 r:core_node2 x:test_shard1_replica_n1] o.a.s.c.RequestParams request params refreshed to version 0
   [junit4]   2> 148289 WARN  (qtp1346482457-424) [n:127.0.0.1:39088_solr c:test s:shard1 r:core_node2 x:test_shard1_replica_n1] o.a.s.c.SolrConfig Couldn't add files from /home/jenkins/jenkins-slave/workspace/Lucene-Solr-BadApples-Tests-8.x/solr/build/solr-core/test/J1/temp/solr.security.AuditLoggerIntegrationTest_41B4EB377A4CD73-001/tempDir-004/node1/test_shard1_replica_n1/../../../../contrib/extraction/lib filtered by .*\.jar to classpath: /home/jenkins/jenkins-slave/workspace/Lucene-Solr-BadApples-Tests-8.x/solr/build/solr-core/test/J1/temp/solr.security.AuditLoggerIntegrationTest_41B4EB377A4CD73-001/tempDir-004/node1/test_shard1_replica_n1/../../../../contrib/extraction/lib
   [junit4]   2> 148289 WARN  (qtp1346482457-424) [n:127.0.0.1:39088_solr c:test s:shard1 r:core_node2 x:test_shard1_replica_n1] o.a.s.c.SolrConfig Couldn't add files from /home/jenkins/jenkins-slave/workspace/Lucene-Solr-BadApples-Tests-8.x/solr/build/solr-core/test/J1/temp/solr.security.AuditLoggerIntegrationTest_41B4EB377A4CD73-001/tempDir-004/node1/test_shard1_replica_n1/../../../../dist filtered by solr-cell-\d.*\.jar to classpath: /home/jenkins/jenkins-slave/workspace/Lucene-Solr-BadApples-Tests-8.x/solr/build/solr-core/test/J1/temp/solr.security.AuditLoggerIntegrationTest_41B4EB377A4CD73-001/tempDir-004/node1/test_shard1_replica_n1/../../../../dist
   [junit4]   2> 148289 WARN  (qtp1346482457-424) [n:127.0.0.1:39088_solr c:test s:shard1 r:core_node2 x:test_shard1_replica_n1] o.a.s.c.SolrConfig Couldn't add files from /home/jenkins/jenkins-slave/workspace/Lucene-Solr-BadApples-Tests-8.x/solr/build/solr-core/test/J1/temp/solr.security.AuditLoggerIntegrationTest_41B4EB377A4CD73-001/tempDir-004/node1/test_shard1_replica_n1/../../../../contrib/clustering/lib filtered by .*\.jar to classpath: /home/jenkins/jenkins-slave/workspace/Lucene-Solr-BadApples-Tests-8.x/solr/build/solr-core/test/J1/temp/solr.security.AuditLoggerIntegrationTest_41B4EB377A4CD73-001/tempDir-004/node1/test_shard1_replica_n1/../../../../contrib/clustering/lib
   [junit4]   2> 148289 WARN  (qtp1346482457-424) [n:127.0.0.1:39088_solr c:test s:shard1 r:core_node2 x:test_shard1_replica_n1] o.a.s.c.SolrConfig Couldn't add files from /home/jenkins/jenkins-slave/workspace/Lucene-Solr-BadApples-Tests-8.x/solr/build/solr-core/test/J1/temp/solr.security.AuditLoggerIntegrationTest_41B4EB377A4CD73-001/tempDir-004/node1/test_shard1_replica_n1/../../../../dist filtered by solr-clustering-\d.*\.jar to classpath: /home/jenkins/jenkins-slave/workspace/Lucene-Solr-BadApples-Tests-8.x/solr/build/solr-core/test/J1/temp/solr.security.AuditLoggerIntegrationTest_41B4EB377A4CD73-001/tempDir-004/node1/test_shard1_replica_n1/../../../../dist
   [junit4]   2> 148289 WARN  (qtp1346482457-424) [n:127.0.0.1:39088_solr c:test s:shard1 r:core_node2 x:test_shard1_replica_n1] o.a.s.c.SolrConfig Couldn't add files from /home/jenkins/jenkins-slave/workspace/Lucene-Solr-BadApples-Tests-8.x/solr/build/solr-core/test/J1/temp/solr.security.AuditLoggerIntegrationTest_41B4EB377A4CD73-001/tempDir-004/node1/test_shard1_replica_n1/../../../../contrib/langid/lib filtered by .*\.jar to classpath: /home/jenkins/jenkins-slave/workspace/Lucene-Solr-BadApples-Tests-8.x/solr/build/solr-core/test/J1/temp/solr.security.AuditLoggerIntegrationTest_41B4EB377A4CD73-001/tempDir-004/node1/test_shard1_replica_n1/../../../../contrib/langid/lib
   [junit4]   2> 148341 WARN  (qtp1346482457-424) [n:127.0.0.1:39088_solr c:test s:shard1 r:core_node2 x:test_shard1_replica_n1] o.a.s.c.SolrConfig Couldn't add files from /home/jenkins/jenkins-slave/workspace/Lucene-Solr-BadApples-Tests-8.x/solr/build/solr-core/test/J1/temp/solr.security.AuditLoggerIntegrationTest_41B4EB377A4CD73-001/tempDir-004/node1/test_shard1_replica_n1/../../../../dist filtered by solr-langid-\d.*\.jar to classpath: /home/jenkins/jenkins-slave/workspace/Lucene-Solr-BadApples-Tests-8.x/solr/build/solr-core/test/J1/temp/solr.security.AuditLoggerIntegrationTest_41B4EB377A4CD73-001/tempDir-004/node1/test_shard1_replica_n1/../../../../dist
   [junit4]   2> 148341 WARN  (qtp1346482457-424) [n:127.0.0.1:39088_solr c:test s:shard1 r:core_node2 x:test_shard1_replica_n1] o.a.s.c.SolrConfig Couldn't add files from /home/jenkins/jenkins-slave/workspace/Lucene-Solr-BadApples-Tests-8.x/solr/build/solr-core/test/J1/temp/solr.security.AuditLoggerIntegrationTest_41B4EB377A4CD73-001/tempDir-004/node1/test_shard1_replica_n1/../../../../contrib/velocity/lib filtered by .*\.jar to classpath: /home/jenkins/jenkins-slave/workspace/Lucene-Solr-BadApples-Tests-8.x/solr/build/solr-core/test/J1/temp/solr.security.AuditLoggerIntegrationTest_41B4EB377A4CD73-001/tempDir-004/node1/test_shard1_replica_n1/../../../../contrib/velocity/lib
   [junit4]   2> 148341 WARN  (qtp1346482457-424) [n:127.0.0.1:39088_solr c:test s:shard1 r:core_node2 x:test_shard1_replica_n1] o.a.s.c.SolrConfig Couldn't add files from /home/jenkins/jenkins-slave/workspace/Lucene-Solr-BadApples-Tests-8.x/solr/build/solr-core/test/J1/temp/solr.security.AuditLoggerIntegrationTest_41B4EB377A4CD73-001/tempDir-004/node1/test_shard1_replica_n1/../../../../dist filtered by solr-velocity-\d.*\.jar to classpath: /home/jenkins/jenkins-slave/workspace/Lucene-Solr-BadApples-Tests-8.x/solr/build/solr-core/test/J1/temp/solr.security.AuditLoggerIntegrationTest_41B4EB377A4CD73-001/tempDir-004/node1/test_shard1_replica_n1/../../../../dist
   [junit4]   2> 148342 WARN  (qtp1346482457-424) [n:127.0.0.1:39088_solr c:test s:shard1 r:core_node2 x:test_shard1_replica_n1] o.a.s.c.SolrConfig Couldn't add files from /home/jenkins/jenkins-slave/workspace/Lucene-Solr-BadApples-Tests-8.x/solr/build/solr-core/test/J1/temp/solr.security.AuditLoggerIntegrationTest_41B4EB377A4CD73-001/tempDir-004/node1/test_shard1_replica_n1/../../../../dist filtered by solr-ltr-\d.*\.jar to classpath: /home/jenkins/jenkins-slave/workspace/Lucene-Solr-BadApples-Tests-8.x/solr/build/solr-core/test/J1/temp/solr.security.AuditLoggerIntegrationTest_41B4EB377A4CD73-001/tempDir-004/node1/test_shard1_replica_n1/../../../../dist
   [junit4]   2> 148361 INFO  (qtp1346482457-424) [n:127.0.0.1:39088_solr c:test s:shard1 r:core_node2 x:test_shard1_replica_n1] o.a.s.c.SolrConfig Using Lucene MatchVersion: 8.2.0
   [junit4]   2> 149323 INFO  (qtp1346482457-424) [n:127.0.0.1:39088_solr c:test s:shard1 r:core_node2 x:test_shard1_replica_n1] o.a.s.s.IndexSchema [test_shard1_replica_n1] Schema name=default-config
   [junit4]   2> 152723 INFO  (qtp1346482457-424) [n:127.0.0.1:39088_solr c:test s:shard1 r:core_node2 x:test_shard1_replica_n1] o.a.s.s.IndexSchema Loaded schema default-config/1.6 with uniqueid field id
   [junit4]   2> 153186 INFO  (qtp1346482457-424) [n:127.0.0.1:39088_solr c:test s:shard1 r:core_node2 x:test_shard1_replica_n1] o.a.s.c.CoreContainer Creating SolrCore 'test_shard1_replica_n1' using configuration from collection test, trusted=true
   [junit4]   2> 153465 INFO  (qtp1346482457-424) [n:127.0.0.1:39088_solr c:test s:shard1 r:core_node2 x:test_shard1_replica_n1] o.a.s.m.r.SolrJmxReporter JMX monitoring for 'solr_39088.solr.core.test.shard1.replica_n1' (registry 'solr.core.test.shard1.replica_n1') enabled at server: com.sun.jmx.mbeanserver.JmxMBeanServer@4671c6f8
   [junit4]   2> 153466 INFO  (qtp1346482457-424) [n:127.0.0.1:39088_solr c:test s:shard1 r:core_node2 x:test_shard1_replica_n1] o.a.s.c.SolrCore [[tes

[...truncated too long message...]

operty disallowed.ivy.jars.list as its length is 0.

-ivy-fail-disallowed-ivy-version:

ivy-fail:

ivy-fail:

ivy-configure:
[ivy:configure] :: loading settings :: file = /home/jenkins/jenkins-slave/workspace/Lucene-Solr-BadApples-Tests-8.x/lucene/top-level-ivy-settings.xml

resolve:

ivy-availability-check:
[loadresource] Do not set property disallowed.ivy.jars.list as its length is 0.

-ivy-fail-disallowed-ivy-version:

ivy-fail:

ivy-configure:
[ivy:configure] :: loading settings :: file = /home/jenkins/jenkins-slave/workspace/Lucene-Solr-BadApples-Tests-8.x/lucene/top-level-ivy-settings.xml

resolve:

ivy-availability-check:
[loadresource] Do not set property disallowed.ivy.jars.list as its length is 0.

-ivy-fail-disallowed-ivy-version:

ivy-fail:

ivy-fail:

ivy-configure:
[ivy:configure] :: loading settings :: file = /home/jenkins/jenkins-slave/workspace/Lucene-Solr-BadApples-Tests-8.x/lucene/top-level-ivy-settings.xml

resolve:

ivy-availability-check:
[loadresource] Do not set property disallowed.ivy.jars.list as its length is 0.

-ivy-fail-disallowed-ivy-version:

ivy-fail:

ivy-configure:
[ivy:configure] :: loading settings :: file = /home/jenkins/jenkins-slave/workspace/Lucene-Solr-BadApples-Tests-8.x/lucene/top-level-ivy-settings.xml

resolve:

ivy-availability-check:
[loadresource] Do not set property disallowed.ivy.jars.list as its length is 0.

-ivy-fail-disallowed-ivy-version:

ivy-fail:

ivy-fail:

ivy-configure:
[ivy:configure] :: loading settings :: file = /home/jenkins/jenkins-slave/workspace/Lucene-Solr-BadApples-Tests-8.x/lucene/top-level-ivy-settings.xml

resolve:

ivy-availability-check:
[loadresource] Do not set property disallowed.ivy.jars.list as its length is 0.

-ivy-fail-disallowed-ivy-version:

ivy-fail:

ivy-fail:

ivy-configure:
[ivy:configure] :: loading settings :: file = /home/jenkins/jenkins-slave/workspace/Lucene-Solr-BadApples-Tests-8.x/lucene/top-level-ivy-settings.xml

resolve:

ivy-availability-check:
[loadresource] Do not set property disallowed.ivy.jars.list as its length is 0.

-ivy-fail-disallowed-ivy-version:

ivy-fail:

ivy-fail:

ivy-configure:
[ivy:configure] :: loading settings :: file = /home/jenkins/jenkins-slave/workspace/Lucene-Solr-BadApples-Tests-8.x/lucene/top-level-ivy-settings.xml

resolve:

ivy-availability-check:
[loadresource] Do not set property disallowed.ivy.jars.list as its length is 0.

-ivy-fail-disallowed-ivy-version:

ivy-fail:

ivy-fail:

ivy-configure:
[ivy:configure] :: loading settings :: file = /home/jenkins/jenkins-slave/workspace/Lucene-Solr-BadApples-Tests-8.x/lucene/top-level-ivy-settings.xml

resolve:

ivy-availability-check:
[loadresource] Do not set property disallowed.ivy.jars.list as its length is 0.

-ivy-fail-disallowed-ivy-version:

ivy-fail:

ivy-fail:

ivy-configure:
[ivy:configure] :: loading settings :: file = /home/jenkins/jenkins-slave/workspace/Lucene-Solr-BadApples-Tests-8.x/lucene/top-level-ivy-settings.xml

resolve:

ivy-availability-check:
[loadresource] Do not set property disallowed.ivy.jars.list as its length is 0.

-ivy-fail-disallowed-ivy-version:

ivy-fail:

ivy-fail:

ivy-configure:
[ivy:configure] :: loading settings :: file = /home/jenkins/jenkins-slave/workspace/Lucene-Solr-BadApples-Tests-8.x/lucene/top-level-ivy-settings.xml

resolve:

ivy-availability-check:
[loadresource] Do not set property disallowed.ivy.jars.list as its length is 0.

-ivy-fail-disallowed-ivy-version:

ivy-fail:

ivy-fail:

ivy-configure:
[ivy:configure] :: loading settings :: file = /home/jenkins/jenkins-slave/workspace/Lucene-Solr-BadApples-Tests-8.x/lucene/top-level-ivy-settings.xml

resolve:

ivy-availability-check:
[loadresource] Do not set property disallowed.ivy.jars.list as its length is 0.

-ivy-fail-disallowed-ivy-version:

ivy-fail:

ivy-fail:

ivy-configure:
[ivy:configure] :: loading settings :: file = /home/jenkins/jenkins-slave/workspace/Lucene-Solr-BadApples-Tests-8.x/lucene/top-level-ivy-settings.xml

resolve:

ivy-availability-check:
[loadresource] Do not set property disallowed.ivy.jars.list as its length is 0.

-ivy-fail-disallowed-ivy-version:

ivy-fail:

ivy-fail:

ivy-configure:
[ivy:configure] :: loading settings :: file = /home/jenkins/jenkins-slave/workspace/Lucene-Solr-BadApples-Tests-8.x/lucene/top-level-ivy-settings.xml

resolve:

ivy-availability-check:
[loadresource] Do not set property disallowed.ivy.jars.list as its length is 0.

-ivy-fail-disallowed-ivy-version:

ivy-fail:

ivy-fail:

ivy-configure:
[ivy:configure] :: loading settings :: file = /home/jenkins/jenkins-slave/workspace/Lucene-Solr-BadApples-Tests-8.x/lucene/top-level-ivy-settings.xml

resolve:

jar-checksums:
    [mkdir] Created dir: /home/jenkins/jenkins-slave/workspace/Lucene-Solr-BadApples-Tests-8.x/solr/null1540022152
     [copy] Copying 239 files to /home/jenkins/jenkins-slave/workspace/Lucene-Solr-BadApples-Tests-8.x/solr/null1540022152
   [delete] Deleting directory /home/jenkins/jenkins-slave/workspace/Lucene-Solr-BadApples-Tests-8.x/solr/null1540022152

check-working-copy:
[ivy:cachepath] :: resolving dependencies :: #;working@lucene2-us-west.apache.org
[ivy:cachepath] 	confs: [default]
[ivy:cachepath] 	found org.eclipse.jgit#org.eclipse.jgit;5.3.0.201903130848-r in public
[ivy:cachepath] 	found com.jcraft#jsch;0.1.54 in public
[ivy:cachepath] 	found com.jcraft#jzlib;1.1.1 in public
[ivy:cachepath] 	found com.googlecode.javaewah#JavaEWAH;1.1.6 in public
[ivy:cachepath] 	found org.slf4j#slf4j-api;1.7.2 in public
[ivy:cachepath] 	found org.bouncycastle#bcpg-jdk15on;1.60 in public
[ivy:cachepath] 	found org.bouncycastle#bcprov-jdk15on;1.60 in public
[ivy:cachepath] 	found org.bouncycastle#bcpkix-jdk15on;1.60 in public
[ivy:cachepath] 	found org.slf4j#slf4j-nop;1.7.2 in public
[ivy:cachepath] :: resolution report :: resolve 22ms :: artifacts dl 1ms
	---------------------------------------------------------------------
	|                  |            modules            ||   artifacts   |
	|       conf       | number| search|dwnlded|evicted|| number|dwnlded|
	---------------------------------------------------------------------
	|      default     |   9   |   0   |   0   |   0   ||   9   |   0   |
	---------------------------------------------------------------------
[wc-checker] Initializing working copy...
[wc-checker] Checking working copy status...

-jenkins-base:

BUILD SUCCESSFUL
Total time: 228 minutes 28 seconds
Archiving artifacts
java.lang.InterruptedException: no matches found within 10000
	at hudson.FilePath$ValidateAntFileMask.hasMatch(FilePath.java:2847)
	at hudson.FilePath$ValidateAntFileMask.invoke(FilePath.java:2726)
	at hudson.FilePath$ValidateAntFileMask.invoke(FilePath.java:2707)
	at hudson.FilePath$FileCallableWrapper.call(FilePath.java:3086)
Also:   hudson.remoting.Channel$CallSiteStackTrace: Remote call to lucene2
		at hudson.remoting.Channel.attachCallSiteStackTrace(Channel.java:1741)
		at hudson.remoting.UserRequest$ExceptionResponse.retrieve(UserRequest.java:357)
		at hudson.remoting.Channel.call(Channel.java:955)
		at hudson.FilePath.act(FilePath.java:1072)
		at hudson.FilePath.act(FilePath.java:1061)
		at hudson.FilePath.validateAntFileMask(FilePath.java:2705)
		at hudson.tasks.ArtifactArchiver.perform(ArtifactArchiver.java:243)
		at hudson.tasks.BuildStepCompatibilityLayer.perform(BuildStepCompatibilityLayer.java:81)
		at hudson.tasks.BuildStepMonitor$1.perform(BuildStepMonitor.java:20)
		at hudson.model.AbstractBuild$AbstractBuildExecution.perform(AbstractBuild.java:744)
		at hudson.model.AbstractBuild$AbstractBuildExecution.performAllBuildSteps(AbstractBuild.java:690)
		at hudson.model.Build$BuildExecution.post2(Build.java:186)
		at hudson.model.AbstractBuild$AbstractBuildExecution.post(AbstractBuild.java:635)
		at hudson.model.Run.execute(Run.java:1835)
		at hudson.model.FreeStyleBuild.run(FreeStyleBuild.java:43)
		at hudson.model.ResourceController.execute(ResourceController.java:97)
		at hudson.model.Executor.run(Executor.java:429)
Caused: hudson.FilePath$TunneledInterruptedException
	at hudson.FilePath$FileCallableWrapper.call(FilePath.java:3088)
	at hudson.remoting.UserRequest.perform(UserRequest.java:212)
	at hudson.remoting.UserRequest.perform(UserRequest.java:54)
	at hudson.remoting.Request$2.run(Request.java:369)
	at hudson.remoting.InterceptingExecutorService$1.call(InterceptingExecutorService.java:72)
	at java.util.concurrent.FutureTask.run(FutureTask.java:266)
	at java.util.concurrent.ThreadPoolExecutor.runWorker(ThreadPoolExecutor.java:1142)
	at java.util.concurrent.ThreadPoolExecutor$Worker.run(ThreadPoolExecutor.java:617)
	at java.lang.Thread.run(Thread.java:748)
Caused: java.lang.InterruptedException: java.lang.InterruptedException: no matches found within 10000
	at hudson.FilePath.act(FilePath.java:1074)
	at hudson.FilePath.act(FilePath.java:1061)
	at hudson.FilePath.validateAntFileMask(FilePath.java:2705)
	at hudson.tasks.ArtifactArchiver.perform(ArtifactArchiver.java:243)
	at hudson.tasks.BuildStepCompatibilityLayer.perform(BuildStepCompatibilityLayer.java:81)
	at hudson.tasks.BuildStepMonitor$1.perform(BuildStepMonitor.java:20)
	at hudson.model.AbstractBuild$AbstractBuildExecution.perform(AbstractBuild.java:744)
	at hudson.model.AbstractBuild$AbstractBuildExecution.performAllBuildSteps(AbstractBuild.java:690)
	at hudson.model.Build$BuildExecution.post2(Build.java:186)
	at hudson.model.AbstractBuild$AbstractBuildExecution.post(AbstractBuild.java:635)
	at hudson.model.Run.execute(Run.java:1835)
	at hudson.model.FreeStyleBuild.run(FreeStyleBuild.java:43)
	at hudson.model.ResourceController.execute(ResourceController.java:97)
	at hudson.model.Executor.run(Executor.java:429)
No artifacts found that match the file pattern "**/*.events,heapdumps/**,**/hs_err_pid*". Configuration error?
Recording test results
Build step 'Publish JUnit test result report' changed build result to UNSTABLE
Email was triggered for: Unstable (Test Failures)
Sending email for trigger: Unstable (Test Failures)

Mime
View raw message