lucene-dev mailing list archives

Site index · List index
Message view « Date » · « Thread »
Top « Date » · « Thread »
From Apache Jenkins Server <jenk...@builds.apache.org>
Subject [JENKINS] Lucene-Solr-Tests-8.x - Build # 181 - Still Failing
Date Wed, 01 May 2019 17:35:51 GMT
Build: https://builds.apache.org/job/Lucene-Solr-Tests-8.x/181/

2 tests failed.
FAILED:  org.apache.solr.update.PeerSyncTest.test

Error Message:
Unexpected exception type, expected SolrException but got org.apache.solr.client.solrj.SolrServerException: Timeout occurred while waiting response from server at: http://127.0.0.1:43596/collection1

Stack Trace:
junit.framework.AssertionFailedError: Unexpected exception type, expected SolrException but got org.apache.solr.client.solrj.SolrServerException: Timeout occurred while waiting response from server at: http://127.0.0.1:43596/collection1
	at __randomizedtesting.SeedInfo.seed([E6C6372B4882BF4E:6E9208F1E67ED2B6]:0)
	at org.apache.lucene.util.LuceneTestCase.expectThrows(LuceneTestCase.java:2700)
	at org.apache.lucene.util.LuceneTestCase.expectThrows(LuceneTestCase.java:2689)
	at org.apache.solr.update.PeerSyncTest.test(PeerSyncTest.java:279)
	at sun.reflect.NativeMethodAccessorImpl.invoke0(Native Method)
	at sun.reflect.NativeMethodAccessorImpl.invoke(NativeMethodAccessorImpl.java:62)
	at sun.reflect.DelegatingMethodAccessorImpl.invoke(DelegatingMethodAccessorImpl.java:43)
	at java.lang.reflect.Method.invoke(Method.java:498)
	at com.carrotsearch.randomizedtesting.RandomizedRunner.invoke(RandomizedRunner.java:1750)
	at com.carrotsearch.randomizedtesting.RandomizedRunner$8.evaluate(RandomizedRunner.java:938)
	at com.carrotsearch.randomizedtesting.RandomizedRunner$9.evaluate(RandomizedRunner.java:974)
	at com.carrotsearch.randomizedtesting.RandomizedRunner$10.evaluate(RandomizedRunner.java:988)
	at org.apache.solr.BaseDistributedSearchTestCase$ShardsRepeatRule$ShardsFixedStatement.callStatement(BaseDistributedSearchTestCase.java:1082)
	at org.apache.solr.BaseDistributedSearchTestCase$ShardsRepeatRule$ShardsStatement.evaluate(BaseDistributedSearchTestCase.java:1054)
	at com.carrotsearch.randomizedtesting.rules.SystemPropertiesRestoreRule$1.evaluate(SystemPropertiesRestoreRule.java:57)
	at org.apache.lucene.util.TestRuleSetupTeardownChained$1.evaluate(TestRuleSetupTeardownChained.java:49)
	at org.apache.lucene.util.AbstractBeforeAfterRule$1.evaluate(AbstractBeforeAfterRule.java:45)
	at org.apache.lucene.util.TestRuleThreadAndTestName$1.evaluate(TestRuleThreadAndTestName.java:48)
	at org.apache.lucene.util.TestRuleIgnoreAfterMaxFailures$1.evaluate(TestRuleIgnoreAfterMaxFailures.java:64)
	at org.apache.lucene.util.TestRuleMarkFailure$1.evaluate(TestRuleMarkFailure.java:47)
	at com.carrotsearch.randomizedtesting.rules.StatementAdapter.evaluate(StatementAdapter.java:36)
	at com.carrotsearch.randomizedtesting.ThreadLeakControl$StatementRunner.run(ThreadLeakControl.java:368)
	at com.carrotsearch.randomizedtesting.ThreadLeakControl.forkTimeoutingTask(ThreadLeakControl.java:817)
	at com.carrotsearch.randomizedtesting.ThreadLeakControl$3.evaluate(ThreadLeakControl.java:468)
	at com.carrotsearch.randomizedtesting.RandomizedRunner.runSingleTest(RandomizedRunner.java:947)
	at com.carrotsearch.randomizedtesting.RandomizedRunner$5.evaluate(RandomizedRunner.java:832)
	at com.carrotsearch.randomizedtesting.RandomizedRunner$6.evaluate(RandomizedRunner.java:883)
	at com.carrotsearch.randomizedtesting.RandomizedRunner$7.evaluate(RandomizedRunner.java:894)
	at com.carrotsearch.randomizedtesting.rules.StatementAdapter.evaluate(StatementAdapter.java:36)
	at com.carrotsearch.randomizedtesting.rules.SystemPropertiesRestoreRule$1.evaluate(SystemPropertiesRestoreRule.java:57)
	at org.apache.lucene.util.AbstractBeforeAfterRule$1.evaluate(AbstractBeforeAfterRule.java:45)
	at com.carrotsearch.randomizedtesting.rules.StatementAdapter.evaluate(StatementAdapter.java:36)
	at org.apache.lucene.util.TestRuleStoreClassName$1.evaluate(TestRuleStoreClassName.java:41)
	at com.carrotsearch.randomizedtesting.rules.NoShadowingOrOverridesOnMethodsRule$1.evaluate(NoShadowingOrOverridesOnMethodsRule.java:40)
	at com.carrotsearch.randomizedtesting.rules.NoShadowingOrOverridesOnMethodsRule$1.evaluate(NoShadowingOrOverridesOnMethodsRule.java:40)
	at com.carrotsearch.randomizedtesting.rules.StatementAdapter.evaluate(StatementAdapter.java:36)
	at com.carrotsearch.randomizedtesting.rules.StatementAdapter.evaluate(StatementAdapter.java:36)
	at com.carrotsearch.randomizedtesting.rules.StatementAdapter.evaluate(StatementAdapter.java:36)
	at org.apache.lucene.util.TestRuleAssertionsRequired$1.evaluate(TestRuleAssertionsRequired.java:53)
	at org.apache.lucene.util.TestRuleMarkFailure$1.evaluate(TestRuleMarkFailure.java:47)
	at org.apache.lucene.util.TestRuleIgnoreAfterMaxFailures$1.evaluate(TestRuleIgnoreAfterMaxFailures.java:64)
	at org.apache.lucene.util.TestRuleIgnoreTestSuites$1.evaluate(TestRuleIgnoreTestSuites.java:54)
	at com.carrotsearch.randomizedtesting.rules.StatementAdapter.evaluate(StatementAdapter.java:36)
	at com.carrotsearch.randomizedtesting.ThreadLeakControl$StatementRunner.run(ThreadLeakControl.java:368)
	at java.lang.Thread.run(Thread.java:748)
Caused by: org.apache.solr.client.solrj.SolrServerException: Timeout occurred while waiting response from server at: http://127.0.0.1:43596/collection1
	at org.apache.solr.client.solrj.impl.HttpSolrClient.executeMethod(HttpSolrClient.java:660)
	at org.apache.solr.client.solrj.impl.HttpSolrClient.request(HttpSolrClient.java:255)
	at org.apache.solr.client.solrj.impl.HttpSolrClient.request(HttpSolrClient.java:244)
	at org.apache.solr.client.solrj.SolrRequest.process(SolrRequest.java:207)
	at org.apache.solr.client.solrj.SolrRequest.process(SolrRequest.java:224)
	at org.apache.solr.BaseDistributedSearchTestCase.add(BaseDistributedSearchTestCase.java:576)
	at org.apache.solr.update.PeerSyncTest.lambda$test$0(PeerSyncTest.java:281)
	at org.apache.lucene.util.LuceneTestCase.expectThrows(LuceneTestCase.java:2695)
	... 43 more
Caused by: java.net.SocketTimeoutException: Read timed out
	at java.net.SocketInputStream.socketRead0(Native Method)
	at java.net.SocketInputStream.socketRead(SocketInputStream.java:116)
	at java.net.SocketInputStream.read(SocketInputStream.java:171)
	at java.net.SocketInputStream.read(SocketInputStream.java:141)
	at org.apache.http.impl.io.SessionInputBufferImpl.streamRead(SessionInputBufferImpl.java:137)
	at org.apache.http.impl.io.SessionInputBufferImpl.fillBuffer(SessionInputBufferImpl.java:153)
	at org.apache.http.impl.io.SessionInputBufferImpl.readLine(SessionInputBufferImpl.java:282)
	at org.apache.http.impl.conn.DefaultHttpResponseParser.parseHead(DefaultHttpResponseParser.java:138)
	at org.apache.http.impl.conn.DefaultHttpResponseParser.parseHead(DefaultHttpResponseParser.java:56)
	at org.apache.http.impl.io.AbstractMessageParser.parse(AbstractMessageParser.java:259)
	at org.apache.http.impl.DefaultBHttpClientConnection.receiveResponseHeader(DefaultBHttpClientConnection.java:163)
	at org.apache.http.impl.conn.CPoolProxy.receiveResponseHeader(CPoolProxy.java:165)
	at org.apache.http.protocol.HttpRequestExecutor.doReceiveResponse(HttpRequestExecutor.java:273)
	at org.apache.http.protocol.HttpRequestExecutor.execute(HttpRequestExecutor.java:125)
	at org.apache.http.impl.execchain.MainClientExec.execute(MainClientExec.java:272)
	at org.apache.http.impl.execchain.ProtocolExec.execute(ProtocolExec.java:185)
	at org.apache.http.impl.execchain.RetryExec.execute(RetryExec.java:89)
	at org.apache.http.impl.execchain.RedirectExec.execute(RedirectExec.java:110)
	at org.apache.http.impl.client.InternalHttpClient.doExecute(InternalHttpClient.java:185)
	at org.apache.http.impl.client.CloseableHttpClient.execute(CloseableHttpClient.java:83)
	at org.apache.http.impl.client.CloseableHttpClient.execute(CloseableHttpClient.java:56)
	at org.apache.solr.client.solrj.impl.HttpSolrClient.executeMethod(HttpSolrClient.java:548)
	... 50 more


FAILED:  org.apache.solr.update.PeerSyncWithLeaderTest.test

Error Message:
Unexpected exception type, expected SolrException but got org.apache.solr.client.solrj.SolrServerException: Timeout occurred while waiting response from server at: http://127.0.0.1:36727/collection1

Stack Trace:
junit.framework.AssertionFailedError: Unexpected exception type, expected SolrException but got org.apache.solr.client.solrj.SolrServerException: Timeout occurred while waiting response from server at: http://127.0.0.1:36727/collection1
	at __randomizedtesting.SeedInfo.seed([E6C6372B4882BF4E:6E9208F1E67ED2B6]:0)
	at org.apache.lucene.util.LuceneTestCase.expectThrows(LuceneTestCase.java:2700)
	at org.apache.lucene.util.LuceneTestCase.expectThrows(LuceneTestCase.java:2689)
	at org.apache.solr.update.PeerSyncTest.test(PeerSyncTest.java:279)
	at sun.reflect.NativeMethodAccessorImpl.invoke0(Native Method)
	at sun.reflect.NativeMethodAccessorImpl.invoke(NativeMethodAccessorImpl.java:62)
	at sun.reflect.DelegatingMethodAccessorImpl.invoke(DelegatingMethodAccessorImpl.java:43)
	at java.lang.reflect.Method.invoke(Method.java:498)
	at com.carrotsearch.randomizedtesting.RandomizedRunner.invoke(RandomizedRunner.java:1750)
	at com.carrotsearch.randomizedtesting.RandomizedRunner$8.evaluate(RandomizedRunner.java:938)
	at com.carrotsearch.randomizedtesting.RandomizedRunner$9.evaluate(RandomizedRunner.java:974)
	at com.carrotsearch.randomizedtesting.RandomizedRunner$10.evaluate(RandomizedRunner.java:988)
	at org.apache.solr.BaseDistributedSearchTestCase$ShardsRepeatRule$ShardsFixedStatement.callStatement(BaseDistributedSearchTestCase.java:1082)
	at org.apache.solr.BaseDistributedSearchTestCase$ShardsRepeatRule$ShardsStatement.evaluate(BaseDistributedSearchTestCase.java:1054)
	at com.carrotsearch.randomizedtesting.rules.SystemPropertiesRestoreRule$1.evaluate(SystemPropertiesRestoreRule.java:57)
	at org.apache.lucene.util.TestRuleSetupTeardownChained$1.evaluate(TestRuleSetupTeardownChained.java:49)
	at org.apache.lucene.util.AbstractBeforeAfterRule$1.evaluate(AbstractBeforeAfterRule.java:45)
	at org.apache.lucene.util.TestRuleThreadAndTestName$1.evaluate(TestRuleThreadAndTestName.java:48)
	at org.apache.lucene.util.TestRuleIgnoreAfterMaxFailures$1.evaluate(TestRuleIgnoreAfterMaxFailures.java:64)
	at org.apache.lucene.util.TestRuleMarkFailure$1.evaluate(TestRuleMarkFailure.java:47)
	at com.carrotsearch.randomizedtesting.rules.StatementAdapter.evaluate(StatementAdapter.java:36)
	at com.carrotsearch.randomizedtesting.ThreadLeakControl$StatementRunner.run(ThreadLeakControl.java:368)
	at com.carrotsearch.randomizedtesting.ThreadLeakControl.forkTimeoutingTask(ThreadLeakControl.java:817)
	at com.carrotsearch.randomizedtesting.ThreadLeakControl$3.evaluate(ThreadLeakControl.java:468)
	at com.carrotsearch.randomizedtesting.RandomizedRunner.runSingleTest(RandomizedRunner.java:947)
	at com.carrotsearch.randomizedtesting.RandomizedRunner$5.evaluate(RandomizedRunner.java:832)
	at com.carrotsearch.randomizedtesting.RandomizedRunner$6.evaluate(RandomizedRunner.java:883)
	at com.carrotsearch.randomizedtesting.RandomizedRunner$7.evaluate(RandomizedRunner.java:894)
	at com.carrotsearch.randomizedtesting.rules.StatementAdapter.evaluate(StatementAdapter.java:36)
	at com.carrotsearch.randomizedtesting.rules.SystemPropertiesRestoreRule$1.evaluate(SystemPropertiesRestoreRule.java:57)
	at org.apache.lucene.util.AbstractBeforeAfterRule$1.evaluate(AbstractBeforeAfterRule.java:45)
	at com.carrotsearch.randomizedtesting.rules.StatementAdapter.evaluate(StatementAdapter.java:36)
	at org.apache.lucene.util.TestRuleStoreClassName$1.evaluate(TestRuleStoreClassName.java:41)
	at com.carrotsearch.randomizedtesting.rules.NoShadowingOrOverridesOnMethodsRule$1.evaluate(NoShadowingOrOverridesOnMethodsRule.java:40)
	at com.carrotsearch.randomizedtesting.rules.NoShadowingOrOverridesOnMethodsRule$1.evaluate(NoShadowingOrOverridesOnMethodsRule.java:40)
	at com.carrotsearch.randomizedtesting.rules.StatementAdapter.evaluate(StatementAdapter.java:36)
	at com.carrotsearch.randomizedtesting.rules.StatementAdapter.evaluate(StatementAdapter.java:36)
	at com.carrotsearch.randomizedtesting.rules.StatementAdapter.evaluate(StatementAdapter.java:36)
	at org.apache.lucene.util.TestRuleAssertionsRequired$1.evaluate(TestRuleAssertionsRequired.java:53)
	at org.apache.lucene.util.TestRuleMarkFailure$1.evaluate(TestRuleMarkFailure.java:47)
	at org.apache.lucene.util.TestRuleIgnoreAfterMaxFailures$1.evaluate(TestRuleIgnoreAfterMaxFailures.java:64)
	at org.apache.lucene.util.TestRuleIgnoreTestSuites$1.evaluate(TestRuleIgnoreTestSuites.java:54)
	at com.carrotsearch.randomizedtesting.rules.StatementAdapter.evaluate(StatementAdapter.java:36)
	at com.carrotsearch.randomizedtesting.ThreadLeakControl$StatementRunner.run(ThreadLeakControl.java:368)
	at java.lang.Thread.run(Thread.java:748)
Caused by: org.apache.solr.client.solrj.SolrServerException: Timeout occurred while waiting response from server at: http://127.0.0.1:36727/collection1
	at org.apache.solr.client.solrj.impl.HttpSolrClient.executeMethod(HttpSolrClient.java:660)
	at org.apache.solr.client.solrj.impl.HttpSolrClient.request(HttpSolrClient.java:255)
	at org.apache.solr.client.solrj.impl.HttpSolrClient.request(HttpSolrClient.java:244)
	at org.apache.solr.client.solrj.SolrRequest.process(SolrRequest.java:207)
	at org.apache.solr.client.solrj.SolrRequest.process(SolrRequest.java:224)
	at org.apache.solr.BaseDistributedSearchTestCase.add(BaseDistributedSearchTestCase.java:576)
	at org.apache.solr.update.PeerSyncTest.lambda$test$0(PeerSyncTest.java:281)
	at org.apache.lucene.util.LuceneTestCase.expectThrows(LuceneTestCase.java:2695)
	... 43 more
Caused by: java.net.SocketTimeoutException: Read timed out
	at java.net.SocketInputStream.socketRead0(Native Method)
	at java.net.SocketInputStream.socketRead(SocketInputStream.java:116)
	at java.net.SocketInputStream.read(SocketInputStream.java:171)
	at java.net.SocketInputStream.read(SocketInputStream.java:141)
	at org.apache.http.impl.io.SessionInputBufferImpl.streamRead(SessionInputBufferImpl.java:137)
	at org.apache.http.impl.io.SessionInputBufferImpl.fillBuffer(SessionInputBufferImpl.java:153)
	at org.apache.http.impl.io.SessionInputBufferImpl.readLine(SessionInputBufferImpl.java:282)
	at org.apache.http.impl.conn.DefaultHttpResponseParser.parseHead(DefaultHttpResponseParser.java:138)
	at org.apache.http.impl.conn.DefaultHttpResponseParser.parseHead(DefaultHttpResponseParser.java:56)
	at org.apache.http.impl.io.AbstractMessageParser.parse(AbstractMessageParser.java:259)
	at org.apache.http.impl.DefaultBHttpClientConnection.receiveResponseHeader(DefaultBHttpClientConnection.java:163)
	at org.apache.http.impl.conn.CPoolProxy.receiveResponseHeader(CPoolProxy.java:165)
	at org.apache.http.protocol.HttpRequestExecutor.doReceiveResponse(HttpRequestExecutor.java:273)
	at org.apache.http.protocol.HttpRequestExecutor.execute(HttpRequestExecutor.java:125)
	at org.apache.http.impl.execchain.MainClientExec.execute(MainClientExec.java:272)
	at org.apache.http.impl.execchain.ProtocolExec.execute(ProtocolExec.java:185)
	at org.apache.http.impl.execchain.RetryExec.execute(RetryExec.java:89)
	at org.apache.http.impl.execchain.RedirectExec.execute(RedirectExec.java:110)
	at org.apache.http.impl.client.InternalHttpClient.doExecute(InternalHttpClient.java:185)
	at org.apache.http.impl.client.CloseableHttpClient.execute(CloseableHttpClient.java:83)
	at org.apache.http.impl.client.CloseableHttpClient.execute(CloseableHttpClient.java:56)
	at org.apache.solr.client.solrj.impl.HttpSolrClient.executeMethod(HttpSolrClient.java:548)
	... 50 more




Build Log:
[...truncated 13692 lines...]
   [junit4] Suite: org.apache.solr.update.PeerSyncTest
   [junit4]   2> Creating dataDir: /x1/jenkins/jenkins-slave/workspace/Lucene-Solr-Tests-8.x/solr/build/solr-core/test/J1/temp/solr.update.PeerSyncTest_E6C6372B4882BF4E-001/init-core-data-001
   [junit4]   2> 714394 WARN  (SUITE-PeerSyncTest-seed#[E6C6372B4882BF4E]-worker) [    ] o.a.s.SolrTestCaseJ4 startTrackingSearchers: numOpens=4 numCloses=4
   [junit4]   2> 714394 INFO  (SUITE-PeerSyncTest-seed#[E6C6372B4882BF4E]-worker) [    ] o.a.s.SolrTestCaseJ4 Using TrieFields (NUMERIC_POINTS_SYSPROP=false) w/NUMERIC_DOCVALUES_SYSPROP=false
   [junit4]   2> 714396 INFO  (SUITE-PeerSyncTest-seed#[E6C6372B4882BF4E]-worker) [    ] o.a.s.SolrTestCaseJ4 Randomized ssl (false) and clientAuth (false) via: @org.apache.solr.SolrTestCaseJ4$SuppressSSL(bugUrl=https://issues.apache.org/jira/browse/SOLR-5776)
   [junit4]   2> 714396 INFO  (SUITE-PeerSyncTest-seed#[E6C6372B4882BF4E]-worker) [    ] o.a.s.SolrTestCaseJ4 SecureRandom sanity checks: test.solr.allowed.securerandom=null & java.security.egd=file:/dev/./urandom
   [junit4]   2> 714396 INFO  (SUITE-PeerSyncTest-seed#[E6C6372B4882BF4E]-worker) [    ] o.a.s.BaseDistributedSearchTestCase Setting hostContext system property: /
   [junit4]   2> 714397 INFO  (TEST-PeerSyncTest.test-seed#[E6C6372B4882BF4E]) [    ] o.a.s.SolrTestCaseJ4 ####initCore
   [junit4]   2> 714398 INFO  (TEST-PeerSyncTest.test-seed#[E6C6372B4882BF4E]) [    ] o.a.s.c.SolrResourceLoader [null] Added 2 libs to classloader, from paths: [/x1/jenkins/jenkins-slave/workspace/Lucene-Solr-Tests-8.x/solr/core/src/test-files/solr/collection1/lib, /x1/jenkins/jenkins-slave/workspace/Lucene-Solr-Tests-8.x/solr/core/src/test-files/solr/collection1/lib/classes]
   [junit4]   2> 714426 INFO  (TEST-PeerSyncTest.test-seed#[E6C6372B4882BF4E]) [    ] o.a.s.c.SolrConfig Using Lucene MatchVersion: 8.2.0
   [junit4]   2> 714447 INFO  (TEST-PeerSyncTest.test-seed#[E6C6372B4882BF4E]) [    ] o.a.s.s.IndexSchema [null] Schema name=test
   [junit4]   2> 715607 INFO  (TEST-PeerSyncTest.test-seed#[E6C6372B4882BF4E]) [    ] o.a.s.s.IndexSchema Loaded schema test/1.0 with uniqueid field id
   [junit4]   2> 715729 INFO  (TEST-PeerSyncTest.test-seed#[E6C6372B4882BF4E]) [    ] o.a.s.h.c.HttpShardHandlerFactory Host whitelist initialized: WhitelistHostChecker [whitelistHosts=null, whitelistHostCheckingEnabled=false]
   [junit4]   2> 715734 WARN  (TEST-PeerSyncTest.test-seed#[E6C6372B4882BF4E]) [    ] o.e.j.u.s.S.config No Client EndPointIdentificationAlgorithm configured for SslContextFactory@126d065b[provider=null,keyStore=null,trustStore=null]
   [junit4]   2> 715738 WARN  (TEST-PeerSyncTest.test-seed#[E6C6372B4882BF4E]) [    ] o.e.j.u.s.S.config No Client EndPointIdentificationAlgorithm configured for SslContextFactory@652bb307[provider=null,keyStore=null,trustStore=null]
   [junit4]   2> 715764 INFO  (TEST-PeerSyncTest.test-seed#[E6C6372B4882BF4E]) [    ] o.a.s.c.TransientSolrCoreCacheDefault Allocating transient cache for 2147483647 transient cores
   [junit4]   2> 715764 INFO  (TEST-PeerSyncTest.test-seed#[E6C6372B4882BF4E]) [    ] o.a.s.h.a.MetricsHistoryHandler No .system collection, keeping metrics history in memory.
   [junit4]   2> 715794 INFO  (TEST-PeerSyncTest.test-seed#[E6C6372B4882BF4E]) [    ] o.a.s.m.r.SolrJmxReporter JMX monitoring for 'solr.node' (registry 'solr.node') enabled at server: com.sun.jmx.mbeanserver.JmxMBeanServer@552894aa
   [junit4]   2> 715805 INFO  (TEST-PeerSyncTest.test-seed#[E6C6372B4882BF4E]) [    ] o.a.s.m.r.SolrJmxReporter JMX monitoring for 'solr.jvm' (registry 'solr.jvm') enabled at server: com.sun.jmx.mbeanserver.JmxMBeanServer@552894aa
   [junit4]   2> 715805 INFO  (TEST-PeerSyncTest.test-seed#[E6C6372B4882BF4E]) [    ] o.a.s.m.r.SolrJmxReporter JMX monitoring for 'solr.jetty' (registry 'solr.jetty') enabled at server: com.sun.jmx.mbeanserver.JmxMBeanServer@552894aa
   [junit4]   2> 715808 INFO  (coreLoadExecutor-2851-thread-1) [    x:collection1] o.a.s.c.SolrResourceLoader [null] Added 2 libs to classloader, from paths: [/x1/jenkins/jenkins-slave/workspace/Lucene-Solr-Tests-8.x/solr/core/src/test-files/solr/collection1/lib, /x1/jenkins/jenkins-slave/workspace/Lucene-Solr-Tests-8.x/solr/core/src/test-files/solr/collection1/lib/classes]
   [junit4]   2> 715841 INFO  (coreLoadExecutor-2851-thread-1) [    x:collection1] o.a.s.c.SolrConfig Using Lucene MatchVersion: 8.2.0
   [junit4]   2> 715863 INFO  (coreLoadExecutor-2851-thread-1) [    x:collection1] o.a.s.s.IndexSchema [collection1] Schema name=test
   [junit4]   2> 716011 INFO  (coreLoadExecutor-2851-thread-1) [    x:collection1] o.a.s.s.IndexSchema Loaded schema test/1.0 with uniqueid field id
   [junit4]   2> 716024 INFO  (coreLoadExecutor-2851-thread-1) [    x:collection1] o.a.s.c.CoreContainer Creating SolrCore 'collection1' using configuration from instancedir /x1/jenkins/jenkins-slave/workspace/Lucene-Solr-Tests-8.x/solr/core/src/test-files/solr/collection1, trusted=true
   [junit4]   2> 716024 INFO  (coreLoadExecutor-2851-thread-1) [    x:collection1] o.a.s.m.r.SolrJmxReporter JMX monitoring for 'solr.core.collection1' (registry 'solr.core.collection1') enabled at server: com.sun.jmx.mbeanserver.JmxMBeanServer@552894aa
   [junit4]   2> 716024 INFO  (coreLoadExecutor-2851-thread-1) [    x:collection1] o.a.s.c.SolrCore [[collection1] ] Opening new SolrCore at [/x1/jenkins/jenkins-slave/workspace/Lucene-Solr-Tests-8.x/solr/core/src/test-files/solr/collection1], dataDir=[/x1/jenkins/jenkins-slave/workspace/Lucene-Solr-Tests-8.x/solr/build/solr-core/test/J1/temp/solr.update.PeerSyncTest_E6C6372B4882BF4E-001/init-core-data-001/]
   [junit4]   2> 716027 INFO  (coreLoadExecutor-2851-thread-1) [    x:collection1] o.a.s.u.RandomMergePolicy RandomMergePolicy wrapping class org.apache.lucene.index.AlcoholicMergePolicy: [AlcoholicMergePolicy: minMergeSize=0, mergeFactor=10, maxMergeSize=1577310086, maxMergeSizeForForcedMerge=9223372036854775807, calibrateSizeByDeletes=true, maxMergeDocs=2147483647, maxCFSSegmentSizeMB=8.796093022207999E12, noCFSRatio=0.1]
   [junit4]   2> 716031 WARN  (coreLoadExecutor-2851-thread-1) [    x:collection1] o.a.s.c.RequestHandlers INVALID paramSet a in requestHandler {type = requestHandler,name = /dump,class = DumpRequestHandler,attributes = {initParams=a, name=/dump, class=DumpRequestHandler},args = {defaults={a=A,b=B}}}
   [junit4]   2> 716113 INFO  (coreLoadExecutor-2851-thread-1) [    x:collection1] o.a.s.u.UpdateHandler Using UpdateLog implementation: org.apache.solr.update.UpdateLog
   [junit4]   2> 716113 INFO  (coreLoadExecutor-2851-thread-1) [    x:collection1] o.a.s.u.UpdateLog Initializing UpdateLog: dataDir= defaultSyncLevel=FLUSH numRecordsToKeep=100 maxNumLogsToKeep=10 numVersionBuckets=65536
   [junit4]   2> 716114 INFO  (coreLoadExecutor-2851-thread-1) [    x:collection1] o.a.s.u.CommitTracker Hard AutoCommit: disabled
   [junit4]   2> 716114 INFO  (coreLoadExecutor-2851-thread-1) [    x:collection1] o.a.s.u.CommitTracker Soft AutoCommit: disabled
   [junit4]   2> 716116 INFO  (coreLoadExecutor-2851-thread-1) [    x:collection1] o.a.s.u.RandomMergePolicy RandomMergePolicy wrapping class org.apache.lucene.index.LogDocMergePolicy: [LogDocMergePolicy: minMergeSize=1000, mergeFactor=37, maxMergeSize=9223372036854775807, maxMergeSizeForForcedMerge=9223372036854775807, calibrateSizeByDeletes=true, maxMergeDocs=2147483647, maxCFSSegmentSizeMB=8.796093022207999E12, noCFSRatio=0.532989447465783]
   [junit4]   2> 716116 INFO  (coreLoadExecutor-2851-thread-1) [    x:collection1] o.a.s.s.SolrIndexSearcher Opening [Searcher@632cf63e[collection1] main]
   [junit4]   2> 716117 WARN  (coreLoadExecutor-2851-thread-1) [    x:collection1] o.a.s.r.ManagedResourceStorage Cannot write to config directory /x1/jenkins/jenkins-slave/workspace/Lucene-Solr-Tests-8.x/solr/core/src/test-files/solr/collection1/conf; switching to use InMemory storage instead.
   [junit4]   2> 716117 INFO  (coreLoadExecutor-2851-thread-1) [    x:collection1] o.a.s.h.ReplicationHandler Commits will be reserved for 10000ms.
   [junit4]   2> 716117 INFO  (coreLoadExecutor-2851-thread-1) [    x:collection1] o.a.s.u.UpdateLog Could not find max version in index or recent updates, using new clock 1632349192317829120
   [junit4]   2> 716120 INFO  (searcherExecutor-2852-thread-1-processing-x:collection1) [    x:collection1] o.a.s.c.SolrCore [collection1] Registered new searcher Searcher@632cf63e[collection1] main{ExitableDirectoryReader(UninvertingDirectoryReader())}
   [junit4]   2> 716120 INFO  (TEST-PeerSyncTest.test-seed#[E6C6372B4882BF4E]) [    ] o.a.s.SolrTestCaseJ4 ####initCore end
   [junit4]   2> 716348 INFO  (TEST-PeerSyncTest.test-seed#[E6C6372B4882BF4E]) [    ] o.a.s.SolrTestCaseJ4 Writing core.properties file to /x1/jenkins/jenkins-slave/workspace/Lucene-Solr-Tests-8.x/solr/build/solr-core/test/J1/temp/solr.update.PeerSyncTest_E6C6372B4882BF4E-001/tempDir-001/control/cores/collection1
   [junit4]   2> 716349 WARN  (TEST-PeerSyncTest.test-seed#[E6C6372B4882BF4E]) [    ] o.e.j.s.AbstractConnector Ignoring deprecated socket close linger time
   [junit4]   2> 716350 INFO  (TEST-PeerSyncTest.test-seed#[E6C6372B4882BF4E]) [    ] o.a.s.c.s.e.JettySolrRunner Start Jetty (original configured port=0)
   [junit4]   2> 716350 INFO  (TEST-PeerSyncTest.test-seed#[E6C6372B4882BF4E]) [    ] o.a.s.c.s.e.JettySolrRunner Trying to start Jetty on port 0 try number 1 ...
   [junit4]   2> 716350 INFO  (TEST-PeerSyncTest.test-seed#[E6C6372B4882BF4E]) [    ] o.e.j.s.Server jetty-9.4.14.v20181114; built: 2018-11-14T21:20:31.478Z; git: c4550056e785fb5665914545889f21dc136ad9e6; jvm 1.8.0_191-b12
   [junit4]   2> 716351 INFO  (TEST-PeerSyncTest.test-seed#[E6C6372B4882BF4E]) [    ] o.e.j.s.session DefaultSessionIdManager workerName=node0
   [junit4]   2> 716352 INFO  (TEST-PeerSyncTest.test-seed#[E6C6372B4882BF4E]) [    ] o.e.j.s.session No SessionScavenger set, using defaults
   [junit4]   2> 716352 INFO  (TEST-PeerSyncTest.test-seed#[E6C6372B4882BF4E]) [    ] o.e.j.s.session node0 Scavenging every 600000ms
   [junit4]   2> 716352 INFO  (TEST-PeerSyncTest.test-seed#[E6C6372B4882BF4E]) [    ] o.e.j.s.h.ContextHandler Started o.e.j.s.ServletContextHandler@748983ac{/,null,AVAILABLE}
   [junit4]   2> 716353 INFO  (TEST-PeerSyncTest.test-seed#[E6C6372B4882BF4E]) [    ] o.e.j.s.AbstractConnector Started ServerConnector@77e99451{HTTP/1.1,[http/1.1, h2c]}{127.0.0.1:37559}
   [junit4]   2> 716353 INFO  (TEST-PeerSyncTest.test-seed#[E6C6372B4882BF4E]) [    ] o.e.j.s.Server Started @716412ms
   [junit4]   2> 716353 INFO  (TEST-PeerSyncTest.test-seed#[E6C6372B4882BF4E]) [    ] o.a.s.c.s.e.JettySolrRunner Jetty properties: {schema=schema.xml, solrconfig=solrconfig-tlog.xml, hostContext=/, hostPort=37559, coreRootDirectory=/x1/jenkins/jenkins-slave/workspace/Lucene-Solr-Tests-8.x/solr/build/solr-core/test/J1/temp/solr.update.PeerSyncTest_E6C6372B4882BF4E-001/tempDir-001/control/cores}
   [junit4]   2> 716353 ERROR (TEST-PeerSyncTest.test-seed#[E6C6372B4882BF4E]) [    ] o.a.s.u.StartupLoggingUtils Missing Java Option solr.log.dir. Logging may be missing or incomplete.
   [junit4]   2> 716353 INFO  (TEST-PeerSyncTest.test-seed#[E6C6372B4882BF4E]) [    ] o.a.s.s.SolrDispatchFilter Using logger factory org.apache.logging.slf4j.Log4jLoggerFactory
   [junit4]   2> 716353 INFO  (TEST-PeerSyncTest.test-seed#[E6C6372B4882BF4E]) [    ] o.a.s.s.SolrDispatchFilter  ___      _       Welcome to Apache Solr? version 8.2.0
   [junit4]   2> 716353 INFO  (TEST-PeerSyncTest.test-seed#[E6C6372B4882BF4E]) [    ] o.a.s.s.SolrDispatchFilter / __| ___| |_ _   Starting in standalone mode on port null
   [junit4]   2> 716353 INFO  (TEST-PeerSyncTest.test-seed#[E6C6372B4882BF4E]) [    ] o.a.s.s.SolrDispatchFilter \__ \/ _ \ | '_|  Install dir: null
   [junit4]   2> 716353 INFO  (TEST-PeerSyncTest.test-seed#[E6C6372B4882BF4E]) [    ] o.a.s.s.SolrDispatchFilter |___/\___/_|_|    Start time: 2019-05-01T16:51:40.356Z
   [junit4]   2> 716354 INFO  (TEST-PeerSyncTest.test-seed#[E6C6372B4882BF4E]) [    ] o.a.s.c.SolrXmlConfig Loading container configuration from /x1/jenkins/jenkins-slave/workspace/Lucene-Solr-Tests-8.x/solr/build/solr-core/test/J1/temp/solr.update.PeerSyncTest_E6C6372B4882BF4E-001/tempDir-001/control/solr.xml
   [junit4]   2> 716360 INFO  (TEST-PeerSyncTest.test-seed#[E6C6372B4882BF4E]) [    ] o.a.s.c.SolrXmlConfig Configuration parameter autoReplicaFailoverWorkLoopDelay is ignored
   [junit4]   2> 716360 INFO  (TEST-PeerSyncTest.test-seed#[E6C6372B4882BF4E]) [    ] o.a.s.c.SolrXmlConfig Configuration parameter autoReplicaFailoverBadNodeExpiration is ignored
   [junit4]   2> 716362 INFO  (TEST-PeerSyncTest.test-seed#[E6C6372B4882BF4E]) [    ] o.a.s.c.SolrXmlConfig MBean server found: com.sun.jmx.mbeanserver.JmxMBeanServer@552894aa, but no JMX reporters were configured - adding default JMX reporter.
   [junit4]   2> 716540 INFO  (TEST-PeerSyncTest.test-seed#[E6C6372B4882BF4E]) [    ] o.a.s.h.c.HttpShardHandlerFactory Host whitelist initialized: WhitelistHostChecker [whitelistHosts=null, whitelistHostCheckingEnabled=false]
   [junit4]   2> 716551 WARN  (TEST-PeerSyncTest.test-seed#[E6C6372B4882BF4E]) [    ] o.e.j.u.s.S.config No Client EndPointIdentificationAlgorithm configured for SslContextFactory@10b8e98b[provider=null,keyStore=null,trustStore=null]
   [junit4]   2> 716556 WARN  (TEST-PeerSyncTest.test-seed#[E6C6372B4882BF4E]) [    ] o.e.j.u.s.S.config No Client EndPointIdentificationAlgorithm configured for SslContextFactory@35f1abe2[provider=null,keyStore=null,trustStore=null]
   [junit4]   2> 716582 INFO  (TEST-PeerSyncTest.test-seed#[E6C6372B4882BF4E]) [    ] o.a.s.c.TransientSolrCoreCacheDefault Allocating transient cache for 4 transient cores
   [junit4]   2> 716582 INFO  (TEST-PeerSyncTest.test-seed#[E6C6372B4882BF4E]) [    ] o.a.s.h.a.MetricsHistoryHandler No .system collection, keeping metrics history in memory.
   [junit4]   2> 716611 INFO  (TEST-PeerSyncTest.test-seed#[E6C6372B4882BF4E]) [    ] o.a.s.m.r.SolrJmxReporter JMX monitoring for 'solr.node' (registry 'solr.node') enabled at server: com.sun.jmx.mbeanserver.JmxMBeanServer@552894aa
   [junit4]   2> 716627 INFO  (TEST-PeerSyncTest.test-seed#[E6C6372B4882BF4E]) [    ] o.a.s.m.r.SolrJmxReporter JMX monitoring for 'solr.jvm' (registry 'solr.jvm') enabled at server: com.sun.jmx.mbeanserver.JmxMBeanServer@552894aa
   [junit4]   2> 716627 INFO  (TEST-PeerSyncTest.test-seed#[E6C6372B4882BF4E]) [    ] o.a.s.m.r.SolrJmxReporter JMX monitoring for 'solr.jetty' (registry 'solr.jetty') enabled at server: com.sun.jmx.mbeanserver.JmxMBeanServer@552894aa
   [junit4]   2> 716630 INFO  (TEST-PeerSyncTest.test-seed#[E6C6372B4882BF4E]) [    ] o.a.s.c.CorePropertiesLocator Found 1 core definitions underneath /x1/jenkins/jenkins-slave/workspace/Lucene-Solr-Tests-8.x/solr/build/solr-core/test/J1/temp/solr.update.PeerSyncTest_E6C6372B4882BF4E-001/tempDir-001/control/cores
   [junit4]   2> 716630 INFO  (TEST-PeerSyncTest.test-seed#[E6C6372B4882BF4E]) [    ] o.a.s.c.CorePropertiesLocator Cores are: [collection1]
   [junit4]   2> 716630 INFO  (coreLoadExecutor-2865-thread-1) [    x:collection1] o.a.s.c.SolrResourceLoader [null] Added 2 libs to classloader, from paths: [/x1/jenkins/jenkins-slave/workspace/Lucene-Solr-Tests-8.x/solr/core/src/test-files/solr/collection1/lib, /x1/jenkins/jenkins-slave/workspace/Lucene-Solr-Tests-8.x/solr/core/src/test-files/solr/collection1/lib/classes]
   [junit4]   2> 716679 INFO  (coreLoadExecutor-2865-thread-1) [    x:collection1] o.a.s.c.SolrConfig Using Lucene MatchVersion: 8.2.0
   [junit4]   2> 716723 INFO  (coreLoadExecutor-2865-thread-1) [    x:collection1] o.a.s.s.IndexSchema [collection1] Schema name=test
   [junit4]   2> 716879 INFO  (coreLoadExecutor-2865-thread-1) [    x:collection1] o.a.s.s.IndexSchema Loaded schema test/1.0 with uniqueid field id
   [junit4]   2> 716890 INFO  (coreLoadExecutor-2865-thread-1) [    x:collection1] o.a.s.c.CoreContainer Creating SolrCore 'collection1' using configuration from configset /x1/jenkins/jenkins-slave/workspace/Lucene-Solr-Tests-8.x/solr/core/src/test-files/solr/collection1, trusted=true
   [junit4]   2> 716890 INFO  (coreLoadExecutor-2865-thread-1) [    x:collection1] o.a.s.m.r.SolrJmxReporter JMX monitoring for 'solr.core.collection1' (registry 'solr.core.collection1') enabled at server: com.sun.jmx.mbeanserver.JmxMBeanServer@552894aa
   [junit4]   2> 716890 INFO  (coreLoadExecutor-2865-thread-1) [    x:collection1] o.a.s.c.SolrCore [[collection1] ] Opening new SolrCore at [/x1/jenkins/jenkins-slave/workspace/Lucene-Solr-Tests-8.x/solr/core/src/test-files/solr/collection1], dataDir=[/x1/jenkins/jenkins-slave/workspace/Lucene-Solr-Tests-8.x/solr/build/solr-core/test/J1/temp/solr.update.PeerSyncTest_E6C6372B4882BF4E-001/tempDir-001/control/cores/collection1/data/]
   [junit4]   2> 716893 INFO  (coreLoadExecutor-2865-thread-1) [    x:collection1] o.a.s.u.RandomMergePolicy RandomMergePolicy wrapping class org.apache.lucene.index.AlcoholicMergePolicy: [AlcoholicMergePolicy: minMergeSize=0, mergeFactor=10, maxMergeSize=1577310086, maxMergeSizeForForcedMerge=9223372036854775807, calibrateSizeByDeletes=true, maxMergeDocs=2147483647, maxCFSSegmentSizeMB=8.796093022207999E12, noCFSRatio=0.1]
   [junit4]   2> 716895 WARN  (coreLoadExecutor-2865-thread-1) [    x:collection1] o.a.s.c.RequestHandlers INVALID paramSet a in requestHandler {type = requestHandler,name = /dump,class = DumpRequestHandler,attributes = {initParams=a, name=/dump, class=DumpRequestHandler},args = {defaults={a=A,b=B}}}
   [junit4]   2> 716956 INFO  (coreLoadExecutor-2865-thread-1) [    x:collection1] o.a.s.u.UpdateHandler Using UpdateLog implementation: org.apache.solr.update.UpdateLog
   [junit4]   2> 716956 INFO  (coreLoadExecutor-2865-thread-1) [    x:collection1] o.a.s.u.UpdateLog Initializing UpdateLog: dataDir= defaultSyncLevel=FLUSH numRecordsToKeep=100 maxNumLogsToKeep=10 numVersionBuckets=65536
   [junit4]   2> 716958 INFO  (coreLoadExecutor-2865-thread-1) [    x:collection1] o.a.s.u.CommitTracker Hard AutoCommit: disabled
   [junit4]   2> 716958 INFO  (coreLoadExecutor-2865-thread-1) [    x:collection1] o.a.s.u.CommitTracker Soft AutoCommit: disabled
   [junit4]   2> 716959 INFO  (coreLoadExecutor-2865-thread-1) [    x:collection1] o.a.s.u.RandomMergePolicy RandomMergePolicy wrapping class org.apache.lucene.index.LogDocMergePolicy: [LogDocMergePolicy: minMergeSize=1000, mergeFactor=37, maxMergeSize=9223372036854775807, maxMergeSizeForForcedMerge=9223372036854775807, calibrateSizeByDeletes=true, maxMergeDocs=2147483647, maxCFSSegmentSizeMB=8.796093022207999E12, noCFSRatio=0.532989447465783]
   [junit4]   2> 716960 INFO  (coreLoadExecutor-2865-thread-1) [    x:collection1] o.a.s.s.SolrIndexSearcher Opening [Searcher@6e49e1c7[collection1] main]
   [junit4]   2> 716960 WARN  (coreLoadExecutor-2865-thread-1) [    x:collection1] o.a.s.r.ManagedResourceStorage Cannot write to config directory /x1/jenkins/jenkins-slave/workspace/Lucene-Solr-Tests-8.x/solr/core/src/test-files/solr/collection1/conf; switching to use InMemory storage instead.
   [junit4]   2> 716961 INFO  (coreLoadExecutor-2865-thread-1) [    x:collection1] o.a.s.h.ReplicationHandler Commits will be reserved for 10000ms.
   [junit4]   2> 716961 INFO  (coreLoadExecutor-2865-thread-1) [    x:collection1] o.a.s.u.UpdateLog Could not find max version in index or recent updates, using new clock 1632349193202827264
   [junit4]   2> 716964 INFO  (searcherExecutor-2866-thread-1-processing-x:collection1) [    x:collection1] o.a.s.c.SolrCore [collection1] Registered new searcher Searcher@6e49e1c7[collection1] main{ExitableDirectoryReader(UninvertingDirectoryReader())}
   [junit4]   2> 717633 INFO  (TEST-PeerSyncTest.test-seed#[E6C6372B4882BF4E]) [    ] o.a.s.SolrTestCaseJ4 Writing core.properties file to /x1/jenkins/jenkins-slave/workspace/Lucene-Solr-Tests-8.x/solr/build/solr-core/test/J1/temp/solr.update.PeerSyncTest_E6C6372B4882BF4E-001/tempDir-001/shard0/cores/collection1
   [junit4]   2> 717634 WARN  (TEST-PeerSyncTest.test-seed#[E6C6372B4882BF4E]) [    ] o.e.j.s.AbstractConnector Ignoring deprecated socket close linger time
   [junit4]   2> 717634 INFO  (TEST-PeerSyncTest.test-seed#[E6C6372B4882BF4E]) [    ] o.a.s.c.s.e.JettySolrRunner Start Jetty (original configured port=0)
   [junit4]   2> 717634 INFO  (TEST-PeerSyncTest.test-seed#[E6C6372B4882BF4E]) [    ] o.a.s.c.s.e.JettySolrRunner Trying to start Jetty on port 0 try number 1 ...
   [junit4]   2> 717634 INFO  (TEST-PeerSyncTest.test-seed#[E6C6372B4882BF4E]) [    ] o.e.j.s.Server jetty-9.4.14.v20181114; built: 2018-11-14T21:20:31.478Z; git: c4550056e785fb5665914545889f21dc136ad9e6; jvm 1.8.0_191-b12
   [junit4]   2> 717636 INFO  (TEST-PeerSyncTest.test-seed#[E6C6372B4882BF4E]) [    ] o.e.j.s.session DefaultSessionIdManager workerName=node0
   [junit4]   2> 717636 INFO  (TEST-PeerSyncTest.test-seed#[E6C6372B4882BF4E]) [    ] o.e.j.s.session No SessionScavenger set, using defaults
   [junit4]   2> 717636 INFO  (TEST-PeerSyncTest.test-seed#[E6C6372B4882BF4E]) [    ] o.e.j.s.session node0 Scavenging every 600000ms
   [junit4]   2> 717636 INFO  (TEST-PeerSyncTest.test-seed#[E6C6372B4882BF4E]) [    ] o.e.j.s.h.ContextHandler Started o.e.j.s.ServletContextHandler@3bd7b0b8{/,null,AVAILABLE}
   [junit4]   2> 717637 INFO  (TEST-PeerSyncTest.test-seed#[E6C6372B4882BF4E]) [    ] o.e.j.s.AbstractConnector Started ServerConnector@7852f927{HTTP/1.1,[http/1.1, h2c]}{127.0.0.1:43596}
   [junit4]   2> 717637 INFO  (TEST-PeerSyncTest.test-seed#[E6C6372B4882BF4E]) [    ] o.e.j.s.Server Started @717695ms
   [junit4]   2> 717637 INFO  (TEST-PeerSyncTest.test-seed#[E6C6372B4882BF4E]) [    ] o.a.s.c.s.e.JettySolrRunner Jetty properties: {schema=schema.xml, solrconfig=solrconfig-tlog.xml, hostContext=/, hostPort=43596, coreRootDirectory=/x1/jenkins/jenkins-slave/workspace/Lucene-Solr-Tests-8.x/solr/build/solr-core/test/J1/temp/solr.update.PeerSyncTest_E6C6372B4882BF4E-001/tempDir-001/shard0/cores}
   [junit4]   2> 717637 ERROR (TEST-PeerSyncTest.test-seed#[E6C6372B4882BF4E]) [    ] o.a.s.u.StartupLoggingUtils Missing Java Option solr.log.dir. Logging may be missing or incomplete.
   [junit4]   2> 717637 INFO  (TEST-PeerSyncTest.test-seed#[E6C6372B4882BF4E]) [    ] o.a.s.s.SolrDispatchFilter Using logger factory org.apache.logging.slf4j.Log4jLoggerFactory
   [junit4]   2> 717637 INFO  (TEST-PeerSyncTest.test-seed#[E6C6372B4882BF4E]) [    ] o.a.s.s.SolrDispatchFilter  ___      _       Welcome to Apache Solr? version 8.2.0
   [junit4]   2> 717637 INFO  (TEST-PeerSyncTest.test-seed#[E6C6372B4882BF4E]) [    ] o.a.s.s.SolrDispatchFilter / __| ___| |_ _   Starting in standalone mode on port null
   [junit4]   2> 717637 INFO  (TEST-PeerSyncTest.test-seed#[E6C6372B4882BF4E]) [    ] o.a.s.s.SolrDispatchFilter \__ \/ _ \ | '_|  Install dir: null
   [junit4]   2> 717637 INFO  (TEST-PeerSyncTest.test-seed#[E6C6372B4882BF4E]) [    ] o.a.s.s.SolrDispatchFilter |___/\___/_|_|    Start time: 2019-05-01T16:51:41.640Z
   [junit4]   2> 717638 INFO  (TEST-PeerSyncTest.test-seed#[E6C6372B4882BF4E]) [    ] o.a.s.c.SolrXmlConfig Loading container configuration from /x1/jenkins/jenkins-slave/workspace/Lucene-Solr-Tests-8.x/solr/build/solr-core/test/J1/temp/solr.update.PeerSyncTest_E6C6372B4882BF4E-001/tempDir-001/shard0/solr.xml
   [junit4]   2> 717642 INFO  (TEST-PeerSyncTest.test-seed#[E6C6372B4882BF4E]) [    ] o.a.s.c.SolrXmlConfig Configuration parameter autoReplicaFailoverWorkLoopDelay is ignored
   [junit4]   2> 717642 INFO  (TEST-PeerSyncTest.test-seed#[E6C6372B4882BF4E]) [    ] o.a.s.c.SolrXmlConfig Configuration parameter autoReplicaFailoverBadNodeExpiration is ignored
   [junit4]   2> 717644 INFO  (TEST-PeerSyncTest.test-seed#[E6C6372B4882BF4E]) [    ] o.a.s.c.SolrXmlConfig MBean server found: com.sun.jmx.mbeanserver.JmxMBeanServer@552894aa, but no JMX reporters were configured - adding default JMX reporter.
   [junit4]   2> 717786 INFO  (TEST-PeerSyncTest.test-seed#[E6C6372B4882BF4E]) [    ] o.a.s.h.c.HttpShardHandlerFactory Host whitelist initialized: WhitelistHostChecker [whitelistHosts=null, whitelistHostCheckingEnabled=false]
   [junit4]   2> 717788 WARN  (TEST-PeerSyncTest.test-seed#[E6C6372B4882BF4E]) [    ] o.e.j.u.s.S.config No Client EndPointIdentificationAlgorithm configured for SslContextFactory@6fa5eab4[provider=null,keyStore=null,trustStore=null]
   [junit4]   2> 717806 WARN  (TEST-PeerSyncTest.test-seed#[E6C6372B4882BF4E]) [    ] o.e.j.u.s.S.config No Client EndPointIdentificationAlgorithm configured for SslContextFactory@33a3cef2[provider=null,keyStore=null,trustStore=null]
   [junit4]   2> 717834 INFO  (TEST-PeerSyncTest.test-seed#[E6C6372B4882BF4E]) [    ] o.a.s.c.TransientSolrCoreCacheDefault Allocating transient cache for 4 transient cores
   [junit4]   2> 717834 INFO  (TEST-PeerSyncTest.test-seed#[E6C6372B4882BF4E]) [    ] o.a.s.h.a.MetricsHistoryHandler No .system collection, keeping metrics history in memory.
   [junit4]   2> 717867 INFO  (TEST-PeerSyncTest.test-seed#[E6C6372B4882BF4E]) [    ] o.a.s.m.r.SolrJmxReporter JMX monitoring for 'solr.node' (registry 'solr.node') enabled at server: com.sun.jmx.mbeanserver.JmxMBeanServer@552894aa
   [junit4]   2> 717889 INFO  (TEST-PeerSyncTest.test-seed#[E6C6372B4882BF4E]) [    ] o.a.s.m.r.SolrJmxReporter JMX monitoring for 'solr.jvm' (registry 'solr.jvm') enabled at server: com.sun.jmx.mbeanserver.JmxMBeanServer@552894aa
   [junit4]   2> 717889 INFO  (TEST-PeerSyncTest.test-seed#[E6C6372B4882BF4E]) [    ] o.a.s.m.r.SolrJmxReporter JMX monitoring for 'solr.jetty' (registry 'solr.jetty') enabled at server: com.sun.jmx.mbeanserver.JmxMBeanServer@552894aa
   [junit4]   2> 717893 INFO  (TEST-PeerSyncTest.test-seed#[E6C6372B4882BF4E]) [    ] o.a.s.c.CorePropertiesLocator Found 1 core definitions underneath /x1/jenkins/jenkins-slave/workspace/Lucene-Solr-Tests-8.x/solr/build/solr-core/test/J1/temp/solr.update.PeerSyncTest_E6C6372B4882BF4E-001/tempDir-001/shard0/cores
   [junit4]   2> 717894 INFO  (TEST-PeerSyncTest.test-seed#[E6C6372B4882BF4E]) [    ] o.a.s.c.CorePropertiesLocator Cores are: [collection1]
   [junit4]   2> 717895 INFO  (coreLoadExecutor-2879-thread-1) [    x:collection1] o.a.s.c.SolrResourceLoader [null] Added 2 libs to classloader, from paths: [/x1/jenkins/jenkins-slave/workspace/Lucene-Solr-Tests-8.x/solr/core/src/test-files/solr/collection1/lib, /x1/jenkins/jenkins-slave/workspace/Lucene-Solr-Tests-8.x/solr/core/src/test-files/solr/collection1/lib/classes]
   [junit4]   2> 717933 INFO  (coreLoadExecutor-2879-thread-1) [    x:collection1] o.a.s.c.SolrConfig Using Lucene MatchVersion: 8.2.0
   [junit4]   2> 717957 INFO  (coreLoadExecutor-2879-thread-1) [    x:collection1] o.a.s.s.IndexSchema [collection1] Schema name=test
   [junit4]   2> 718119 INFO  (coreLoadExecutor-2879-thread-1) [    x:collection1] o.a.s.s.IndexSchema Loaded schema test/1.0 with uniqueid field id
   [junit4]   2> 718134 INFO  (coreLoadExecutor-2879-thread-1) [    x:collection1] o.a.s.c.CoreContainer Creating SolrCore 'collection1' using configuration from configset /x1/jenkins/jenkins-slave/workspace/Lucene-Solr-Tests-8.x/solr/core/src/test-files/solr/collection1, trusted=true
   [junit4]   2> 718135 INFO  (coreLoadExecutor-2879-thread-1) [    x:collection1] o.a.s.m.r.SolrJmxReporter JMX monitoring for 'solr.core.collection1' (registry 'solr.core.collection1') enabled at server: com.sun.jmx.mbeanserver.JmxMBeanServer@552894aa
   [junit4]   2> 718135 INFO  (coreLoadExecutor-2879-thread-1) [    x:collection1] o.a.s.c.SolrCore [[collection1] ] Opening new SolrCore at [/x1/jenkins/jenkins-slave/workspace/Lucene-Solr-Tests-8.x/solr/core/src/test-files/solr/collection1], dataDir=[/x1/jenkins/jenkins-slave/workspace/Lucene-Solr-Tests-8.x/solr/build/solr-core/test/J1/temp/solr.update.PeerSyncTest_E6C6372B4882BF4E-001/tempDir-001/shard0/cores/collection1/data/]
   [junit4]   2> 718138 INFO  (coreLoadExecutor-2879-thread-1) [    x:collection1] o.a.s.u.RandomMergePolicy RandomMergePolicy wrapping class org.apache.lucene.index.AlcoholicMergePolicy: [AlcoholicMergePolicy: minMergeSize=0, mergeFactor=10, maxMergeSize=1577310086, maxMergeSizeForForcedMerge=9223372036854775807, calibrateSizeByDeletes=true, maxMergeDocs=2147483647, maxCFSSegmentSizeMB=8.796093022207999E12, noCFSRatio=0.1]
   [junit4]   2> 718141 WARN  (coreLoadExecutor-2879-thread-1) [    x:collection1] o.a.s.c.RequestHandlers INVALID paramSet a in requestHandler {type = requestHandler,name = /dump,class = DumpRequestHandler,attributes = {initParams=a, name=/dump, class=DumpRequestHandler},args = {defaults={a=A,b=B}}}
   [junit4]   2> 718223 INFO  (coreLoadExecutor-2879-thread-1) [    x:collection1] o.a.s.u.UpdateHandler Using UpdateLog implementation: org.apache.solr.update.UpdateLog
   [junit4]   2> 718223 INFO  (coreLoadExecutor-2879-thread-1) [    x:collection1] o.a.s.u.UpdateLog Initializing UpdateLog: dataDir= defaultSyncLevel=FLUSH numRecordsToKeep=100 maxNumLogsToKeep=10 numVersionBuckets=65536
   [junit4]   2> 718225 INFO  (coreLoadExecutor-2879-thread-1) [    x:collection1] o.a.s.u.CommitTracker Hard AutoCommit: disabled
   [junit4]   2> 718225 INFO  (coreLoadExecutor-2879-thread-1) [    x:collection1] o.a.s.u.CommitTracker Soft AutoCommit: disabled
   [junit4]   2> 718227 INFO  (coreLoadExecutor-2879-thread-1) [    x:collection1] o.a.s.u.RandomMergePolicy RandomMergePolicy wrapping class org.apache.lucene.index.LogDocMergePolicy: [LogDocMergePolicy: minMergeSize=1000, mergeFactor=37, maxMergeSize=9223372036854775807, maxMergeSizeForForcedMerge=9223372036854775807, calibrateSizeByDeletes=true, maxMergeDocs=2147483647, maxCFSSegmentSizeMB=8.796093022207999E12, noCFSRatio=0.532989447465783]
   [junit4]   2> 718228 INFO  (coreLoadExecutor-2879-thread-1) [    x:collection1] o.a.s.s.SolrIndexSearcher Opening [Searcher@5f1c6da1[collection1] main]
   [junit4]   2> 718228 WARN  (coreLoadExecutor-2879-thread-1) [    x:collection1] o.a.s.r.ManagedResourceStorage Cannot write to config directory /x1/jenkins/jenkins-slave/workspace/Lucene-Solr-Tests-8.x/solr/core/src/test-files/solr/collection1/conf; switching to use InMemory storage instead.
   [junit4]   2> 718229 INFO  (coreLoadExecutor-2879-thread-1) [    x:collection1] o.a.s.h.ReplicationHandler Commits will be reserved for 10000ms.
   [junit4]   2> 718230 INFO  (coreLoadExecutor-2879-thread-1) [    x:collection1] o.a.s.u.UpdateLog Could not find max version in index or recent updates, using new clock 1632349194533470208
   [junit4]   2> 718234 INFO  (searcherExecutor-2880-thread-1-processing-x:collection1) [    x:collection1] o.a.s.c.SolrCore [collection1] Registered new searcher Searcher@5f1c6da1[collection1] main{ExitableDirectoryReader(UninvertingDirectoryReader())}
   [junit4]   2> 718910 INFO  (TEST-PeerSyncTest.test-seed#[E6C6372B4882BF4E]) [    ] o.a.s.SolrTestCaseJ4 Writing core.properties file to /x1/jenkins/jenkins-slave/workspace/Lucene-Solr-Tests-8.x/solr/build/solr-core/test/J1/temp/solr.update.PeerSyncTest_E6C6372B4882BF4E-001/tempDir-001/shard1/cores/collection1
   [junit4]   2> 718911 WARN  (TEST-PeerSyncTest.test-seed#[E6C6372B4882BF4E]) [    ] o.e.j.s.AbstractConnector Ignoring deprecated socket close linger time
   [junit4]   2> 718911 INFO  (TEST-PeerSyncTest.test-seed#[E6C6372B4882BF4E]) [    ] o.a.s.c.s.e.JettySolrRunner Start Jetty (original configured port=0)
   [junit4]   2> 718911 INFO  (TEST-PeerSyncTest.test-seed#[E6C6372B4882BF4E]) [    ] o.a.s.c.s.e.JettySolrRunner Trying to start Jetty on port 0 try number 1 ...
   [junit4]   2> 718911 INFO  (TEST-PeerSyncTest.test-seed#[E6C6372B4882BF4E]) [    ] o.e.j.s.Server jetty-9.4.14.v20181114; built: 2018-11-14T21:20:31.478Z; git: c4550056e785fb5665914545889f21dc136ad9e6; jvm 1.8.0_191-b12
   [junit4]   2> 718915 INFO  (TEST-PeerSyncTest.test-seed#[E6C6372B4882BF4E]) [    ] o.e.j.s.session DefaultSessionIdManager workerName=node0
   [junit4]   2> 718915 INFO  (TEST-PeerSyncTest.test-seed#[E6C6372B4882BF4E]) [    ] o.e.j.s.session No SessionScavenger set, using defaults
   [junit4]   2> 718915 INFO  (TEST-PeerSyncTest.test-seed#[E6C6372B4882BF4E]) [    ] o.e.j.s.session node0 Scavenging every 660000ms
   [junit4]   2> 718916 INFO  (TEST-PeerSyncTest.test-seed#[E6C6372B4882BF4E]) [    ] o.e.j.s.h.ContextHandler Started o.e.j.s.ServletContextHandler@692fe9a6{/,null,AVAILABLE}
   [junit4]   2> 718917 INFO  (TEST-PeerSyncTest.test-seed#[E6C6372B4882BF4E]) [    ] o.e.j.s.AbstractConnector Started ServerConnector@29c4be3f{HTTP/1.1,[http/1.1, h2c]}{127.0.0.1:36988}
   [junit4]   2> 718917 INFO  (TEST-PeerSyncTest.test-seed#[E6C6372B4882BF4E]) [    ] o.e.j.s.Server Started @718976ms
   [junit4]   2> 718917 INFO  (TEST-PeerSyncTest.test-seed#[E6C6372B4882BF4E]) [    ] o.a.s.c.s.e.JettySolrRunner Jetty properties: {schema=schema.xml, solrconfig=solrconfig-tlog.xml, hostContext=/, hostPort=36988, coreRootDirectory=/x1/jenkins/jenkins-slave/workspace/Lucene-Solr-Tests-8.x/solr/build/solr-core/test/J1/temp/solr.update.PeerSyncTest_E6C6372B4882BF4E-001/tempDir-001/shard1/cores}
   [junit4]   2> 718917 ERROR (TEST-PeerSyncTest.test-seed#[E6C6372B4882BF4E]) [    ] o.a.s.u.StartupLoggingUtils Missing Java Option solr.log.dir. Logging may be missing or incomplete.
   [junit4]   2> 718917 INFO  (TEST-PeerSyncTest.test-seed#[E6C6372B4882BF4E]) [    ] o.a.s.s.SolrDispatchFilter Using logger factory org.apache.logging.slf4j.Log4jLoggerFactory
   [junit4]   2> 718917 INFO  (TEST-PeerSyncTest.test-seed#[E6C6372B4882BF4E]) [    ] o.a.s.s.SolrDispatchFilter  ___      _       Welcome to Apache Solr? version 8.2.0
   [junit4]   2> 718917 INFO  (TEST-PeerSyncTest.test-seed#[E6C6372B4882BF4E]) [    ] o.a.s.s.SolrDispatchFilter / __| ___| |_ _   Starting in standalone mode on port null
   [junit4]   2> 718917 INFO  (TEST-PeerSyncTest.test-seed#[E6C6372B4882BF4E]) [    ] o.a.s.s.SolrDispatchFilter \__ \/ _ \ | '_|  Install dir: null
   [junit4]   2> 718917 INFO  (TEST-PeerSyncTest.test-seed#[E6C6372B4882BF4E]) [    ] o.a.s.s.SolrDispatchFilter |___/\___/_|_|    Start time: 2019-05-01T16:51:42.920Z
   [junit4]   2> 718918 INFO  (TEST-PeerSyncTest.test-seed#[E6C6372B4882BF4E]) [    ] o.a.s.c.SolrXmlConfig Loading container configuration from /x1/jenkins/jenkins-slave/workspace/Lucene-Solr-Tests-8.x/solr/build/solr-core/test/J1/temp/solr.update.PeerSyncTest_E6C6372B4882BF4E-001/tempDir-001/shard1/solr.xml
   [junit4]   2> 718923 INFO  (TEST-PeerSyncTest.test-seed#[E6C6372B4882BF4E]) [    ] o.a.s.c.SolrXmlConfig Configuration parameter autoReplicaFailoverWorkLoopDelay is ignored
   [junit4]   2> 718923 INFO  (TEST-PeerSyncTest.test-seed#[E6C6372B4882BF4E]) [    ] o.a.s.c.SolrXmlConfig Configuration parameter autoReplicaFailoverBadNodeExpiration is ignored
   [junit4]   2> 718924 INFO  (TEST-PeerSyncTest.test-seed#[E6C6372B4882BF4E]) [    ] o.a.s.c.SolrXmlConfig MBean server found: com.sun.jmx.mbeanserver.JmxMBeanServer@552894aa, but no JMX reporters were configured - adding default JMX reporter.
   [junit4]   2> 719197 INFO  (TEST-PeerSyncTest.test-seed#[E6C6372B4882BF4E]) [    ] o.a.s.h.c.HttpShardHandlerFactory Host whitelist initialized: WhitelistHostChecker [whitelistHosts=null, whitelistHostCheckingEnabled=false]
   [junit4]   2> 719199 WARN  (TEST-PeerSyncTest.test-seed#[E6C6372B4882BF4E]) [    ] o.e.j.u.s.S.config No Client EndPointIdentificationAlgorithm configured for SslContextFactory@7fc67e63[provider=null,keyStore=null,trustStore=null]
   [junit4]   2> 719208 WARN  (TEST-PeerSyncTest.test-seed#[E6C6372B4882BF4E]) [    ] o.e.j.u.s.S.config No Client EndPointIdentificationAlgorithm configured for SslContextFactory@357e9ed[provider=null,keyStore=null,trustStore=null]
   [junit4]   2> 719249 INFO  (TEST-PeerSyncTest.test-seed#[E6C6372B4882BF4E]) [    ] o.a.s.c.TransientSolrCoreCacheDefault Allocating transient cache for 4 transient cores
   [junit4]   2> 719249 INFO  (TEST-PeerSyncTest.test-seed#[E6C6372B4882BF4E]) [    ] o.a.s.h.a.MetricsHistoryHandler No .system collection, keeping metrics history in memory.
   [junit4]   2> 719280 INFO  (TEST-PeerSyncTest.test-seed#[E6C6372B4882BF4E]) [    ] o.a.s.m.r.SolrJmxReporter JMX monitoring for 'solr.node' (registry 'solr.node') enabled at server: com.sun.jmx.mbeanserver.JmxMBeanServer@552894aa
   [junit4]   2> 719299 INFO  (TEST-PeerSyncTest.test-seed#[E6C6372B4882BF4E]) [    ] o.a.s.m.r.SolrJmxReporter JMX monitoring for 'solr.jvm' (registry 'solr.jvm') enabled at server: com.sun.jmx.mbeanserver.JmxMBeanServer@552894aa
   [junit4]   2> 719299 INFO  (TEST-PeerSyncTest.test-seed#[E6C6372B4882BF4E]) [    ] o.a.s.m.r.SolrJmxReporter JMX monitoring for 'solr.jetty' (registry 'solr.jetty') enabled at server: com.sun.jmx.mbeanserver.JmxMBeanServer@552894aa
   [junit4]   2> 719302 INFO  (TEST-PeerSyncTest.test-seed#[E6C6372B4882BF4E]) [    ] o.a.s.c.CorePropertiesLocator Found 1 core definitions underneath /x1/jenkins/jenkins-slave/workspace/Lucene-Solr-Tests-8.x/solr/build/solr-core/test/J1/temp/solr.update.PeerSyncTest_E6C6372B4882BF4E-001/tempDir-001/shard1/cores
   [junit4]   2> 719302 INFO  (TEST-PeerSyncTest.test-seed#[E6C6372B4882BF4E]) [    ] o.a.s.c.CorePropertiesLocator Cores are: [collection1]
   [junit4]   2> 719303 INFO  (coreLoadExecutor-2893-thread-1) [    x:collection1] o.a.s.c.SolrResourceLoader [null] Added 2 libs to classloader, from paths: [/x1/jenkins/jenkins-slave/workspace/Lucene-Solr-Tests-8.x/solr/core/src/test-files/solr/collection1/lib, /x1/jenkins/jenkins-slave/workspace/Lucene-Solr-Tests-8.x/solr/core/src/test-files/solr/collection1/lib/classes]
   [junit4]   2> 719376 INFO  (coreLoadExecutor-2893-thread-1) [    x:collection1] o.a.s.c.SolrConfig Using Lucene MatchVersion: 8.2.0
   [junit4]   2> 719411 INFO  (coreLoadExecutor-2893-thread-1) [    x:collection1] o.a.s.s.IndexSchema [collection1] Schema name=test
   [junit4]   2> 719586 INFO  (coreLoadExecutor-2893-thread-1) [    x:collection1] o.a.s.s.IndexSchema Loaded schema test/1.0 with uniqueid field id
   [junit4]   2> 719600 INFO  (coreLoadExecutor-2893-thread-1) [    x:collection1] o.a.s.c.CoreContainer Creating SolrCore 'collection1' using configuration from configset /x1/jenkins/jenkins-slave/workspace/Lucene-Solr-Tests-8.x/solr/core/src/test-files/solr/collection1, trusted=true
   [junit4]   2> 719600 INFO  (coreLoadExecutor-2893-thread-1) [    x:collection1] o.a.s.m.r.SolrJmxReporter JMX monitoring for 'solr.core.collection1' (registry 'solr.core.collection1') enabled at server: com.sun.jmx.mbeanserver.JmxMBeanServer@552894aa
   [junit4]   2> 719601 INFO  (coreLoadExecutor-2893-thread-1) [    x:collection1] o.a.s.c.SolrCore [[collection1] ] Opening new SolrCore at [/x1/jenkins/jenkins-slave/workspace/Lucene-Solr-Tests-8.x/solr/core/src/test-files/solr/collection1], dataDir=[/x1/jenkins/jenkins-slave/workspace/Lucene-Solr-Tests-8.x/solr/build/solr-core/test/J1/temp/solr.update.PeerSyncTest_E6C6372B4882BF4E-001/tempDir-001/shard1/cores/collection1/data/]
   [junit4]   2> 719606 INFO  (coreLoadExecutor-2893-thread-1) [    x:collection1] o.a.s.u.RandomMergePolicy RandomMergePolicy wrapping class org.apache.lucene.index.AlcoholicMergePolicy: [AlcoholicMergePolicy: minMergeSize=0, mergeFactor=10, maxMergeSize=1577310086, maxMergeSizeForForcedMerge=9223372036854775807, calibrateSizeByDeletes=true, maxMergeDocs=2147483647, maxCFSSegmentSizeMB=8.796093022207999E12, noCFSRatio=0.1]
   [junit4]   2> 719609 WARN  (coreLoadExecutor-2893-thread-1) [    x:collection1] o.a.s.c.RequestHandlers INVALID paramSet a in requestHandler {type = requestHandler,name = /dump,class = DumpRequestHandler,attributes = {initParams=a, name=/dump, class=DumpRequestHandler},args = {defaults={a=A,b=B}}}
   [junit4]   2> 719714 INFO  (coreLoadExecutor-2893-thread-1) [    x:collection1] o.a.s.u.UpdateHandler Using UpdateLog implementation: org.apache.solr.update.UpdateLog
   [junit4]   2> 719714 INFO  (coreLoadExecutor-2893-thread-1) [    x:collection1] o.a.s.u.UpdateLog Initializing UpdateLog: dataDir= defaultSyncLevel=FLUSH numRecordsToKeep=100 maxNumLogsToKeep=10 numVersionBuckets=65536
   [junit4]   2> 719716 INFO  (coreLoadExecutor-2893-thread-1) [    x:collection1] o.a.s.u.CommitTracker Hard AutoCommit: disabled
   [junit4]   2> 719716 INFO  (coreLoadExecutor-2893-thread-1) [    x:collection1] o.a.s.u.CommitTracker Soft AutoCommit: disabled
   [junit4]   2> 719717 INFO  (coreLoadExecutor-2893-thread-1) [    x:collection1] o.a.s.u.RandomMergePolicy RandomMergePolicy wrapping class org.apache.lucene.index.LogDocMergePolicy: [LogDocMergePolicy: minMergeSize=1000, mergeFactor=37, maxMergeSize=9223372036854775807, maxMergeSizeForForcedMerge=9223372036854775807, calibrateSizeByDeletes=true, maxMergeDocs=2147483647, maxCFSSegmentSizeMB=8.796093022207999E12, noCFSRatio=0.532989447465783]
   [junit4]   2> 719717 INFO  (coreLoadExecutor-2893-thread-1) [    x:collection1] o.a.s.s.SolrIndexSearcher Opening [Searcher@82afb67[collection1] main]
   [junit4]   2> 719718 WARN  (coreLoadExecutor-2893-thread-1) [    x:collection1] o.a.s.r.ManagedResourceStorage Cannot write to config directory /x1/jenkins/jenkins-slave/workspace/Lucene-Solr-Tests-8.x/solr/core/src/test-files/solr/collection1/conf; switching to use InMemory storage instead.
   [junit4]   2> 719718 INFO  (coreLoadExecutor-2893-thread-1) [    x:collection1] o.a.s.h.ReplicationHandler Commits will be reserved for 10000ms.
   [junit4]   2> 719718 INFO  (coreLoadExecutor-2893-thread-1) [    x:collection1] o.a.s.u.UpdateLog Could not find max version in index or recent updates, using new clock 1632349196093751296
   [junit4]   2> 719731 INFO  (searcherExecutor-2894-thread-1-processing-x:collection1) [    x:collection1] o.a.s.c.SolrCore [collection1] Registered new searcher Searcher@82afb67[collection1] main{ExitableDirectoryReader(UninvertingDirectoryReader())}
   [junit4]   2> 719912 INFO  (TEST-PeerSyncTest.test-seed#[E6C6372B4882BF4E]) [    ] o.a.s.SolrTestCaseJ4 Writing core.properties file to /x1/jenkins/jenkins-slave/workspace/Lucene-Solr-Tests-8.x/solr/build/solr-core/test/J1/temp/solr.update.PeerSyncTest_E6C6372B4882BF4E-001/tempDir-001/shard2/cores/collection1
   [junit4]   2> 719913 WARN  (TEST-PeerSyncTest.test-seed#[E6C6372B4882BF4E]) [    ] o.e.j.s.AbstractConnector Ignoring deprecated socket close linger time
   [junit4]   2> 719913 INFO  (TEST-PeerSyncTest.test-seed#[E6C6372B4882BF4E]) [    ] o.a.s.c.s.e.JettySolrRunner Start Jetty (original configured port=0)
   [junit4]   2> 719913 INFO  (TEST-PeerSyncTest.test-seed#[E6C6372B4882BF4E]) [    ] o.a.s.c.s.e.JettySolrRunner Trying to start Jetty on port 0 try number 1 ...
   [junit4]   2> 719913 INFO  (TEST-PeerSyncTest.test-seed#[E6C6372B4882BF4E]) [    ] o.e.j.s.Server jetty-9.4.14.v20181114; built: 2018-11-14T21:20:31.478Z; git: c4550056e785fb5665914545889f21dc136ad9e6; jvm 1.8.0_191-b12
   [junit4]   2> 719915 INFO  (TEST-PeerSyncTest.test-seed#[E6C6372B4882BF4E]) [    ] o.e.j.s.session DefaultSessionIdManager workerName=node0
   [junit4]   2> 719915 INFO  (TEST-PeerSyncTest.test-seed#[E6C6372B4882BF4E]) [    ] o.e.j.s.session No SessionScavenger set, using defaults
   [junit4]   2> 719915 INFO  (TEST-PeerSyncTest.test-seed#[E6C6372B4882BF4E]) [    ] o.e.j.s.session node0 Scavenging every 660000ms
   [junit4]   2> 719915 INFO  (TEST-PeerSyncTest.test-seed#[E6C6372B4882BF4E]) [    ] o.e.j.s.h.ContextHandler Started o.e.j.s.ServletContextHandler@5e1c6bcc{/,null,AVAILABLE}
   [junit4]   2> 719916 INFO  (TEST-PeerSyncTest.test-seed#[E6C6372B4882BF4E]) [    ] o.e.j.s.AbstractConnector Started ServerConnector@36cdfc63{HTTP/1.1,[http/1.1, h2c]}{127.0.0.1:37006}
   [junit4]   2> 719916 INFO  (TEST-PeerSyncTest.test-seed#[E6C6372B4882BF4E]) [    ] o.e.j.s.Server Started @719974ms
   [junit4]   2> 719916 INFO  (TEST-PeerSyncTest.test-seed#[E6C6372B4882BF4E]) [    ] o.a.s.c.s.e.JettySolrRunner Jetty properties: {schema=schema.xml, solrconfig=solrconfig-tlog.xml, hostContext=/, hostPort=37006, coreRootDirectory=/x1/jenkins/jenkins-slave/workspace/Lucene-Solr-Tests-8.x/solr/build/solr-core/test/J1/temp/solr.update.PeerSyncTest_E6C6372B4882BF4E-001/tempDir-001/shard2/cores}
   [junit4]   2> 719916 ERROR (TEST-PeerSyncTest.test-seed#[E6C6372B4882BF4E]) [    ] o.a.s.u.StartupLoggingUtils Missing Java Option solr.log.dir. Logging may be missing or incomplete.
   [junit4]   2> 719916 INFO  (TEST-PeerSyncTest.test-seed#[E6C6372B4882BF4E]) [    ] o.a.s.s.SolrDispatchFilter Using logger factory org.apache.logging.slf4j.Log4jLoggerFactory
   [junit4]   2> 719916 INFO  (TEST-PeerSyncTest.test-seed#[E6C6372B4882BF4E]) [    ] o.a.s.s.SolrDispatchFilter  ___      _       Welcome to Apache Solr? version 8.2.0
   [junit4]   2> 719916 INFO  (TEST-PeerSyncTest.test-seed#[E6C6372B4882BF4E]) [    ] o.a.s.s.SolrDispatchFilter / __| ___| |_ _   Starting in standalone mode on port null
   [junit4]   2> 719916 INFO  (TEST-PeerSyncTest.test-seed#[E6C6372B4882BF4E]) [    ] o.a.s.s.SolrDispatchFilter \__ \/ _ \ | '_|  Install dir: null
   [junit4]   2> 719916 INFO  (TEST-PeerSyncTest.test-seed#[E6C6372B4882BF4E]) [    ] o.a.s.s.SolrDispatchFilter |___/\___/_|_|    Start time: 2019-05-01T16:51:43.919Z
   [junit4]   2> 719917 INFO  (TEST-PeerSyncTest.test-seed#[E6C6372B4882BF4E]) [    ] o.a.s.c.SolrXmlConfig Loading container configuration from /x1/jenkins/jenkins-slave/workspace/Lucene-Solr-Tests-8.x/solr/build/solr-core/test/J1/temp/solr.update.PeerSyncTest_E6C6372B4882BF4E-001/tempDir-001/shard2/solr.xml
   [junit4]   2> 719922 INFO  (TEST-PeerSyncTest.test-seed#[E6C6372B4882BF4E]) [    ] o.a.s.c.SolrXmlConfig Configuration parameter autoReplicaFailoverWorkLoopDelay is ignored
   [junit4]   2> 719922 INFO  (TEST-PeerSyncTest.test-seed#[E6C6372B4882BF4E]) [    ] o.a.s.c.SolrXmlConfig Configuration parameter autoReplicaFailoverBadNodeExpiration is ignored
   [junit4]   2> 719924 INFO  (TEST-PeerSyncTest.test-seed#[E6C6372B4882BF4E]) [    ] o.a.s.c.SolrXmlConfig MBean server found: com.sun.jmx.mbeanserver.JmxMBeanServer@552894aa, but no JMX reporters were configured - adding default JMX reporter.
   [junit4]   2> 720009 INFO  (TEST-PeerSyncTest.test-seed#[E6C6372B4882BF4E]) [    ] o.a.s.h.c.HttpShardHandlerFactory Host whitelist initialized: WhitelistHostChecker [whitelistHosts=null, whitelistHostCheckingEnabled=false]
   [junit4]   2> 720012 WARN  (TEST-PeerSyncTest.test-seed#[E6C6372B4882BF4E]) [    ] o.e.j.u.s.S.config No Client EndPointIdentificationAlgorithm configured for SslContextFactory@5382083e[provider=null,keyStore=null,trustStore=null]
   [junit4]   2> 720017 WARN  (TEST-PeerSyncTest.test-seed#[E6C6372B4882BF4E]) [    ] o.e.j.u.s.S.config No Client EndPointIdentificationAlgorithm configured for SslContextFactory@6ae3b3cb[provider=null,keyStore=null,trustStore=null]
   [junit4]   2> 720051 INFO  (TEST-PeerSyncTest.test-seed#[E6C6372B4882BF4E]) [    ] o.a.s.c.TransientSolrCoreCacheDefault Allocating transient cache for 4 transient cores
   [junit4]   2> 720051 INFO  (TEST-PeerSyncTest.test-seed#[E6C6372B4882BF4E]) [    ] o.a.s.h.a.MetricsHistoryHandler No .system collection, keeping metrics history in memory.
   [junit4]   2> 720082 INFO  (TEST-PeerSyncTest.test-seed#[E6C6372B4882BF4E]) [    ] o.a.s.m.r.SolrJmxReporter JMX monitoring for 'solr.node' (registry 'solr.node') enabled at server: com.sun.jmx.mbeanserver.JmxMBeanServer@552894aa
   [junit4]   2> 720109 INFO  (TEST-PeerSyncTest.test-seed#[E6C6372B4882BF4E]) [    ] o.a.s.m.r.SolrJmxReporter JMX monitoring for 'solr.jvm' (registry 'solr.jvm') enabled at server: com.sun.jmx.mbeanserver.JmxMBeanServer@552894aa
   [junit4]   2> 720109 INFO  (TEST-PeerSyncTest.test-seed#[E6C6372B4882BF4E]) [    ] o.a.s.m.r.SolrJmxReporter JMX monitoring for 'solr.jetty' (registry 'solr.jetty') enabled at server: com.sun.jmx.mbeanserver.JmxMBeanServer@552894aa
   [junit4]   2> 720112 INFO  (TEST-PeerSyncTest.test-seed#[E6C6372B4882BF4E]) [    ] o.a.s.c.CorePropertiesLocator Found 1 core definitions underneath /x1/jenkins/jenkins-slave/workspace/Lucene-Solr-Tests-8.x/solr/build/solr-core/test/J1/temp/solr.update.PeerSyncTest_E6C6372B4882BF4E-001/tempDir-001/shard2/cores
   [junit4]   2> 720112 INFO  (TEST-PeerSyncTest.test-seed#[E6C6372B4882BF4E]) [    ] o.a.s.c.CorePropertiesLocator Cores are: [collection1]
   [junit4]   2> 720113 INFO  (coreLoadExecutor-2907-thread-1) [    x:collection1] o.a.s.c.SolrResourceLoader [null] Added 2 libs to classloader, from paths: [/x1/jenkins/jenkins-slave/workspace/Lucene-Solr-Tests-8.x/solr/core/src/test-files/solr/collection1/lib, /x1/jenkins/jenkins-slave/workspace/Lucene-Solr-Tests-8.x/solr/core/src/test-files/solr/collection1/lib/classes]
   [junit4]   2> 720206 INFO  (coreLoadExecutor-2907-thread-1) [    x:collection1] o.a.s.c.SolrConfig Using Lucene MatchVersion: 8.2.0
   [junit4]   2> 720231 INFO  (coreLoadExecutor-2907-thread-1) [    x:collection1] o.a.s.s.IndexSchema [collection1] Schema name=test
   [junit4]   2> 720413 INFO  (coreLoadExecutor-2907-thread-1) [    x:collection1] o.a.s.s.IndexSchema Loaded schema test/1.0 with uniqueid field id
   [junit4]   2> 720424 INFO  (coreLoadExecutor-2907-thread-1) [    x:collection1] o.a.s.c.CoreContainer Creating SolrCore 'collection1' using configuration from configset /x1/jenkins/jenkins-slave/workspace/Lucene-Solr-Tests-8.x/solr/core/src/test-files/solr/collection1, trusted=true
   [junit4]   2> 720424 INFO  (coreLoadExecutor-2907-thread-1) [    x:collection1] o.a.s.m.r.SolrJmxReporter JMX monitoring for 'solr.core.collection1' (registry 'solr.core.collection1') enabled at server: com.sun.jmx.mbeanserver.JmxMBeanServer@552894aa
   [junit4]   2> 720424 INFO  (coreLoadExecutor-2907-thread-1) [    x:collection1] o.a.s.c.SolrCore [[collection1] ] Opening new SolrCore at [/x1/jenkins/jenkins-slave/workspace/Lucene-Solr-Tests-8.x/solr/core/src/test-files/solr/collection1], dataDir=[/x1/jenkins/jenkins-slave/workspace/Lucene-Solr-Tests-8.x/solr/build/solr-core/test/J1/temp/solr.update.PeerSyncTest_E6C6372B4882BF4E-001/tempDir-001/shard2/cores/collection1/data/]
   [junit4]   2> 720427 INFO  (coreLoadExecutor-2907-thread-1) [    x:collection1] o.a.s.u.RandomMergePolicy RandomMergePolicy wrapping class org.apache.lucene.index.AlcoholicMergePolicy: [AlcoholicMergePolicy: minMergeSize=0, mergeFactor=10, maxMergeSize=1577310086, maxMergeSizeForForcedMerge=9223372036854775807, calibrateSizeByDeletes=true, maxMergeDocs=2147483647, maxCFSSegmentSizeMB=8.796093022207999E12, noCFSRatio=0.1]
   [junit4]   2> 720429 WARN  (coreLoadExecutor-2907-thread-1) [    x:collection1] o.a.s.c.RequestHandlers INVALID paramSet a in requestHandler {type = requestHandler,name = /dump,class = DumpRequestHandler,attributes = {initParams=a, name=/dump, class=DumpRequestHandler},args = {defaults={a=A,b=B}}}
   [junit4]   2> 720532 INFO  (coreLoadExecutor-2907-thread-1) [    x:collection1] o.a.s.u.UpdateHandler Using UpdateLog implementation: org.apache.solr.update.UpdateLog
   [junit4]   2> 720532 INFO  (coreLoadExecutor-2907-thread-1) [    x:collection1] o.a.s.u.UpdateLog Initializing UpdateLog: dataDir= defaultSyncLevel=FLUSH numRecordsToKeep=100 maxNumLogsToKeep=10 numVersionBuckets=65536
   [junit4]   2> 720534 INFO  (coreLoadExecutor-2907-thread-1) [    x:collection1] o.a.s.u.CommitTracker Hard AutoCommit: disabled
   [junit4]   2> 720534 INFO  (coreLoadExecutor-2907-thread-1) [    x:collection1] o.a.s.u.CommitTracker Soft AutoCommit: disabled
   [junit4]   2> 720536 INFO  (coreLoadExecutor-2907-thread-1) [    x:collection1] o.a.s.u.RandomMergePolicy RandomMergePolicy wrapping class org.apache.lucene.index.LogDocMergePolicy: [LogDocMergePolicy: minMergeSize=1000, mergeFactor=37, maxMergeSize=9223372036854775807, maxMergeSizeForForcedMerge=9223372036854775807, calibrateSizeByDeletes=true, maxMergeDocs=2147483647, maxCFSSegmentSizeMB=8.796093022207999E12, noCFSRatio=0.532989447465783]
   [junit4]   2> 720537 INFO  (coreLoadExecutor-2907-thread-1) [    x:collection1] o.a.s.s.SolrIndexSearcher Opening [Searcher@64c5876[collection1] main]
   [junit4]   2> 720538 WARN  (coreLoadExecutor-2907-thread-1) [    x:collection1] o.a.s.r.ManagedResourceStorage Cannot write to config directory /x1/jenkins/jenkins-slave/workspace/Lucene-Solr-Tests-8.x/solr/core/src/test-files/solr/collection1/conf; switching to use InMemory storage instead.
   [junit4]   2> 720539 INFO  (coreLoadExecutor-2907-thread-1) [    x:collection1] o.a.s.h.ReplicationHandler Commits will be reserved for 10000ms.
   [junit4]   2> 720539 INFO  (coreLoadExecutor-2907-thread-1) [    x:collection1] o.a.s.u.UpdateLog Could not find max version in index or recent updates, using new clock 1632349196954632192
   [junit4]   2> 720543 INFO  (searcherExecutor-2908-thread-1-processing-x:collection1) [    x:collection1] o.a.s.c.SolrCore [collection1] Registered new searcher Searcher@64c5876[collection1] main{ExitableDirectoryReader(UninvertingDirectoryReader())}
   [junit4]   2> 720548 INFO  (TEST-PeerSyncTest.test-seed#[E6C6372B4882BF4E]) [    ] o.a.s.SolrTestCaseJ4 ###Starting test
   [junit4]   2> 720568 INFO  (qtp849937725-12724) [    x:collection1] o.a.s.u.p.LogUpdateProcessorFactory [collection1]  webapp= path=/update params={update.distrib=FROMLEADER&wt=javabin&version=2}{add=[1 (1)]} 0 14
   [junit4]   2> 720578 INFO  (qtp1654706597-12745) [    x:collection1] o.a.s.u.PeerSync PeerSync: core=collection1 url= START replicas=[http://127.0.0.1:43596/collection1] nUpdates=100
   [junit4]   2> 720604 INFO  (qtp849937725-12726) [    x:collection1] o.a.s.s.SolrIndexSearcher Opening [Searcher@2173f86f[collection1] realtime]
   [junit4]   2> 720605 INFO  (qtp849937725-12726) [    x:collection1] o.a.s.u.IndexFingerprint IndexFingerprint millis:14.0 result:{maxVersionSpecified=9223372036854775807, maxVersionEncountered=1, maxInHash=1, versionsHash=-5451962507482445012, numVersions=1, numDocs=1, maxDoc=1}
   [junit4]   2> 720605 INFO  (qtp849937725-12726) [    x:collection1] o.a.s.c.S.Request [collection1]  webapp= path=/get params={distrib=false&qt=/get&getFingerprint=9223372036854775807&wt=javabin&version=2} status=0 QTime=14
   [junit4]   2> 720607 INFO  (qtp1654706597-12745) [    x:collection1] o.a.s.u.IndexFingerprint IndexFingerprint millis:1.0 result:{maxVersionSpecified=9223372036854775807, maxVersionEncountered=0, maxInHash=0, versionsHash=0, numVersions=0, numDocs=0, maxDoc=0}
   [junit4]   2> 720607 INFO  (qtp1654706597-12745) [    x:collection1] o.a.s.u.PeerSync PeerSync: core=collection1 url= DONE.  We have no versions.  sync failed.
   [junit4]   2> 720611 INFO  (qtp849937725-12726) [    x:collection1] o.a.s.u.IndexFingerprint IndexFingerprint millis:1.0 result:{maxVersionSpecified=9223372036854775807, maxVersionEncountered=1, maxInHash=1, versionsHash=-5451962507482445012, numVersions=1, numDocs=1, maxDoc=1}
   [junit4]   2> 720612 INFO  (qtp849937725-12726) [    x:collection1] o.a.s.c.S.Request [collection1]  webapp= path=/get params={distrib=false&qt=/get&fingerprint=true&getVersions=100&wt=javabin&version=2} status=0 QTime=2
   [junit4]   2> 720612 INFO  (qtp1654706597-12745) [    x:collection1] o.a.s.c.S.Request [collection1]  webapp= path=/get params={qt=/get&getVersions=100&sync=http://127.0.0.1:43596/collection1&wt=javabin&version=2} status=0 QTime=35
   [junit4]   2> 720616 INFO  (qtp1654706597-12746) [    x:collection1] o.a.s.u.p.LogUpdateProcessorFactory [collection1]  webapp= path=/update params={update.distrib=FROMLEADER&wt=javabin&version=2}{add=[1 (1)]} 0 2
   [junit4]   2> 720625 INFO  (qtp1654706597-12747) [    x:collection1] o.a.s.u.PeerSync PeerSync: core=collection1 url= START replicas=[http://127.0.0.1:43596/collection1] nUpdates=100
   [junit4]   2> 720627 INFO  (qtp849937725-12727) [    x:collection1] o.a.s.u.IndexFingerprint IndexFingerprint millis:0.0 result:{maxVersionSpecified=9223372036854775807, maxVersionEncountered=1, maxInHash=1, versionsHash=-5451962507482445012, numVersions=1, numDocs=1, maxDoc=1}
   [junit4]   2> 720627 INFO  (qtp849937725-12727) [    x:collection1] o.a.s.c.S.Request [collection1]  webapp= path=/get params={distrib=false&qt=/get&getFingerprint=9223372036854775807&wt=javabin&version=2} status=0 QTime=0
   [junit4]   2> 720638 INFO  (qtp1654706597-12747) [    x:collection1] o.a.s.s.SolrIndexSearcher Opening [Searcher@5525bb0f[collection1] realtime]
   [junit4]   2> 720639 INFO  (qtp1654706597-12747) [    x:collection1] o.a.s.u.IndexFingerprint IndexFingerprint millis:11.0 result:{maxVersionSpecified=9223372036854775807, maxVersionEncountered=1, maxInHash=1, versionsHash=-5451962507482445012, numVersions=1, numDocs=1, maxDoc=1}
   [junit4]   2> 720639 INFO  (qtp1654706597-12747) [    x:collection1] o.a.s.u.PeerSync We are already in sync. No need to do a PeerSync 
   [junit4]   2> 720639 INFO  (qtp1654706597-12747) [    x:collection1] o.a.s.c.S.Request [collection1]  webapp= path=/get params={qt=/get&getVersions=100&sync=http://127.0.0.1:43596/collection1&wt=javabin&version=2} status=0 QTime=13
   [junit4]   2> 720640 INFO  (qtp849937725-12723) [    x:collection1] o.a.s.u.DirectUpdateHandler2 start commit{_version_=1632349197060538368,optimize=false,openSearcher=true,waitSearcher=true,expungeDeletes=false,softCommit=false,prepareCommit=false}
   [junit4]   2> 720640 INFO  (qtp849937725-12723) [    x:collection1] o.a.s.u.SolrIndexWriter Calling setCommitData with IW:org.apache.solr.update.SolrIndexWriter@4c9bfa40 commitCommandVersion:1632349197060538368
   [junit4]   2> 720650 INFO  (qtp849937725-12723) [    x:collection1] o.a.s.s.SolrIndexSearcher Opening [Searcher@6df81ff7[collection1] main]
   [junit4]   2> 720650 INFO  (qtp849937725-12723) [    x:collection1] o.a.s.u.DirectUpdateHandler2 end_commit_flush
   [junit4]   2> 720652 INFO  (searcherExecutor-2880-thread-1-processing-x:collection1) [    x:collection1] o.a.s.c.SolrCore [collection1] Registered new searcher Searcher@6df81ff7[collection1] main{ExitableDirectoryReader(UninvertingDirectoryReader(Uninverting(_0(8.2.0):c1:[diagnostics={os=Linux, java.vendor=Oracle Corporation, java.version=1.8.0_191, java.vm.version=25.191-b12, lucene.version=8.2.0, os.arch=amd64, java.runtime.version=1.8.0_191-b12, source=flush, os.version=4.4.0-137-generic, timestamp=1556729504599}]:[attributes={Lucene50StoredFieldsFormat.mode=BEST_SPEED}])))}
   [junit4]   2> 720653 INFO  (qtp849937725-12723) [    x:collection1] o.a.s.u.p.LogUpdateProcessorFactory [collection1]  webapp= path=/update params={waitSearcher=true&commit=true&softCommit=false&wt=javabin&version=2}{commit=} 0 12
   [junit4]   2> 720662 INFO  (qtp1654706597-12748) [    x:collection1] o.a.s.u.DirectUpdateHandler2 start commit{_version_=1632349197083607040,optimize=false,openSearcher=true,waitSearcher=true,expungeDeletes=false,softCommit=false,prepareCommit=false}
   [junit4]   2> 720662 INFO  (qtp1654706597-12748) [    x:collection1] o.a.s.u.SolrIndexWriter Calling setCommitData with IW:org.apache.solr.update.SolrIndexWriter@43a69161 commitCommandVersion:1632349197083607040
   [junit4]   2> 720673 INFO  (qtp1654706597-12748) [    x:collection1] o.a.s.s.SolrIndexSearcher Opening [Searcher@4e9f1f30[collection1] main]
   [junit4]   2> 720673 INFO  (qtp1654706597-12748) [    x:collection1] o.a.s.u.DirectUpdateHandler2 end_commit_flush
   [junit4]   2> 720676 INFO  (searcherExecutor-2894-thread-1-processing-x:collection1) [    x:collection1] o.a.s.c.SolrCore [collection1] Registered new searcher Searcher@4e9f1f30[collection1] main{ExitableDirectoryReader(UninvertingDirectoryReader(Uninverting(_0(8.2.0):c1:[diagnostics={os=Linux, java.vendor=Oracle Corporation, java.version=1.8.0_191, java.vm.version=25.191-b12, lucene.version=8.2.0, os.arch=amd64, java.runtime.version=1.8.0_191-b12, source=flush, os.version=4.4.0-137-generic, timestamp=1556729504639}]:[attributes={Lucene50StoredFieldsFormat.mode=BEST_SPEED}])))}
   [junit4]   2> 720676 INFO  (qtp1654706597-12748) [    x:collection1] o.a.s.u.p.LogUpdateProcessorFactory [collection1]  webapp= path=/update params={waitSearcher=true&commit=true&softCommit=false&wt=javabin&version=2}{commit=} 0 15
   [junit4]   2> 720678 INFO  (qtp849937725-12724) [    x:collection1] o.a.s.c.S.Request [collection1]  webapp= path=/select params={q=*:*&wt=javabin&version=2} hits=1 status=0 QTime=0
   [junit4]   2> 720679 INFO  (qtp1654706597-12744) [    x:collection1] o.a.s.c.S.Request [collection1]  webapp= path=/select params={q=*:*&wt=javabin&version=2} hits=1 status=0 QTime=0
   [junit4]   2> 720699 INFO  (qtp849937725-12725) [    x:collection1] o.a.s.u.p.LogUpdateProcessorFactory [collection1]  webapp= path=/update params={update.distrib=FROMLEADER&wt=javabin&version=2}{add=[2 (2)]} 0 18
   [junit4]   2> 720700 INFO  (qtp1654706597-12745) [    x:collection1] o.a.s.u.PeerSync PeerSync: core=collection1 url= START replicas=[http://127.0.0.1:43596/collection1] nUpdates=100
   [junit4]   2> 720725 INFO  (qtp849937725-12725) [    x:collection1] o.a.s.s.SolrIndexSearcher Opening [Searcher@368fddf9[collection1] realtime]
   [junit4]   2> 720725 INFO  (qtp849937725-12725) [    x:collection1] o.a.s.u.IndexFingerprint IndexFingerprint millis:24.0 result:{maxVersionSpecified=9223372036854775807, maxVersionEncountered=2, maxInHash=2, versionsHash=-1218814014108643565, numVersions=2, numDocs=2, maxDoc=1}
   [junit4]   2> 720725 INFO  (qtp849937725-12725) [    x:collection1] o.a.s.c.S.Request [collection1]  webapp= path=/get params={distrib=false&qt=/get&getFingerprint=9223372036854775807&wt=javabin&version=2} status=0 QTime=24
   [junit4]   2> 720726 INFO  (qtp1654706597-12745) [    x:collection1] o.a.s.u.IndexFingerprint IndexFingerprint millis:0.0 result:{maxVersionSpecified=9223372036854775807, maxVersionEncountered=1, maxInHash=1, versionsHash=-5451962507482445012, numVersions=1, numDocs=1, maxDoc=1}
   [junit4]   2> 720727 INFO  (qtp849937725-12727) [    x:collection1] o.a.s.u.IndexFingerprint IndexFingerprint millis:0.0 result:{maxVersionSpecified=9223372036854775807, maxVersionEncountered=2, maxInHash=2, versionsHash=-1218814014108643565, numVersions=2, numDocs=2, maxDoc=1}
   [junit4]   2> 720727 INFO  (qtp849937725-12727) [    x:collection1] o.a.s.c.S.Request [collection1]  webapp= path=/get params={distrib=false&qt=/get&fingerprint=true&getVersions=100&wt=javabin&version=2} status=0 QTime=0
   [junit4]   2> 720728 INFO  (qtp1654706597-12745) [    x:collection1] o.a.s.u.PeerSync PeerSync: core=collection1 url=  Received 2 versions from http://127.0.0.1:43596/collection1 fingerprint:{maxVersionSpecified=9223372036854775807, maxVersionEncountered=2, maxInHash=2, versionsHash=-1218814014108643565, numVersions=2, numDocs=2, maxDoc=1}
   [junit4]   2> 720728 INFO  (qtp1654706597-12745) [    x:collection1] o.a.s.u.PeerSync PeerSync: core=collection1 url= Requesting updates from http://127.0.0.1:43596/collection1n=1 versions=2
   [junit4]   2> 720729 INFO  (qtp849937725-12723) [    x:collection1] o.a.s.u.IndexFingerprint IndexFingerprint millis:0.0 result:{maxVersionSpecified=2, maxVersionEncountered=2, maxInHash=2, versionsHash=-1218814014108643565, numVersions=2, numDocs=2, maxDoc=1}
   [junit4]   2> 720729 INFO  (qtp849937725-12723) [    x:collection1] o.a.s.c.S.Request [collection1]  webapp= path=/get params={getUpdates=2&distrib=false&qt=/get&fingerprint=true&onlyIfActive=false&wt=javabin&version=2} status=0 QTime=0
   [junit4]   2> 720736 INFO  (qtp1654706597-12745) [    x:collection1] o.a.s.u.p.LogUpdateProcessorFactory [collection1] {add=[2 (2)]} 0 7
   [junit4]   2> 720759 INFO  (qtp1654706597-12745) [    x:collection1] o.a.s.s.SolrIndexSearcher Opening [Searcher@3d24eb59[collection1] realtime]
   [junit4]   2> 720759 INFO  (qtp1654706597-12745) [    x:collection1] o.a.s.u.IndexFingerprint IndexFingerprint millis:22.0 result:{maxVersionSpecified=2, maxVersionEncountered=2, maxInHash=2, versionsHash=-1218814014108643565, numVersions=2, numDocs=2, maxDoc=1}
   [junit4]   2> 720759 INFO  (qtp1654706597-12745) [    x:collection1] o.a.s.u.PeerSync Fingerprint comparison: 0
   [junit4]   2> 720759 INFO  (qtp1654706597-12745) [    x:collection1] o.a.s.u.PeerSync PeerSync: core=collection1 url= DONE. sync succeeded
   [junit4]   2> 720759 INFO  (qtp1654706597-12745) [    x:collection1] o.a.s.c.S.Request [collection1]  webapp= path=/get params={qt=/get&getVersions=100&sync=http://127.0.0.1:43596/collection1&wt=javabin&version=2} status=0 QTime=59
   [junit4]   2> 720760 INFO  (qtp849937725-12724) [    x:collection1] o.a.s.u.DirectUpdateHandler2 start commit{_version_=1632349197186367488,optimize=false,openSearcher=true,waitSearcher=true,expungeDeletes=false,softCommit=false,prepareCommit=false}
   [junit4]   2> 720761 INFO  (qtp849937725-12724) [    x:collection1] o.a.s.u.SolrIndexWriter Calling setCommitData with IW:org.apache.solr.update.SolrIndexWriter@4c9bfa40 commitCommandVersion:1632349197186367488
   [junit4]   2> 720762 INFO  (qtp849937725-12724) [    x:collection1] o.a.s.s.SolrIndexSearcher Opening [Searcher@61028bb1[collection1] main]
   [junit4]   2> 720762 INFO  (qtp849937725-12724) [    x:collection1] o.a.s.u.DirectUpdateHandler2 end_commit_flush
   [junit4]   2> 720765 INFO  (searcherExecutor-2880-thread-1-processing-x:collection1) [    x:collection1] o.a.s.c.SolrCore [collection1] Registered new searcher Searcher@61028bb1[collection1] main{ExitableDirectoryReader(UninvertingDirectoryReader(Uninverting(_0(8.2.0):c1:[diagnostics={os=Linux, java.vendor=Oracle Corporation, java.version=1.8.0_191, java.vm.version=25.191-b12, lucene.version=8.2.0, os.arch=amd64, java.runtime.version=1.8.0_191-b12, source=flush, os.version=4.4.0-137-generic, timestamp=1556729504599}]:[attributes={Lucene50StoredFieldsFormat.mode=BEST_SPEED}]) Uninverting(_1(8.2.0):c1:[diagnostics={os=Linux, java.vendor=Oracle Corporation, java.version=1.8.0_191, java.vm.version=25.191-b12, lucene.version=8.2.0, os.arch=amd64, java.runtime.version=1.8.0_191-b12, source=flush, os.version=4.4.0-137-generic, timestamp=1556729504714}]:[attributes={Lucene50StoredFieldsFormat.mode=BEST_SPEED}])))}
   [junit4]   2> 720765 INFO  (qtp849937725-12724) [    x:collection1] o.a.s.u.p.LogUpdateProcessorFactory [collection1]  webapp= path=/update params={waitSearcher=true&commit=true&softCommit=false&wt=javabin&version=2}{commit=} 0 4
   [junit4]   2> 720766 INFO  (qtp1654706597-12746) [    x:collection1] o.a.s.u.DirectUpdateHandler2 start commit{_version_=1632349197192658944,optimize=false,openSearcher=true,waitSearcher=true,expungeDeletes=false,softCommit=false,prepareCommit=false}
   [junit4]   2> 720769 INFO  (qtp1654706597-12746) [    x:collection1] o.a.s.u.SolrIndexWriter Calling setCommitData with IW:org.apache.solr.update.SolrIndexWriter@43a69161 commitCommandVersion:1632349197192658944
   [junit4]   2> 720770 INFO  (qtp1654706597-12746) [    x:collection1] o.a.s.s.SolrIndexSearcher Opening [Searcher@32181d2a[collection1] main]
   [junit4]   2> 720770 INFO  (qtp1654706597-12746) [    x:collection1] o.a.s.u.DirectUpdateHandler2 end_commit_flush
   [junit4]   2> 720773 INFO  (searcherExecutor-2894-thread-1-processing-x:collection1) [    x:collection1] o.a.s.c.SolrCore [collection1] Registered new searcher Searcher@32181d2a[collection1] main{ExitableDirectoryReader(UninvertingDirectoryReader(Uninverting(_0(8.2.0):c1:[diagnostics={os=Linux, java.vendor=Oracle Corporation, java.version=1.8.0_191, java.vm.version=25.191-b12, lucene.version=8.2.0, os.arch=amd64, java.runtime.version=1.8.0_191-b12, source=flush, os.version=4.4.0-137-generic, timestamp=1556729504639}]:[attributes={Lucene50StoredFieldsFormat.mode=BEST_SPEED}]) Uninverting(_1(8.2.0):c1:[diagnostics={os=Linux, java.vendor=Oracle Corporation, java.version=1.8.0_191, java.vm.version=25.191-b12, lucene.version=8.2.0, os.arch=amd64, java.runtime.version=1.8.0_191-b12, source=flush, os.version=4.4.0-137-generic, timestamp=1556729504748}]:[attributes={Lucene50StoredFieldsFormat.mode=BEST_SPEED}])))}
   [junit4]   2> 720773 INFO  (qtp1654706597-12746) [    x:collection1] o.a.s.u.p.LogUpdateProcessorFactory [collection1]  webapp= path=/update params={waitSearcher=true&commit=true&softCommit=false&wt=javabin&version=2}{commit=} 0 7
   [junit4]   2> 720774 INFO  (qtp849937725-12726) [    x:collection1] o.a.s.c.S.Request [collection1]  webapp= path=/select params={q=*:*&wt=javabin&version=2} hits=2 status=0 QTime=0
   [junit4]   2> 720779 INFO  (qtp1654706597-12747) [    x:collection1] o.a.s.c.S.Request [collection1]  webapp= path=/select params={q=*:*&wt=javabin&version=2} hits=2 status=0 QTime=0
   [junit4]   2> 720784 INFO  (qtp849937725-12725) [    x:collection1] o.a.s.u.p.LogUpdateProcessorFactory [collection1]  webapp= path=/update params={update.distrib=FROMLEADER&wt=javabin&version=2}{add=[3 (3)]} 0 2
   [junit4]   2> 720787 INFO  (qtp849937725-12727) [    x:collection1] o.a.s.u.p.LogUpdateProcessorFactory [collection1]  webapp= path=/update params={update.distrib=FROMLEADER&wt=javabin&version=2}{add=[4 (4)]} 0 1
   [junit4]   2> 720789 INFO  (qtp849937725-12723) [    x:collection1] o.a.s.u.p.LogUpdateProcessorFactory [collection1]  webapp= path=/update params={update.distrib=FROMLEADER&wt=javabin&version=2}{add=[5 (5)]} 0 1
   [junit4]   2> 720791 INFO  (qtp849937725-12724) [    x:collection1] o.a.s.u.p.LogUpdateProcessorFactory [collection1]  webapp= path=/update params={update.distrib=FROMLEADER&wt=javabin&version=2}{add=[6 (6)]} 0 1
   [junit4]   2> 720792 INFO  (qtp849937725-12726) [    x:collection1] o.a.s.u.p.LogUpdateProcessorFactory [collection1]  webapp= path=/update params={update.distrib=FROMLEADER&wt=javabin&version=2}{add=[7 (7)]} 0 0
   [junit4]   2> 720794 INFO  (qtp849937725-12725) [    x:collection1] o.a.s.u.p.LogUpdateProcessorFactory [collection1]  webapp= path=/update params={update.distrib=FROMLEADER&wt=javabin&version=2}{add=[8 (8)]} 0 1
   [junit4]   2> 720796 INFO  (qtp849937725-12727) [    x:collection1] o.a.s.u.p.LogUpdateProcessorFactory [collection1]  webapp= path=/update params={update.distrib=FROMLEADER&wt=javabin&version=2}{add=[9 (9)]} 0 0
   [junit4]   2> 720797 INFO  (qtp849937725-12723) [    x:collection1] o.a.s.u.p.LogUpdateProcessorFactory [collection1]  webapp= path=/update params={update.distrib=FROMLEADER&wt=javabin&version=2}{add=[10 (10)]} 0 1
   [junit4]   2> 720798 INFO  (qtp1654706597-12748) [    x:collection1] o.a.s.u.PeerSync PeerSync: core=collection1 url= START replicas=[http://127.0.0.1:43596/collection1] nUpdates=100
   [junit4]   2> 720810 INFO  (qtp849937725-12724) [    x:collection1] o.a.s.s.SolrIndexSearcher Opening [Searcher@52752b52[collection1] realtime]
   [junit4]   2> 720811 INFO  (qtp849937725-12724) [    x:collection1] o.a.s.u.IndexFingerprint IndexFingerprint millis:11.0 result:{maxVersionSpecified=9223372036854775807, maxVersionEncountered=10, maxInHash=10, versionsHash=-5671163287542876028, numVersions=10, numDocs=10, maxDoc=8}
   [junit4]   2> 720811 INFO  (qtp849937725-12724) [    x:collection1] o.a.s.c.S.Request [collection1]  webapp= path=/get params={distrib=false&qt=/get&getFingerprint=9223372036854775807&wt=javabin&version=2} status=0 QTime=12
   [junit4]   2> 720812 INFO  (qtp1654706597-12748) [    x:collection1] o.a.s.u.IndexFingerprint IndexFingerprint millis:0.0 result:{maxVersionSpecified=9223372036854775807, maxVersionEncountered=2, maxInHash=2, versionsHash=-1218814014108643565, numVersions=2, numDocs=2, maxDoc=1}
   [junit4]   2> 720813 INFO  (qtp849937725-12724) [    x:collection1] o.a.s.u.IndexFingerprint IndexFingerprint millis:0.0 result:{maxVersionSpecified=9223372036854775807, maxVersionEncountered=10, maxInHash=10, versionsHash=-5671163287542876028, numVersions=10, numDocs=10, maxDoc=8}
   [junit4]   2> 720813 INFO  (qtp849937725-12724) [    x:collection1] o.a.s.c.S.Request [collection1]  webapp= path=/get params={distrib=false&qt=/get&fingerprint=true&getVersions=100&wt=javabin&version=2} status=0 QTime=0
   [junit4]   2> 720813 INFO  (qtp1654706597-12748) [    x:collection1] o.a.s.u.PeerSync PeerSync: core=collection1 url=  Received 10 versions from http://127.0.0.1:43596/collection1 fingerprint:{maxVersionSpecified=9223372036854775807, maxVersionEncountered=10, maxInHash=10, versionsHash=-5671163287542876028, numVersions=10, numDocs=10, maxDoc=8}
   [junit4]   2> 720813 INFO  (qtp1654706597-12748) [    x:collection1] o.a.s.u.PeerSync PeerSync: core=collection1 url= Requesting updates from http://127.0.0.1:43596/collection1n=8 versions=10,9,8,7,6,5,4,3
   [junit4]   2> 720814 INFO  (qtp849937725-12724) [    x:collection1] o.a.s.u.IndexFingerprint IndexFingerprint millis:0.0 result:{maxVersionSpecified=10, maxVersionEncountered=10, maxInHash=10, versionsHash=-5671163287542876028, numVersions=10, numDocs=10, maxDoc=8}
   [junit4]   2> 720814 INFO  (qtp849937725-12724) [    x:collection1] o.a.s.c.S.Request [collection1]  webapp= path=/get params={getUpdates=10,9,8,7,6,5,4,3&distrib=false&qt=/get&fingerprint=true&onlyIfActive=false&wt=javabin&version=2} status=0 QTime=0
   [junit4]   2> 720821 INFO  (qtp1654706597-12748) [    x:collection1] o.a.s.u.p.LogUpdateProcessorFactory [collection1] {add=[3 (3), 4 (4), 5 (5), 6 (6), 7 (7), 8 (8), 9 (9), 10 (10)]} 0 6
   [junit4]   2> 720835 INFO  (qtp1654706597-12748) [    x:collection1] o.a.s.s.SolrIndexSearcher Opening [Searcher@668eba0d[collection1] realtime]
   [junit4]   2> 720835 INFO  (qtp1654706597-12748) [    x:collection1] o.a.s.u.IndexFingerprint IndexFingerprint millis:14.0 result:{maxVersionSpecified=10, maxVersionEncountered=10, maxInHash=10, versionsHash=-5671163287542876028, numVersions=10, numDocs=10, maxDoc=8}
   [junit4]   2> 720835 INFO  (qtp1654706597-12748) [    x:collection1] o.a.s.u.PeerSync Fingerprint comparison: 0
   [junit4]   2> 720835 INFO  (qtp1654706597-12748) [    x:collection1] o.a.s.u.PeerSync PeerSync: core=collection1 url= DONE. sync succeeded
   [junit4]   2> 720835 INFO  (qtp1654706597-12748) [    x:collection1] o.a.s.c.S.Request [collection1]  webapp= path=/get params={qt=/get&getVersions=100&sync=http://127.0.0.1:43596/collection1&wt=javabin&version=2} status=0 QTime=37
   [junit4]   2> 720837 INFO  (qtp849937725-12726) [    x:collection1] o.a.s.u.DirectUpdateHandler2 start commit{_version_=1632349197267107840,optimize=false,openSearcher=true,waitSearcher=true,expungeDeletes=false,softCommit=false,prepareCommit=false}
   [junit4]   2> 720837 INFO  (qtp849937725-12726) [    x:collection1] o.a.s.u.SolrIndexWriter Calling

[...truncated too long message...]

.net.SocketInputStream.read(SocketInputStream.java:141)
   [junit4]    > 	at org.apache.http.impl.io.SessionInputBufferImpl.streamRead(SessionInputBufferImpl.java:137)
   [junit4]    > 	at org.apache.http.impl.io.SessionInputBufferImpl.fillBuffer(SessionInputBufferImpl.java:153)
   [junit4]    > 	at org.apache.http.impl.io.SessionInputBufferImpl.readLine(SessionInputBufferImpl.java:282)
   [junit4]    > 	at org.apache.http.impl.conn.DefaultHttpResponseParser.parseHead(DefaultHttpResponseParser.java:138)
   [junit4]    > 	at org.apache.http.impl.conn.DefaultHttpResponseParser.parseHead(DefaultHttpResponseParser.java:56)
   [junit4]    > 	at org.apache.http.impl.io.AbstractMessageParser.parse(AbstractMessageParser.java:259)
   [junit4]    > 	at org.apache.http.impl.DefaultBHttpClientConnection.receiveResponseHeader(DefaultBHttpClientConnection.java:163)
   [junit4]    > 	at org.apache.http.impl.conn.CPoolProxy.receiveResponseHeader(CPoolProxy.java:165)
   [junit4]    > 	at org.apache.http.protocol.HttpRequestExecutor.doReceiveResponse(HttpRequestExecutor.java:273)
   [junit4]    > 	at org.apache.http.protocol.HttpRequestExecutor.execute(HttpRequestExecutor.java:125)
   [junit4]    > 	at org.apache.http.impl.execchain.MainClientExec.execute(MainClientExec.java:272)
   [junit4]    > 	at org.apache.http.impl.execchain.ProtocolExec.execute(ProtocolExec.java:185)
   [junit4]    > 	at org.apache.http.impl.execchain.RetryExec.execute(RetryExec.java:89)
   [junit4]    > 	at org.apache.http.impl.execchain.RedirectExec.execute(RedirectExec.java:110)
   [junit4]    > 	at org.apache.http.impl.client.InternalHttpClient.doExecute(InternalHttpClient.java:185)
   [junit4]    > 	at org.apache.http.impl.client.CloseableHttpClient.execute(CloseableHttpClient.java:83)
   [junit4]    > 	at org.apache.http.impl.client.CloseableHttpClient.execute(CloseableHttpClient.java:56)
   [junit4]    > 	at org.apache.solr.client.solrj.impl.HttpSolrClient.executeMethod(HttpSolrClient.java:548)
   [junit4]    > 	... 50 more
   [junit4]   2> 1254657 INFO  (SUITE-PeerSyncWithLeaderTest-seed#[E6C6372B4882BF4E]-worker) [    ] o.a.s.SolrTestCaseJ4 ###deleteCore
   [junit4]   2> 1254657 INFO  (SUITE-PeerSyncWithLeaderTest-seed#[E6C6372B4882BF4E]-worker) [    ] o.a.s.c.CoreContainer Shutting down CoreContainer instance=1166289117
   [junit4]   2> 1254667 INFO  (coreCloseExecutor-6756-thread-1) [    x:collection1] o.a.s.c.SolrCore [collection1]  CLOSING SolrCore org.apache.solr.core.SolrCore@3669035d
   [junit4]   2> 1254668 INFO  (coreCloseExecutor-6756-thread-1) [    x:collection1] o.a.s.m.SolrMetricManager Closing metric reporters for registry=solr.core.collection1, tag=3669035d
   [junit4]   2> 1254668 INFO  (coreCloseExecutor-6756-thread-1) [    x:collection1] o.a.s.m.r.SolrJmxReporter Closing reporter [org.apache.solr.metrics.reporters.SolrJmxReporter@18eefdc1: rootName = null, domain = solr.core.collection1, service url = null, agent id = null] for registry solr.core.collection1 / com.codahale.metrics.MetricRegistry@77baed0b
   [junit4]   2> 1254688 INFO  (SUITE-PeerSyncWithLeaderTest-seed#[E6C6372B4882BF4E]-worker) [    ] o.a.s.m.SolrMetricManager Closing metric reporters for registry=solr.node, tag=null
   [junit4]   2> 1254688 INFO  (SUITE-PeerSyncWithLeaderTest-seed#[E6C6372B4882BF4E]-worker) [    ] o.a.s.m.r.SolrJmxReporter Closing reporter [org.apache.solr.metrics.reporters.SolrJmxReporter@d3317b1: rootName = null, domain = solr.node, service url = null, agent id = null] for registry solr.node / com.codahale.metrics.MetricRegistry@3d8d7f48
   [junit4]   2> 1254690 INFO  (SUITE-PeerSyncWithLeaderTest-seed#[E6C6372B4882BF4E]-worker) [    ] o.a.s.m.SolrMetricManager Closing metric reporters for registry=solr.jvm, tag=null
   [junit4]   2> 1254690 INFO  (SUITE-PeerSyncWithLeaderTest-seed#[E6C6372B4882BF4E]-worker) [    ] o.a.s.m.r.SolrJmxReporter Closing reporter [org.apache.solr.metrics.reporters.SolrJmxReporter@10f6df9f: rootName = null, domain = solr.jvm, service url = null, agent id = null] for registry solr.jvm / com.codahale.metrics.MetricRegistry@2fbd0046
   [junit4]   2> 1254691 INFO  (SUITE-PeerSyncWithLeaderTest-seed#[E6C6372B4882BF4E]-worker) [    ] o.a.s.m.SolrMetricManager Closing metric reporters for registry=solr.jetty, tag=null
   [junit4]   2> 1254691 INFO  (SUITE-PeerSyncWithLeaderTest-seed#[E6C6372B4882BF4E]-worker) [    ] o.a.s.m.r.SolrJmxReporter Closing reporter [org.apache.solr.metrics.reporters.SolrJmxReporter@51e5cd82: rootName = null, domain = solr.jetty, service url = null, agent id = null] for registry solr.jetty / com.codahale.metrics.MetricRegistry@4f6c96cf
   [junit4]   2> NOTE: leaving temporary files on disk at: /x1/jenkins/jenkins-slave/workspace/Lucene-Solr-Tests-8.x/solr/build/solr-core/test/J2/temp/solr.update.PeerSyncWithLeaderTest_E6C6372B4882BF4E-001
   [junit4]   2> NOTE: test params are: codec=Asserting(Lucene80): {title_stringNoNorms=Lucene50(blocksize=128), title_stemmed=PostingsFormat(name=LuceneVarGapDocFreqInterval), multiDefault=Lucene50(blocksize=128), _root_=PostingsFormat(name=LuceneVarGapDocFreqInterval), id=PostingsFormat(name=Direct), text=PostingsFormat(name=LuceneVarGapFixedInterval), title=PostingsFormat(name=LuceneVarGapDocFreqInterval), title_lettertok=PostingsFormat(name=Direct)}, docValues:{range_facet_l_dv=DocValuesFormat(name=Lucene80), n_l1=DocValuesFormat(name=Lucene80), val_i_dvo=DocValuesFormat(name=Direct), intDefault=DocValuesFormat(name=Asserting), n_dt1=DocValuesFormat(name=Asserting), n_td1=DocValuesFormat(name=Asserting), n_d1=DocValuesFormat(name=Lucene80), range_facet_l=DocValuesFormat(name=Lucene80), n_f1=DocValuesFormat(name=Asserting), n_ti1=DocValuesFormat(name=Lucene80), n_tl1=DocValuesFormat(name=Asserting), _version_=DocValuesFormat(name=Asserting), n_tf1=DocValuesFormat(name=Lucene80), n_tdt1=DocValuesFormat(name=Asserting), id_i1=DocValuesFormat(name=Asserting), range_facet_i_dv=DocValuesFormat(name=Lucene80), intDvoDefault=DocValuesFormat(name=Lucene80), timestamp=DocValuesFormat(name=Lucene80)}, maxPointsInLeafNode=1437, maxMBSortInHeap=7.058186939561931, sim=Asserting(org.apache.lucene.search.similarities.AssertingSimilarity@870bd16), locale=lv-LV, timezone=Canada/Central
   [junit4]   2> NOTE: Linux 4.4.0-137-generic amd64/Oracle Corporation 1.8.0_191 (64-bit)/cpus=4,threads=1,free=61098648,total=529530880
   [junit4]   2> NOTE: All tests run in this JVM: [HttpSolrCallGetCoreTest, DistributedTermsComponentTest, AsyncCallRequestStatusResponseTest, TestSolrIndexConfig, TestSQLHandlerNonCloud, HLLSerializationTest, TestLegacyBM25SimilarityFactory, CollectionsAPISolrJTest, TestCharFilters, XmlUpdateRequestHandlerTest, ClassificationUpdateProcessorIntegrationTest, TestLuceneIndexBackCompat, PolyFieldTest, TestLRUCache, TestSolrJ, CurrencyRangeFacetCloudTest, AutoScalingHandlerTest, SolrCloudExampleTest, TestScoreJoinQPNoScore, TestStressLiveNodes, TestSubQueryTransformer, ScheduledTriggerIntegrationTest, DeleteInactiveReplicaTest, RestartWhileUpdatingTest, TestFieldSortValues, LeaderElectionTest, DistributedIntervalFacetingTest, TestPartialUpdateDeduplication, SolrRequestParserTest, AssignBackwardCompatibilityTest, TestFoldingMultitermQuery, CdcrUpdateLogTest, TestJmxIntegration, RegexBoostProcessorTest, TestSystemIdResolver, NestedAtomicUpdateTest, TestStressReorder, TestSlowCompositeReaderWrapper, TestPullReplicaErrorHandling, HdfsSyncSliceTest, ChaosMonkeySafeLeaderTest, PingRequestHandlerTest, ImplicitSnitchTest, SpellCheckCollatorWithCollapseTest, TestMacroExpander, ActionThrottleTest, TestLegacyNumericUtils, TestDirectoryFactory, CloudMLTQParserTest, BinaryUpdateRequestHandlerTest, TestCustomDocTransformer, SaslZkACLProviderTest, RAMDirectoryFactoryTest, AutoscalingHistoryHandlerTest, TriggerSetPropertiesIntegrationTest, TestConfig, TestComponentsName, DistributedMLTComponentTest, BitVectorTest, TestTolerantUpdateProcessorRandomCloud, CollectionsAPIAsyncDistributedZkTest, TestSolrConfigHandler, NodeAddedTriggerTest, UpdateLogTest, PKIAuthenticationIntegrationTest, SolrTestCaseJ4Test, TermVectorComponentTest, TestZkAclsWithHadoopAuth, PeerSyncWithBufferUpdatesTest, TestElisionMultitermQuery, TestPerFieldSimilarityWithDefaultOverride, PrimUtilsTest, TestNestedUpdateProcessor, TestFunctionQuery, TestXmlQParser, ForceLeaderTest, TestNumericRangeQuery32, TestPKIAuthenticationPlugin, MetricsHistoryHandlerTest, EmbeddedSolrNoSerializeTest, TriggerCooldownIntegrationTest, TemplateUpdateProcessorTest, TestConfigSetProperties, CleanupOldIndexTest, TestFieldCache, BadIndexSchemaTest, RecoveryZkTest, UUIDFieldTest, TestConfigsApi, SyncSliceTest, SearchRateTriggerTest, TestCollapseQParserPlugin, TestStandardQParsers, ClusterStateUpdateTest, HdfsDirectoryFactoryTest, DistributedQueueTest, CdcrRequestHandlerTest, MetricUtilsTest, TestManagedSchemaAPI, GraphQueryTest, TestCloudConsistency, CustomCollectionTest, OverseerTest, TaggerTest, DistribCursorPagingTest, TestTrackingShardHandlerFactory, TestDynamicFieldResource, MergeStrategyTest, DocValuesTest, ZkShardTermsTest, TestExactStatsCache, MissingSegmentRecoveryTest, TestReversedWildcardFilterFactory, TestReqParamsAPI, AuditLoggerPluginTest, HealthCheckHandlerTest, FastVectorHighlighterTest, FieldAnalysisRequestHandlerTest, SolrShardReporterTest, TestLogWatcher, TestRangeQuery, PeerSyncWithLeaderTest]
   [junit4] Completed [403/855 (2!)] on J2 in 140.50s, 1 test, 1 failure <<< FAILURES!

[...truncated 10590 lines...]
BUILD FAILED
/x1/jenkins/jenkins-slave/workspace/Lucene-Solr-Tests-8.x/build.xml:634: The following error occurred while executing this line:
/x1/jenkins/jenkins-slave/workspace/Lucene-Solr-Tests-8.x/build.xml:128: Found 1 violations in source files (File uses Mockito but has no assumeWorkingMockito() call).

Total time: 97 minutes 58 seconds
Build step 'Invoke Ant' marked build as failure
Archiving artifacts
Recording test results
Email was triggered for: Failure - Any
Sending email for trigger: Failure - Any

Mime
View raw message