lucene-dev mailing list archives

Site index · List index
Message view « Date » · « Thread »
Top « Date » · « Thread »
From Policeman Jenkins Server <jenk...@thetaphi.de>
Subject [JENKINS] Lucene-Solr-8.x-Windows (64bit/jdk-12) - Build # 234 - Failure!
Date Wed, 01 May 2019 00:25:53 GMT
Build: https://jenkins.thetaphi.de/job/Lucene-Solr-8.x-Windows/234/
Java: 64bit/jdk-12 -XX:+UseCompressedOops -XX:+UseConcMarkSweepGC

1 tests failed.
FAILED:  org.apache.solr.update.PeerSyncTest.test

Error Message:
Unexpected exception type, expected SolrException but got org.apache.solr.client.solrj.SolrServerException: Timeout occurred while waiting response from server at: http://127.0.0.1:61537/collection1

Stack Trace:
junit.framework.AssertionFailedError: Unexpected exception type, expected SolrException but got org.apache.solr.client.solrj.SolrServerException: Timeout occurred while waiting response from server at: http://127.0.0.1:61537/collection1
	at __randomizedtesting.SeedInfo.seed([3C5227AC57A2E9B6:B4061876F95E844E]:0)
	at org.apache.lucene.util.LuceneTestCase.expectThrows(LuceneTestCase.java:2700)
	at org.apache.lucene.util.LuceneTestCase.expectThrows(LuceneTestCase.java:2689)
	at org.apache.solr.update.PeerSyncTest.test(PeerSyncTest.java:279)
	at java.base/jdk.internal.reflect.NativeMethodAccessorImpl.invoke0(Native Method)
	at java.base/jdk.internal.reflect.NativeMethodAccessorImpl.invoke(NativeMethodAccessorImpl.java:62)
	at java.base/jdk.internal.reflect.DelegatingMethodAccessorImpl.invoke(DelegatingMethodAccessorImpl.java:43)
	at java.base/java.lang.reflect.Method.invoke(Method.java:567)
	at com.carrotsearch.randomizedtesting.RandomizedRunner.invoke(RandomizedRunner.java:1750)
	at com.carrotsearch.randomizedtesting.RandomizedRunner$8.evaluate(RandomizedRunner.java:938)
	at com.carrotsearch.randomizedtesting.RandomizedRunner$9.evaluate(RandomizedRunner.java:974)
	at com.carrotsearch.randomizedtesting.RandomizedRunner$10.evaluate(RandomizedRunner.java:988)
	at org.apache.solr.BaseDistributedSearchTestCase$ShardsRepeatRule$ShardsFixedStatement.callStatement(BaseDistributedSearchTestCase.java:1082)
	at org.apache.solr.BaseDistributedSearchTestCase$ShardsRepeatRule$ShardsStatement.evaluate(BaseDistributedSearchTestCase.java:1054)
	at com.carrotsearch.randomizedtesting.rules.SystemPropertiesRestoreRule$1.evaluate(SystemPropertiesRestoreRule.java:57)
	at org.apache.lucene.util.TestRuleSetupTeardownChained$1.evaluate(TestRuleSetupTeardownChained.java:49)
	at org.apache.lucene.util.AbstractBeforeAfterRule$1.evaluate(AbstractBeforeAfterRule.java:45)
	at org.apache.lucene.util.TestRuleThreadAndTestName$1.evaluate(TestRuleThreadAndTestName.java:48)
	at org.apache.lucene.util.TestRuleIgnoreAfterMaxFailures$1.evaluate(TestRuleIgnoreAfterMaxFailures.java:64)
	at org.apache.lucene.util.TestRuleMarkFailure$1.evaluate(TestRuleMarkFailure.java:47)
	at com.carrotsearch.randomizedtesting.rules.StatementAdapter.evaluate(StatementAdapter.java:36)
	at com.carrotsearch.randomizedtesting.ThreadLeakControl$StatementRunner.run(ThreadLeakControl.java:368)
	at com.carrotsearch.randomizedtesting.ThreadLeakControl.forkTimeoutingTask(ThreadLeakControl.java:817)
	at com.carrotsearch.randomizedtesting.ThreadLeakControl$3.evaluate(ThreadLeakControl.java:468)
	at com.carrotsearch.randomizedtesting.RandomizedRunner.runSingleTest(RandomizedRunner.java:947)
	at com.carrotsearch.randomizedtesting.RandomizedRunner$5.evaluate(RandomizedRunner.java:832)
	at com.carrotsearch.randomizedtesting.RandomizedRunner$6.evaluate(RandomizedRunner.java:883)
	at com.carrotsearch.randomizedtesting.RandomizedRunner$7.evaluate(RandomizedRunner.java:894)
	at com.carrotsearch.randomizedtesting.rules.StatementAdapter.evaluate(StatementAdapter.java:36)
	at com.carrotsearch.randomizedtesting.rules.SystemPropertiesRestoreRule$1.evaluate(SystemPropertiesRestoreRule.java:57)
	at org.apache.lucene.util.AbstractBeforeAfterRule$1.evaluate(AbstractBeforeAfterRule.java:45)
	at com.carrotsearch.randomizedtesting.rules.StatementAdapter.evaluate(StatementAdapter.java:36)
	at org.apache.lucene.util.TestRuleStoreClassName$1.evaluate(TestRuleStoreClassName.java:41)
	at com.carrotsearch.randomizedtesting.rules.NoShadowingOrOverridesOnMethodsRule$1.evaluate(NoShadowingOrOverridesOnMethodsRule.java:40)
	at com.carrotsearch.randomizedtesting.rules.NoShadowingOrOverridesOnMethodsRule$1.evaluate(NoShadowingOrOverridesOnMethodsRule.java:40)
	at com.carrotsearch.randomizedtesting.rules.StatementAdapter.evaluate(StatementAdapter.java:36)
	at com.carrotsearch.randomizedtesting.rules.StatementAdapter.evaluate(StatementAdapter.java:36)
	at org.apache.lucene.util.TestRuleAssertionsRequired$1.evaluate(TestRuleAssertionsRequired.java:53)
	at org.apache.lucene.util.TestRuleMarkFailure$1.evaluate(TestRuleMarkFailure.java:47)
	at org.apache.lucene.util.TestRuleIgnoreAfterMaxFailures$1.evaluate(TestRuleIgnoreAfterMaxFailures.java:64)
	at org.apache.lucene.util.TestRuleIgnoreTestSuites$1.evaluate(TestRuleIgnoreTestSuites.java:54)
	at com.carrotsearch.randomizedtesting.rules.StatementAdapter.evaluate(StatementAdapter.java:36)
	at com.carrotsearch.randomizedtesting.ThreadLeakControl$StatementRunner.run(ThreadLeakControl.java:368)
	at java.base/java.lang.Thread.run(Thread.java:835)
Caused by: org.apache.solr.client.solrj.SolrServerException: Timeout occurred while waiting response from server at: http://127.0.0.1:61537/collection1
	at org.apache.solr.client.solrj.impl.HttpSolrClient.executeMethod(HttpSolrClient.java:660)
	at org.apache.solr.client.solrj.impl.HttpSolrClient.request(HttpSolrClient.java:255)
	at org.apache.solr.client.solrj.impl.HttpSolrClient.request(HttpSolrClient.java:244)
	at org.apache.solr.client.solrj.SolrRequest.process(SolrRequest.java:207)
	at org.apache.solr.client.solrj.SolrRequest.process(SolrRequest.java:224)
	at org.apache.solr.BaseDistributedSearchTestCase.add(BaseDistributedSearchTestCase.java:576)
	at org.apache.solr.update.PeerSyncTest.lambda$test$0(PeerSyncTest.java:281)
	at org.apache.lucene.util.LuceneTestCase.expectThrows(LuceneTestCase.java:2695)
	... 42 more
Caused by: java.net.SocketTimeoutException: Read timed out
	at java.base/java.net.SocketInputStream.socketRead0(Native Method)
	at java.base/java.net.SocketInputStream.socketRead(SocketInputStream.java:115)
	at java.base/java.net.SocketInputStream.read(SocketInputStream.java:168)
	at java.base/java.net.SocketInputStream.read(SocketInputStream.java:140)
	at org.apache.http.impl.io.SessionInputBufferImpl.streamRead(SessionInputBufferImpl.java:137)
	at org.apache.http.impl.io.SessionInputBufferImpl.fillBuffer(SessionInputBufferImpl.java:153)
	at org.apache.http.impl.io.SessionInputBufferImpl.readLine(SessionInputBufferImpl.java:282)
	at org.apache.http.impl.conn.DefaultHttpResponseParser.parseHead(DefaultHttpResponseParser.java:138)
	at org.apache.http.impl.conn.DefaultHttpResponseParser.parseHead(DefaultHttpResponseParser.java:56)
	at org.apache.http.impl.io.AbstractMessageParser.parse(AbstractMessageParser.java:259)
	at org.apache.http.impl.DefaultBHttpClientConnection.receiveResponseHeader(DefaultBHttpClientConnection.java:163)
	at org.apache.http.impl.conn.CPoolProxy.receiveResponseHeader(CPoolProxy.java:165)
	at org.apache.http.protocol.HttpRequestExecutor.doReceiveResponse(HttpRequestExecutor.java:273)
	at org.apache.http.protocol.HttpRequestExecutor.execute(HttpRequestExecutor.java:125)
	at org.apache.http.impl.execchain.MainClientExec.execute(MainClientExec.java:272)
	at org.apache.http.impl.execchain.ProtocolExec.execute(ProtocolExec.java:185)
	at org.apache.http.impl.execchain.RetryExec.execute(RetryExec.java:89)
	at org.apache.http.impl.execchain.RedirectExec.execute(RedirectExec.java:110)
	at org.apache.http.impl.client.InternalHttpClient.doExecute(InternalHttpClient.java:185)
	at org.apache.http.impl.client.CloseableHttpClient.execute(CloseableHttpClient.java:83)
	at org.apache.http.impl.client.CloseableHttpClient.execute(CloseableHttpClient.java:56)
	at org.apache.solr.client.solrj.impl.HttpSolrClient.executeMethod(HttpSolrClient.java:548)
	... 49 more




Build Log:
[...truncated 2104 lines...]
   [junit4] JVM J0: stderr was not empty, see: C:\Users\jenkins\workspace\Lucene-Solr-8.x-Windows\lucene\build\core\test\temp\junit4-J0-20190430_223042_9357423210818332950626.syserr
   [junit4] >>> JVM J0 emitted unexpected output (verbatim) ----
   [junit4] OpenJDK 64-Bit Server VM warning: Option UseConcMarkSweepGC was deprecated in version 9.0 and will likely be removed in a future release.
   [junit4] <<< JVM J0: EOF ----

[...truncated 3 lines...]
   [junit4] JVM J1: stderr was not empty, see: C:\Users\jenkins\workspace\Lucene-Solr-8.x-Windows\lucene\build\core\test\temp\junit4-J1-20190430_223042_9351378429580346680224.syserr
   [junit4] >>> JVM J1 emitted unexpected output (verbatim) ----
   [junit4] OpenJDK 64-Bit Server VM warning: Option UseConcMarkSweepGC was deprecated in version 9.0 and will likely be removed in a future release.
   [junit4] <<< JVM J1: EOF ----

[...truncated 319 lines...]
   [junit4] JVM J0: stderr was not empty, see: C:\Users\jenkins\workspace\Lucene-Solr-8.x-Windows\lucene\build\test-framework\test\temp\junit4-J0-20190430_224247_09017314226346262970708.syserr
   [junit4] >>> JVM J0 emitted unexpected output (verbatim) ----
   [junit4] OpenJDK 64-Bit Server VM warning: Option UseConcMarkSweepGC was deprecated in version 9.0 and will likely be removed in a future release.
   [junit4] <<< JVM J0: EOF ----

[...truncated 3 lines...]
   [junit4] JVM J1: stderr was not empty, see: C:\Users\jenkins\workspace\Lucene-Solr-8.x-Windows\lucene\build\test-framework\test\temp\junit4-J1-20190430_224247_09012108620572787447429.syserr
   [junit4] >>> JVM J1 emitted unexpected output (verbatim) ----
   [junit4] OpenJDK 64-Bit Server VM warning: Option UseConcMarkSweepGC was deprecated in version 9.0 and will likely be removed in a future release.
   [junit4] <<< JVM J1: EOF ----

[...truncated 1084 lines...]
   [junit4] JVM J0: stderr was not empty, see: C:\Users\jenkins\workspace\Lucene-Solr-8.x-Windows\lucene\build\analysis\common\test\temp\junit4-J0-20190430_224512_08315512313596084922276.syserr
   [junit4] >>> JVM J0 emitted unexpected output (verbatim) ----
   [junit4] OpenJDK 64-Bit Server VM warning: Option UseConcMarkSweepGC was deprecated in version 9.0 and will likely be removed in a future release.
   [junit4] <<< JVM J0: EOF ----

   [junit4] JVM J1: stderr was not empty, see: C:\Users\jenkins\workspace\Lucene-Solr-8.x-Windows\lucene\build\analysis\common\test\temp\junit4-J1-20190430_224512_0838786891729946898903.syserr
   [junit4] >>> JVM J1 emitted unexpected output (verbatim) ----
   [junit4] OpenJDK 64-Bit Server VM warning: Option UseConcMarkSweepGC was deprecated in version 9.0 and will likely be removed in a future release.
   [junit4] <<< JVM J1: EOF ----

[...truncated 257 lines...]
   [junit4] JVM J0: stderr was not empty, see: C:\Users\jenkins\workspace\Lucene-Solr-8.x-Windows\lucene\build\analysis\icu\test\temp\junit4-J0-20190430_224818_3709406891965001775153.syserr
   [junit4] >>> JVM J0 emitted unexpected output (verbatim) ----
   [junit4] OpenJDK 64-Bit Server VM warning: Option UseConcMarkSweepGC was deprecated in version 9.0 and will likely be removed in a future release.
   [junit4] <<< JVM J0: EOF ----

[...truncated 3 lines...]
   [junit4] JVM J1: stderr was not empty, see: C:\Users\jenkins\workspace\Lucene-Solr-8.x-Windows\lucene\build\analysis\icu\test\temp\junit4-J1-20190430_224818_37093299975473006257.syserr
   [junit4] >>> JVM J1 emitted unexpected output (verbatim) ----
   [junit4] OpenJDK 64-Bit Server VM warning: Option UseConcMarkSweepGC was deprecated in version 9.0 and will likely be removed in a future release.
   [junit4] <<< JVM J1: EOF ----

[...truncated 239 lines...]
   [junit4] JVM J1: stderr was not empty, see: C:\Users\jenkins\workspace\Lucene-Solr-8.x-Windows\lucene\build\analysis\kuromoji\test\temp\junit4-J1-20190430_224843_3267707123537665138082.syserr
   [junit4] >>> JVM J1 emitted unexpected output (verbatim) ----
   [junit4] OpenJDK 64-Bit Server VM warning: Option UseConcMarkSweepGC was deprecated in version 9.0 and will likely be removed in a future release.
   [junit4] <<< JVM J1: EOF ----

[...truncated 18 lines...]
   [junit4] JVM J0: stderr was not empty, see: C:\Users\jenkins\workspace\Lucene-Solr-8.x-Windows\lucene\build\analysis\kuromoji\test\temp\junit4-J0-20190430_224843_3251911823509168734616.syserr
   [junit4] >>> JVM J0 emitted unexpected output (verbatim) ----
   [junit4] OpenJDK 64-Bit Server VM warning: Option UseConcMarkSweepGC was deprecated in version 9.0 and will likely be removed in a future release.
   [junit4] <<< JVM J0: EOF ----

[...truncated 163 lines...]
   [junit4] JVM J0: stderr was not empty, see: C:\Users\jenkins\workspace\Lucene-Solr-8.x-Windows\lucene\build\analysis\morfologik\test\temp\junit4-J0-20190430_224927_4042543438831501033702.syserr
   [junit4] >>> JVM J0 emitted unexpected output (verbatim) ----
   [junit4] OpenJDK 64-Bit Server VM warning: Option UseConcMarkSweepGC was deprecated in version 9.0 and will likely be removed in a future release.
   [junit4] <<< JVM J0: EOF ----

[...truncated 3 lines...]
   [junit4] JVM J1: stderr was not empty, see: C:\Users\jenkins\workspace\Lucene-Solr-8.x-Windows\lucene\build\analysis\morfologik\test\temp\junit4-J1-20190430_224927_4043007225185051791157.syserr
   [junit4] >>> JVM J1 emitted unexpected output (verbatim) ----
   [junit4] OpenJDK 64-Bit Server VM warning: Option UseConcMarkSweepGC was deprecated in version 9.0 and will likely be removed in a future release.
   [junit4] <<< JVM J1: EOF ----

[...truncated 208 lines...]
   [junit4] JVM J1: stderr was not empty, see: C:\Users\jenkins\workspace\Lucene-Solr-8.x-Windows\lucene\build\analysis\nori\test\temp\junit4-J1-20190430_224939_2596702820687750544120.syserr
   [junit4] >>> JVM J1 emitted unexpected output (verbatim) ----
   [junit4] OpenJDK 64-Bit Server VM warning: Option UseConcMarkSweepGC was deprecated in version 9.0 and will likely be removed in a future release.
   [junit4] <<< JVM J1: EOF ----

[...truncated 3 lines...]
   [junit4] JVM J0: stderr was not empty, see: C:\Users\jenkins\workspace\Lucene-Solr-8.x-Windows\lucene\build\analysis\nori\test\temp\junit4-J0-20190430_224939_26016089024923943710810.syserr
   [junit4] >>> JVM J0 emitted unexpected output (verbatim) ----
   [junit4] OpenJDK 64-Bit Server VM warning: Option UseConcMarkSweepGC was deprecated in version 9.0 and will likely be removed in a future release.
   [junit4] <<< JVM J0: EOF ----

[...truncated 169 lines...]
   [junit4] JVM J1: stderr was not empty, see: C:\Users\jenkins\workspace\Lucene-Solr-8.x-Windows\lucene\build\analysis\opennlp\test\temp\junit4-J1-20190430_224956_70116797758743238152062.syserr
   [junit4] >>> JVM J1 emitted unexpected output (verbatim) ----
   [junit4] OpenJDK 64-Bit Server VM warning: Option UseConcMarkSweepGC was deprecated in version 9.0 and will likely be removed in a future release.
   [junit4] <<< JVM J1: EOF ----

[...truncated 3 lines...]
   [junit4] JVM J0: stderr was not empty, see: C:\Users\jenkins\workspace\Lucene-Solr-8.x-Windows\lucene\build\analysis\opennlp\test\temp\junit4-J0-20190430_224956_7011731278812317229196.syserr
   [junit4] >>> JVM J0 emitted unexpected output (verbatim) ----
   [junit4] OpenJDK 64-Bit Server VM warning: Option UseConcMarkSweepGC was deprecated in version 9.0 and will likely be removed in a future release.
   [junit4] <<< JVM J0: EOF ----

[...truncated 180 lines...]
   [junit4] JVM J1: stderr was not empty, see: C:\Users\jenkins\workspace\Lucene-Solr-8.x-Windows\lucene\build\analysis\phonetic\test\temp\junit4-J1-20190430_225005_63911205228825525812089.syserr
   [junit4] >>> JVM J1 emitted unexpected output (verbatim) ----
   [junit4] OpenJDK 64-Bit Server VM warning: Option UseConcMarkSweepGC was deprecated in version 9.0 and will likely be removed in a future release.
   [junit4] <<< JVM J1: EOF ----

   [junit4] JVM J0: stderr was not empty, see: C:\Users\jenkins\workspace\Lucene-Solr-8.x-Windows\lucene\build\analysis\phonetic\test\temp\junit4-J0-20190430_225005_63911502383822895530310.syserr
   [junit4] >>> JVM J0 emitted unexpected output (verbatim) ----
   [junit4] OpenJDK 64-Bit Server VM warning: Option UseConcMarkSweepGC was deprecated in version 9.0 and will likely be removed in a future release.
   [junit4] <<< JVM J0: EOF ----

[...truncated 160 lines...]
   [junit4] JVM J0: stderr was not empty, see: C:\Users\jenkins\workspace\Lucene-Solr-8.x-Windows\lucene\build\analysis\smartcn\test\temp\junit4-J0-20190430_225025_22418027526791448694045.syserr
   [junit4] >>> JVM J0 emitted unexpected output (verbatim) ----
   [junit4] OpenJDK 64-Bit Server VM warning: Option UseConcMarkSweepGC was deprecated in version 9.0 and will likely be removed in a future release.
   [junit4] <<< JVM J0: EOF ----

[...truncated 3 lines...]
   [junit4] JVM J1: stderr was not empty, see: C:\Users\jenkins\workspace\Lucene-Solr-8.x-Windows\lucene\build\analysis\smartcn\test\temp\junit4-J1-20190430_225025_22411790978527663398852.syserr
   [junit4] >>> JVM J1 emitted unexpected output (verbatim) ----
   [junit4] OpenJDK 64-Bit Server VM warning: Option UseConcMarkSweepGC was deprecated in version 9.0 and will likely be removed in a future release.
   [junit4] <<< JVM J1: EOF ----

[...truncated 168 lines...]
   [junit4] JVM J1: stderr was not empty, see: C:\Users\jenkins\workspace\Lucene-Solr-8.x-Windows\lucene\build\analysis\stempel\test\temp\junit4-J1-20190430_225035_7341585419888024374187.syserr
   [junit4] >>> JVM J1 emitted unexpected output (verbatim) ----
   [junit4] OpenJDK 64-Bit Server VM warning: Option UseConcMarkSweepGC was deprecated in version 9.0 and will likely be removed in a future release.
   [junit4] <<< JVM J1: EOF ----

   [junit4] JVM J0: stderr was not empty, see: C:\Users\jenkins\workspace\Lucene-Solr-8.x-Windows\lucene\build\analysis\stempel\test\temp\junit4-J0-20190430_225035_73416261261932166088125.syserr
   [junit4] >>> JVM J0 emitted unexpected output (verbatim) ----
   [junit4] OpenJDK 64-Bit Server VM warning: Option UseConcMarkSweepGC was deprecated in version 9.0 and will likely be removed in a future release.
   [junit4] <<< JVM J0: EOF ----

[...truncated 194 lines...]
   [junit4] JVM J1: stderr was not empty, see: C:\Users\jenkins\workspace\Lucene-Solr-8.x-Windows\lucene\build\backward-codecs\test\temp\junit4-J1-20190430_225042_78218438619326835075853.syserr
   [junit4] >>> JVM J1 emitted unexpected output (verbatim) ----
   [junit4] OpenJDK 64-Bit Server VM warning: Option UseConcMarkSweepGC was deprecated in version 9.0 and will likely be removed in a future release.
   [junit4] <<< JVM J1: EOF ----

[...truncated 9 lines...]
   [junit4] JVM J0: stderr was not empty, see: C:\Users\jenkins\workspace\Lucene-Solr-8.x-Windows\lucene\build\backward-codecs\test\temp\junit4-J0-20190430_225042_7829920396759413428672.syserr
   [junit4] >>> JVM J0 emitted unexpected output (verbatim) ----
   [junit4] OpenJDK 64-Bit Server VM warning: Option UseConcMarkSweepGC was deprecated in version 9.0 and will likely be removed in a future release.
   [junit4] <<< JVM J0: EOF ----

[...truncated 1557 lines...]
   [junit4] JVM J1: stderr was not empty, see: C:\Users\jenkins\workspace\Lucene-Solr-8.x-Windows\lucene\build\benchmark\test\temp\junit4-J1-20190430_225307_37811963775233287782327.syserr
   [junit4] >>> JVM J1 emitted unexpected output (verbatim) ----
   [junit4] OpenJDK 64-Bit Server VM warning: Option UseConcMarkSweepGC was deprecated in version 9.0 and will likely be removed in a future release.
   [junit4] <<< JVM J1: EOF ----

[...truncated 3 lines...]
   [junit4] JVM J0: stderr was not empty, see: C:\Users\jenkins\workspace\Lucene-Solr-8.x-Windows\lucene\build\benchmark\test\temp\junit4-J0-20190430_225307_3788964251237551413035.syserr
   [junit4] >>> JVM J0 emitted unexpected output (verbatim) ----
   [junit4] OpenJDK 64-Bit Server VM warning: Option UseConcMarkSweepGC was deprecated in version 9.0 and will likely be removed in a future release.
   [junit4] <<< JVM J0: EOF ----

[...truncated 255 lines...]
   [junit4] JVM J1: stderr was not empty, see: C:\Users\jenkins\workspace\Lucene-Solr-8.x-Windows\lucene\build\classification\test\temp\junit4-J1-20190430_225328_63310235097129714444060.syserr
   [junit4] >>> JVM J1 emitted unexpected output (verbatim) ----
   [junit4] OpenJDK 64-Bit Server VM warning: Option UseConcMarkSweepGC was deprecated in version 9.0 and will likely be removed in a future release.
   [junit4] <<< JVM J1: EOF ----

   [junit4] JVM J0: stderr was not empty, see: C:\Users\jenkins\workspace\Lucene-Solr-8.x-Windows\lucene\build\classification\test\temp\junit4-J0-20190430_225328_63318155589989191086044.syserr
   [junit4] >>> JVM J0 emitted unexpected output (verbatim) ----
   [junit4] OpenJDK 64-Bit Server VM warning: Option UseConcMarkSweepGC was deprecated in version 9.0 and will likely be removed in a future release.
   [junit4] <<< JVM J0: EOF ----

[...truncated 262 lines...]
   [junit4] JVM J0: stderr was not empty, see: C:\Users\jenkins\workspace\Lucene-Solr-8.x-Windows\lucene\build\codecs\test\temp\junit4-J0-20190430_225353_0793490666009000299295.syserr
   [junit4] >>> JVM J0 emitted unexpected output (verbatim) ----
   [junit4] OpenJDK 64-Bit Server VM warning: Option UseConcMarkSweepGC was deprecated in version 9.0 and will likely be removed in a future release.
   [junit4] <<< JVM J0: EOF ----

[...truncated 3 lines...]
   [junit4] JVM J1: stderr was not empty, see: C:\Users\jenkins\workspace\Lucene-Solr-8.x-Windows\lucene\build\codecs\test\temp\junit4-J1-20190430_225353_08114288965694879904221.syserr
   [junit4] >>> JVM J1 emitted unexpected output (verbatim) ----
   [junit4] OpenJDK 64-Bit Server VM warning: Option UseConcMarkSweepGC was deprecated in version 9.0 and will likely be removed in a future release.
   [junit4] <<< JVM J1: EOF ----

[...truncated 235 lines...]
   [junit4] JVM J0: stderr was not empty, see: C:\Users\jenkins\workspace\Lucene-Solr-8.x-Windows\lucene\build\demo\test\temp\junit4-J0-20190430_225619_03017088608056414037580.syserr
   [junit4] >>> JVM J0 emitted unexpected output (verbatim) ----
   [junit4] OpenJDK 64-Bit Server VM warning: Option UseConcMarkSweepGC was deprecated in version 9.0 and will likely be removed in a future release.
   [junit4] <<< JVM J0: EOF ----

   [junit4] JVM J1: stderr was not empty, see: C:\Users\jenkins\workspace\Lucene-Solr-8.x-Windows\lucene\build\demo\test\temp\junit4-J1-20190430_225619_03017771649790498084270.syserr
   [junit4] >>> JVM J1 emitted unexpected output (verbatim) ----
   [junit4] OpenJDK 64-Bit Server VM warning: Option UseConcMarkSweepGC was deprecated in version 9.0 and will likely be removed in a future release.
   [junit4] <<< JVM J1: EOF ----

[...truncated 174 lines...]
   [junit4] JVM J0: stderr was not empty, see: C:\Users\jenkins\workspace\Lucene-Solr-8.x-Windows\lucene\build\expressions\test\temp\junit4-J0-20190430_225624_833944618558074097928.syserr
   [junit4] >>> JVM J0 emitted unexpected output (verbatim) ----
   [junit4] OpenJDK 64-Bit Server VM warning: Option UseConcMarkSweepGC was deprecated in version 9.0 and will likely be removed in a future release.
   [junit4] <<< JVM J0: EOF ----

[...truncated 3 lines...]
   [junit4] JVM J1: stderr was not empty, see: C:\Users\jenkins\workspace\Lucene-Solr-8.x-Windows\lucene\build\expressions\test\temp\junit4-J1-20190430_225624_8338360271787814528240.syserr
   [junit4] >>> JVM J1 emitted unexpected output (verbatim) ----
   [junit4] OpenJDK 64-Bit Server VM warning: Option UseConcMarkSweepGC was deprecated in version 9.0 and will likely be removed in a future release.
   [junit4] <<< JVM J1: EOF ----

[...truncated 235 lines...]
   [junit4] JVM J1: stderr was not empty, see: C:\Users\jenkins\workspace\Lucene-Solr-8.x-Windows\lucene\build\facet\test\temp\junit4-J1-20190430_225634_90516651696383458824204.syserr
   [junit4] >>> JVM J1 emitted unexpected output (verbatim) ----
   [junit4] OpenJDK 64-Bit Server VM warning: Option UseConcMarkSweepGC was deprecated in version 9.0 and will likely be removed in a future release.
   [junit4] <<< JVM J1: EOF ----

[...truncated 3 lines...]
   [junit4] JVM J0: stderr was not empty, see: C:\Users\jenkins\workspace\Lucene-Solr-8.x-Windows\lucene\build\facet\test\temp\junit4-J0-20190430_225634_90512106686455188982191.syserr
   [junit4] >>> JVM J0 emitted unexpected output (verbatim) ----
   [junit4] OpenJDK 64-Bit Server VM warning: Option UseConcMarkSweepGC was deprecated in version 9.0 and will likely be removed in a future release.
   [junit4] <<< JVM J0: EOF ----

[...truncated 183 lines...]
   [junit4] JVM J0: stderr was not empty, see: C:\Users\jenkins\workspace\Lucene-Solr-8.x-Windows\lucene\build\grouping\test\temp\junit4-J0-20190430_225715_64611435125759432069936.syserr
   [junit4] >>> JVM J0 emitted unexpected output (verbatim) ----
   [junit4] OpenJDK 64-Bit Server VM warning: Option UseConcMarkSweepGC was deprecated in version 9.0 and will likely be removed in a future release.
   [junit4] <<< JVM J0: EOF ----

[...truncated 3 lines...]
   [junit4] JVM J1: stderr was not empty, see: C:\Users\jenkins\workspace\Lucene-Solr-8.x-Windows\lucene\build\grouping\test\temp\junit4-J1-20190430_225715_6466324954908666557857.syserr
   [junit4] >>> JVM J1 emitted unexpected output (verbatim) ----
   [junit4] OpenJDK 64-Bit Server VM warning: Option UseConcMarkSweepGC was deprecated in version 9.0 and will likely be removed in a future release.
   [junit4] <<< JVM J1: EOF ----

[...truncated 259 lines...]
   [junit4] JVM J0: stderr was not empty, see: C:\Users\jenkins\workspace\Lucene-Solr-8.x-Windows\lucene\build\highlighter\test\temp\junit4-J0-20190430_225724_43614593211668430172605.syserr
   [junit4] >>> JVM J0 emitted unexpected output (verbatim) ----
   [junit4] OpenJDK 64-Bit Server VM warning: Option UseConcMarkSweepGC was deprecated in version 9.0 and will likely be removed in a future release.
   [junit4] <<< JVM J0: EOF ----

   [junit4] JVM J1: stderr was not empty, see: C:\Users\jenkins\workspace\Lucene-Solr-8.x-Windows\lucene\build\highlighter\test\temp\junit4-J1-20190430_225724_4366981797614772671941.syserr
   [junit4] >>> JVM J1 emitted unexpected output (verbatim) ----
   [junit4] OpenJDK 64-Bit Server VM warning: Option UseConcMarkSweepGC was deprecated in version 9.0 and will likely be removed in a future release.
   [junit4] <<< JVM J1: EOF ----

[...truncated 167 lines...]
   [junit4] JVM J1: stderr was not empty, see: C:\Users\jenkins\workspace\Lucene-Solr-8.x-Windows\lucene\build\join\test\temp\junit4-J1-20190430_225802_44613387068492756999851.syserr
   [junit4] >>> JVM J1 emitted unexpected output (verbatim) ----
   [junit4] OpenJDK 64-Bit Server VM warning: Option UseConcMarkSweepGC was deprecated in version 9.0 and will likely be removed in a future release.
   [junit4] <<< JVM J1: EOF ----

[...truncated 6 lines...]
   [junit4] JVM J0: stderr was not empty, see: C:\Users\jenkins\workspace\Lucene-Solr-8.x-Windows\lucene\build\join\test\temp\junit4-J0-20190430_225802_44515088694037254923490.syserr
   [junit4] >>> JVM J0 emitted unexpected output (verbatim) ----
   [junit4] OpenJDK 64-Bit Server VM warning: Option UseConcMarkSweepGC was deprecated in version 9.0 and will likely be removed in a future release.
   [junit4] <<< JVM J0: EOF ----

[...truncated 303 lines...]
   [junit4] JVM J1: stderr was not empty, see: C:\Users\jenkins\workspace\Lucene-Solr-8.x-Windows\lucene\build\luke\test\temp\junit4-J1-20190430_225817_4522928431930192243260.syserr
   [junit4] >>> JVM J1 emitted unexpected output (verbatim) ----
   [junit4] OpenJDK 64-Bit Server VM warning: Option UseConcMarkSweepGC was deprecated in version 9.0 and will likely be removed in a future release.
   [junit4] <<< JVM J1: EOF ----

[...truncated 3 lines...]
   [junit4] JVM J0: stderr was not empty, see: C:\Users\jenkins\workspace\Lucene-Solr-8.x-Windows\lucene\build\luke\test\temp\junit4-J0-20190430_225817_45211462439767734203082.syserr
   [junit4] >>> JVM J0 emitted unexpected output (verbatim) ----
   [junit4] OpenJDK 64-Bit Server VM warning: Option UseConcMarkSweepGC was deprecated in version 9.0 and will likely be removed in a future release.
   [junit4] <<< JVM J0: EOF ----

[...truncated 156 lines...]
   [junit4] JVM J0: stderr was not empty, see: C:\Users\jenkins\workspace\Lucene-Solr-8.x-Windows\lucene\build\memory\test\temp\junit4-J0-20190430_225830_9726071787034829265199.syserr
   [junit4] >>> JVM J0 emitted unexpected output (verbatim) ----
   [junit4] OpenJDK 64-Bit Server VM warning: Option UseConcMarkSweepGC was deprecated in version 9.0 and will likely be removed in a future release.
   [junit4] <<< JVM J0: EOF ----

[...truncated 3 lines...]
   [junit4] JVM J1: stderr was not empty, see: C:\Users\jenkins\workspace\Lucene-Solr-8.x-Windows\lucene\build\memory\test\temp\junit4-J1-20190430_225830_9734997339120718966013.syserr
   [junit4] >>> JVM J1 emitted unexpected output (verbatim) ----
   [junit4] OpenJDK 64-Bit Server VM warning: Option UseConcMarkSweepGC was deprecated in version 9.0 and will likely be removed in a future release.
   [junit4] <<< JVM J1: EOF ----

[...truncated 190 lines...]
   [junit4] JVM J1: stderr was not empty, see: C:\Users\jenkins\workspace\Lucene-Solr-8.x-Windows\lucene\build\misc\test\temp\junit4-J1-20190430_225842_9129237137968375660575.syserr
   [junit4] >>> JVM J1 emitted unexpected output (verbatim) ----
   [junit4] OpenJDK 64-Bit Server VM warning: Option UseConcMarkSweepGC was deprecated in version 9.0 and will likely be removed in a future release.
   [junit4] <<< JVM J1: EOF ----

[...truncated 5 lines...]
   [junit4] JVM J0: stderr was not empty, see: C:\Users\jenkins\workspace\Lucene-Solr-8.x-Windows\lucene\build\misc\test\temp\junit4-J0-20190430_225842_8917009377844791223560.syserr
   [junit4] >>> JVM J0 emitted unexpected output (verbatim) ----
   [junit4] OpenJDK 64-Bit Server VM warning: Option UseConcMarkSweepGC was deprecated in version 9.0 and will likely be removed in a future release.
   [junit4] <<< JVM J0: EOF ----

[...truncated 307 lines...]
   [junit4] JVM J0: stderr was not empty, see: C:\Users\jenkins\workspace\Lucene-Solr-8.x-Windows\lucene\build\queries\test\temp\junit4-J0-20190430_225935_2244364193525363838671.syserr
   [junit4] >>> JVM J0 emitted unexpected output (verbatim) ----
   [junit4] OpenJDK 64-Bit Server VM warning: Option UseConcMarkSweepGC was deprecated in version 9.0 and will likely be removed in a future release.
   [junit4] <<< JVM J0: EOF ----

[...truncated 3 lines...]
   [junit4] JVM J1: stderr was not empty, see: C:\Users\jenkins\workspace\Lucene-Solr-8.x-Windows\lucene\build\queries\test\temp\junit4-J1-20190430_225935_2272075739507261364210.syserr
   [junit4] >>> JVM J1 emitted unexpected output (verbatim) ----
   [junit4] OpenJDK 64-Bit Server VM warning: Option UseConcMarkSweepGC was deprecated in version 9.0 and will likely be removed in a future release.
   [junit4] <<< JVM J1: EOF ----

[...truncated 235 lines...]
   [junit4] JVM J1: stderr was not empty, see: C:\Users\jenkins\workspace\Lucene-Solr-8.x-Windows\lucene\build\queryparser\test\temp\junit4-J1-20190430_225955_7635470625207271896839.syserr
   [junit4] >>> JVM J1 emitted unexpected output (verbatim) ----
   [junit4] OpenJDK 64-Bit Server VM warning: Option UseConcMarkSweepGC was deprecated in version 9.0 and will likely be removed in a future release.
   [junit4] <<< JVM J1: EOF ----

   [junit4] JVM J0: stderr was not empty, see: C:\Users\jenkins\workspace\Lucene-Solr-8.x-Windows\lucene\build\queryparser\test\temp\junit4-J0-20190430_225955_76210091689939150395904.syserr
   [junit4] >>> JVM J0 emitted unexpected output (verbatim) ----
   [junit4] OpenJDK 64-Bit Server VM warning: Option UseConcMarkSweepGC was deprecated in version 9.0 and will likely be removed in a future release.
   [junit4] <<< JVM J0: EOF ----

[...truncated 212 lines...]
   [junit4] JVM J1: stderr was not empty, see: C:\Users\jenkins\workspace\Lucene-Solr-8.x-Windows\lucene\build\replicator\test\temp\junit4-J1-20190430_230015_8491984198586562606068.syserr
   [junit4] >>> JVM J1 emitted unexpected output (verbatim) ----
   [junit4] OpenJDK 64-Bit Server VM warning: Option UseConcMarkSweepGC was deprecated in version 9.0 and will likely be removed in a future release.
   [junit4] <<< JVM J1: EOF ----

[...truncated 8 lines...]
   [junit4] JVM J0: stderr was not empty, see: C:\Users\jenkins\workspace\Lucene-Solr-8.x-Windows\lucene\build\replicator\test\temp\junit4-J0-20190430_230015_84913557346958152590945.syserr
   [junit4] >>> JVM J0 emitted unexpected output (verbatim) ----
   [junit4] OpenJDK 64-Bit Server VM warning: Option UseConcMarkSweepGC was deprecated in version 9.0 and will likely be removed in a future release.
   [junit4] <<< JVM J0: EOF ----

[...truncated 251 lines...]
   [junit4] JVM J1: stderr was not empty, see: C:\Users\jenkins\workspace\Lucene-Solr-8.x-Windows\lucene\build\sandbox\test\temp\junit4-J1-20190430_230040_96716992690093822013434.syserr
   [junit4] >>> JVM J1 emitted unexpected output (verbatim) ----
   [junit4] OpenJDK 64-Bit Server VM warning: Option UseConcMarkSweepGC was deprecated in version 9.0 and will likely be removed in a future release.
   [junit4] <<< JVM J1: EOF ----

[...truncated 3 lines...]
   [junit4] JVM J0: stderr was not empty, see: C:\Users\jenkins\workspace\Lucene-Solr-8.x-Windows\lucene\build\sandbox\test\temp\junit4-J0-20190430_230040_9675307711144973692552.syserr
   [junit4] >>> JVM J0 emitted unexpected output (verbatim) ----
   [junit4] OpenJDK 64-Bit Server VM warning: Option UseConcMarkSweepGC was deprecated in version 9.0 and will likely be removed in a future release.
   [junit4] <<< JVM J0: EOF ----

[...truncated 300 lines...]
   [junit4] JVM J1: stderr was not empty, see: C:\Users\jenkins\workspace\Lucene-Solr-8.x-Windows\lucene\build\spatial-extras\test\temp\junit4-J1-20190430_230134_76410500982181077589331.syserr
   [junit4] >>> JVM J1 emitted unexpected output (verbatim) ----
   [junit4] OpenJDK 64-Bit Server VM warning: Option UseConcMarkSweepGC was deprecated in version 9.0 and will likely be removed in a future release.
   [junit4] <<< JVM J1: EOF ----

[...truncated 3 lines...]
   [junit4] JVM J0: stderr was not empty, see: C:\Users\jenkins\workspace\Lucene-Solr-8.x-Windows\lucene\build\spatial-extras\test\temp\junit4-J0-20190430_230134_7641892156956049021064.syserr
   [junit4] >>> JVM J0 emitted unexpected output (verbatim) ----
   [junit4] OpenJDK 64-Bit Server VM warning: Option UseConcMarkSweepGC was deprecated in version 9.0 and will likely be removed in a future release.
   [junit4] <<< JVM J0: EOF ----

[...truncated 193 lines...]
   [junit4] JVM J0: stderr was not empty, see: C:\Users\jenkins\workspace\Lucene-Solr-8.x-Windows\lucene\build\spatial3d\test\temp\junit4-J0-20190430_230215_30416002691057775498458.syserr
   [junit4] >>> JVM J0 emitted unexpected output (verbatim) ----
   [junit4] OpenJDK 64-Bit Server VM warning: Option UseConcMarkSweepGC was deprecated in version 9.0 and will likely be removed in a future release.
   [junit4] <<< JVM J0: EOF ----

[...truncated 5 lines...]
   [junit4] JVM J1: stderr was not empty, see: C:\Users\jenkins\workspace\Lucene-Solr-8.x-Windows\lucene\build\spatial3d\test\temp\junit4-J1-20190430_230215_30417176209760511863421.syserr
   [junit4] >>> JVM J1 emitted unexpected output (verbatim) ----
   [junit4] OpenJDK 64-Bit Server VM warning: Option UseConcMarkSweepGC was deprecated in version 9.0 and will likely be removed in a future release.
   [junit4] <<< JVM J1: EOF ----

[...truncated 152 lines...]
   [junit4] JVM J0: stderr was not empty, see: C:\Users\jenkins\workspace\Lucene-Solr-8.x-Windows\lucene\build\spatial\test\temp\junit4-J0-20190430_230239_997820999078605671609.syserr
   [junit4] >>> JVM J0 emitted unexpected output (verbatim) ----
   [junit4] OpenJDK 64-Bit Server VM warning: Option UseConcMarkSweepGC was deprecated in version 9.0 and will likely be removed in a future release.
   [junit4] <<< JVM J0: EOF ----

[...truncated 256 lines...]
   [junit4] JVM J0: stderr was not empty, see: C:\Users\jenkins\workspace\Lucene-Solr-8.x-Windows\lucene\build\suggest\test\temp\junit4-J0-20190430_230244_33711049609041553638876.syserr
   [junit4] >>> JVM J0 emitted unexpected output (verbatim) ----
   [junit4] OpenJDK 64-Bit Server VM warning: Option UseConcMarkSweepGC was deprecated in version 9.0 and will likely be removed in a future release.
   [junit4] <<< JVM J0: EOF ----

[...truncated 3 lines...]
   [junit4] JVM J1: stderr was not empty, see: C:\Users\jenkins\workspace\Lucene-Solr-8.x-Windows\lucene\build\suggest\test\temp\junit4-J1-20190430_230244_33713958213029821793714.syserr
   [junit4] >>> JVM J1 emitted unexpected output (verbatim) ----
   [junit4] OpenJDK 64-Bit Server VM warning: Option UseConcMarkSweepGC was deprecated in version 9.0 and will likely be removed in a future release.
   [junit4] <<< JVM J1: EOF ----

[...truncated 2910 lines...]
   [junit4] Suite: org.apache.solr.update.PeerSyncTest
   [junit4]   2> Creating dataDir: C:\Users\jenkins\workspace\Lucene-Solr-8.x-Windows\solr\build\solr-core\test\J0\temp\solr.update.PeerSyncTest_3C5227AC57A2E9B6-001\init-core-data-001
   [junit4]   2> 1516229 WARN  (SUITE-PeerSyncTest-seed#[3C5227AC57A2E9B6]-worker) [    ] o.a.s.SolrTestCaseJ4 startTrackingSearchers: numOpens=7 numCloses=7
   [junit4]   2> 1516229 INFO  (SUITE-PeerSyncTest-seed#[3C5227AC57A2E9B6]-worker) [    ] o.a.s.SolrTestCaseJ4 Using PointFields (NUMERIC_POINTS_SYSPROP=true) w/NUMERIC_DOCVALUES_SYSPROP=true
   [junit4]   2> 1516231 INFO  (SUITE-PeerSyncTest-seed#[3C5227AC57A2E9B6]-worker) [    ] o.a.s.SolrTestCaseJ4 Randomized ssl (false) and clientAuth (false) via: @org.apache.solr.SolrTestCaseJ4$SuppressSSL(bugUrl="https://issues.apache.org/jira/browse/SOLR-5776")
   [junit4]   2> 1516231 INFO  (SUITE-PeerSyncTest-seed#[3C5227AC57A2E9B6]-worker) [    ] o.a.s.SolrTestCaseJ4 SecureRandom sanity checks: test.solr.allowed.securerandom=null & java.security.egd=file:/dev/./urandom
   [junit4]   2> 1516232 INFO  (SUITE-PeerSyncTest-seed#[3C5227AC57A2E9B6]-worker) [    ] o.a.s.BaseDistributedSearchTestCase Setting hostContext system property: /
   [junit4]   2> 1516233 INFO  (TEST-PeerSyncTest.test-seed#[3C5227AC57A2E9B6]) [    ] o.a.s.SolrTestCaseJ4 ####initCore
   [junit4]   2> 1516233 INFO  (TEST-PeerSyncTest.test-seed#[3C5227AC57A2E9B6]) [    ] o.a.s.c.SolrResourceLoader [null] Added 2 libs to classloader, from paths: [/C:/Users/jenkins/workspace/Lucene-Solr-8.x-Windows/solr/core/src/test-files/solr/collection1/lib, /C:/Users/jenkins/workspace/Lucene-Solr-8.x-Windows/solr/core/src/test-files/solr/collection1/lib/classes]
   [junit4]   2> 1516262 INFO  (TEST-PeerSyncTest.test-seed#[3C5227AC57A2E9B6]) [    ] o.a.s.c.SolrConfig Using Lucene MatchVersion: 8.1.0
   [junit4]   2> 1516276 INFO  (TEST-PeerSyncTest.test-seed#[3C5227AC57A2E9B6]) [    ] o.a.s.s.IndexSchema [null] Schema name=test
   [junit4]   2> 1516352 INFO  (TEST-PeerSyncTest.test-seed#[3C5227AC57A2E9B6]) [    ] o.a.s.s.IndexSchema Loaded schema test/1.0 with uniqueid field id
   [junit4]   2> 1516470 INFO  (TEST-PeerSyncTest.test-seed#[3C5227AC57A2E9B6]) [    ] o.a.s.h.c.HttpShardHandlerFactory Host whitelist initialized: WhitelistHostChecker [whitelistHosts=null, whitelistHostCheckingEnabled=false]
   [junit4]   2> 1516474 WARN  (TEST-PeerSyncTest.test-seed#[3C5227AC57A2E9B6]) [    ] o.e.j.u.s.S.config No Client EndPointIdentificationAlgorithm configured for SslContextFactory@376aade8[provider=null,keyStore=null,trustStore=null]
   [junit4]   2> 1516478 WARN  (TEST-PeerSyncTest.test-seed#[3C5227AC57A2E9B6]) [    ] o.e.j.u.s.S.config No Client EndPointIdentificationAlgorithm configured for SslContextFactory@576852d9[provider=null,keyStore=null,trustStore=null]
   [junit4]   2> 1516500 INFO  (TEST-PeerSyncTest.test-seed#[3C5227AC57A2E9B6]) [    ] o.a.s.c.TransientSolrCoreCacheDefault Allocating transient cache for 2147483647 transient cores
   [junit4]   2> 1516500 INFO  (TEST-PeerSyncTest.test-seed#[3C5227AC57A2E9B6]) [    ] o.a.s.h.a.MetricsHistoryHandler No .system collection, keeping metrics history in memory.
   [junit4]   2> 1516518 INFO  (TEST-PeerSyncTest.test-seed#[3C5227AC57A2E9B6]) [    ] o.a.s.m.r.SolrJmxReporter JMX monitoring for 'solr.node' (registry 'solr.node') enabled at server: com.sun.jmx.mbeanserver.JmxMBeanServer@4d2f4bba
   [junit4]   2> 1516524 INFO  (TEST-PeerSyncTest.test-seed#[3C5227AC57A2E9B6]) [    ] o.a.s.m.r.SolrJmxReporter JMX monitoring for 'solr.jvm' (registry 'solr.jvm') enabled at server: com.sun.jmx.mbeanserver.JmxMBeanServer@4d2f4bba
   [junit4]   2> 1516525 INFO  (TEST-PeerSyncTest.test-seed#[3C5227AC57A2E9B6]) [    ] o.a.s.m.r.SolrJmxReporter JMX monitoring for 'solr.jetty' (registry 'solr.jetty') enabled at server: com.sun.jmx.mbeanserver.JmxMBeanServer@4d2f4bba
   [junit4]   2> 1516527 INFO  (coreLoadExecutor-8291-thread-1) [    x:collection1] o.a.s.c.SolrResourceLoader [null] Added 2 libs to classloader, from paths: [/C:/Users/jenkins/workspace/Lucene-Solr-8.x-Windows/solr/core/src/test-files/solr/collection1/lib, /C:/Users/jenkins/workspace/Lucene-Solr-8.x-Windows/solr/core/src/test-files/solr/collection1/lib/classes]
   [junit4]   2> 1516561 INFO  (coreLoadExecutor-8291-thread-1) [    x:collection1] o.a.s.c.SolrConfig Using Lucene MatchVersion: 8.1.0
   [junit4]   2> 1516579 INFO  (coreLoadExecutor-8291-thread-1) [    x:collection1] o.a.s.s.IndexSchema [collection1] Schema name=test
   [junit4]   2> 1516680 INFO  (coreLoadExecutor-8291-thread-1) [    x:collection1] o.a.s.s.IndexSchema Loaded schema test/1.0 with uniqueid field id
   [junit4]   2> 1516693 INFO  (coreLoadExecutor-8291-thread-1) [    x:collection1] o.a.s.c.CoreContainer Creating SolrCore 'collection1' using configuration from instancedir C:\Users\jenkins\workspace\Lucene-Solr-8.x-Windows\solr\core\src\test-files\solr\collection1, trusted=true
   [junit4]   2> 1516693 INFO  (coreLoadExecutor-8291-thread-1) [    x:collection1] o.a.s.m.r.SolrJmxReporter JMX monitoring for 'solr.core.collection1' (registry 'solr.core.collection1') enabled at server: com.sun.jmx.mbeanserver.JmxMBeanServer@4d2f4bba
   [junit4]   2> 1516694 INFO  (coreLoadExecutor-8291-thread-1) [    x:collection1] o.a.s.c.SolrCore [[collection1] ] Opening new SolrCore at [C:\Users\jenkins\workspace\Lucene-Solr-8.x-Windows\solr\core\src\test-files\solr\collection1], dataDir=[C:\Users\jenkins\workspace\Lucene-Solr-8.x-Windows\solr\build\solr-core\test\J0\temp\solr.update.PeerSyncTest_3C5227AC57A2E9B6-001\init-core-data-001\]
   [junit4]   2> 1516695 INFO  (coreLoadExecutor-8291-thread-1) [    x:collection1] o.a.s.u.RandomMergePolicy RandomMergePolicy wrapping class org.apache.lucene.index.TieredMergePolicy: [TieredMergePolicy: maxMergeAtOnce=20, maxMergeAtOnceExplicit=30, maxMergedSegmentMB=17.623046875, floorSegmentMB=1.1728515625, forceMergeDeletesPctAllowed=21.130560358368562, segmentsPerTier=18.0, maxCFSSegmentSizeMB=8.796093022207999E12, noCFSRatio=1.0, deletesPctAllowed=47.514513361112954
   [junit4]   2> 1516696 WARN  (coreLoadExecutor-8291-thread-1) [    x:collection1] o.a.s.c.RequestHandlers INVALID paramSet a in requestHandler {type = requestHandler,name = /dump,class = DumpRequestHandler,attributes = {initParams=a, name=/dump, class=DumpRequestHandler},args = {defaults={a=A,b=B}}}
   [junit4]   2> 1516756 INFO  (coreLoadExecutor-8291-thread-1) [    x:collection1] o.a.s.u.UpdateHandler Using UpdateLog implementation: org.apache.solr.update.UpdateLog
   [junit4]   2> 1516756 INFO  (coreLoadExecutor-8291-thread-1) [    x:collection1] o.a.s.u.UpdateLog Initializing UpdateLog: dataDir= defaultSyncLevel=FLUSH numRecordsToKeep=100 maxNumLogsToKeep=10 numVersionBuckets=65536
   [junit4]   2> 1516757 INFO  (coreLoadExecutor-8291-thread-1) [    x:collection1] o.a.s.u.CommitTracker Hard AutoCommit: disabled
   [junit4]   2> 1516757 INFO  (coreLoadExecutor-8291-thread-1) [    x:collection1] o.a.s.u.CommitTracker Soft AutoCommit: disabled
   [junit4]   2> 1516758 INFO  (coreLoadExecutor-8291-thread-1) [    x:collection1] o.a.s.u.RandomMergePolicy RandomMergePolicy wrapping class org.apache.lucene.index.LogByteSizeMergePolicy: [LogByteSizeMergePolicy: minMergeSize=1677721, mergeFactor=22, maxMergeSize=2147483648, maxMergeSizeForForcedMerge=9223372036854775807, calibrateSizeByDeletes=false, maxMergeDocs=2147483647, maxCFSSegmentSizeMB=8.796093022207999E12, noCFSRatio=1.0]
   [junit4]   2> 1516758 INFO  (coreLoadExecutor-8291-thread-1) [    x:collection1] o.a.s.s.SolrIndexSearcher Opening [Searcher@14d9c77c[collection1] main]
   [junit4]   2> 1516758 WARN  (coreLoadExecutor-8291-thread-1) [    x:collection1] o.a.s.r.ManagedResourceStorage Cannot write to config directory C:\Users\jenkins\workspace\Lucene-Solr-8.x-Windows\solr\core\src\test-files\solr\collection1\conf; switching to use InMemory storage instead.
   [junit4]   2> 1516759 INFO  (coreLoadExecutor-8291-thread-1) [    x:collection1] o.a.s.h.ReplicationHandler Commits will be reserved for 10000ms.
   [junit4]   2> 1516759 INFO  (coreLoadExecutor-8291-thread-1) [    x:collection1] o.a.s.u.UpdateLog Could not find max version in index or recent updates, using new clock 1632283677790568448
   [junit4]   2> 1516760 INFO  (searcherExecutor-8292-thread-1-processing-x:collection1) [    x:collection1] o.a.s.c.SolrCore [collection1] Registered new searcher Searcher@14d9c77c[collection1] main{ExitableDirectoryReader(UninvertingDirectoryReader())}
   [junit4]   2> 1516761 INFO  (TEST-PeerSyncTest.test-seed#[3C5227AC57A2E9B6]) [    ] o.a.s.SolrTestCaseJ4 ####initCore end
   [junit4]   2> 1517160 INFO  (TEST-PeerSyncTest.test-seed#[3C5227AC57A2E9B6]) [    ] o.a.s.SolrTestCaseJ4 Writing core.properties file to C:\Users\jenkins\workspace\Lucene-Solr-8.x-Windows\solr\build\solr-core\test\J0\temp\solr.update.PeerSyncTest_3C5227AC57A2E9B6-001\tempDir-001\control\cores\collection1
   [junit4]   2> 1517161 WARN  (TEST-PeerSyncTest.test-seed#[3C5227AC57A2E9B6]) [    ] o.e.j.s.AbstractConnector Ignoring deprecated socket close linger time
   [junit4]   2> 1517161 INFO  (TEST-PeerSyncTest.test-seed#[3C5227AC57A2E9B6]) [    ] o.a.s.c.s.e.JettySolrRunner Start Jetty (original configured port=0)
   [junit4]   2> 1517161 INFO  (TEST-PeerSyncTest.test-seed#[3C5227AC57A2E9B6]) [    ] o.a.s.c.s.e.JettySolrRunner Trying to start Jetty on port 0 try number 1 ...
   [junit4]   2> 1517162 INFO  (TEST-PeerSyncTest.test-seed#[3C5227AC57A2E9B6]) [    ] o.e.j.s.Server jetty-9.4.14.v20181114; built: 2018-11-14T21:20:31.478Z; git: c4550056e785fb5665914545889f21dc136ad9e6; jvm 12+33
   [junit4]   2> 1517162 INFO  (TEST-PeerSyncTest.test-seed#[3C5227AC57A2E9B6]) [    ] o.e.j.s.session DefaultSessionIdManager workerName=node0
   [junit4]   2> 1517162 INFO  (TEST-PeerSyncTest.test-seed#[3C5227AC57A2E9B6]) [    ] o.e.j.s.session No SessionScavenger set, using defaults
   [junit4]   2> 1517162 INFO  (TEST-PeerSyncTest.test-seed#[3C5227AC57A2E9B6]) [    ] o.e.j.s.session node0 Scavenging every 600000ms
   [junit4]   2> 1517163 INFO  (TEST-PeerSyncTest.test-seed#[3C5227AC57A2E9B6]) [    ] o.e.j.s.h.ContextHandler Started o.e.j.s.ServletContextHandler@380b171d{/,null,AVAILABLE}
   [junit4]   2> 1517163 INFO  (TEST-PeerSyncTest.test-seed#[3C5227AC57A2E9B6]) [    ] o.e.j.s.AbstractConnector Started ServerConnector@1d7e1deb{HTTP/1.1,[http/1.1, h2c]}{127.0.0.1:61526}
   [junit4]   2> 1517163 INFO  (TEST-PeerSyncTest.test-seed#[3C5227AC57A2E9B6]) [    ] o.e.j.s.Server Started @1517186ms
   [junit4]   2> 1517163 INFO  (TEST-PeerSyncTest.test-seed#[3C5227AC57A2E9B6]) [    ] o.a.s.c.s.e.JettySolrRunner Jetty properties: {schema=schema.xml, hostContext=/, solrconfig=solrconfig-tlog.xml, hostPort=61526, coreRootDirectory=C:\Users\jenkins\workspace\Lucene-Solr-8.x-Windows\solr\build\solr-core\test\J0\temp\solr.update.PeerSyncTest_3C5227AC57A2E9B6-001\tempDir-001\control\cores}
   [junit4]   2> 1517163 ERROR (TEST-PeerSyncTest.test-seed#[3C5227AC57A2E9B6]) [    ] o.a.s.u.StartupLoggingUtils Missing Java Option solr.log.dir. Logging may be missing or incomplete.
   [junit4]   2> 1517163 INFO  (TEST-PeerSyncTest.test-seed#[3C5227AC57A2E9B6]) [    ] o.a.s.s.SolrDispatchFilter Using logger factory org.apache.logging.slf4j.Log4jLoggerFactory
   [junit4]   2> 1517164 INFO  (TEST-PeerSyncTest.test-seed#[3C5227AC57A2E9B6]) [    ] o.a.s.s.SolrDispatchFilter  ___      _       Welcome to Apache Solr? version 8.1.0
   [junit4]   2> 1517164 INFO  (TEST-PeerSyncTest.test-seed#[3C5227AC57A2E9B6]) [    ] o.a.s.s.SolrDispatchFilter / __| ___| |_ _   Starting in standalone mode on port null
   [junit4]   2> 1517164 INFO  (TEST-PeerSyncTest.test-seed#[3C5227AC57A2E9B6]) [    ] o.a.s.s.SolrDispatchFilter \__ \/ _ \ | '_|  Install dir: null
   [junit4]   2> 1517164 INFO  (TEST-PeerSyncTest.test-seed#[3C5227AC57A2E9B6]) [    ] o.a.s.s.SolrDispatchFilter |___/\___/_|_|    Start time: 2019-04-30T23:30:21.003427700Z
   [junit4]   2> 1517164 INFO  (TEST-PeerSyncTest.test-seed#[3C5227AC57A2E9B6]) [    ] o.a.s.c.SolrXmlConfig Loading container configuration from C:\Users\jenkins\workspace\Lucene-Solr-8.x-Windows\solr\build\solr-core\test\J0\temp\solr.update.PeerSyncTest_3C5227AC57A2E9B6-001\tempDir-001\control\solr.xml
   [junit4]   2> 1517168 INFO  (TEST-PeerSyncTest.test-seed#[3C5227AC57A2E9B6]) [    ] o.a.s.c.SolrXmlConfig Configuration parameter autoReplicaFailoverWorkLoopDelay is ignored
   [junit4]   2> 1517168 INFO  (TEST-PeerSyncTest.test-seed#[3C5227AC57A2E9B6]) [    ] o.a.s.c.SolrXmlConfig Configuration parameter autoReplicaFailoverBadNodeExpiration is ignored
   [junit4]   2> 1517169 INFO  (TEST-PeerSyncTest.test-seed#[3C5227AC57A2E9B6]) [    ] o.a.s.c.SolrXmlConfig MBean server found: com.sun.jmx.mbeanserver.JmxMBeanServer@4d2f4bba, but no JMX reporters were configured - adding default JMX reporter.
   [junit4]   2> 1517397 INFO  (TEST-PeerSyncTest.test-seed#[3C5227AC57A2E9B6]) [    ] o.a.s.h.c.HttpShardHandlerFactory Host whitelist initialized: WhitelistHostChecker [whitelistHosts=null, whitelistHostCheckingEnabled=false]
   [junit4]   2> 1517399 WARN  (TEST-PeerSyncTest.test-seed#[3C5227AC57A2E9B6]) [    ] o.e.j.u.s.S.config No Client EndPointIdentificationAlgorithm configured for SslContextFactory@54b551f0[provider=null,keyStore=null,trustStore=null]
   [junit4]   2> 1517402 WARN  (TEST-PeerSyncTest.test-seed#[3C5227AC57A2E9B6]) [    ] o.e.j.u.s.S.config No Client EndPointIdentificationAlgorithm configured for SslContextFactory@78ada6d1[provider=null,keyStore=null,trustStore=null]
   [junit4]   2> 1517434 INFO  (TEST-PeerSyncTest.test-seed#[3C5227AC57A2E9B6]) [    ] o.a.s.c.TransientSolrCoreCacheDefault Allocating transient cache for 4 transient cores
   [junit4]   2> 1517434 INFO  (TEST-PeerSyncTest.test-seed#[3C5227AC57A2E9B6]) [    ] o.a.s.h.a.MetricsHistoryHandler No .system collection, keeping metrics history in memory.
   [junit4]   2> 1517470 INFO  (TEST-PeerSyncTest.test-seed#[3C5227AC57A2E9B6]) [    ] o.a.s.m.r.SolrJmxReporter JMX monitoring for 'solr.node' (registry 'solr.node') enabled at server: com.sun.jmx.mbeanserver.JmxMBeanServer@4d2f4bba
   [junit4]   2> 1517481 INFO  (TEST-PeerSyncTest.test-seed#[3C5227AC57A2E9B6]) [    ] o.a.s.m.r.SolrJmxReporter JMX monitoring for 'solr.jvm' (registry 'solr.jvm') enabled at server: com.sun.jmx.mbeanserver.JmxMBeanServer@4d2f4bba
   [junit4]   2> 1517483 INFO  (TEST-PeerSyncTest.test-seed#[3C5227AC57A2E9B6]) [    ] o.a.s.m.r.SolrJmxReporter JMX monitoring for 'solr.jetty' (registry 'solr.jetty') enabled at server: com.sun.jmx.mbeanserver.JmxMBeanServer@4d2f4bba
   [junit4]   2> 1517485 INFO  (TEST-PeerSyncTest.test-seed#[3C5227AC57A2E9B6]) [    ] o.a.s.c.CorePropertiesLocator Found 1 core definitions underneath C:\Users\jenkins\workspace\Lucene-Solr-8.x-Windows\solr\build\solr-core\test\J0\temp\solr.update.PeerSyncTest_3C5227AC57A2E9B6-001\tempDir-001\control\cores
   [junit4]   2> 1517485 INFO  (TEST-PeerSyncTest.test-seed#[3C5227AC57A2E9B6]) [    ] o.a.s.c.CorePropertiesLocator Cores are: [collection1]
   [junit4]   2> 1517487 INFO  (coreLoadExecutor-8305-thread-1) [    x:collection1] o.a.s.c.SolrResourceLoader [null] Added 2 libs to classloader, from paths: [/C:/Users/jenkins/workspace/Lucene-Solr-8.x-Windows/solr/core/src/test-files/solr/collection1/lib, /C:/Users/jenkins/workspace/Lucene-Solr-8.x-Windows/solr/core/src/test-files/solr/collection1/lib/classes]
   [junit4]   2> 1517527 INFO  (coreLoadExecutor-8305-thread-1) [    x:collection1] o.a.s.c.SolrConfig Using Lucene MatchVersion: 8.1.0
   [junit4]   2> 1517552 INFO  (coreLoadExecutor-8305-thread-1) [    x:collection1] o.a.s.s.IndexSchema [collection1] Schema name=test
   [junit4]   2> 1517671 INFO  (coreLoadExecutor-8305-thread-1) [    x:collection1] o.a.s.s.IndexSchema Loaded schema test/1.0 with uniqueid field id
   [junit4]   2> 1517692 INFO  (coreLoadExecutor-8305-thread-1) [    x:collection1] o.a.s.c.CoreContainer Creating SolrCore 'collection1' using configuration from configset C:\Users\jenkins\workspace\Lucene-Solr-8.x-Windows\solr\core\src\test-files\solr\collection1, trusted=true
   [junit4]   2> 1517694 INFO  (coreLoadExecutor-8305-thread-1) [    x:collection1] o.a.s.m.r.SolrJmxReporter JMX monitoring for 'solr.core.collection1' (registry 'solr.core.collection1') enabled at server: com.sun.jmx.mbeanserver.JmxMBeanServer@4d2f4bba
   [junit4]   2> 1517694 INFO  (coreLoadExecutor-8305-thread-1) [    x:collection1] o.a.s.c.SolrCore [[collection1] ] Opening new SolrCore at [C:\Users\jenkins\workspace\Lucene-Solr-8.x-Windows\solr\core\src\test-files\solr\collection1], dataDir=[C:\Users\jenkins\workspace\Lucene-Solr-8.x-Windows\solr\build\solr-core\test\J0\temp\solr.update.PeerSyncTest_3C5227AC57A2E9B6-001\tempDir-001\control\cores\collection1\data\]
   [junit4]   2> 1517695 INFO  (coreLoadExecutor-8305-thread-1) [    x:collection1] o.a.s.u.RandomMergePolicy RandomMergePolicy wrapping class org.apache.lucene.index.TieredMergePolicy: [TieredMergePolicy: maxMergeAtOnce=20, maxMergeAtOnceExplicit=30, maxMergedSegmentMB=17.623046875, floorSegmentMB=1.1728515625, forceMergeDeletesPctAllowed=21.130560358368562, segmentsPerTier=18.0, maxCFSSegmentSizeMB=8.796093022207999E12, noCFSRatio=1.0, deletesPctAllowed=47.514513361112954
   [junit4]   2> 1517696 WARN  (coreLoadExecutor-8305-thread-1) [    x:collection1] o.a.s.c.RequestHandlers INVALID paramSet a in requestHandler {type = requestHandler,name = /dump,class = DumpRequestHandler,attributes = {initParams=a, name=/dump, class=DumpRequestHandler},args = {defaults={a=A,b=B}}}
   [junit4]   2> 1517789 INFO  (coreLoadExecutor-8305-thread-1) [    x:collection1] o.a.s.u.UpdateHandler Using UpdateLog implementation: org.apache.solr.update.UpdateLog
   [junit4]   2> 1517789 INFO  (coreLoadExecutor-8305-thread-1) [    x:collection1] o.a.s.u.UpdateLog Initializing UpdateLog: dataDir= defaultSyncLevel=FLUSH numRecordsToKeep=100 maxNumLogsToKeep=10 numVersionBuckets=65536
   [junit4]   2> 1517792 INFO  (coreLoadExecutor-8305-thread-1) [    x:collection1] o.a.s.u.CommitTracker Hard AutoCommit: disabled
   [junit4]   2> 1517792 INFO  (coreLoadExecutor-8305-thread-1) [    x:collection1] o.a.s.u.CommitTracker Soft AutoCommit: disabled
   [junit4]   2> 1517793 INFO  (coreLoadExecutor-8305-thread-1) [    x:collection1] o.a.s.u.RandomMergePolicy RandomMergePolicy wrapping class org.apache.lucene.index.LogByteSizeMergePolicy: [LogByteSizeMergePolicy: minMergeSize=1677721, mergeFactor=22, maxMergeSize=2147483648, maxMergeSizeForForcedMerge=9223372036854775807, calibrateSizeByDeletes=false, maxMergeDocs=2147483647, maxCFSSegmentSizeMB=8.796093022207999E12, noCFSRatio=1.0]
   [junit4]   2> 1517793 INFO  (coreLoadExecutor-8305-thread-1) [    x:collection1] o.a.s.s.SolrIndexSearcher Opening [Searcher@4ce615d2[collection1] main]
   [junit4]   2> 1517793 WARN  (coreLoadExecutor-8305-thread-1) [    x:collection1] o.a.s.r.ManagedResourceStorage Cannot write to config directory C:\Users\jenkins\workspace\Lucene-Solr-8.x-Windows\solr\core\src\test-files\solr\collection1\conf; switching to use InMemory storage instead.
   [junit4]   2> 1517794 INFO  (coreLoadExecutor-8305-thread-1) [    x:collection1] o.a.s.h.ReplicationHandler Commits will be reserved for 10000ms.
   [junit4]   2> 1517794 INFO  (coreLoadExecutor-8305-thread-1) [    x:collection1] o.a.s.u.UpdateLog Could not find max version in index or recent updates, using new clock 1632283678875844608
   [junit4]   2> 1517797 INFO  (searcherExecutor-8306-thread-1-processing-x:collection1) [    x:collection1] o.a.s.c.SolrCore [collection1] Registered new searcher Searcher@4ce615d2[collection1] main{ExitableDirectoryReader(UninvertingDirectoryReader())}
   [junit4]   2> 1518439 INFO  (TEST-PeerSyncTest.test-seed#[3C5227AC57A2E9B6]) [    ] o.a.s.SolrTestCaseJ4 Writing core.properties file to C:\Users\jenkins\workspace\Lucene-Solr-8.x-Windows\solr\build\solr-core\test\J0\temp\solr.update.PeerSyncTest_3C5227AC57A2E9B6-001\tempDir-001\shard0\cores\collection1
   [junit4]   2> 1518441 WARN  (TEST-PeerSyncTest.test-seed#[3C5227AC57A2E9B6]) [    ] o.e.j.s.AbstractConnector Ignoring deprecated socket close linger time
   [junit4]   2> 1518441 INFO  (TEST-PeerSyncTest.test-seed#[3C5227AC57A2E9B6]) [    ] o.a.s.c.s.e.JettySolrRunner Start Jetty (original configured port=0)
   [junit4]   2> 1518441 INFO  (TEST-PeerSyncTest.test-seed#[3C5227AC57A2E9B6]) [    ] o.a.s.c.s.e.JettySolrRunner Trying to start Jetty on port 0 try number 1 ...
   [junit4]   2> 1518441 INFO  (TEST-PeerSyncTest.test-seed#[3C5227AC57A2E9B6]) [    ] o.e.j.s.Server jetty-9.4.14.v20181114; built: 2018-11-14T21:20:31.478Z; git: c4550056e785fb5665914545889f21dc136ad9e6; jvm 12+33
   [junit4]   2> 1518443 INFO  (TEST-PeerSyncTest.test-seed#[3C5227AC57A2E9B6]) [    ] o.e.j.s.session DefaultSessionIdManager workerName=node0
   [junit4]   2> 1518443 INFO  (TEST-PeerSyncTest.test-seed#[3C5227AC57A2E9B6]) [    ] o.e.j.s.session No SessionScavenger set, using defaults
   [junit4]   2> 1518443 INFO  (TEST-PeerSyncTest.test-seed#[3C5227AC57A2E9B6]) [    ] o.e.j.s.session node0 Scavenging every 660000ms
   [junit4]   2> 1518444 INFO  (TEST-PeerSyncTest.test-seed#[3C5227AC57A2E9B6]) [    ] o.e.j.s.h.ContextHandler Started o.e.j.s.ServletContextHandler@6dacefbc{/,null,AVAILABLE}
   [junit4]   2> 1518445 INFO  (TEST-PeerSyncTest.test-seed#[3C5227AC57A2E9B6]) [    ] o.e.j.s.AbstractConnector Started ServerConnector@242702f8{HTTP/1.1,[http/1.1, h2c]}{127.0.0.1:61537}
   [junit4]   2> 1518445 INFO  (TEST-PeerSyncTest.test-seed#[3C5227AC57A2E9B6]) [    ] o.e.j.s.Server Started @1518468ms
   [junit4]   2> 1518445 INFO  (TEST-PeerSyncTest.test-seed#[3C5227AC57A2E9B6]) [    ] o.a.s.c.s.e.JettySolrRunner Jetty properties: {schema=schema.xml, hostContext=/, solrconfig=solrconfig-tlog.xml, hostPort=61537, coreRootDirectory=C:\Users\jenkins\workspace\Lucene-Solr-8.x-Windows\solr\build\solr-core\test\J0\temp\solr.update.PeerSyncTest_3C5227AC57A2E9B6-001\tempDir-001\shard0\cores}
   [junit4]   2> 1518446 ERROR (TEST-PeerSyncTest.test-seed#[3C5227AC57A2E9B6]) [    ] o.a.s.u.StartupLoggingUtils Missing Java Option solr.log.dir. Logging may be missing or incomplete.
   [junit4]   2> 1518446 INFO  (TEST-PeerSyncTest.test-seed#[3C5227AC57A2E9B6]) [    ] o.a.s.s.SolrDispatchFilter Using logger factory org.apache.logging.slf4j.Log4jLoggerFactory
   [junit4]   2> 1518446 INFO  (TEST-PeerSyncTest.test-seed#[3C5227AC57A2E9B6]) [    ] o.a.s.s.SolrDispatchFilter  ___      _       Welcome to Apache Solr? version 8.1.0
   [junit4]   2> 1518446 INFO  (TEST-PeerSyncTest.test-seed#[3C5227AC57A2E9B6]) [    ] o.a.s.s.SolrDispatchFilter / __| ___| |_ _   Starting in standalone mode on port null
   [junit4]   2> 1518446 INFO  (TEST-PeerSyncTest.test-seed#[3C5227AC57A2E9B6]) [    ] o.a.s.s.SolrDispatchFilter \__ \/ _ \ | '_|  Install dir: null
   [junit4]   2> 1518446 INFO  (TEST-PeerSyncTest.test-seed#[3C5227AC57A2E9B6]) [    ] o.a.s.s.SolrDispatchFilter |___/\___/_|_|    Start time: 2019-04-30T23:30:22.285368900Z
   [junit4]   2> 1518447 INFO  (TEST-PeerSyncTest.test-seed#[3C5227AC57A2E9B6]) [    ] o.a.s.c.SolrXmlConfig Loading container configuration from C:\Users\jenkins\workspace\Lucene-Solr-8.x-Windows\solr\build\solr-core\test\J0\temp\solr.update.PeerSyncTest_3C5227AC57A2E9B6-001\tempDir-001\shard0\solr.xml
   [junit4]   2> 1518451 INFO  (TEST-PeerSyncTest.test-seed#[3C5227AC57A2E9B6]) [    ] o.a.s.c.SolrXmlConfig Configuration parameter autoReplicaFailoverWorkLoopDelay is ignored
   [junit4]   2> 1518451 INFO  (TEST-PeerSyncTest.test-seed#[3C5227AC57A2E9B6]) [    ] o.a.s.c.SolrXmlConfig Configuration parameter autoReplicaFailoverBadNodeExpiration is ignored
   [junit4]   2> 1518455 INFO  (TEST-PeerSyncTest.test-seed#[3C5227AC57A2E9B6]) [    ] o.a.s.c.SolrXmlConfig MBean server found: com.sun.jmx.mbeanserver.JmxMBeanServer@4d2f4bba, but no JMX reporters were configured - adding default JMX reporter.
   [junit4]   2> 1518660 INFO  (TEST-PeerSyncTest.test-seed#[3C5227AC57A2E9B6]) [    ] o.a.s.h.c.HttpShardHandlerFactory Host whitelist initialized: WhitelistHostChecker [whitelistHosts=null, whitelistHostCheckingEnabled=false]
   [junit4]   2> 1518661 WARN  (TEST-PeerSyncTest.test-seed#[3C5227AC57A2E9B6]) [    ] o.e.j.u.s.S.config No Client EndPointIdentificationAlgorithm configured for SslContextFactory@5c691211[provider=null,keyStore=null,trustStore=null]
   [junit4]   2> 1518669 WARN  (TEST-PeerSyncTest.test-seed#[3C5227AC57A2E9B6]) [    ] o.e.j.u.s.S.config No Client EndPointIdentificationAlgorithm configured for SslContextFactory@1e72c42[provider=null,keyStore=null,trustStore=null]
   [junit4]   2> 1518726 INFO  (TEST-PeerSyncTest.test-seed#[3C5227AC57A2E9B6]) [    ] o.a.s.c.TransientSolrCoreCacheDefault Allocating transient cache for 4 transient cores
   [junit4]   2> 1518726 INFO  (TEST-PeerSyncTest.test-seed#[3C5227AC57A2E9B6]) [    ] o.a.s.h.a.MetricsHistoryHandler No .system collection, keeping metrics history in memory.
   [junit4]   2> 1518763 INFO  (TEST-PeerSyncTest.test-seed#[3C5227AC57A2E9B6]) [    ] o.a.s.m.r.SolrJmxReporter JMX monitoring for 'solr.node' (registry 'solr.node') enabled at server: com.sun.jmx.mbeanserver.JmxMBeanServer@4d2f4bba
   [junit4]   2> 1518779 INFO  (TEST-PeerSyncTest.test-seed#[3C5227AC57A2E9B6]) [    ] o.a.s.m.r.SolrJmxReporter JMX monitoring for 'solr.jvm' (registry 'solr.jvm') enabled at server: com.sun.jmx.mbeanserver.JmxMBeanServer@4d2f4bba
   [junit4]   2> 1518779 INFO  (TEST-PeerSyncTest.test-seed#[3C5227AC57A2E9B6]) [    ] o.a.s.m.r.SolrJmxReporter JMX monitoring for 'solr.jetty' (registry 'solr.jetty') enabled at server: com.sun.jmx.mbeanserver.JmxMBeanServer@4d2f4bba
   [junit4]   2> 1518783 INFO  (TEST-PeerSyncTest.test-seed#[3C5227AC57A2E9B6]) [    ] o.a.s.c.CorePropertiesLocator Found 1 core definitions underneath C:\Users\jenkins\workspace\Lucene-Solr-8.x-Windows\solr\build\solr-core\test\J0\temp\solr.update.PeerSyncTest_3C5227AC57A2E9B6-001\tempDir-001\shard0\cores
   [junit4]   2> 1518783 INFO  (TEST-PeerSyncTest.test-seed#[3C5227AC57A2E9B6]) [    ] o.a.s.c.CorePropertiesLocator Cores are: [collection1]
   [junit4]   2> 1518784 INFO  (coreLoadExecutor-8319-thread-1) [    x:collection1] o.a.s.c.SolrResourceLoader [null] Added 2 libs to classloader, from paths: [/C:/Users/jenkins/workspace/Lucene-Solr-8.x-Windows/solr/core/src/test-files/solr/collection1/lib, /C:/Users/jenkins/workspace/Lucene-Solr-8.x-Windows/solr/core/src/test-files/solr/collection1/lib/classes]
   [junit4]   2> 1518821 INFO  (coreLoadExecutor-8319-thread-1) [    x:collection1] o.a.s.c.SolrConfig Using Lucene MatchVersion: 8.1.0
   [junit4]   2> 1518854 INFO  (coreLoadExecutor-8319-thread-1) [    x:collection1] o.a.s.s.IndexSchema [collection1] Schema name=test
   [junit4]   2> 1518972 INFO  (coreLoadExecutor-8319-thread-1) [    x:collection1] o.a.s.s.IndexSchema Loaded schema test/1.0 with uniqueid field id
   [junit4]   2> 1518992 INFO  (coreLoadExecutor-8319-thread-1) [    x:collection1] o.a.s.c.CoreContainer Creating SolrCore 'collection1' using configuration from configset C:\Users\jenkins\workspace\Lucene-Solr-8.x-Windows\solr\core\src\test-files\solr\collection1, trusted=true
   [junit4]   2> 1518992 INFO  (coreLoadExecutor-8319-thread-1) [    x:collection1] o.a.s.m.r.SolrJmxReporter JMX monitoring for 'solr.core.collection1' (registry 'solr.core.collection1') enabled at server: com.sun.jmx.mbeanserver.JmxMBeanServer@4d2f4bba
   [junit4]   2> 1518992 INFO  (coreLoadExecutor-8319-thread-1) [    x:collection1] o.a.s.c.SolrCore [[collection1] ] Opening new SolrCore at [C:\Users\jenkins\workspace\Lucene-Solr-8.x-Windows\solr\core\src\test-files\solr\collection1], dataDir=[C:\Users\jenkins\workspace\Lucene-Solr-8.x-Windows\solr\build\solr-core\test\J0\temp\solr.update.PeerSyncTest_3C5227AC57A2E9B6-001\tempDir-001\shard0\cores\collection1\data\]
   [junit4]   2> 1518992 INFO  (coreLoadExecutor-8319-thread-1) [    x:collection1] o.a.s.u.RandomMergePolicy RandomMergePolicy wrapping class org.apache.lucene.index.TieredMergePolicy: [TieredMergePolicy: maxMergeAtOnce=20, maxMergeAtOnceExplicit=30, maxMergedSegmentMB=17.623046875, floorSegmentMB=1.1728515625, forceMergeDeletesPctAllowed=21.130560358368562, segmentsPerTier=18.0, maxCFSSegmentSizeMB=8.796093022207999E12, noCFSRatio=1.0, deletesPctAllowed=47.514513361112954
   [junit4]   2> 1518995 WARN  (coreLoadExecutor-8319-thread-1) [    x:collection1] o.a.s.c.RequestHandlers INVALID paramSet a in requestHandler {type = requestHandler,name = /dump,class = DumpRequestHandler,attributes = {initParams=a, name=/dump, class=DumpRequestHandler},args = {defaults={a=A,b=B}}}
   [junit4]   2> 1519097 INFO  (coreLoadExecutor-8319-thread-1) [    x:collection1] o.a.s.u.UpdateHandler Using UpdateLog implementation: org.apache.solr.update.UpdateLog
   [junit4]   2> 1519097 INFO  (coreLoadExecutor-8319-thread-1) [    x:collection1] o.a.s.u.UpdateLog Initializing UpdateLog: dataDir= defaultSyncLevel=FLUSH numRecordsToKeep=100 maxNumLogsToKeep=10 numVersionBuckets=65536
   [junit4]   2> 1519100 INFO  (coreLoadExecutor-8319-thread-1) [    x:collection1] o.a.s.u.CommitTracker Hard AutoCommit: disabled
   [junit4]   2> 1519100 INFO  (coreLoadExecutor-8319-thread-1) [    x:collection1] o.a.s.u.CommitTracker Soft AutoCommit: disabled
   [junit4]   2> 1519101 INFO  (coreLoadExecutor-8319-thread-1) [    x:collection1] o.a.s.u.RandomMergePolicy RandomMergePolicy wrapping class org.apache.lucene.index.LogByteSizeMergePolicy: [LogByteSizeMergePolicy: minMergeSize=1677721, mergeFactor=22, maxMergeSize=2147483648, maxMergeSizeForForcedMerge=9223372036854775807, calibrateSizeByDeletes=false, maxMergeDocs=2147483647, maxCFSSegmentSizeMB=8.796093022207999E12, noCFSRatio=1.0]
   [junit4]   2> 1519102 INFO  (coreLoadExecutor-8319-thread-1) [    x:collection1] o.a.s.s.SolrIndexSearcher Opening [Searcher@212a31f1[collection1] main]
   [junit4]   2> 1519102 WARN  (coreLoadExecutor-8319-thread-1) [    x:collection1] o.a.s.r.ManagedResourceStorage Cannot write to config directory C:\Users\jenkins\workspace\Lucene-Solr-8.x-Windows\solr\core\src\test-files\solr\collection1\conf; switching to use InMemory storage instead.
   [junit4]   2> 1519102 INFO  (coreLoadExecutor-8319-thread-1) [    x:collection1] o.a.s.h.ReplicationHandler Commits will be reserved for 10000ms.
   [junit4]   2> 1519103 INFO  (coreLoadExecutor-8319-thread-1) [    x:collection1] o.a.s.u.UpdateLog Could not find max version in index or recent updates, using new clock 1632283680248430592
   [junit4]   2> 1519105 INFO  (searcherExecutor-8320-thread-1-processing-x:collection1) [    x:collection1] o.a.s.c.SolrCore [collection1] Registered new searcher Searcher@212a31f1[collection1] main{ExitableDirectoryReader(UninvertingDirectoryReader())}
   [junit4]   2> 1519811 INFO  (TEST-PeerSyncTest.test-seed#[3C5227AC57A2E9B6]) [    ] o.a.s.SolrTestCaseJ4 Writing core.properties file to C:\Users\jenkins\workspace\Lucene-Solr-8.x-Windows\solr\build\solr-core\test\J0\temp\solr.update.PeerSyncTest_3C5227AC57A2E9B6-001\tempDir-001\shard1\cores\collection1
   [junit4]   2> 1519813 WARN  (TEST-PeerSyncTest.test-seed#[3C5227AC57A2E9B6]) [    ] o.e.j.s.AbstractConnector Ignoring deprecated socket close linger time
   [junit4]   2> 1519813 INFO  (TEST-PeerSyncTest.test-seed#[3C5227AC57A2E9B6]) [    ] o.a.s.c.s.e.JettySolrRunner Start Jetty (original configured port=0)
   [junit4]   2> 1519813 INFO  (TEST-PeerSyncTest.test-seed#[3C5227AC57A2E9B6]) [    ] o.a.s.c.s.e.JettySolrRunner Trying to start Jetty on port 0 try number 1 ...
   [junit4]   2> 1519814 INFO  (TEST-PeerSyncTest.test-seed#[3C5227AC57A2E9B6]) [    ] o.e.j.s.Server jetty-9.4.14.v20181114; built: 2018-11-14T21:20:31.478Z; git: c4550056e785fb5665914545889f21dc136ad9e6; jvm 12+33
   [junit4]   2> 1519814 INFO  (TEST-PeerSyncTest.test-seed#[3C5227AC57A2E9B6]) [    ] o.e.j.s.session DefaultSessionIdManager workerName=node0
   [junit4]   2> 1519814 INFO  (TEST-PeerSyncTest.test-seed#[3C5227AC57A2E9B6]) [    ] o.e.j.s.session No SessionScavenger set, using defaults
   [junit4]   2> 1519814 INFO  (TEST-PeerSyncTest.test-seed#[3C5227AC57A2E9B6]) [    ] o.e.j.s.session node0 Scavenging every 600000ms
   [junit4]   2> 1519815 INFO  (TEST-PeerSyncTest.test-seed#[3C5227AC57A2E9B6]) [    ] o.e.j.s.h.ContextHandler Started o.e.j.s.ServletContextHandler@70a89fee{/,null,AVAILABLE}
   [junit4]   2> 1519816 INFO  (TEST-PeerSyncTest.test-seed#[3C5227AC57A2E9B6]) [    ] o.e.j.s.AbstractConnector Started ServerConnector@7e190804{HTTP/1.1,[http/1.1, h2c]}{127.0.0.1:61550}
   [junit4]   2> 1519816 INFO  (TEST-PeerSyncTest.test-seed#[3C5227AC57A2E9B6]) [    ] o.e.j.s.Server Started @1519839ms
   [junit4]   2> 1519816 INFO  (TEST-PeerSyncTest.test-seed#[3C5227AC57A2E9B6]) [    ] o.a.s.c.s.e.JettySolrRunner Jetty properties: {schema=schema.xml, hostContext=/, solrconfig=solrconfig-tlog.xml, hostPort=61550, coreRootDirectory=C:\Users\jenkins\workspace\Lucene-Solr-8.x-Windows\solr\build\solr-core\test\J0\temp\solr.update.PeerSyncTest_3C5227AC57A2E9B6-001\tempDir-001\shard1\cores}
   [junit4]   2> 1519816 ERROR (TEST-PeerSyncTest.test-seed#[3C5227AC57A2E9B6]) [    ] o.a.s.u.StartupLoggingUtils Missing Java Option solr.log.dir. Logging may be missing or incomplete.
   [junit4]   2> 1519816 INFO  (TEST-PeerSyncTest.test-seed#[3C5227AC57A2E9B6]) [    ] o.a.s.s.SolrDispatchFilter Using logger factory org.apache.logging.slf4j.Log4jLoggerFactory
   [junit4]   2> 1519817 INFO  (TEST-PeerSyncTest.test-seed#[3C5227AC57A2E9B6]) [    ] o.a.s.s.SolrDispatchFilter  ___      _       Welcome to Apache Solr? version 8.1.0
   [junit4]   2> 1519817 INFO  (TEST-PeerSyncTest.test-seed#[3C5227AC57A2E9B6]) [    ] o.a.s.s.SolrDispatchFilter / __| ___| |_ _   Starting in standalone mode on port null
   [junit4]   2> 1519817 INFO  (TEST-PeerSyncTest.test-seed#[3C5227AC57A2E9B6]) [    ] o.a.s.s.SolrDispatchFilter \__ \/ _ \ | '_|  Install dir: null
   [junit4]   2> 1519817 INFO  (TEST-PeerSyncTest.test-seed#[3C5227AC57A2E9B6]) [    ] o.a.s.s.SolrDispatchFilter |___/\___/_|_|    Start time: 2019-04-30T23:30:23.656382700Z
   [junit4]   2> 1519817 INFO  (TEST-PeerSyncTest.test-seed#[3C5227AC57A2E9B6]) [    ] o.a.s.c.SolrXmlConfig Loading container configuration from C:\Users\jenkins\workspace\Lucene-Solr-8.x-Windows\solr\build\solr-core\test\J0\temp\solr.update.PeerSyncTest_3C5227AC57A2E9B6-001\tempDir-001\shard1\solr.xml
   [junit4]   2> 1519822 INFO  (TEST-PeerSyncTest.test-seed#[3C5227AC57A2E9B6]) [    ] o.a.s.c.SolrXmlConfig Configuration parameter autoReplicaFailoverWorkLoopDelay is ignored
   [junit4]   2> 1519822 INFO  (TEST-PeerSyncTest.test-seed#[3C5227AC57A2E9B6]) [    ] o.a.s.c.SolrXmlConfig Configuration parameter autoReplicaFailoverBadNodeExpiration is ignored
   [junit4]   2> 1519824 INFO  (TEST-PeerSyncTest.test-seed#[3C5227AC57A2E9B6]) [    ] o.a.s.c.SolrXmlConfig MBean server found: com.sun.jmx.mbeanserver.JmxMBeanServer@4d2f4bba, but no JMX reporters were configured - adding default JMX reporter.
   [junit4]   2> 1520271 INFO  (TEST-PeerSyncTest.test-seed#[3C5227AC57A2E9B6]) [    ] o.a.s.h.c.HttpShardHandlerFactory Host whitelist initialized: WhitelistHostChecker [whitelistHosts=null, whitelistHostCheckingEnabled=false]
   [junit4]   2> 1520274 WARN  (TEST-PeerSyncTest.test-seed#[3C5227AC57A2E9B6]) [    ] o.e.j.u.s.S.config No Client EndPointIdentificationAlgorithm configured for SslContextFactory@52d68117[provider=null,keyStore=null,trustStore=null]
   [junit4]   2> 1520281 WARN  (TEST-PeerSyncTest.test-seed#[3C5227AC57A2E9B6]) [    ] o.e.j.u.s.S.config No Client EndPointIdentificationAlgorithm configured for SslContextFactory@1d5d2755[provider=null,keyStore=null,trustStore=null]
   [junit4]   2> 1520322 INFO  (TEST-PeerSyncTest.test-seed#[3C5227AC57A2E9B6]) [    ] o.a.s.c.TransientSolrCoreCacheDefault Allocating transient cache for 4 transient cores
   [junit4]   2> 1520322 INFO  (TEST-PeerSyncTest.test-seed#[3C5227AC57A2E9B6]) [    ] o.a.s.h.a.MetricsHistoryHandler No .system collection, keeping metrics history in memory.
   [junit4]   2> 1520352 INFO  (TEST-PeerSyncTest.test-seed#[3C5227AC57A2E9B6]) [    ] o.a.s.m.r.SolrJmxReporter JMX monitoring for 'solr.node' (registry 'solr.node') enabled at server: com.sun.jmx.mbeanserver.JmxMBeanServer@4d2f4bba
   [junit4]   2> 1520370 INFO  (TEST-PeerSyncTest.test-seed#[3C5227AC57A2E9B6]) [    ] o.a.s.m.r.SolrJmxReporter JMX monitoring for 'solr.jvm' (registry 'solr.jvm') enabled at server: com.sun.jmx.mbeanserver.JmxMBeanServer@4d2f4bba
   [junit4]   2> 1520370 INFO  (TEST-PeerSyncTest.test-seed#[3C5227AC57A2E9B6]) [    ] o.a.s.m.r.SolrJmxReporter JMX monitoring for 'solr.jetty' (registry 'solr.jetty') enabled at server: com.sun.jmx.mbeanserver.JmxMBeanServer@4d2f4bba
   [junit4]   2> 1520374 INFO  (TEST-PeerSyncTest.test-seed#[3C5227AC57A2E9B6]) [    ] o.a.s.c.CorePropertiesLocator Found 1 core definitions underneath C:\Users\jenkins\workspace\Lucene-Solr-8.x-Windows\solr\build\solr-core\test\J0\temp\solr.update.PeerSyncTest_3C5227AC57A2E9B6-001\tempDir-001\shard1\cores
   [junit4]   2> 1520374 INFO  (TEST-PeerSyncTest.test-seed#[3C5227AC57A2E9B6]) [    ] o.a.s.c.CorePropertiesLocator Cores are: [collection1]
   [junit4]   2> 1520375 INFO  (coreLoadExecutor-8333-thread-1) [    x:collection1] o.a.s.c.SolrResourceLoader [null] Added 2 libs to classloader, from paths: [/C:/Users/jenkins/workspace/Lucene-Solr-8.x-Windows/solr/core/src/test-files/solr/collection1/lib, /C:/Users/jenkins/workspace/Lucene-Solr-8.x-Windows/solr/core/src/test-files/solr/collection1/lib/classes]
   [junit4]   2> 1520418 INFO  (coreLoadExecutor-8333-thread-1) [    x:collection1] o.a.s.c.SolrConfig Using Lucene MatchVersion: 8.1.0
   [junit4]   2> 1520443 INFO  (coreLoadExecutor-8333-thread-1) [    x:collection1] o.a.s.s.IndexSchema [collection1] Schema name=test
   [junit4]   2> 1520562 INFO  (coreLoadExecutor-8333-thread-1) [    x:collection1] o.a.s.s.IndexSchema Loaded schema test/1.0 with uniqueid field id
   [junit4]   2> 1520581 INFO  (coreLoadExecutor-8333-thread-1) [    x:collection1] o.a.s.c.CoreContainer Creating SolrCore 'collection1' using configuration from configset C:\Users\jenkins\workspace\Lucene-Solr-8.x-Windows\solr\core\src\test-files\solr\collection1, trusted=true
   [junit4]   2> 1520581 INFO  (coreLoadExecutor-8333-thread-1) [    x:collection1] o.a.s.m.r.SolrJmxReporter JMX monitoring for 'solr.core.collection1' (registry 'solr.core.collection1') enabled at server: com.sun.jmx.mbeanserver.JmxMBeanServer@4d2f4bba
   [junit4]   2> 1520582 INFO  (coreLoadExecutor-8333-thread-1) [    x:collection1] o.a.s.c.SolrCore [[collection1] ] Opening new SolrCore at [C:\Users\jenkins\workspace\Lucene-Solr-8.x-Windows\solr\core\src\test-files\solr\collection1], dataDir=[C:\Users\jenkins\workspace\Lucene-Solr-8.x-Windows\solr\build\solr-core\test\J0\temp\solr.update.PeerSyncTest_3C5227AC57A2E9B6-001\tempDir-001\shard1\cores\collection1\data\]
   [junit4]   2> 1520583 INFO  (coreLoadExecutor-8333-thread-1) [    x:collection1] o.a.s.u.RandomMergePolicy RandomMergePolicy wrapping class org.apache.lucene.index.TieredMergePolicy: [TieredMergePolicy: maxMergeAtOnce=20, maxMergeAtOnceExplicit=30, maxMergedSegmentMB=17.623046875, floorSegmentMB=1.1728515625, forceMergeDeletesPctAllowed=21.130560358368562, segmentsPerTier=18.0, maxCFSSegmentSizeMB=8.796093022207999E12, noCFSRatio=1.0, deletesPctAllowed=47.514513361112954
   [junit4]   2> 1520585 WARN  (coreLoadExecutor-8333-thread-1) [    x:collection1] o.a.s.c.RequestHandlers INVALID paramSet a in requestHandler {type = requestHandler,name = /dump,class = DumpRequestHandler,attributes = {initParams=a, name=/dump, class=DumpRequestHandler},args = {defaults={a=A,b=B}}}
   [junit4]   2> 1520741 INFO  (coreLoadExecutor-8333-thread-1) [    x:collection1] o.a.s.u.UpdateHandler Using UpdateLog implementation: org.apache.solr.update.UpdateLog
   [junit4]   2> 1520741 INFO  (coreLoadExecutor-8333-thread-1) [    x:collection1] o.a.s.u.UpdateLog Initializing UpdateLog: dataDir= defaultSyncLevel=FLUSH numRecordsToKeep=100 maxNumLogsToKeep=10 numVersionBuckets=65536
   [junit4]   2> 1520745 INFO  (coreLoadExecutor-8333-thread-1) [    x:collection1] o.a.s.u.CommitTracker Hard AutoCommit: disabled
   [junit4]   2> 1520745 INFO  (coreLoadExecutor-8333-thread-1) [    x:collection1] o.a.s.u.CommitTracker Soft AutoCommit: disabled
   [junit4]   2> 1520746 INFO  (coreLoadExecutor-8333-thread-1) [    x:collection1] o.a.s.u.RandomMergePolicy RandomMergePolicy wrapping class org.apache.lucene.index.LogByteSizeMergePolicy: [LogByteSizeMergePolicy: minMergeSize=1677721, mergeFactor=22, maxMergeSize=2147483648, maxMergeSizeForForcedMerge=9223372036854775807, calibrateSizeByDeletes=false, maxMergeDocs=2147483647, maxCFSSegmentSizeMB=8.796093022207999E12, noCFSRatio=1.0]
   [junit4]   2> 1520747 INFO  (coreLoadExecutor-8333-thread-1) [    x:collection1] o.a.s.s.SolrIndexSearcher Opening [Searcher@6e355b96[collection1] main]
   [junit4]   2> 1520748 WARN  (coreLoadExecutor-8333-thread-1) [    x:collection1] o.a.s.r.ManagedResourceStorage Cannot write to config directory C:\Users\jenkins\workspace\Lucene-Solr-8.x-Windows\solr\core\src\test-files\solr\collection1\conf; switching to use InMemory storage instead.
   [junit4]   2> 1520748 INFO  (coreLoadExecutor-8333-thread-1) [    x:collection1] o.a.s.h.ReplicationHandler Commits will be reserved for 10000ms.
   [junit4]   2> 1520748 INFO  (coreLoadExecutor-8333-thread-1) [    x:collection1] o.a.s.u.UpdateLog Could not find max version in index or recent updates, using new clock 1632283681973338112
   [junit4]   2> 1520751 INFO  (searcherExecutor-8334-thread-1-processing-x:collection1) [    x:collection1] o.a.s.c.SolrCore [collection1] Registered new searcher Searcher@6e355b96[collection1] main{ExitableDirectoryReader(UninvertingDirectoryReader())}
   [junit4]   2> 1521876 INFO  (TEST-PeerSyncTest.test-seed#[3C5227AC57A2E9B6]) [    ] o.a.s.SolrTestCaseJ4 Writing core.properties file to C:\Users\jenkins\workspace\Lucene-Solr-8.x-Windows\solr\build\solr-core\test\J0\temp\solr.update.PeerSyncTest_3C5227AC57A2E9B6-001\tempDir-001\shard2\cores\collection1
   [junit4]   2> 1521877 WARN  (TEST-PeerSyncTest.test-seed#[3C5227AC57A2E9B6]) [    ] o.e.j.s.AbstractConnector Ignoring deprecated socket close linger time
   [junit4]   2> 1521877 INFO  (TEST-PeerSyncTest.test-seed#[3C5227AC57A2E9B6]) [    ] o.a.s.c.s.e.JettySolrRunner Start Jetty (original configured port=0)
   [junit4]   2> 1521878 INFO  (TEST-PeerSyncTest.test-seed#[3C5227AC57A2E9B6]) [    ] o.a.s.c.s.e.JettySolrRunner Trying to start Jetty on port 0 try number 1 ...
   [junit4]   2> 1521878 INFO  (TEST-PeerSyncTest.test-seed#[3C5227AC57A2E9B6]) [    ] o.e.j.s.Server jetty-9.4.14.v20181114; built: 2018-11-14T21:20:31.478Z; git: c4550056e785fb5665914545889f21dc136ad9e6; jvm 12+33
   [junit4]   2> 1521878 INFO  (TEST-PeerSyncTest.test-seed#[3C5227AC57A2E9B6]) [    ] o.e.j.s.session DefaultSessionIdManager workerName=node0
   [junit4]   2> 1521878 INFO  (TEST-PeerSyncTest.test-seed#[3C5227AC57A2E9B6]) [    ] o.e.j.s.session No SessionScavenger set, using defaults
   [junit4]   2> 1521878 INFO  (TEST-PeerSyncTest.test-seed#[3C5227AC57A2E9B6]) [    ] o.e.j.s.session node0 Scavenging every 600000ms
   [junit4]   2> 1521878 INFO  (TEST-PeerSyncTest.test-seed#[3C5227AC57A2E9B6]) [    ] o.e.j.s.h.ContextHandler Started o.e.j.s.ServletContextHandler@50e9b534{/,null,AVAILABLE}
   [junit4]   2> 1521879 INFO  (TEST-PeerSyncTest.test-seed#[3C5227AC57A2E9B6]) [    ] o.e.j.s.AbstractConnector Started ServerConnector@2e2980bd{HTTP/1.1,[http/1.1, h2c]}{127.0.0.1:61567}
   [junit4]   2> 1521879 INFO  (TEST-PeerSyncTest.test-seed#[3C5227AC57A2E9B6]) [    ] o.e.j.s.Server Started @1521902ms
   [junit4]   2> 1521879 INFO  (TEST-PeerSyncTest.test-seed#[3C5227AC57A2E9B6]) [    ] o.a.s.c.s.e.JettySolrRunner Jetty properties: {schema=schema.xml, hostContext=/, solrconfig=solrconfig-tlog.xml, hostPort=61567, coreRootDirectory=C:\Users\jenkins\workspace\Lucene-Solr-8.x-Windows\solr\build\solr-core\test\J0\temp\solr.update.PeerSyncTest_3C5227AC57A2E9B6-001\tempDir-001\shard2\cores}
   [junit4]   2> 1521880 ERROR (TEST-PeerSyncTest.test-seed#[3C5227AC57A2E9B6]) [    ] o.a.s.u.StartupLoggingUtils Missing Java Option solr.log.dir. Logging may be missing or incomplete.
   [junit4]   2> 1521880 INFO  (TEST-PeerSyncTest.test-seed#[3C5227AC57A2E9B6]) [    ] o.a.s.s.SolrDispatchFilter Using logger factory org.apache.logging.slf4j.Log4jLoggerFactory
   [junit4]   2> 1521880 INFO  (TEST-PeerSyncTest.test-seed#[3C5227AC57A2E9B6]) [    ] o.a.s.s.SolrDispatchFilter  ___      _       Welcome to Apache Solr? version 8.1.0
   [junit4]   2> 1521880 INFO  (TEST-PeerSyncTest.test-seed#[3C5227AC57A2E9B6]) [    ] o.a.s.s.SolrDispatchFilter / __| ___| |_ _   Starting in standalone mode on port null
   [junit4]   2> 1521880 INFO  (TEST-PeerSyncTest.test-seed#[3C5227AC57A2E9B6]) [    ] o.a.s.s.SolrDispatchFilter \__ \/ _ \ | '_|  Install dir: null
   [junit4]   2> 1521880 INFO  (TEST-PeerSyncTest.test-seed#[3C5227AC57A2E9B6]) [    ] o.a.s.s.SolrDispatchFilter |___/\___/_|_|    Start time: 2019-04-30T23:30:25.719445100Z
   [junit4]   2> 1521880 INFO  (TEST-PeerSyncTest.test-seed#[3C5227AC57A2E9B6]) [    ] o.a.s.c.SolrXmlConfig Loading container configuration from C:\Users\jenkins\workspace\Lucene-Solr-8.x-Windows\solr\build\solr-core\test\J0\temp\solr.update.PeerSyncTest_3C5227AC57A2E9B6-001\tempDir-001\shard2\solr.xml
   [junit4]   2> 1521884 INFO  (TEST-PeerSyncTest.test-seed#[3C5227AC57A2E9B6]) [    ] o.a.s.c.SolrXmlConfig Configuration parameter autoReplicaFailoverWorkLoopDelay is ignored
   [junit4]   2> 1521884 INFO  (TEST-PeerSyncTest.test-seed#[3C5227AC57A2E9B6]) [    ] o.a.s.c.SolrXmlConfig Configuration parameter autoReplicaFailoverBadNodeExpiration is ignored
   [junit4]   2> 1521887 INFO  (TEST-PeerSyncTest.test-seed#[3C5227AC57A2E9B6]) [    ] o.a.s.c.SolrXmlConfig MBean server found: com.sun.jmx.mbeanserver.JmxMBeanServer@4d2f4bba, but no JMX reporters were configured - adding default JMX reporter.
   [junit4]   2> 1521976 INFO  (TEST-PeerSyncTest.test-seed#[3C5227AC57A2E9B6]) [    ] o.a.s.h.c.HttpShardHandlerFactory Host whitelist initialized: WhitelistHostChecker [whitelistHosts=null, whitelistHostCheckingEnabled=false]
   [junit4]   2> 1521978 WARN  (TEST-PeerSyncTest.test-seed#[3C5227AC57A2E9B6]) [    ] o.e.j.u.s.S.config No Client EndPointIdentificationAlgorithm configured for SslContextFactory@39bf3e1f[provider=null,keyStore=null,trustStore=null]
   [junit4]   2> 1521983 WARN  (TEST-PeerSyncTest.test-seed#[3C5227AC57A2E9B6]) [    ] o.e.j.u.s.S.config No Client EndPointIdentificationAlgorithm configured for SslContextFactory@35e1a510[provider=null,keyStore=null,trustStore=null]
   [junit4]   2> 1522033 INFO  (TEST-PeerSyncTest.test-seed#[3C5227AC57A2E9B6]) [    ] o.a.s.c.TransientSolrCoreCacheDefault Allocating transient cache for 4 transient cores
   [junit4]   2> 1522033 INFO  (TEST-PeerSyncTest.test-seed#[3C5227AC57A2E9B6]) [    ] o.a.s.h.a.MetricsHistoryHandler No .system collection, keeping metrics history in memory.
   [junit4]   2> 1522057 INFO  (TEST-PeerSyncTest.test-seed#[3C5227AC57A2E9B6]) [    ] o.a.s.m.r.SolrJmxReporter JMX monitoring for 'solr.node' (registry 'solr.node') enabled at server: com.sun.jmx.mbeanserver.JmxMBeanServer@4d2f4bba
   [junit4]   2> 1522066 INFO  (TEST-PeerSyncTest.test-seed#[3C5227AC57A2E9B6]) [    ] o.a.s.m.r.SolrJmxReporter JMX monitoring for 'solr.jvm' (registry 'solr.jvm') enabled at server: com.sun.jmx.mbeanserver.JmxMBeanServer@4d2f4bba
   [junit4]   2> 1522066 INFO  (TEST-PeerSyncTest.test-seed#[3C5227AC57A2E9B6]) [    ] o.a.s.m.r.SolrJmxReporter JMX monitoring for 'solr.jetty' (registry 'solr.jetty') enabled at server: com.sun.jmx.mbeanserver.JmxMBeanServer@4d2f4bba
   [junit4]   2> 1522069 INFO  (TEST-PeerSyncTest.test-seed#[3C5227AC57A2E9B6]) [    ] o.a.s.c.CorePropertiesLocator Found 1 core definitions underneath C:\Users\jenkins\workspace\Lucene-Solr-8.x-Windows\solr\build\solr-core\test\J0\temp\solr.update.PeerSyncTest_3C5227AC57A2E9B6-001\tempDir-001\shard2\cores
   [junit4]   2> 1522069 INFO  (TEST-PeerSyncTest.test-seed#[3C5227AC57A2E9B6]) [    ] o.a.s.c.CorePropertiesLocator Cores are: [collection1]
   [junit4]   2> 1522070 INFO  (coreLoadExecutor-8347-thread-1) [    x:collection1] o.a.s.c.SolrResourceLoader [null] Added 2 libs to classloader, from paths: [/C:/Users/jenkins/workspace/Lucene-Solr-8.x-Windows/solr/core/src/test-files/solr/collection1/lib, /C:/Users/jenkins/workspace/Lucene-Solr-8.x-Windows/solr/core/src/test-files/solr/collection1/lib/classes]
   [junit4]   2> 1522099 INFO  (coreLoadExecutor-8347-thread-1) [    x:collection1] o.a.s.c.SolrConfig Using Lucene MatchVersion: 8.1.0
   [junit4]   2> 1522120 INFO  (coreLoadExecutor-8347-thread-1) [    x:collection1] o.a.s.s.IndexSchema [collection1] Schema name=test
   [junit4]   2> 1522209 INFO  (coreLoadExecutor-8347-thread-1) [    x:collection1] o.a.s.s.IndexSchema Loaded schema test/1.0 with uniqueid field id
   [junit4]   2> 1522232 INFO  (coreLoadExecutor-8347-thread-1) [    x:collection1] o.a.s.c.CoreContainer Creating SolrCore 'collection1' using configuration from configset C:\Users\jenkins\workspace\Lucene-Solr-8.x-Windows\solr\core\src\test-files\solr\collection1, trusted=true
   [junit4]   2> 1522232 INFO  (coreLoadExecutor-8347-thread-1) [    x:collection1] o.a.s.m.r.SolrJmxReporter JMX monitoring for 'solr.core.collection1' (registry 'solr.core.collection1') enabled at server: com.sun.jmx.mbeanserver.JmxMBeanServer@4d2f4bba
   [junit4]   2> 1522232 INFO  (coreLoadExecutor-8347-thread-1) [    x:collection1] o.a.s.c.SolrCore [[collection1] ] Opening new SolrCore at [C:\Users\jenkins\workspace\Lucene-Solr-8.x-Windows\solr\core\src\test-files\solr\collection1], dataDir=[C:\Users\jenkins\workspace\Lucene-Solr-8.x-Windows\solr\build\solr-core\test\J0\temp\solr.update.PeerSyncTest_3C5227AC57A2E9B6-001\tempDir-001\shard2\cores\collection1\data\]
   [junit4]   2> 1522246 INFO  (coreLoadExecutor-8347-thread-1) [    x:collection1] o.a.s.u.RandomMergePolicy RandomMergePolicy wrapping class org.apache.lucene.index.TieredMergePolicy: [TieredMergePolicy: maxMergeAtOnce=20, maxMergeAtOnceExplicit=30, maxMergedSegmentMB=17.623046875, floorSegmentMB=1.1728515625, forceMergeDeletesPctAllowed=21.130560358368562, segmentsPerTier=18.0, maxCFSSegmentSizeMB=8.796093022207999E12, noCFSRatio=1.0, deletesPctAllowed=47.514513361112954
   [junit4]   2> 1522293 WARN  (coreLoadExecutor-8347-thread-1) [    x:collection1] o.a.s.c.RequestHandlers INVALID paramSet a in requestHandler {type = requestHandler,name = /dump,class = DumpRequestHandler,attributes = {initParams=a, name=/dump, class=DumpRequestHandler},args = {defaults={a=A,b=B}}}
   [junit4]   2> 1522437 INFO  (coreLoadExecutor-8347-thread-1) [    x:collection1] o.a.s.u.UpdateHandler Using UpdateLog implementation: org.apache.solr.update.UpdateLog
   [junit4]   2> 1522437 INFO  (coreLoadExecutor-8347-thread-1) [    x:collection1] o.a.s.u.UpdateLog Initializing UpdateLog: dataDir= defaultSyncLevel=FLUSH numRecordsToKeep=100 maxNumLogsToKeep=10 numVersionBuckets=65536
   [junit4]   2> 1522438 INFO  (coreLoadExecutor-8347-thread-1) [    x:collection1] o.a.s.u.CommitTracker Hard AutoCommit: disabled
   [junit4]   2> 1522438 INFO  (coreLoadExecutor-8347-thread-1) [    x:collection1] o.a.s.u.CommitTracker Soft AutoCommit: disabled
   [junit4]   2> 1522457 INFO  (coreLoadExecutor-8347-thread-1) [    x:collection1] o.a.s.u.RandomMergePolicy RandomMergePolicy wrapping class org.apache.lucene.index.LogByteSizeMergePolicy: [LogByteSizeMergePolicy: minMergeSize=1677721, mergeFactor=22, maxMergeSize=2147483648, maxMergeSizeForForcedMerge=9223372036854775807, calibrateSizeByDeletes=false, maxMergeDocs=2147483647, maxCFSSegmentSizeMB=8.796093022207999E12, noCFSRatio=1.0]
   [junit4]   2> 1522460 INFO  (coreLoadExecutor-8347-thread-1) [    x:collection1] o.a.s.s.SolrIndexSearcher Opening [Searcher@41df1429[collection1] main]
   [junit4]   2> 1522461 WARN  (coreLoadExecutor-8347-thread-1) [    x:collection1] o.a.s.r.ManagedResourceStorage Cannot write to config directory C:\Users\jenkins\workspace\Lucene-Solr-8.x-Windows\solr\core\src\test-files\solr\collection1\conf; switching to use InMemory

[...truncated too long message...]

moved in a future release.
   [junit4] <<< JVM J0: EOF ----

[...truncated 3 lines...]
   [junit4] JVM J1: stderr was not empty, see: C:\Users\jenkins\workspace\Lucene-Solr-8.x-Windows\solr\build\contrib\solr-analysis-extras\test\temp\junit4-J1-20190501_001426_04813166312759312257993.syserr
   [junit4] >>> JVM J1 emitted unexpected output (verbatim) ----
   [junit4] OpenJDK 64-Bit Server VM warning: Option UseConcMarkSweepGC was deprecated in version 9.0 and will likely be removed in a future release.
   [junit4] <<< JVM J1: EOF ----

[...truncated 804 lines...]
   [junit4] JVM J1: stderr was not empty, see: C:\Users\jenkins\workspace\Lucene-Solr-8.x-Windows\solr\build\contrib\solr-analytics\test\temp\junit4-J1-20190501_001515_1383067613222290718279.syserr
   [junit4] >>> JVM J1 emitted unexpected output (verbatim) ----
   [junit4] OpenJDK 64-Bit Server VM warning: Option UseConcMarkSweepGC was deprecated in version 9.0 and will likely be removed in a future release.
   [junit4] <<< JVM J1: EOF ----

   [junit4] JVM J0: stderr was not empty, see: C:\Users\jenkins\workspace\Lucene-Solr-8.x-Windows\solr\build\contrib\solr-analytics\test\temp\junit4-J0-20190501_001515_1381959098731660637865.syserr
   [junit4] >>> JVM J0 emitted unexpected output (verbatim) ----
   [junit4] OpenJDK 64-Bit Server VM warning: Option UseConcMarkSweepGC was deprecated in version 9.0 and will likely be removed in a future release.
   [junit4] <<< JVM J0: EOF ----

[...truncated 572 lines...]
   [junit4] JVM J0: stderr was not empty, see: C:\Users\jenkins\workspace\Lucene-Solr-8.x-Windows\solr\build\contrib\solr-clustering\test\temp\junit4-J0-20190501_001814_45515244633832485798591.syserr
   [junit4] >>> JVM J0 emitted unexpected output (verbatim) ----
   [junit4] OpenJDK 64-Bit Server VM warning: Option UseConcMarkSweepGC was deprecated in version 9.0 and will likely be removed in a future release.
   [junit4] <<< JVM J0: EOF ----

[...truncated 3 lines...]
   [junit4] JVM J1: stderr was not empty, see: C:\Users\jenkins\workspace\Lucene-Solr-8.x-Windows\solr\build\contrib\solr-clustering\test\temp\junit4-J1-20190501_001814_45510432039966463132619.syserr
   [junit4] >>> JVM J1 emitted unexpected output (verbatim) ----
   [junit4] OpenJDK 64-Bit Server VM warning: Option UseConcMarkSweepGC was deprecated in version 9.0 and will likely be removed in a future release.
   [junit4] <<< JVM J1: EOF ----

[...truncated 1301 lines...]
   [junit4] JVM J0: stderr was not empty, see: C:\Users\jenkins\workspace\Lucene-Solr-8.x-Windows\solr\build\contrib\solr-dataimporthandler-extras\test\temp\junit4-J0-20190501_001907_17815868825358027854208.syserr
   [junit4] >>> JVM J0 emitted unexpected output (verbatim) ----
   [junit4] OpenJDK 64-Bit Server VM warning: Option UseConcMarkSweepGC was deprecated in version 9.0 and will likely be removed in a future release.
   [junit4] <<< JVM J0: EOF ----

[...truncated 3 lines...]
   [junit4] JVM J1: stderr was not empty, see: C:\Users\jenkins\workspace\Lucene-Solr-8.x-Windows\solr\build\contrib\solr-dataimporthandler-extras\test\temp\junit4-J1-20190501_001907_1788264259455063642424.syserr
   [junit4] >>> JVM J1 emitted unexpected output (verbatim) ----
   [junit4] OpenJDK 64-Bit Server VM warning: Option UseConcMarkSweepGC was deprecated in version 9.0 and will likely be removed in a future release.
   [junit4] <<< JVM J1: EOF ----

[...truncated 667 lines...]
   [junit4] JVM J1: stderr was not empty, see: C:\Users\jenkins\workspace\Lucene-Solr-8.x-Windows\solr\build\contrib\solr-dataimporthandler\test\temp\junit4-J1-20190501_001939_514444065441452713069.syserr
   [junit4] >>> JVM J1 emitted unexpected output (verbatim) ----
   [junit4] OpenJDK 64-Bit Server VM warning: Option UseConcMarkSweepGC was deprecated in version 9.0 and will likely be removed in a future release.
   [junit4] <<< JVM J1: EOF ----

[...truncated 3 lines...]
   [junit4] JVM J0: stderr was not empty, see: C:\Users\jenkins\workspace\Lucene-Solr-8.x-Windows\solr\build\contrib\solr-dataimporthandler\test\temp\junit4-J0-20190501_001939_5146176621281991387155.syserr
   [junit4] >>> JVM J0 emitted unexpected output (verbatim) ----
   [junit4] OpenJDK 64-Bit Server VM warning: Option UseConcMarkSweepGC was deprecated in version 9.0 and will likely be removed in a future release.
   [junit4] <<< JVM J0: EOF ----

[...truncated 574 lines...]
   [junit4] JVM J1: stderr was not empty, see: C:\Users\jenkins\workspace\Lucene-Solr-8.x-Windows\solr\build\contrib\solr-cell\test\temp\junit4-J1-20190501_002109_8172844583273649633471.syserr
   [junit4] >>> JVM J1 emitted unexpected output (verbatim) ----
   [junit4] OpenJDK 64-Bit Server VM warning: Option UseConcMarkSweepGC was deprecated in version 9.0 and will likely be removed in a future release.
   [junit4] <<< JVM J1: EOF ----

[...truncated 3 lines...]
   [junit4] JVM J0: stderr was not empty, see: C:\Users\jenkins\workspace\Lucene-Solr-8.x-Windows\solr\build\contrib\solr-cell\test\temp\junit4-J0-20190501_002109_8254781777090034818359.syserr
   [junit4] >>> JVM J0 emitted unexpected output (verbatim) ----
   [junit4] OpenJDK 64-Bit Server VM warning: Option UseConcMarkSweepGC was deprecated in version 9.0 and will likely be removed in a future release.
   [junit4] <<< JVM J0: EOF ----

[...truncated 582 lines...]
   [junit4] JVM J1: stderr was not empty, see: C:\Users\jenkins\workspace\Lucene-Solr-8.x-Windows\solr\build\contrib\solr-langid\test\temp\junit4-J1-20190501_002158_6215487645634764953476.syserr
   [junit4] >>> JVM J1 emitted unexpected output (verbatim) ----
   [junit4] OpenJDK 64-Bit Server VM warning: Option UseConcMarkSweepGC was deprecated in version 9.0 and will likely be removed in a future release.
   [junit4] <<< JVM J1: EOF ----

[...truncated 3 lines...]
   [junit4] JVM J0: stderr was not empty, see: C:\Users\jenkins\workspace\Lucene-Solr-8.x-Windows\solr\build\contrib\solr-langid\test\temp\junit4-J0-20190501_002158_6218061912224996003231.syserr
   [junit4] >>> JVM J0 emitted unexpected output (verbatim) ----
   [junit4] OpenJDK 64-Bit Server VM warning: Option UseConcMarkSweepGC was deprecated in version 9.0 and will likely be removed in a future release.
   [junit4] <<< JVM J0: EOF ----

[...truncated 683 lines...]
   [junit4] JVM J1: stderr was not empty, see: C:\Users\jenkins\workspace\Lucene-Solr-8.x-Windows\solr\build\contrib\solr-ltr\test\temp\junit4-J1-20190501_002234_29915183308593416993860.syserr
   [junit4] >>> JVM J1 emitted unexpected output (verbatim) ----
   [junit4] OpenJDK 64-Bit Server VM warning: Option UseConcMarkSweepGC was deprecated in version 9.0 and will likely be removed in a future release.
   [junit4] <<< JVM J1: EOF ----

[...truncated 3 lines...]
   [junit4] JVM J0: stderr was not empty, see: C:\Users\jenkins\workspace\Lucene-Solr-8.x-Windows\solr\build\contrib\solr-ltr\test\temp\junit4-J0-20190501_002234_29911550961280498504051.syserr
   [junit4] >>> JVM J0 emitted unexpected output (verbatim) ----
   [junit4] OpenJDK 64-Bit Server VM warning: Option UseConcMarkSweepGC was deprecated in version 9.0 and will likely be removed in a future release.
   [junit4] <<< JVM J0: EOF ----

[...truncated 582 lines...]
   [junit4] JVM J1: stderr was not empty, see: C:\Users\jenkins\workspace\Lucene-Solr-8.x-Windows\solr\build\contrib\solr-prometheus-exporter\test\temp\junit4-J1-20190501_002403_96515845104427548021187.syserr
   [junit4] >>> JVM J1 emitted unexpected output (verbatim) ----
   [junit4] OpenJDK 64-Bit Server VM warning: Option UseConcMarkSweepGC was deprecated in version 9.0 and will likely be removed in a future release.
   [junit4] <<< JVM J1: EOF ----

[...truncated 3 lines...]
   [junit4] JVM J0: stderr was not empty, see: C:\Users\jenkins\workspace\Lucene-Solr-8.x-Windows\solr\build\contrib\solr-prometheus-exporter\test\temp\junit4-J0-20190501_002403_9654387134192903956410.syserr
   [junit4] >>> JVM J0 emitted unexpected output (verbatim) ----
   [junit4] OpenJDK 64-Bit Server VM warning: Option UseConcMarkSweepGC was deprecated in version 9.0 and will likely be removed in a future release.
   [junit4] <<< JVM J0: EOF ----

[...truncated 568 lines...]
   [junit4] JVM J0: stderr was not empty, see: C:\Users\jenkins\workspace\Lucene-Solr-8.x-Windows\solr\build\contrib\solr-velocity\test\temp\junit4-J0-20190501_002502_84715311557756598121029.syserr
   [junit4] >>> JVM J0 emitted unexpected output (verbatim) ----
   [junit4] OpenJDK 64-Bit Server VM warning: Option UseConcMarkSweepGC was deprecated in version 9.0 and will likely be removed in a future release.
   [junit4] <<< JVM J0: EOF ----

[...truncated 31 lines...]
BUILD FAILED
C:\Users\jenkins\workspace\Lucene-Solr-8.x-Windows\build.xml:634: The following error occurred while executing this line:
C:\Users\jenkins\workspace\Lucene-Solr-8.x-Windows\build.xml:128: Found 1 violations in source files (File uses Mockito but has no assumeWorkingMockito() call).

Total time: 115 minutes 30 seconds
Build step 'Invoke Ant' marked build as failure
Archiving artifacts
Setting ANT_1_8_2_HOME=C:\Users\jenkins\tools\hudson.tasks.Ant_AntInstallation\ANT_1.8.2
[WARNINGS] Skipping publisher since build result is FAILURE
Recording test results
Setting ANT_1_8_2_HOME=C:\Users\jenkins\tools\hudson.tasks.Ant_AntInstallation\ANT_1.8.2
Email was triggered for: Failure - Any
Sending email for trigger: Failure - Any
Setting ANT_1_8_2_HOME=C:\Users\jenkins\tools\hudson.tasks.Ant_AntInstallation\ANT_1.8.2
Setting ANT_1_8_2_HOME=C:\Users\jenkins\tools\hudson.tasks.Ant_AntInstallation\ANT_1.8.2
Setting ANT_1_8_2_HOME=C:\Users\jenkins\tools\hudson.tasks.Ant_AntInstallation\ANT_1.8.2
Setting ANT_1_8_2_HOME=C:\Users\jenkins\tools\hudson.tasks.Ant_AntInstallation\ANT_1.8.2
Setting ANT_1_8_2_HOME=C:\Users\jenkins\tools\hudson.tasks.Ant_AntInstallation\ANT_1.8.2
Setting ANT_1_8_2_HOME=C:\Users\jenkins\tools\hudson.tasks.Ant_AntInstallation\ANT_1.8.2

Mime
View raw message