lucene-dev mailing list archives

Site index · List index
Message view « Date » · « Thread »
Top « Date » · « Thread »
From Apache Jenkins Server <jenk...@builds.apache.org>
Subject [JENKINS] Lucene-Solr-NightlyTests-master - Build # 1839 - Still Unstable
Date Fri, 03 May 2019 15:50:44 GMT
Build: https://builds.apache.org/job/Lucene-Solr-NightlyTests-master/1839/

2 tests failed.
FAILED:  org.apache.solr.cloud.ChaosMonkeyNothingIsSafeTest.test

Error Message:
Test abandoned because suite timeout was reached.

Stack Trace:
java.lang.Exception: Test abandoned because suite timeout was reached.
	at __randomizedtesting.SeedInfo.seed([F7D80A63C16FF740]:0)


FAILED:  junit.framework.TestSuite.org.apache.solr.cloud.ChaosMonkeyNothingIsSafeTest

Error Message:
Suite timeout exceeded (>= 7200000 msec).

Stack Trace:
java.lang.Exception: Suite timeout exceeded (>= 7200000 msec).
	at __randomizedtesting.SeedInfo.seed([F7D80A63C16FF740]:0)




Build Log:
[...truncated 16020 lines...]
   [junit4] Suite: org.apache.solr.cloud.ChaosMonkeyNothingIsSafeTest
   [junit4]   2> Creating dataDir: /x1/jenkins/jenkins-slave/workspace/Lucene-Solr-NightlyTests-master/checkout/solr/build/solr-core/test/J2/temp/solr.cloud.ChaosMonkeyNothingIsSafeTest_F7D80A63C16FF740-001/init-core-data-001
   [junit4]   2> 2786705 WARN  (SUITE-ChaosMonkeyNothingIsSafeTest-seed#[F7D80A63C16FF740]-worker) [    ] o.a.s.SolrTestCaseJ4 startTrackingSearchers: numOpens=31 numCloses=31
   [junit4]   2> 2786705 INFO  (SUITE-ChaosMonkeyNothingIsSafeTest-seed#[F7D80A63C16FF740]-worker) [    ] o.a.s.SolrTestCaseJ4 Using PointFields (NUMERIC_POINTS_SYSPROP=true) w/NUMERIC_DOCVALUES_SYSPROP=true
   [junit4]   2> 2786706 INFO  (SUITE-ChaosMonkeyNothingIsSafeTest-seed#[F7D80A63C16FF740]-worker) [    ] o.a.s.SolrTestCaseJ4 Randomized ssl (false) and clientAuth (false) via: @org.apache.solr.SolrTestCaseJ4$SuppressSSL(bugUrl="https://issues.apache.org/jira/browse/SOLR-5776")
   [junit4]   2> 2786706 INFO  (SUITE-ChaosMonkeyNothingIsSafeTest-seed#[F7D80A63C16FF740]-worker) [    ] o.a.s.SolrTestCaseJ4 SecureRandom sanity checks: test.solr.allowed.securerandom=null & java.security.egd=file:/dev/./urandom
   [junit4]   2> 2786706 INFO  (SUITE-ChaosMonkeyNothingIsSafeTest-seed#[F7D80A63C16FF740]-worker) [    ] o.a.s.BaseDistributedSearchTestCase Setting hostContext system property: /
   [junit4]   2> 2786711 INFO  (TEST-ChaosMonkeyNothingIsSafeTest.test-seed#[F7D80A63C16FF740]) [    ] o.a.s.c.ZkTestServer STARTING ZK TEST SERVER
   [junit4]   2> 2786711 INFO  (ZkTestServer Run Thread) [    ] o.a.s.c.ZkTestServer client port:0.0.0.0/0.0.0.0:0
   [junit4]   2> 2786711 INFO  (ZkTestServer Run Thread) [    ] o.a.s.c.ZkTestServer Starting server
   [junit4]   2> 2786811 INFO  (TEST-ChaosMonkeyNothingIsSafeTest.test-seed#[F7D80A63C16FF740]) [    ] o.a.s.c.ZkTestServer start zk server on port:45775
   [junit4]   2> 2786811 INFO  (TEST-ChaosMonkeyNothingIsSafeTest.test-seed#[F7D80A63C16FF740]) [    ] o.a.s.c.ZkTestServer parse host and port list: 127.0.0.1:45775
   [junit4]   2> 2786812 INFO  (TEST-ChaosMonkeyNothingIsSafeTest.test-seed#[F7D80A63C16FF740]) [    ] o.a.s.c.ZkTestServer connecting to 127.0.0.1 45775
   [junit4]   2> 2786816 INFO  (zkConnectionManagerCallback-71500-thread-1) [    ] o.a.s.c.c.ConnectionManager zkClient has connected
   [junit4]   2> 2786820 INFO  (zkConnectionManagerCallback-71502-thread-1) [    ] o.a.s.c.c.ConnectionManager zkClient has connected
   [junit4]   2> 2786821 INFO  (TEST-ChaosMonkeyNothingIsSafeTest.test-seed#[F7D80A63C16FF740]) [    ] o.a.s.c.ZkTestServer put /x1/jenkins/jenkins-slave/workspace/Lucene-Solr-NightlyTests-master/checkout/solr/core/src/test-files/solr/collection1/conf/solrconfig-tlog.xml to /configs/conf1/solrconfig.xml
   [junit4]   2> 2786823 INFO  (TEST-ChaosMonkeyNothingIsSafeTest.test-seed#[F7D80A63C16FF740]) [    ] o.a.s.c.ZkTestServer put /x1/jenkins/jenkins-slave/workspace/Lucene-Solr-NightlyTests-master/checkout/solr/core/src/test-files/solr/collection1/conf/schema15.xml to /configs/conf1/schema.xml
   [junit4]   2> 2786824 INFO  (TEST-ChaosMonkeyNothingIsSafeTest.test-seed#[F7D80A63C16FF740]) [    ] o.a.s.c.ZkTestServer put /x1/jenkins/jenkins-slave/workspace/Lucene-Solr-NightlyTests-master/checkout/solr/core/src/test-files/solr/collection1/conf/solrconfig.snippet.randomindexconfig.xml to /configs/conf1/solrconfig.snippet.randomindexconfig.xml
   [junit4]   2> 2786826 INFO  (TEST-ChaosMonkeyNothingIsSafeTest.test-seed#[F7D80A63C16FF740]) [    ] o.a.s.c.ZkTestServer put /x1/jenkins/jenkins-slave/workspace/Lucene-Solr-NightlyTests-master/checkout/solr/core/src/test-files/solr/collection1/conf/stopwords.txt to /configs/conf1/stopwords.txt
   [junit4]   2> 2786828 INFO  (TEST-ChaosMonkeyNothingIsSafeTest.test-seed#[F7D80A63C16FF740]) [    ] o.a.s.c.ZkTestServer put /x1/jenkins/jenkins-slave/workspace/Lucene-Solr-NightlyTests-master/checkout/solr/core/src/test-files/solr/collection1/conf/protwords.txt to /configs/conf1/protwords.txt
   [junit4]   2> 2786829 INFO  (TEST-ChaosMonkeyNothingIsSafeTest.test-seed#[F7D80A63C16FF740]) [    ] o.a.s.c.ZkTestServer put /x1/jenkins/jenkins-slave/workspace/Lucene-Solr-NightlyTests-master/checkout/solr/core/src/test-files/solr/collection1/conf/currency.xml to /configs/conf1/currency.xml
   [junit4]   2> 2786831 INFO  (TEST-ChaosMonkeyNothingIsSafeTest.test-seed#[F7D80A63C16FF740]) [    ] o.a.s.c.ZkTestServer put /x1/jenkins/jenkins-slave/workspace/Lucene-Solr-NightlyTests-master/checkout/solr/core/src/test-files/solr/collection1/conf/enumsConfig.xml to /configs/conf1/enumsConfig.xml
   [junit4]   2> 2786832 INFO  (TEST-ChaosMonkeyNothingIsSafeTest.test-seed#[F7D80A63C16FF740]) [    ] o.a.s.c.ZkTestServer put /x1/jenkins/jenkins-slave/workspace/Lucene-Solr-NightlyTests-master/checkout/solr/core/src/test-files/solr/collection1/conf/open-exchange-rates.json to /configs/conf1/open-exchange-rates.json
   [junit4]   2> 2786833 INFO  (TEST-ChaosMonkeyNothingIsSafeTest.test-seed#[F7D80A63C16FF740]) [    ] o.a.s.c.ZkTestServer put /x1/jenkins/jenkins-slave/workspace/Lucene-Solr-NightlyTests-master/checkout/solr/core/src/test-files/solr/collection1/conf/mapping-ISOLatin1Accent.txt to /configs/conf1/mapping-ISOLatin1Accent.txt
   [junit4]   2> 2786835 INFO  (TEST-ChaosMonkeyNothingIsSafeTest.test-seed#[F7D80A63C16FF740]) [    ] o.a.s.c.ZkTestServer put /x1/jenkins/jenkins-slave/workspace/Lucene-Solr-NightlyTests-master/checkout/solr/core/src/test-files/solr/collection1/conf/old_synonyms.txt to /configs/conf1/old_synonyms.txt
   [junit4]   2> 2786836 INFO  (TEST-ChaosMonkeyNothingIsSafeTest.test-seed#[F7D80A63C16FF740]) [    ] o.a.s.c.ZkTestServer put /x1/jenkins/jenkins-slave/workspace/Lucene-Solr-NightlyTests-master/checkout/solr/core/src/test-files/solr/collection1/conf/synonyms.txt to /configs/conf1/synonyms.txt
   [junit4]   2> 2786838 INFO  (TEST-ChaosMonkeyNothingIsSafeTest.test-seed#[F7D80A63C16FF740]) [    ] o.a.s.c.AbstractFullDistribZkTestBase Will use NRT replicas unless explicitly asked otherwise
   [junit4]   2> 2787027 WARN  (TEST-ChaosMonkeyNothingIsSafeTest.test-seed#[F7D80A63C16FF740]) [    ] o.e.j.s.AbstractConnector Ignoring deprecated socket close linger time
   [junit4]   2> 2787028 INFO  (TEST-ChaosMonkeyNothingIsSafeTest.test-seed#[F7D80A63C16FF740]) [    ] o.a.s.c.s.e.JettySolrRunner Start Jetty (original configured port=0)
   [junit4]   2> 2787028 INFO  (TEST-ChaosMonkeyNothingIsSafeTest.test-seed#[F7D80A63C16FF740]) [    ] o.a.s.c.s.e.JettySolrRunner Trying to start Jetty on port 0 try number 1 ...
   [junit4]   2> 2787028 INFO  (TEST-ChaosMonkeyNothingIsSafeTest.test-seed#[F7D80A63C16FF740]) [    ] o.e.j.s.Server jetty-9.4.14.v20181114; built: 2018-11-14T21:20:31.478Z; git: c4550056e785fb5665914545889f21dc136ad9e6; jvm 11.0.1+13-LTS
   [junit4]   2> 2787047 INFO  (TEST-ChaosMonkeyNothingIsSafeTest.test-seed#[F7D80A63C16FF740]) [    ] o.e.j.s.session DefaultSessionIdManager workerName=node0
   [junit4]   2> 2787047 INFO  (TEST-ChaosMonkeyNothingIsSafeTest.test-seed#[F7D80A63C16FF740]) [    ] o.e.j.s.session No SessionScavenger set, using defaults
   [junit4]   2> 2787047 INFO  (TEST-ChaosMonkeyNothingIsSafeTest.test-seed#[F7D80A63C16FF740]) [    ] o.e.j.s.session node0 Scavenging every 660000ms
   [junit4]   2> 2787048 INFO  (TEST-ChaosMonkeyNothingIsSafeTest.test-seed#[F7D80A63C16FF740]) [    ] o.e.j.s.h.ContextHandler Started o.e.j.s.ServletContextHandler@71699809{/,null,AVAILABLE}
   [junit4]   2> 2787052 INFO  (TEST-ChaosMonkeyNothingIsSafeTest.test-seed#[F7D80A63C16FF740]) [    ] o.e.j.s.AbstractConnector Started ServerConnector@16567bff{HTTP/1.1,[http/1.1, h2c]}{127.0.0.1:46620}
   [junit4]   2> 2787052 INFO  (TEST-ChaosMonkeyNothingIsSafeTest.test-seed#[F7D80A63C16FF740]) [    ] o.e.j.s.Server Started @2787100ms
   [junit4]   2> 2787052 INFO  (TEST-ChaosMonkeyNothingIsSafeTest.test-seed#[F7D80A63C16FF740]) [    ] o.a.s.c.s.e.JettySolrRunner Jetty properties: {hostContext=/, solr.data.dir=/x1/jenkins/jenkins-slave/workspace/Lucene-Solr-NightlyTests-master/checkout/solr/build/solr-core/test/J2/temp/solr.cloud.ChaosMonkeyNothingIsSafeTest_F7D80A63C16FF740-001/tempDir-001/control/data, hostPort=46620, coreRootDirectory=/x1/jenkins/jenkins-slave/workspace/Lucene-Solr-NightlyTests-master/checkout/solr/build/solr-core/test/J2/temp/solr.cloud.ChaosMonkeyNothingIsSafeTest_F7D80A63C16FF740-001/control-001/cores, replicaType=NRT}
   [junit4]   2> 2787053 ERROR (TEST-ChaosMonkeyNothingIsSafeTest.test-seed#[F7D80A63C16FF740]) [    ] o.a.s.u.StartupLoggingUtils Missing Java Option solr.log.dir. Logging may be missing or incomplete.
   [junit4]   2> 2787053 INFO  (TEST-ChaosMonkeyNothingIsSafeTest.test-seed#[F7D80A63C16FF740]) [    ] o.a.s.s.SolrDispatchFilter Using logger factory org.apache.logging.slf4j.Log4jLoggerFactory
   [junit4]   2> 2787053 INFO  (TEST-ChaosMonkeyNothingIsSafeTest.test-seed#[F7D80A63C16FF740]) [    ] o.a.s.s.SolrDispatchFilter  ___      _       Welcome to Apache Solr? version 9.0.0
   [junit4]   2> 2787053 INFO  (TEST-ChaosMonkeyNothingIsSafeTest.test-seed#[F7D80A63C16FF740]) [    ] o.a.s.s.SolrDispatchFilter / __| ___| |_ _   Starting in cloud mode on port null
   [junit4]   2> 2787053 INFO  (TEST-ChaosMonkeyNothingIsSafeTest.test-seed#[F7D80A63C16FF740]) [    ] o.a.s.s.SolrDispatchFilter \__ \/ _ \ | '_|  Install dir: null
   [junit4]   2> 2787054 INFO  (TEST-ChaosMonkeyNothingIsSafeTest.test-seed#[F7D80A63C16FF740]) [    ] o.a.s.s.SolrDispatchFilter |___/\___/_|_|    Start time: 2019-05-03T13:20:46.026989Z
   [junit4]   2> 2787056 INFO  (zkConnectionManagerCallback-71504-thread-1) [    ] o.a.s.c.c.ConnectionManager zkClient has connected
   [junit4]   2> 2787058 INFO  (TEST-ChaosMonkeyNothingIsSafeTest.test-seed#[F7D80A63C16FF740]) [    ] o.a.s.s.SolrDispatchFilter Loading solr.xml from SolrHome (not found in ZooKeeper)
   [junit4]   2> 2787058 INFO  (TEST-ChaosMonkeyNothingIsSafeTest.test-seed#[F7D80A63C16FF740]) [    ] o.a.s.c.SolrXmlConfig Loading container configuration from /x1/jenkins/jenkins-slave/workspace/Lucene-Solr-NightlyTests-master/checkout/solr/build/solr-core/test/J2/temp/solr.cloud.ChaosMonkeyNothingIsSafeTest_F7D80A63C16FF740-001/control-001/solr.xml
   [junit4]   2> 2787062 INFO  (TEST-ChaosMonkeyNothingIsSafeTest.test-seed#[F7D80A63C16FF740]) [    ] o.a.s.c.SolrXmlConfig Configuration parameter autoReplicaFailoverWorkLoopDelay is ignored
   [junit4]   2> 2787062 INFO  (TEST-ChaosMonkeyNothingIsSafeTest.test-seed#[F7D80A63C16FF740]) [    ] o.a.s.c.SolrXmlConfig Configuration parameter autoReplicaFailoverBadNodeExpiration is ignored
   [junit4]   2> 2787064 INFO  (TEST-ChaosMonkeyNothingIsSafeTest.test-seed#[F7D80A63C16FF740]) [    ] o.a.s.c.SolrXmlConfig MBean server found: com.sun.jmx.mbeanserver.JmxMBeanServer@50e707b6, but no JMX reporters were configured - adding default JMX reporter.
   [junit4]   2> 2787231 INFO  (TEST-ChaosMonkeyNothingIsSafeTest.test-seed#[F7D80A63C16FF740]) [    ] o.a.s.h.c.HttpShardHandlerFactory Host whitelist initialized: WhitelistHostChecker [whitelistHosts=null, whitelistHostCheckingEnabled=false]
   [junit4]   2> 2787233 WARN  (TEST-ChaosMonkeyNothingIsSafeTest.test-seed#[F7D80A63C16FF740]) [    ] o.e.j.u.s.S.config No Client EndPointIdentificationAlgorithm configured for SslContextFactory@7aac8362[provider=null,keyStore=null,trustStore=null]
   [junit4]   2> 2787238 WARN  (TEST-ChaosMonkeyNothingIsSafeTest.test-seed#[F7D80A63C16FF740]) [    ] o.e.j.u.s.S.config No Client EndPointIdentificationAlgorithm configured for SslContextFactory@5a71c981[provider=null,keyStore=null,trustStore=null]
   [junit4]   2> 2787239 INFO  (TEST-ChaosMonkeyNothingIsSafeTest.test-seed#[F7D80A63C16FF740]) [    ] o.a.s.c.ZkContainer Zookeeper client=127.0.0.1:45775/solr
   [junit4]   2> 2787247 INFO  (zkConnectionManagerCallback-71511-thread-1) [    ] o.a.s.c.c.ConnectionManager zkClient has connected
   [junit4]   2> 2787256 INFO  (zkConnectionManagerCallback-71513-thread-1) [    ] o.a.s.c.c.ConnectionManager zkClient has connected
   [junit4]   2> 2787404 INFO  (TEST-ChaosMonkeyNothingIsSafeTest.test-seed#[F7D80A63C16FF740]) [n:127.0.0.1:46620_    ] o.a.s.c.OverseerElectionContext I am going to be the leader 127.0.0.1:46620_
   [junit4]   2> 2787404 INFO  (TEST-ChaosMonkeyNothingIsSafeTest.test-seed#[F7D80A63C16FF740]) [n:127.0.0.1:46620_    ] o.a.s.c.Overseer Overseer (id=73238840943443972-127.0.0.1:46620_-n_0000000000) starting
   [junit4]   2> 2787413 INFO  (zkConnectionManagerCallback-71520-thread-1) [    ] o.a.s.c.c.ConnectionManager zkClient has connected
   [junit4]   2> 2787417 INFO  (TEST-ChaosMonkeyNothingIsSafeTest.test-seed#[F7D80A63C16FF740]) [n:127.0.0.1:46620_    ] o.a.s.c.s.i.ZkClientClusterStateProvider Cluster at 127.0.0.1:45775/solr ready
   [junit4]   2> 2787419 INFO  (TEST-ChaosMonkeyNothingIsSafeTest.test-seed#[F7D80A63C16FF740]) [n:127.0.0.1:46620_    ] o.a.s.c.ZkController Register node as live in ZooKeeper:/live_nodes/127.0.0.1:46620_
   [junit4]   2> 2787423 INFO  (OverseerStateUpdate-73238840943443972-127.0.0.1:46620_-n_0000000000) [n:127.0.0.1:46620_    ] o.a.s.c.Overseer Starting to work on the main queue : 127.0.0.1:46620_
   [junit4]   2> 2787428 INFO  (zkCallback-71519-thread-1) [    ] o.a.s.c.c.ZkStateReader Updated live nodes from ZooKeeper... (0) -> (1)
   [junit4]   2> 2787429 INFO  (OverseerStateUpdate-73238840943443972-127.0.0.1:46620_-n_0000000000) [n:127.0.0.1:46620_    ] o.a.s.c.c.ZkStateReader Updated live nodes from ZooKeeper... (0) -> (1)
   [junit4]   2> 2787460 INFO  (TEST-ChaosMonkeyNothingIsSafeTest.test-seed#[F7D80A63C16FF740]) [n:127.0.0.1:46620_    ] o.a.s.h.a.MetricsHistoryHandler No .system collection, keeping metrics history in memory.
   [junit4]   2> 2787502 INFO  (TEST-ChaosMonkeyNothingIsSafeTest.test-seed#[F7D80A63C16FF740]) [n:127.0.0.1:46620_    ] o.a.s.m.r.SolrJmxReporter JMX monitoring for 'solr.node' (registry 'solr.node') enabled at server: com.sun.jmx.mbeanserver.JmxMBeanServer@50e707b6
   [junit4]   2> 2787525 INFO  (TEST-ChaosMonkeyNothingIsSafeTest.test-seed#[F7D80A63C16FF740]) [n:127.0.0.1:46620_    ] o.a.s.m.r.SolrJmxReporter JMX monitoring for 'solr.jvm' (registry 'solr.jvm') enabled at server: com.sun.jmx.mbeanserver.JmxMBeanServer@50e707b6
   [junit4]   2> 2787525 INFO  (TEST-ChaosMonkeyNothingIsSafeTest.test-seed#[F7D80A63C16FF740]) [n:127.0.0.1:46620_    ] o.a.s.m.r.SolrJmxReporter JMX monitoring for 'solr.jetty' (registry 'solr.jetty') enabled at server: com.sun.jmx.mbeanserver.JmxMBeanServer@50e707b6
   [junit4]   2> 2787528 INFO  (TEST-ChaosMonkeyNothingIsSafeTest.test-seed#[F7D80A63C16FF740]) [n:127.0.0.1:46620_    ] o.a.s.c.CorePropertiesLocator Found 0 core definitions underneath /x1/jenkins/jenkins-slave/workspace/Lucene-Solr-NightlyTests-master/checkout/solr/build/solr-core/test/J2/temp/solr.cloud.ChaosMonkeyNothingIsSafeTest_F7D80A63C16FF740-001/control-001/cores
   [junit4]   2> 2787558 INFO  (zkConnectionManagerCallback-71526-thread-1) [    ] o.a.s.c.c.ConnectionManager zkClient has connected
   [junit4]   2> 2787559 INFO  (TEST-ChaosMonkeyNothingIsSafeTest.test-seed#[F7D80A63C16FF740]) [    ] o.a.s.c.c.ZkStateReader Updated live nodes from ZooKeeper... (0) -> (1)
   [junit4]   2> 2787561 INFO  (TEST-ChaosMonkeyNothingIsSafeTest.test-seed#[F7D80A63C16FF740]) [    ] o.a.s.c.s.i.ZkClientClusterStateProvider Cluster at 127.0.0.1:45775/solr ready
   [junit4]   2> 2787563 INFO  (qtp1277329185-151594) [n:127.0.0.1:46620_    ] o.a.s.h.a.CollectionsHandler Invoked Collection Action :create with params collection.configName=conf1&name=control_collection&nrtReplicas=1&action=CREATE&numShards=1&createNodeSet=127.0.0.1:46620_&wt=javabin&version=2 and sendToOCPQueue=true
   [junit4]   2> 2787567 INFO  (OverseerThreadFactory-14012-thread-1-processing-n:127.0.0.1:46620_) [n:127.0.0.1:46620_    ] o.a.s.c.a.c.CreateCollectionCmd Create collection control_collection
   [junit4]   2> 2787677 INFO  (qtp1277329185-151596) [n:127.0.0.1:46620_    x:control_collection_shard1_replica_n1] o.a.s.h.a.CoreAdminOperation core create command qt=/admin/cores&collection.configName=conf1&newCollection=true&name=control_collection_shard1_replica_n1&action=CREATE&numShards=1&collection=control_collection&shard=shard1&wt=javabin&version=2&replicaType=NRT
   [junit4]   2> 2787677 INFO  (qtp1277329185-151596) [n:127.0.0.1:46620_    x:control_collection_shard1_replica_n1] o.a.s.c.TransientSolrCoreCacheDefault Allocating transient cache for 4 transient cores
   [junit4]   2> 2788696 INFO  (qtp1277329185-151596) [n:127.0.0.1:46620_ c:control_collection s:shard1  x:control_collection_shard1_replica_n1] o.a.s.c.SolrConfig Using Lucene MatchVersion: 9.0.0
   [junit4]   2> 2788724 INFO  (qtp1277329185-151596) [n:127.0.0.1:46620_ c:control_collection s:shard1  x:control_collection_shard1_replica_n1] o.a.s.s.IndexSchema [control_collection_shard1_replica_n1] Schema name=test
   [junit4]   2> 2788818 INFO  (qtp1277329185-151596) [n:127.0.0.1:46620_ c:control_collection s:shard1  x:control_collection_shard1_replica_n1] o.a.s.s.IndexSchema Loaded schema test/1.6 with uniqueid field id
   [junit4]   2> 2788840 INFO  (qtp1277329185-151596) [n:127.0.0.1:46620_ c:control_collection s:shard1  x:control_collection_shard1_replica_n1] o.a.s.c.CoreContainer Creating SolrCore 'control_collection_shard1_replica_n1' using configuration from collection control_collection, trusted=true
   [junit4]   2> 2788841 INFO  (qtp1277329185-151596) [n:127.0.0.1:46620_ c:control_collection s:shard1  x:control_collection_shard1_replica_n1] o.a.s.m.r.SolrJmxReporter JMX monitoring for 'solr.core.control_collection.shard1.replica_n1' (registry 'solr.core.control_collection.shard1.replica_n1') enabled at server: com.sun.jmx.mbeanserver.JmxMBeanServer@50e707b6
   [junit4]   2> 2788842 INFO  (qtp1277329185-151596) [n:127.0.0.1:46620_ c:control_collection s:shard1  x:control_collection_shard1_replica_n1] o.a.s.c.SolrCore [[control_collection_shard1_replica_n1] ] Opening new SolrCore at [/x1/jenkins/jenkins-slave/workspace/Lucene-Solr-NightlyTests-master/checkout/solr/build/solr-core/test/J2/temp/solr.cloud.ChaosMonkeyNothingIsSafeTest_F7D80A63C16FF740-001/control-001/cores/control_collection_shard1_replica_n1], dataDir=[/x1/jenkins/jenkins-slave/workspace/Lucene-Solr-NightlyTests-master/checkout/solr/build/solr-core/test/J2/temp/solr.cloud.ChaosMonkeyNothingIsSafeTest_F7D80A63C16FF740-001/control-001/cores/control_collection_shard1_replica_n1/data/]
   [junit4]   2> 2788847 INFO  (qtp1277329185-151596) [n:127.0.0.1:46620_ c:control_collection s:shard1  x:control_collection_shard1_replica_n1] o.a.s.u.RandomMergePolicy RandomMergePolicy wrapping class org.apache.lucene.index.LogDocMergePolicy: [LogDocMergePolicy: minMergeSize=1000, mergeFactor=20, maxMergeSize=9223372036854775807, maxMergeSizeForForcedMerge=9223372036854775807, calibrateSizeByDeletes=false, maxMergeDocs=2147483647, maxCFSSegmentSizeMB=8.796093022207999E12, noCFSRatio=0.0]
   [junit4]   2> 2788857 WARN  (qtp1277329185-151596) [n:127.0.0.1:46620_ c:control_collection s:shard1  x:control_collection_shard1_replica_n1] o.a.s.c.RequestHandlers INVALID paramSet a in requestHandler {type = requestHandler,name = /dump,class = DumpRequestHandler,attributes = {initParams=a, name=/dump, class=DumpRequestHandler},args = {defaults={a=A,b=B}}}
   [junit4]   2> 2788928 INFO  (qtp1277329185-151596) [n:127.0.0.1:46620_ c:control_collection s:shard1  x:control_collection_shard1_replica_n1] o.a.s.u.UpdateHandler Using UpdateLog implementation: org.apache.solr.update.UpdateLog
   [junit4]   2> 2788928 INFO  (qtp1277329185-151596) [n:127.0.0.1:46620_ c:control_collection s:shard1  x:control_collection_shard1_replica_n1] o.a.s.u.UpdateLog Initializing UpdateLog: dataDir= defaultSyncLevel=FLUSH numRecordsToKeep=100 maxNumLogsToKeep=10 numVersionBuckets=65536
   [junit4]   2> 2788930 INFO  (qtp1277329185-151596) [n:127.0.0.1:46620_ c:control_collection s:shard1  x:control_collection_shard1_replica_n1] o.a.s.u.CommitTracker Hard AutoCommit: if uncommitted for 15000ms; 
   [junit4]   2> 2788930 INFO  (qtp1277329185-151596) [n:127.0.0.1:46620_ c:control_collection s:shard1  x:control_collection_shard1_replica_n1] o.a.s.u.CommitTracker Soft AutoCommit: disabled
   [junit4]   2> 2788932 INFO  (qtp1277329185-151596) [n:127.0.0.1:46620_ c:control_collection s:shard1  x:control_collection_shard1_replica_n1] o.a.s.u.RandomMergePolicy RandomMergePolicy wrapping class org.apache.lucene.index.MockRandomMergePolicy: org.apache.lucene.index.MockRandomMergePolicy@28d64453
   [junit4]   2> 2788932 INFO  (qtp1277329185-151596) [n:127.0.0.1:46620_ c:control_collection s:shard1  x:control_collection_shard1_replica_n1] o.a.s.s.SolrIndexSearcher Opening [Searcher@4a01015e[control_collection_shard1_replica_n1] main]
   [junit4]   2> 2788934 INFO  (qtp1277329185-151596) [n:127.0.0.1:46620_ c:control_collection s:shard1  x:control_collection_shard1_replica_n1] o.a.s.r.ManagedResourceStorage Configured ZooKeeperStorageIO with znodeBase: /configs/conf1
   [junit4]   2> 2788935 INFO  (qtp1277329185-151596) [n:127.0.0.1:46620_ c:control_collection s:shard1  x:control_collection_shard1_replica_n1] o.a.s.r.ManagedResourceStorage Loaded null at path _rest_managed.json using ZooKeeperStorageIO:path=/configs/conf1
   [junit4]   2> 2788935 INFO  (qtp1277329185-151596) [n:127.0.0.1:46620_ c:control_collection s:shard1  x:control_collection_shard1_replica_n1] o.a.s.h.ReplicationHandler Commits will be reserved for 10000ms.
   [junit4]   2> 2788936 INFO  (qtp1277329185-151596) [n:127.0.0.1:46620_ c:control_collection s:shard1  x:control_collection_shard1_replica_n1] o.a.s.u.UpdateLog Could not find max version in index or recent updates, using new clock 1632517119445827584
   [junit4]   2> 2788940 INFO  (searcherExecutor-14017-thread-1-processing-n:127.0.0.1:46620_ x:control_collection_shard1_replica_n1 c:control_collection s:shard1) [n:127.0.0.1:46620_ c:control_collection s:shard1  x:control_collection_shard1_replica_n1] o.a.s.c.SolrCore [control_collection_shard1_replica_n1] Registered new searcher Searcher@4a01015e[control_collection_shard1_replica_n1] main{ExitableDirectoryReader(UninvertingDirectoryReader())}
   [junit4]   2> 2788943 INFO  (qtp1277329185-151596) [n:127.0.0.1:46620_ c:control_collection s:shard1  x:control_collection_shard1_replica_n1] o.a.s.c.ZkShardTerms Successful update of terms at /collections/control_collection/terms/shard1 to Terms{values={core_node2=0}, version=0}
   [junit4]   2> 2788943 INFO  (qtp1277329185-151596) [n:127.0.0.1:46620_ c:control_collection s:shard1  x:control_collection_shard1_replica_n1] o.a.s.c.ShardLeaderElectionContextBase make sure parent is created /collections/control_collection/leaders/shard1
   [junit4]   2> 2788947 INFO  (qtp1277329185-151596) [n:127.0.0.1:46620_ c:control_collection s:shard1  x:control_collection_shard1_replica_n1] o.a.s.c.ShardLeaderElectionContext Enough replicas found to continue.
   [junit4]   2> 2788948 INFO  (qtp1277329185-151596) [n:127.0.0.1:46620_ c:control_collection s:shard1  x:control_collection_shard1_replica_n1] o.a.s.c.ShardLeaderElectionContext I may be the new leader - try and sync
   [junit4]   2> 2788948 INFO  (qtp1277329185-151596) [n:127.0.0.1:46620_ c:control_collection s:shard1  x:control_collection_shard1_replica_n1] o.a.s.c.SyncStrategy Sync replicas to http://127.0.0.1:46620/control_collection_shard1_replica_n1/
   [junit4]   2> 2788948 INFO  (qtp1277329185-151596) [n:127.0.0.1:46620_ c:control_collection s:shard1  x:control_collection_shard1_replica_n1] o.a.s.c.SyncStrategy Sync Success - now sync replicas to me
   [junit4]   2> 2788948 INFO  (qtp1277329185-151596) [n:127.0.0.1:46620_ c:control_collection s:shard1  x:control_collection_shard1_replica_n1] o.a.s.c.SyncStrategy http://127.0.0.1:46620/control_collection_shard1_replica_n1/ has no replicas
   [junit4]   2> 2788948 INFO  (qtp1277329185-151596) [n:127.0.0.1:46620_ c:control_collection s:shard1  x:control_collection_shard1_replica_n1] o.a.s.c.ShardLeaderElectionContextBase Creating leader registration node /collections/control_collection/leaders/shard1/leader after winning as /collections/control_collection/leader_elect/shard1/election/73238840943443972-core_node2-n_0000000000
   [junit4]   2> 2788950 INFO  (qtp1277329185-151596) [n:127.0.0.1:46620_ c:control_collection s:shard1  x:control_collection_shard1_replica_n1] o.a.s.c.ShardLeaderElectionContext I am the new leader: http://127.0.0.1:46620/control_collection_shard1_replica_n1/ shard1
   [junit4]   2> 2789052 INFO  (zkCallback-71512-thread-1) [    ] o.a.s.c.c.ZkStateReader A cluster state change: [WatchedEvent state:SyncConnected type:NodeDataChanged path:/collections/control_collection/state.json] for collection [control_collection] has occurred - updating... (live nodes size: [1])
   [junit4]   2> 2789054 INFO  (qtp1277329185-151596) [n:127.0.0.1:46620_ c:control_collection s:shard1  x:control_collection_shard1_replica_n1] o.a.s.c.ZkController I am the leader, no recovery necessary
   [junit4]   2> 2789056 INFO  (qtp1277329185-151596) [n:127.0.0.1:46620_ c:control_collection s:shard1  x:control_collection_shard1_replica_n1] o.a.s.s.HttpSolrCall [admin] webapp=null path=/admin/cores params={qt=/admin/cores&collection.configName=conf1&newCollection=true&name=control_collection_shard1_replica_n1&action=CREATE&numShards=1&collection=control_collection&shard=shard1&wt=javabin&version=2&replicaType=NRT} status=0 QTime=1379
   [junit4]   2> 2789058 INFO  (zkCallback-71512-thread-2) [    ] o.a.s.c.c.ZkStateReader A cluster state change: [WatchedEvent state:SyncConnected type:NodeDataChanged path:/collections/control_collection/state.json] for collection [control_collection] has occurred - updating... (live nodes size: [1])
   [junit4]   2> 2789074 INFO  (qtp1277329185-151594) [n:127.0.0.1:46620_    ] o.a.s.h.a.CollectionsHandler Wait for new collection to be active for at most 45 seconds. Check all shard replicas
   [junit4]   2> 2789160 INFO  (zkCallback-71512-thread-2) [    ] o.a.s.c.c.ZkStateReader A cluster state change: [WatchedEvent state:SyncConnected type:NodeDataChanged path:/collections/control_collection/state.json] for collection [control_collection] has occurred - updating... (live nodes size: [1])
   [junit4]   2> 2789160 INFO  (zkCallback-71512-thread-3) [    ] o.a.s.c.c.ZkStateReader A cluster state change: [WatchedEvent state:SyncConnected type:NodeDataChanged path:/collections/control_collection/state.json] for collection [control_collection] has occurred - updating... (live nodes size: [1])
   [junit4]   2> 2789160 INFO  (zkCallback-71512-thread-4) [    ] o.a.s.c.c.ZkStateReader A cluster state change: [WatchedEvent state:SyncConnected type:NodeDataChanged path:/collections/control_collection/state.json] for collection [control_collection] has occurred - updating... (live nodes size: [1])
   [junit4]   2> 2789161 INFO  (qtp1277329185-151594) [n:127.0.0.1:46620_    ] o.a.s.s.HttpSolrCall [admin] webapp=null path=/admin/collections params={collection.configName=conf1&name=control_collection&nrtReplicas=1&action=CREATE&numShards=1&createNodeSet=127.0.0.1:46620_&wt=javabin&version=2} status=0 QTime=1597
   [junit4]   2> 2789169 INFO  (zkConnectionManagerCallback-71532-thread-1) [    ] o.a.s.c.c.ConnectionManager zkClient has connected
   [junit4]   2> 2789171 INFO  (TEST-ChaosMonkeyNothingIsSafeTest.test-seed#[F7D80A63C16FF740]) [    ] o.a.s.c.c.ZkStateReader Updated live nodes from ZooKeeper... (0) -> (1)
   [junit4]   2> 2789173 INFO  (TEST-ChaosMonkeyNothingIsSafeTest.test-seed#[F7D80A63C16FF740]) [    ] o.a.s.c.s.i.ZkClientClusterStateProvider Cluster at 127.0.0.1:45775/solr ready
   [junit4]   2> 2789173 INFO  (TEST-ChaosMonkeyNothingIsSafeTest.test-seed#[F7D80A63C16FF740]) [    ] o.a.s.c.ChaosMonkey monkey: init - expire sessions:false cause connection loss:false
   [junit4]   2> 2789175 INFO  (qtp1277329185-151596) [n:127.0.0.1:46620_    ] o.a.s.h.a.CollectionsHandler Invoked Collection Action :create with params collection.configName=conf1&name=collection1&nrtReplicas=1&action=CREATE&numShards=1&createNodeSet=&stateFormat=1&wt=javabin&version=2 and sendToOCPQueue=true
   [junit4]   2> 2789181 INFO  (OverseerCollectionConfigSetProcessor-73238840943443972-127.0.0.1:46620_-n_0000000000) [n:127.0.0.1:46620_    ] o.a.s.c.OverseerTaskQueue Response ZK path: /overseer/collection-queue-work/qnr-0000000000 doesn't exist.  Requestor may have disconnected from ZooKeeper
   [junit4]   2> 2789182 INFO  (OverseerThreadFactory-14012-thread-2-processing-n:127.0.0.1:46620_) [n:127.0.0.1:46620_    ] o.a.s.c.a.c.CreateCollectionCmd Create collection collection1
   [junit4]   2> 2789390 WARN  (OverseerThreadFactory-14012-thread-2-processing-n:127.0.0.1:46620_) [n:127.0.0.1:46620_    ] o.a.s.c.a.c.CreateCollectionCmd It is unusual to create a collection (collection1) without cores.
   [junit4]   2> 2789392 INFO  (qtp1277329185-151596) [n:127.0.0.1:46620_    ] o.a.s.h.a.CollectionsHandler Wait for new collection to be active for at most 45 seconds. Check all shard replicas
   [junit4]   2> 2789393 INFO  (qtp1277329185-151596) [n:127.0.0.1:46620_    ] o.a.s.s.HttpSolrCall [admin] webapp=null path=/admin/collections params={collection.configName=conf1&name=collection1&nrtReplicas=1&action=CREATE&numShards=1&createNodeSet=&stateFormat=1&wt=javabin&version=2} status=0 QTime=218
   [junit4]   2> 2789403 INFO  (TEST-ChaosMonkeyNothingIsSafeTest.test-seed#[F7D80A63C16FF740]) [    ] o.a.s.c.AbstractFullDistribZkTestBase Creating jetty instances pullReplicaCount=0 numOtherReplicas=9
   [junit4]   2> 2789677 INFO  (TEST-ChaosMonkeyNothingIsSafeTest.test-seed#[F7D80A63C16FF740]) [    ] o.a.s.c.AbstractFullDistribZkTestBase create jetty 1 in directory /x1/jenkins/jenkins-slave/workspace/Lucene-Solr-NightlyTests-master/checkout/solr/build/solr-core/test/J2/temp/solr.cloud.ChaosMonkeyNothingIsSafeTest_F7D80A63C16FF740-001/shard-1-001 of type NRT
   [junit4]   2> 2789688 WARN  (closeThreadPool-71533-thread-1) [    ] o.e.j.s.AbstractConnector Ignoring deprecated socket close linger time
   [junit4]   2> 2789690 INFO  (closeThreadPool-71533-thread-1) [    ] o.a.s.c.s.e.JettySolrRunner Start Jetty (original configured port=0)
   [junit4]   2> 2789690 INFO  (closeThreadPool-71533-thread-1) [    ] o.a.s.c.s.e.JettySolrRunner Trying to start Jetty on port 0 try number 1 ...
   [junit4]   2> 2789690 INFO  (closeThreadPool-71533-thread-1) [    ] o.e.j.s.Server jetty-9.4.14.v20181114; built: 2018-11-14T21:20:31.478Z; git: c4550056e785fb5665914545889f21dc136ad9e6; jvm 11.0.1+13-LTS
   [junit4]   2> 2789703 INFO  (closeThreadPool-71533-thread-1) [    ] o.e.j.s.session DefaultSessionIdManager workerName=node0
   [junit4]   2> 2789703 INFO  (closeThreadPool-71533-thread-1) [    ] o.e.j.s.session No SessionScavenger set, using defaults
   [junit4]   2> 2789703 INFO  (closeThreadPool-71533-thread-1) [    ] o.e.j.s.session node0 Scavenging every 660000ms
   [junit4]   2> 2789704 INFO  (closeThreadPool-71533-thread-1) [    ] o.e.j.s.h.ContextHandler Started o.e.j.s.ServletContextHandler@4dad2639{/,null,AVAILABLE}
   [junit4]   2> 2789704 INFO  (closeThreadPool-71533-thread-1) [    ] o.e.j.s.AbstractConnector Started ServerConnector@7645854{HTTP/1.1,[http/1.1, h2c]}{127.0.0.1:45990}
   [junit4]   2> 2789705 INFO  (closeThreadPool-71533-thread-1) [    ] o.e.j.s.Server Started @2789753ms
   [junit4]   2> 2789705 INFO  (closeThreadPool-71533-thread-1) [    ] o.a.s.c.s.e.JettySolrRunner Jetty properties: {hostContext=/, solrconfig=solrconfig.xml, solr.data.dir=/x1/jenkins/jenkins-slave/workspace/Lucene-Solr-NightlyTests-master/checkout/solr/build/solr-core/test/J2/temp/solr.cloud.ChaosMonkeyNothingIsSafeTest_F7D80A63C16FF740-001/tempDir-001/jetty1, hostPort=45990, coreRootDirectory=/x1/jenkins/jenkins-slave/workspace/Lucene-Solr-NightlyTests-master/checkout/solr/build/solr-core/test/J2/../../../../../../../../../../../x1/jenkins/jenkins-slave/workspace/Lucene-Solr-NightlyTests-master/checkout/solr/build/solr-core/test/J2/temp/solr.cloud.ChaosMonkeyNothingIsSafeTest_F7D80A63C16FF740-001/shard-1-001/cores}
   [junit4]   2> 2789705 ERROR (closeThreadPool-71533-thread-1) [    ] o.a.s.u.StartupLoggingUtils Missing Java Option solr.log.dir. Logging may be missing or incomplete.
   [junit4]   2> 2789705 INFO  (closeThreadPool-71533-thread-1) [    ] o.a.s.s.SolrDispatchFilter Using logger factory org.apache.logging.slf4j.Log4jLoggerFactory
   [junit4]   2> 2789705 INFO  (closeThreadPool-71533-thread-1) [    ] o.a.s.s.SolrDispatchFilter  ___      _       Welcome to Apache Solr? version 9.0.0
   [junit4]   2> 2789705 INFO  (closeThreadPool-71533-thread-1) [    ] o.a.s.s.SolrDispatchFilter / __| ___| |_ _   Starting in cloud mode on port null
   [junit4]   2> 2789705 INFO  (closeThreadPool-71533-thread-1) [    ] o.a.s.s.SolrDispatchFilter \__ \/ _ \ | '_|  Install dir: null
   [junit4]   2> 2789705 INFO  (closeThreadPool-71533-thread-1) [    ] o.a.s.s.SolrDispatchFilter |___/\___/_|_|    Start time: 2019-05-03T13:20:48.678685Z
   [junit4]   2> 2789708 INFO  (zkConnectionManagerCallback-71535-thread-1) [    ] o.a.s.c.c.ConnectionManager zkClient has connected
   [junit4]   2> 2789709 INFO  (closeThreadPool-71533-thread-1) [    ] o.a.s.s.SolrDispatchFilter Loading solr.xml from SolrHome (not found in ZooKeeper)
   [junit4]   2> 2789709 INFO  (closeThreadPool-71533-thread-1) [    ] o.a.s.c.SolrXmlConfig Loading container configuration from /x1/jenkins/jenkins-slave/workspace/Lucene-Solr-NightlyTests-master/checkout/solr/build/solr-core/test/J2/temp/solr.cloud.ChaosMonkeyNothingIsSafeTest_F7D80A63C16FF740-001/shard-1-001/solr.xml
   [junit4]   2> 2789713 INFO  (closeThreadPool-71533-thread-1) [    ] o.a.s.c.SolrXmlConfig Configuration parameter autoReplicaFailoverWorkLoopDelay is ignored
   [junit4]   2> 2789713 INFO  (closeThreadPool-71533-thread-1) [    ] o.a.s.c.SolrXmlConfig Configuration parameter autoReplicaFailoverBadNodeExpiration is ignored
   [junit4]   2> 2789715 INFO  (closeThreadPool-71533-thread-1) [    ] o.a.s.c.SolrXmlConfig MBean server found: com.sun.jmx.mbeanserver.JmxMBeanServer@50e707b6, but no JMX reporters were configured - adding default JMX reporter.
   [junit4]   2> 2790136 INFO  (closeThreadPool-71533-thread-1) [    ] o.a.s.h.c.HttpShardHandlerFactory Host whitelist initialized: WhitelistHostChecker [whitelistHosts=null, whitelistHostCheckingEnabled=false]
   [junit4]   2> 2790139 WARN  (closeThreadPool-71533-thread-1) [    ] o.e.j.u.s.S.config No Client EndPointIdentificationAlgorithm configured for SslContextFactory@488e0ef0[provider=null,keyStore=null,trustStore=null]
   [junit4]   2> 2790144 WARN  (closeThreadPool-71533-thread-1) [    ] o.e.j.u.s.S.config No Client EndPointIdentificationAlgorithm configured for SslContextFactory@62ad7a36[provider=null,keyStore=null,trustStore=null]
   [junit4]   2> 2790145 INFO  (closeThreadPool-71533-thread-1) [    ] o.a.s.c.ZkContainer Zookeeper client=127.0.0.1:45775/solr
   [junit4]   2> 2790148 INFO  (zkConnectionManagerCallback-71542-thread-1) [    ] o.a.s.c.c.ConnectionManager zkClient has connected
   [junit4]   2> 2790163 INFO  (zkConnectionManagerCallback-71544-thread-1) [    ] o.a.s.c.c.ConnectionManager zkClient has connected
   [junit4]   2> 2790173 INFO  (closeThreadPool-71533-thread-1) [n:127.0.0.1:45990_    ] o.a.s.c.c.ZkStateReader Updated live nodes from ZooKeeper... (0) -> (1)
   [junit4]   2> 2790179 INFO  (closeThreadPool-71533-thread-1) [n:127.0.0.1:45990_    ] o.a.s.c.ZkController Publish node=127.0.0.1:45990_ as DOWN
   [junit4]   2> 2790181 INFO  (closeThreadPool-71533-thread-1) [n:127.0.0.1:45990_    ] o.a.s.c.TransientSolrCoreCacheDefault Allocating transient cache for 4 transient cores
   [junit4]   2> 2790181 INFO  (closeThreadPool-71533-thread-1) [n:127.0.0.1:45990_    ] o.a.s.c.ZkController Register node as live in ZooKeeper:/live_nodes/127.0.0.1:45990_
   [junit4]   2> 2790183 INFO  (zkCallback-71531-thread-1) [    ] o.a.s.c.c.ZkStateReader Updated live nodes from ZooKeeper... (1) -> (2)
   [junit4]   2> 2790183 INFO  (zkCallback-71519-thread-1) [    ] o.a.s.c.c.ZkStateReader Updated live nodes from ZooKeeper... (1) -> (2)
   [junit4]   2> 2790183 INFO  (zkCallback-71512-thread-2) [    ] o.a.s.c.c.ZkStateReader Updated live nodes from ZooKeeper... (1) -> (2)
   [junit4]   2> 2790184 INFO  (zkCallback-71543-thread-1) [    ] o.a.s.c.c.ZkStateReader Updated live nodes from ZooKeeper... (1) -> (2)
   [junit4]   2> 2790218 INFO  (TEST-ChaosMonkeyNothingIsSafeTest.test-seed#[F7D80A63C16FF740]) [    ] o.a.s.c.AbstractFullDistribZkTestBase create jetty 2 in directory /x1/jenkins/jenkins-slave/workspace/Lucene-Solr-NightlyTests-master/checkout/solr/build/solr-core/test/J2/temp/solr.cloud.ChaosMonkeyNothingIsSafeTest_F7D80A63C16FF740-001/shard-2-001 of type NRT
   [junit4]   2> 2790222 INFO  (zkConnectionManagerCallback-71551-thread-1) [    ] o.a.s.c.c.ConnectionManager zkClient has connected
   [junit4]   2> 2790227 INFO  (closeThreadPool-71533-thread-1) [n:127.0.0.1:45990_    ] o.a.s.c.c.ZkStateReader Updated live nodes from ZooKeeper... (0) -> (2)
   [junit4]   2> 2790229 INFO  (closeThreadPool-71533-thread-1) [n:127.0.0.1:45990_    ] o.a.s.c.s.i.ZkClientClusterStateProvider Cluster at 127.0.0.1:45775/solr ready
   [junit4]   2> 2790230 INFO  (closeThreadPool-71533-thread-1) [n:127.0.0.1:45990_    ] o.a.s.h.a.MetricsHistoryHandler No .system collection, keeping metrics history in memory.
   [junit4]   2> 2790231 WARN  (closeThreadPool-71533-thread-2) [    ] o.e.j.s.AbstractConnector Ignoring deprecated socket close linger time
   [junit4]   2> 2790232 INFO  (closeThreadPool-71533-thread-2) [    ] o.a.s.c.s.e.JettySolrRunner Start Jetty (original configured port=0)
   [junit4]   2> 2790238 INFO  (closeThreadPool-71533-thread-2) [    ] o.a.s.c.s.e.JettySolrRunner Trying to start Jetty on port 0 try number 1 ...
   [junit4]   2> 2790238 INFO  (closeThreadPool-71533-thread-2) [    ] o.e.j.s.Server jetty-9.4.14.v20181114; built: 2018-11-14T21:20:31.478Z; git: c4550056e785fb5665914545889f21dc136ad9e6; jvm 11.0.1+13-LTS
   [junit4]   2> 2790243 INFO  (closeThreadPool-71533-thread-2) [    ] o.e.j.s.session DefaultSessionIdManager workerName=node0
   [junit4]   2> 2790243 INFO  (closeThreadPool-71533-thread-2) [    ] o.e.j.s.session No SessionScavenger set, using defaults
   [junit4]   2> 2790243 INFO  (closeThreadPool-71533-thread-2) [    ] o.e.j.s.session node0 Scavenging every 660000ms
   [junit4]   2> 2790244 INFO  (closeThreadPool-71533-thread-2) [    ] o.e.j.s.h.ContextHandler Started o.e.j.s.ServletContextHandler@79dff35f{/,null,AVAILABLE}
   [junit4]   2> 2790244 INFO  (closeThreadPool-71533-thread-2) [    ] o.e.j.s.AbstractConnector Started ServerConnector@26c7f459{HTTP/1.1,[http/1.1, h2c]}{127.0.0.1:34979}
   [junit4]   2> 2790244 INFO  (closeThreadPool-71533-thread-2) [    ] o.e.j.s.Server Started @2790293ms
   [junit4]   2> 2790244 INFO  (closeThreadPool-71533-thread-2) [    ] o.a.s.c.s.e.JettySolrRunner Jetty properties: {hostContext=/, solrconfig=solrconfig.xml, solr.data.dir=/x1/jenkins/jenkins-slave/workspace/Lucene-Solr-NightlyTests-master/checkout/solr/build/solr-core/test/J2/temp/solr.cloud.ChaosMonkeyNothingIsSafeTest_F7D80A63C16FF740-001/tempDir-001/jetty2, hostPort=34979, coreRootDirectory=/x1/jenkins/jenkins-slave/workspace/Lucene-Solr-NightlyTests-master/checkout/solr/build/solr-core/test/J2/../../../../../../../../../../../x1/jenkins/jenkins-slave/workspace/Lucene-Solr-NightlyTests-master/checkout/solr/build/solr-core/test/J2/temp/solr.cloud.ChaosMonkeyNothingIsSafeTest_F7D80A63C16FF740-001/shard-2-001/cores}
   [junit4]   2> 2790245 ERROR (closeThreadPool-71533-thread-2) [    ] o.a.s.u.StartupLoggingUtils Missing Java Option solr.log.dir. Logging may be missing or incomplete.
   [junit4]   2> 2790245 INFO  (closeThreadPool-71533-thread-2) [    ] o.a.s.s.SolrDispatchFilter Using logger factory org.apache.logging.slf4j.Log4jLoggerFactory
   [junit4]   2> 2790245 INFO  (closeThreadPool-71533-thread-2) [    ] o.a.s.s.SolrDispatchFilter  ___      _       Welcome to Apache Solr? version 9.0.0
   [junit4]   2> 2790245 INFO  (closeThreadPool-71533-thread-2) [    ] o.a.s.s.SolrDispatchFilter / __| ___| |_ _   Starting in cloud mode on port null
   [junit4]   2> 2790245 INFO  (closeThreadPool-71533-thread-2) [    ] o.a.s.s.SolrDispatchFilter \__ \/ _ \ | '_|  Install dir: null
   [junit4]   2> 2790245 INFO  (closeThreadPool-71533-thread-2) [    ] o.a.s.s.SolrDispatchFilter |___/\___/_|_|    Start time: 2019-05-03T13:20:49.218888Z
   [junit4]   2> 2790257 INFO  (zkConnectionManagerCallback-71554-thread-1) [    ] o.a.s.c.c.ConnectionManager zkClient has connected
   [junit4]   2> 2790261 INFO  (closeThreadPool-71533-thread-2) [    ] o.a.s.s.SolrDispatchFilter Loading solr.xml from SolrHome (not found in ZooKeeper)
   [junit4]   2> 2790261 INFO  (closeThreadPool-71533-thread-2) [    ] o.a.s.c.SolrXmlConfig Loading container configuration from /x1/jenkins/jenkins-slave/workspace/Lucene-Solr-NightlyTests-master/checkout/solr/build/solr-core/test/J2/temp/solr.cloud.ChaosMonkeyNothingIsSafeTest_F7D80A63C16FF740-001/shard-2-001/solr.xml
   [junit4]   2> 2790265 INFO  (closeThreadPool-71533-thread-2) [    ] o.a.s.c.SolrXmlConfig Configuration parameter autoReplicaFailoverWorkLoopDelay is ignored
   [junit4]   2> 2790265 INFO  (closeThreadPool-71533-thread-2) [    ] o.a.s.c.SolrXmlConfig Configuration parameter autoReplicaFailoverBadNodeExpiration is ignored
   [junit4]   2> 2790268 INFO  (closeThreadPool-71533-thread-2) [    ] o.a.s.c.SolrXmlConfig MBean server found: com.sun.jmx.mbeanserver.JmxMBeanServer@50e707b6, but no JMX reporters were configured - adding default JMX reporter.
   [junit4]   2> 2790357 INFO  (closeThreadPool-71533-thread-1) [n:127.0.0.1:45990_    ] o.a.s.m.r.SolrJmxReporter JMX monitoring for 'solr.node' (registry 'solr.node') enabled at server: com.sun.jmx.mbeanserver.JmxMBeanServer@50e707b6
   [junit4]   2> 2790396 INFO  (closeThreadPool-71533-thread-1) [n:127.0.0.1:45990_    ] o.a.s.m.r.SolrJmxReporter JMX monitoring for 'solr.jvm' (registry 'solr.jvm') enabled at server: com.sun.jmx.mbeanserver.JmxMBeanServer@50e707b6
   [junit4]   2> 2790396 INFO  (closeThreadPool-71533-thread-1) [n:127.0.0.1:45990_    ] o.a.s.m.r.SolrJmxReporter JMX monitoring for 'solr.jetty' (registry 'solr.jetty') enabled at server: com.sun.jmx.mbeanserver.JmxMBeanServer@50e707b6
   [junit4]   2> 2790429 INFO  (closeThreadPool-71533-thread-1) [n:127.0.0.1:45990_    ] o.a.s.c.CorePropertiesLocator Found 0 core definitions underneath /x1/jenkins/jenkins-slave/workspace/Lucene-Solr-NightlyTests-master/checkout/solr/build/solr-core/test/J2/../../../../../../../../../../../x1/jenkins/jenkins-slave/workspace/Lucene-Solr-NightlyTests-master/checkout/solr/build/solr-core/test/J2/temp/solr.cloud.ChaosMonkeyNothingIsSafeTest_F7D80A63C16FF740-001/shard-1-001/cores
   [junit4]   2> 2790573 INFO  (closeThreadPool-71533-thread-2) [    ] o.a.s.h.c.HttpShardHandlerFactory Host whitelist initialized: WhitelistHostChecker [whitelistHosts=null, whitelistHostCheckingEnabled=false]
   [junit4]   2> 2790574 WARN  (closeThreadPool-71533-thread-2) [    ] o.e.j.u.s.S.config No Client EndPointIdentificationAlgorithm configured for SslContextFactory@74076aa6[provider=null,keyStore=null,trustStore=null]
   [junit4]   2> 2790578 WARN  (closeThreadPool-71533-thread-2) [    ] o.e.j.u.s.S.config No Client EndPointIdentificationAlgorithm configured for SslContextFactory@71057bc1[provider=null,keyStore=null,trustStore=null]
   [junit4]   2> 2790580 INFO  (closeThreadPool-71533-thread-2) [    ] o.a.s.c.ZkContainer Zookeeper client=127.0.0.1:45775/solr
   [junit4]   2> 2790587 INFO  (zkConnectionManagerCallback-71561-thread-1) [    ] o.a.s.c.c.ConnectionManager zkClient has connected
   [junit4]   2> 2790599 INFO  (zkConnectionManagerCallback-71563-thread-1) [    ] o.a.s.c.c.ConnectionManager zkClient has connected
   [junit4]   2> 2790618 INFO  (closeThreadPool-71533-thread-2) [n:127.0.0.1:34979_    ] o.a.s.c.c.ZkStateReader Updated live nodes from ZooKeeper... (0) -> (2)
   [junit4]   2> 2790621 INFO  (TEST-ChaosMonkeyNothingIsSafeTest.test-seed#[F7D80A63C16FF740]) [    ] o.a.s.c.AbstractFullDistribZkTestBase create jetty 3 in directory /x1/jenkins/jenkins-slave/workspace/Lucene-Solr-NightlyTests-master/checkout/solr/build/solr-core/test/J2/temp/solr.cloud.ChaosMonkeyNothingIsSafeTest_F7D80A63C16FF740-001/shard-3-001 of type NRT
   [junit4]   2> 2790621 WARN  (closeThreadPool-71533-thread-1) [    ] o.e.j.s.AbstractConnector Ignoring deprecated socket close linger time
   [junit4]   2> 2790622 INFO  (closeThreadPool-71533-thread-1) [    ] o.a.s.c.s.e.JettySolrRunner Start Jetty (original configured port=0)
   [junit4]   2> 2790622 INFO  (closeThreadPool-71533-thread-1) [    ] o.a.s.c.s.e.JettySolrRunner Trying to start Jetty on port 0 try number 1 ...
   [junit4]   2> 2790622 INFO  (closeThreadPool-71533-thread-1) [    ] o.e.j.s.Server jetty-9.4.14.v20181114; built: 2018-11-14T21:20:31.478Z; git: c4550056e785fb5665914545889f21dc136ad9e6; jvm 11.0.1+13-LTS
   [junit4]   2> 2790628 INFO  (closeThreadPool-71533-thread-2) [n:127.0.0.1:34979_    ] o.a.s.c.ZkController Publish node=127.0.0.1:34979_ as DOWN
   [junit4]   2> 2790632 INFO  (closeThreadPool-71533-thread-2) [n:127.0.0.1:34979_    ] o.a.s.c.TransientSolrCoreCacheDefault Allocating transient cache for 4 transient cores
   [junit4]   2> 2790633 INFO  (closeThreadPool-71533-thread-2) [n:127.0.0.1:34979_    ] o.a.s.c.ZkController Register node as live in ZooKeeper:/live_nodes/127.0.0.1:34979_
   [junit4]   2> 2790634 INFO  (zkCallback-71543-thread-1) [    ] o.a.s.c.c.ZkStateReader Updated live nodes from ZooKeeper... (2) -> (3)
   [junit4]   2> 2790634 INFO  (zkCallback-71519-thread-1) [    ] o.a.s.c.c.ZkStateReader Updated live nodes from ZooKeeper... (2) -> (3)
   [junit4]   2> 2790634 INFO  (zkCallback-71531-thread-1) [    ] o.a.s.c.c.ZkStateReader Updated live nodes from ZooKeeper... (2) -> (3)
   [junit4]   2> 2790756 INFO  (zkCallback-71512-thread-2) [    ] o.a.s.c.c.ZkStateReader Updated live nodes from ZooKeeper... (2) -> (3)
   [junit4]   2> 2790756 INFO  (zkCallback-71550-thread-1) [    ] o.a.s.c.c.ZkStateReader Updated live nodes from ZooKeeper... (2) -> (3)
   [junit4]   2> 2790757 INFO  (zkCallback-71562-thread-1) [    ] o.a.s.c.c.ZkStateReader Updated live nodes from ZooKeeper... (2) -> (3)
   [junit4]   2> 2790758 INFO  (closeThreadPool-71533-thread-1) [    ] o.e.j.s.session DefaultSessionIdManager workerName=node0
   [junit4]   2> 2790758 INFO  (closeThreadPool-71533-thread-1) [    ] o.e.j.s.session No SessionScavenger set, using defaults
   [junit4]   2> 2790758 INFO  (closeThreadPool-71533-thread-1) [    ] o.e.j.s.session node0 Scavenging every 600000ms
   [junit4]   2> 2790758 INFO  (closeThreadPool-71533-thread-1) [    ] o.e.j.s.h.ContextHandler Started o.e.j.s.ServletContextHandler@4cee0ee5{/,null,AVAILABLE}
   [junit4]   2> 2790759 INFO  (closeThreadPool-71533-thread-1) [    ] o.e.j.s.AbstractConnector Started ServerConnector@54c76b06{HTTP/1.1,[http/1.1, h2c]}{127.0.0.1:34500}
   [junit4]   2> 2790759 INFO  (closeThreadPool-71533-thread-1) [    ] o.e.j.s.Server Started @2790807ms
   [junit4]   2> 2790759 INFO  (closeThreadPool-71533-thread-1) [    ] o.a.s.c.s.e.JettySolrRunner Jetty properties: {hostContext=/, solrconfig=solrconfig.xml, solr.data.dir=/x1/jenkins/jenkins-slave/workspace/Lucene-Solr-NightlyTests-master/checkout/solr/build/solr-core/test/J2/temp/solr.cloud.ChaosMonkeyNothingIsSafeTest_F7D80A63C16FF740-001/tempDir-001/jetty3, hostPort=34500, coreRootDirectory=/x1/jenkins/jenkins-slave/workspace/Lucene-Solr-NightlyTests-master/checkout/solr/build/solr-core/test/J2/temp/solr.cloud.ChaosMonkeyNothingIsSafeTest_F7D80A63C16FF740-001/shard-3-001/cores, replicaType=NRT}
   [junit4]   2> 2790760 ERROR (closeThreadPool-71533-thread-1) [    ] o.a.s.u.StartupLoggingUtils Missing Java Option solr.log.dir. Logging may be missing or incomplete.
   [junit4]   2> 2790760 INFO  (closeThreadPool-71533-thread-1) [    ] o.a.s.s.SolrDispatchFilter Using logger factory org.apache.logging.slf4j.Log4jLoggerFactory
   [junit4]   2> 2790760 INFO  (closeThreadPool-71533-thread-1) [    ] o.a.s.s.SolrDispatchFilter  ___      _       Welcome to Apache Solr? version 9.0.0
   [junit4]   2> 2790760 INFO  (closeThreadPool-71533-thread-1) [    ] o.a.s.s.SolrDispatchFilter / __| ___| |_ _   Starting in cloud mode on port null
   [junit4]   2> 2790760 INFO  (closeThreadPool-71533-thread-1) [    ] o.a.s.s.SolrDispatchFilter \__ \/ _ \ | '_|  Install dir: null
   [junit4]   2> 2790760 INFO  (closeThreadPool-71533-thread-1) [    ] o.a.s.s.SolrDispatchFilter |___/\___/_|_|    Start time: 2019-05-03T13:20:49.733365Z
   [junit4]   2> 2790779 INFO  (zkConnectionManagerCallback-71567-thread-1) [    ] o.a.s.c.c.ConnectionManager zkClient has connected
   [junit4]   2> 2790781 INFO  (closeThreadPool-71533-thread-1) [    ] o.a.s.s.SolrDispatchFilter Loading solr.xml from SolrHome (not found in ZooKeeper)
   [junit4]   2> 2790781 INFO  (closeThreadPool-71533-thread-1) [    ] o.a.s.c.SolrXmlConfig Loading container configuration from /x1/jenkins/jenkins-slave/workspace/Lucene-Solr-NightlyTests-master/checkout/solr/build/solr-core/test/J2/temp/solr.cloud.ChaosMonkeyNothingIsSafeTest_F7D80A63C16FF740-001/shard-3-001/solr.xml
   [junit4]   2> 2790785 INFO  (closeThreadPool-71533-thread-1) [    ] o.a.s.c.SolrXmlConfig Configuration parameter autoReplicaFailoverWorkLoopDelay is ignored
   [junit4]   2> 2790785 INFO  (closeThreadPool-71533-thread-1) [    ] o.a.s.c.SolrXmlConfig Configuration parameter autoReplicaFailoverBadNodeExpiration is ignored
   [junit4]   2> 2790787 INFO  (closeThreadPool-71533-thread-1) [    ] o.a.s.c.SolrXmlConfig MBean server found: com.sun.jmx.mbeanserver.JmxMBeanServer@50e707b6, but no JMX reporters were configured - adding default JMX reporter.
   [junit4]   2> 2790812 INFO  (zkConnectionManagerCallback-71572-thread-1) [    ] o.a.s.c.c.ConnectionManager zkClient has connected
   [junit4]   2> 2790818 INFO  (closeThreadPool-71533-thread-2) [n:127.0.0.1:34979_    ] o.a.s.c.c.ZkStateReader Updated live nodes from ZooKeeper... (0) -> (3)
   [junit4]   2> 2790821 INFO  (closeThreadPool-71533-thread-2) [n:127.0.0.1:34979_    ] o.a.s.c.s.i.ZkClientClusterStateProvider Cluster at 127.0.0.1:45775/solr ready
   [junit4]   2> 2790825 INFO  (closeThreadPool-71533-thread-2) [n:127.0.0.1:34979_    ] o.a.s.h.a.MetricsHistoryHandler No .system collection, keeping metrics history in memory.
   [junit4]   2> 2790906 INFO  (closeThreadPool-71533-thread-2) [n:127.0.0.1:34979_    ] o.a.s.m.r.SolrJmxReporter JMX monitoring for 'solr.node' (registry 'solr.node') enabled at server: com.sun.jmx.mbeanserver.JmxMBeanServer@50e707b6
   [junit4]   2> 2790979 INFO  (closeThreadPool-71533-thread-2) [n:127.0.0.1:34979_    ] o.a.s.m.r.SolrJmxReporter JMX monitoring for 'solr.jvm' (registry 'solr.jvm') enabled at server: com.sun.jmx.mbeanserver.JmxMBeanServer@50e707b6
   [junit4]   2> 2790982 INFO  (closeThreadPool-71533-thread-2) [n:127.0.0.1:34979_    ] o.a.s.m.r.SolrJmxReporter JMX monitoring for 'solr.jetty' (registry 'solr.jetty') enabled at server: com.sun.jmx.mbeanserver.JmxMBeanServer@50e707b6
   [junit4]   2> 2790991 INFO  (closeThreadPool-71533-thread-2) [n:127.0.0.1:34979_    ] o.a.s.c.CorePropertiesLocator Found 0 core definitions underneath /x1/jenkins/jenkins-slave/workspace/Lucene-Solr-NightlyTests-master/checkout/solr/build/solr-core/test/J2/../../../../../../../../../../../x1/jenkins/jenkins-slave/workspace/Lucene-Solr-NightlyTests-master/checkout/solr/build/solr-core/test/J2/temp/solr.cloud.ChaosMonkeyNothingIsSafeTest_F7D80A63C16FF740-001/shard-2-001/cores
   [junit4]   2> 2791150 INFO  (closeThreadPool-71533-thread-1) [    ] o.a.s.h.c.HttpShardHandlerFactory Host whitelist initialized: WhitelistHostChecker [whitelistHosts=null, whitelistHostCheckingEnabled=false]
   [junit4]   2> 2791161 WARN  (closeThreadPool-71533-thread-1) [    ] o.e.j.u.s.S.config No Client EndPointIdentificationAlgorithm configured for SslContextFactory@53dba72[provider=null,keyStore=null,trustStore=null]
   [junit4]   2> 2791162 INFO  (TEST-ChaosMonkeyNothingIsSafeTest.test-seed#[F7D80A63C16FF740]) [    ] o.a.s.c.AbstractFullDistribZkTestBase create jetty 4 in directory /x1/jenkins/jenkins-slave/workspace/Lucene-Solr-NightlyTests-master/checkout/solr/build/solr-core/test/J2/temp/solr.cloud.ChaosMonkeyNothingIsSafeTest_F7D80A63C16FF740-001/shard-4-001 of type NRT
   [junit4]   2> 2791163 WARN  (closeThreadPool-71533-thread-2) [    ] o.e.j.s.AbstractConnector Ignoring deprecated socket close linger time
   [junit4]   2> 2791163 INFO  (closeThreadPool-71533-thread-2) [    ] o.a.s.c.s.e.JettySolrRunner Start Jetty (original configured port=0)
   [junit4]   2> 2791163 INFO  (closeThreadPool-71533-thread-2) [    ] o.a.s.c.s.e.JettySolrRunner Trying to start Jetty on port 0 try number 1 ...
   [junit4]   2> 2791163 INFO  (closeThreadPool-71533-thread-2) [    ] o.e.j.s.Server jetty-9.4.14.v20181114; built: 2018-11-14T21:20:31.478Z; git: c4550056e785fb5665914545889f21dc136ad9e6; jvm 11.0.1+13-LTS
   [junit4]   2> 2791186 WARN  (closeThreadPool-71533-thread-1) [    ] o.e.j.u.s.S.config No Client EndPointIdentificationAlgorithm configured for SslContextFactory@4c5ee943[provider=null,keyStore=null,trustStore=null]
   [junit4]   2> 2791188 INFO  (closeThreadPool-71533-thread-1) [    ] o.a.s.c.ZkContainer Zookeeper client=127.0.0.1:45775/solr
   [junit4]   2> 2791189 INFO  (OverseerCollectionConfigSetProcessor-73238840943443972-127.0.0.1:46620_-n_0000000000) [n:127.0.0.1:46620_    ] o.a.s.c.OverseerTaskQueue Response ZK path: /overseer/collection-queue-work/qnr-0000000002 doesn't exist.  Requestor may have disconnected from ZooKeeper
   [junit4]   2> 2791201 INFO  (closeThreadPool-71533-thread-2) [    ] o.e.j.s.session DefaultSessionIdManager workerName=node0
   [junit4]   2> 2791201 INFO  (closeThreadPool-71533-thread-2) [    ] o.e.j.s.session No SessionScavenger set, using defaults
   [junit4]   2> 2791201 INFO  (closeThreadPool-71533-thread-2) [    ] o.e.j.s.session node0 Scavenging every 660000ms
   [junit4]   2> 2791201 INFO  (closeThreadPool-71533-thread-2) [    ] o.e.j.s.h.ContextHandler Started o.e.j.s.ServletContextHandler@66448c39{/,null,AVAILABLE}
   [junit4]   2> 2791202 INFO  (closeThreadPool-71533-thread-2) [    ] o.e.j.s.AbstractConnector Started ServerConnector@4153387a{HTTP/1.1,[http/1.1, h2c]}{127.0.0.1:34553}
   [junit4]   2> 2791202 INFO  (closeThreadPool-71533-thread-2) [    ] o.e.j.s.Server Started @2791251ms
   [junit4]   2> 2791202 INFO  (closeThreadPool-71533-thread-2) [    ] o.a.s.c.s.e.JettySolrRunner Jetty properties: {hostContext=/, solrconfig=solrconfig.xml, solr.data.dir=/x1/jenkins/jenkins-slave/workspace/Lucene-Solr-NightlyTests-master/checkout/solr/build/solr-core/test/J2/temp/solr.cloud.ChaosMonkeyNothingIsSafeTest_F7D80A63C16FF740-001/tempDir-001/jetty4, hostPort=34553, coreRootDirectory=/x1/jenkins/jenkins-slave/workspace/Lucene-Solr-NightlyTests-master/checkout/solr/build/solr-core/test/J2/temp/solr.cloud.ChaosMonkeyNothingIsSafeTest_F7D80A63C16FF740-001/shard-4-001/cores, replicaType=NRT}
   [junit4]   2> 2791203 ERROR (closeThreadPool-71533-thread-2) [    ] o.a.s.u.StartupLoggingUtils Missing Java Option solr.log.dir. Logging may be missing or incomplete.
   [junit4]   2> 2791203 INFO  (closeThreadPool-71533-thread-2) [    ] o.a.s.s.SolrDispatchFilter Using logger factory org.apache.logging.slf4j.Log4jLoggerFactory
   [junit4]   2> 2791203 INFO  (closeThreadPool-71533-thread-2) [    ] o.a.s.s.SolrDispatchFilter  ___      _       Welcome to Apache Solr? version 9.0.0
   [junit4]   2> 2791203 INFO  (closeThreadPool-71533-thread-2) [    ] o.a.s.s.SolrDispatchFilter / __| ___| |_ _   Starting in cloud mode on port null
   [junit4]   2> 2791203 INFO  (closeThreadPool-71533-thread-2) [    ] o.a.s.s.SolrDispatchFilter \__ \/ _ \ | '_|  Install dir: null
   [junit4]   2> 2791203 INFO  (closeThreadPool-71533-thread-2) [    ] o.a.s.s.SolrDispatchFilter |___/\___/_|_|    Start time: 2019-05-03T13:20:50.176562Z
   [junit4]   2> 2791205 INFO  (zkConnectionManagerCallback-71580-thread-1) [    ] o.a.s.c.c.ConnectionManager zkClient has connected
   [junit4]   2> 2791211 INFO  (zkConnectionManagerCallback-71582-thread-1) [    ] o.a.s.c.c.ConnectionManager zkClient has connected
   [junit4]   2> 2791216 INFO  (closeThreadPool-71533-thread-2) [    ] o.a.s.s.SolrDispatchFilter Loading solr.xml from SolrHome (not found in ZooKeeper)
   [junit4]   2> 2791216 INFO  (closeThreadPool-71533-thread-2) [    ] o.a.s.c.SolrXmlConfig Loading container configuration from /x1/jenkins/jenkins-slave/workspace/Lucene-Solr-NightlyTests-master/checkout/solr/build/solr-core/test/J2/temp/solr.cloud.ChaosMonkeyNothingIsSafeTest_F7D80A63C16FF740-001/shard-4-001/solr.xml
   [junit4]   2> 2791223 INFO  (closeThreadPool-71533-thread-2) [    ] o.a.s.c.SolrXmlConfig Configuration parameter autoReplicaFailoverWorkLoopDelay is ignored
   [junit4]   2> 2791223 INFO  (closeThreadPool-71533-thread-2) [    ] o.a.s.c.SolrXmlConfig Configuration parameter autoReplicaFailoverBadNodeExpiration is ignored
   [junit4]   2> 2791226 INFO  (closeThreadPool-71533-thread-2) [    ] o.a.s.c.SolrXmlConfig MBean server found: com.sun.jmx.mbeanserver.JmxMBeanServer@50e707b6, but no JMX reporters were configured - adding default JMX reporter.
   [junit4]   2> 2791236 INFO  (zkConnectionManagerCallback-71584-thread-1) [    ] o.a.s.c.c.ConnectionManager zkClient has connected
   [junit4]   2> 2791250 INFO  (closeThreadPool-71533-thread-1) [    ] o.a.s.c.c.ZkStateReader Updated live nodes from ZooKeeper... (0) -> (3)
   [junit4]   2> 2791269 INFO  (closeThreadPool-71533-thread-1) [    ] o.a.s.c.ZkController Publish node=127.0.0.1:34500_ as DOWN
   [junit4]   2> 2791278 INFO  (closeThreadPool-71533-thread-1) [    ] o.a.s.c.TransientSolrCoreCacheDefault Allocating transient cache for 4 transient cores
   [junit4]   2> 2791278 INFO  (closeThreadPool-71533-thread-1) [    ] o.a.s.c.ZkController Register node as live in ZooKeeper:/live_nodes/127.0.0.1:34500_
   [junit4]   2> 2791280 INFO  (zkCallback-71531-thread-1) [    ] o.a.s.c.c.ZkStateReader Updated live nodes from ZooKeeper... (3) -> (4)
   [junit4]   2> 2791280 INFO  (zkCallback-71543-thread-1) [    ] o.a.s.c.c.ZkStateReader Updated live nodes from ZooKeeper... (3) -> (4)
   [junit4]   2> 2791281 INFO  (zkCallback-71519-thread-1) [    ] o.a.s.c.c.ZkStateReader Updated live nodes from ZooKeeper... (3) -> (4)
   [junit4]   2> 2791282 INFO  (zkCallback-71512-thread-2) [    ] o.a.s.c.c.ZkStateReader Updated live nodes from ZooKeeper... (3) -> (4)
   [junit4]   2> 2791282 INFO  (zkCallback-71562-thread-1) [    ] o.a.s.c.c.ZkStateReader Updated live nodes from ZooKeeper... (3) -> (4)
   [junit4]   2> 2791282 INFO  (zkCallback-71550-thread-1) [    ] o.a.s.c.c.ZkStateReader Updated live nodes from ZooKeeper... (3) -> (4)
   [junit4]   2> 2791340 INFO  (zkCallback-71571-thread-1) [    ] o.a.s.c.c.ZkStateReader Updated live nodes from ZooKeeper... (3) -> (4)
   [junit4]   2> 2791343 INFO  (zkCallback-71583-thread-1) [    ] o.a.s.c.c.ZkStateReader Updated live nodes from ZooKeeper... (3) -> (4)
   [junit4]   2> 2791548 INFO  (zkConnectionManagerCallback-71592-thread-1) [    ] o.a.s.c.c.ConnectionManager zkClient has connected
   [junit4]   2> 2791550 INFO  (closeThreadPool-71533-thread-1) [    ] o.a.s.c.c.ZkStateReader Updated live nodes from ZooKeeper... (0) -> (4)
   [junit4]   2> 2791554 INFO  (closeThreadPool-71533-thread-1) [    ] o.a.s.c.s.i.ZkClientClusterStateProvider Cluster at 127.0.0.1:45775/solr ready
   [junit4]   2> 2791562 INFO  (closeThreadPool-71533-thread-1) [    ] o.a.s.h.a.MetricsHistoryHandler No .system collection, keeping metrics history in memory.
   [junit4]   2> 2791566 INFO  (closeThreadPool-71533-thread-2) [    ] o.a.s.h.c.HttpShardHandlerFactory Host whitelist initialized: WhitelistHostChecker [whitelistHosts=null, whitelistHostCheckingEnabled=false]
   [junit4]   2> 2791574 WARN  (closeThreadPool-71533-thread-2) [    ] o.e.j.u.s.S.config No Client EndPointIdentificationAlgorithm configured for SslContextFactory@51da2d17[provider=null,keyStore=null,trustStore=null]
   [junit4]   2> 2791593 WARN  (closeThreadPool-71533-thread-2) [    ] o.e.j.u.s.S.config No Client EndPointIdentificationAlgorithm configured for SslContextFactory@46b1082[provider=null,keyStore=null,trustStore=null]
   [junit4]   2> 2791596 INFO  (closeThreadPool-71533-thread-2) [    ] o.a.s.c.ZkContainer Zookeeper client=127.0.0.1:45775/solr
   [junit4]   2> 2791608 INFO  (zkConnectionManagerCallback-71599-thread-1) [    ] o.a.s.c.c.ConnectionManager zkClient has connected
   [junit4]   2> 2791613 INFO  (zkConnectionManagerCallback-71601-thread-1) [    ] o.a.s.c.c.ConnectionManager zkClient has connected
   [junit4]   2> 2791616 INFO  (closeThreadPool-71533-thread-1) [    ] o.a.s.m.r.SolrJmxReporter JMX monitoring for 'solr.node' (registry 'solr.node') enabled at server: com.sun.jmx.mbeanserver.JmxMBeanServer@50e707b6
   [junit4]   2> 2791621 INFO  (closeThreadPool-71533-thread-2) [    ] o.a.s.c.c.ZkStateReader Updated live nodes from ZooKeeper... (0) -> (4)
   [junit4]   2> 2791628 INFO  (closeThreadPool-71533-thread-2) [    ] o.a.s.c.ZkController Publish node=127.0.0.1:34553_ as DOWN
   [junit4]   2> 2791630 INFO  (closeThreadPool-71533-thread-2) [    ] o.a.s.c.TransientSolrCoreCacheDefault Allocating transient cache for 4 transient cores
   [junit4]   2> 2791630 INFO  (closeThreadPool-71533-thread-2) [    ] o.a.s.c.ZkController Register node as live in ZooKeeper:/live_nodes/127.0.0.1:34553_
   [junit4]   2> 2791633 INFO  (zkCallback-71543-thread-1) [    ] o.a.s.c.c.ZkStateReader Updated live nodes from ZooKeeper... (4) -> (5)
   [junit4]   2> 2791633 INFO  (zkCallback-71531-thread-1) [    ] o.a.s.c.c.ZkStateReader Updated live nodes from ZooKeeper... (4) -> (5)
   [junit4]   2> 2791633 INFO  (zkCallback-71519-thread-1) [    ] o.a.s.c.c.ZkStateReader Updated live nodes from ZooKeeper... (4) -> (5)
   [junit4]   2> 2791633 INFO  (zkCallback-71571-thread-1) [    ] o.a.s.c.c.ZkStateReader Updated live nodes from ZooKeeper... (4) -> (5)
   [junit4]   2> 2791633 INFO  (zkCallback-71583-thread-1) [    ] o.a.s.c.c.ZkStateReader Updated live nodes from ZooKeeper... (4) -> (5)
   [junit4]   2> 2791633 INFO  (zkCallback-71550-thread-1) [    ] o.a.s.c.c.ZkStateReader Updated live nodes from ZooKeeper... (4) -> (5)
   [junit4]   2> 2791633 INFO  (zkCallback-71562-thread-1) [    ] o.a.s.c.c.ZkStateReader Updated live nodes from ZooKeeper... (4) -> (5)
   [junit4]   2> 2791633 INFO  (zkCallback-71512-thread-2) [    ] o.a.s.c.c.ZkStateReader Updated live nodes from ZooKeeper... (4) -> (5)
   [junit4]   2> 2791634 INFO  (zkCallback-71591-thread-1) [    ] o.a.s.c.c.ZkStateReader Updated live nodes from ZooKeeper... (4) -> (5)
   [junit4]   2> 2791647 INFO  (zkCallback-71600-thread-1) [    ] o.a.s.c.c.ZkStateReader Updated live nodes from ZooKeeper... (4) -> (5)
   [junit4]   2> 2791652 INFO  (closeThreadPool-71533-thread-1) [    ] o.a.s.m.r.SolrJmxReporter JMX monitoring for 'solr.jvm' (registry 'solr.jvm') enabled at server: com.sun.jmx.mbeanserver.JmxMBeanServer@50e707b6
   [junit4]   2> 2791653 INFO  (closeThreadPool-71533-thread-1) [    ] o.a.s.m.r.SolrJmxReporter JMX monitoring for 'solr.jetty' (registry 'solr.jetty') enabled at server: com.sun.jmx.mbeanserver.JmxMBeanServer@50e707b6
   [junit4]   2> 2791655 INFO  (closeThreadPool-71533-thread-1) [    ] o.a.s.c.CorePropertiesLocator Found 0 core definitions underneath /x1/jenkins/jenkins-slave/workspace/Lucene-Solr-NightlyTests-master/checkout/solr/build/solr-core/test/J2/temp/solr.cloud.ChaosMonkeyNothingIsSafeTest_F7D80A63C16FF740-001/shard-3-001/cores
   [junit4]   2> 2791681 INFO  (zkConnectionManagerCallback-71608-thread-1) [    ] o.a.s.c.c.ConnectionManager zkClient has connected
   [junit4]   2> 2791684 INFO  (closeThreadPool-71533-thread-2) [    ] o.a.s.c.c.ZkStateReader Updated live nodes from ZooKeeper... (0) -> (5)
   [junit4]   2> 2791686 INFO  (closeThreadPool-71533-thread-2) [    ] o.a.s.c.s.i.ZkClientClusterStateProvider Cluster at 127.0.0.1:45775/solr ready
   [junit4]   2> 2791686 INFO  (closeThreadPool-71533-thread-2) [    ] o.a.s.h.a.MetricsHistoryHandler No .system collection, keeping metrics history in memory.
   [junit4]   2> 2791697 INFO  (TEST-ChaosMonkeyNothingIsSafeTest.test-seed#[F7D80A63C16FF740]) [    ] o.a.s.c.AbstractFullDistribZkTestBase create jetty 5 in directory /x1/jenkins/jenkins-slave/workspace/Lucene-Solr-NightlyTests-master/checkout/solr/build/solr-core/test/J2/temp/solr.cloud.ChaosMonkeyNothingIsSafeTest_F7D80A63C16FF740-001/shard-5-001 of type NRT
   [junit4]   2> 2791707 WARN  (closeThreadPool-71533-thread-3) [    ] o.e.j.s.AbstractConnector Ignoring deprecated socket close linger time
   [junit4]   2> 2791707 INFO  (closeThreadPool-71533-thread-3) [    ] o.a.s.c.s.e.JettySolrRunner Start Jetty (original configured port=0)
   [junit4]   2> 2791708 INFO  (closeThreadPool-71533-thread-3) [    ] o.a.s.c.s.e.JettySolrRunner Trying to start Jetty on port 0 try number 1 ...
   [junit4]   2> 2791708 INFO  (closeThreadPool-71533-thread-3) [    ] o.e.j.s.Server jetty-9.4.14.v20181114; built: 2018-11-14T21:20:31.478Z; git: c4550056e785fb5665914545889f21dc136ad9e6; jvm 11.0.1+13-LTS
   [junit4]   2> 2791732 INFO  (closeThreadPool-71533-thread-3) [    ] o.e.j.s.session DefaultSessionIdManager workerName=node0
   [junit4]   2> 2791732 INFO  (closeThreadPool-71533-thread-3) [    ] o.e.j.s.session No SessionScavenger set, using defaults
   [junit4]   2> 2791732 INFO  (closeThreadPool-71533-thread-3) [    ] o.e.j.s.session node0 Scavenging every 600000ms
   [junit4]   2> 2791734 INFO  (closeThreadPool-71533-thread-3) [    ] o.e.j.s.h.ContextHandler Started o.e.j.s.ServletContextHandler@475cb8bc{/,null,AVAILABLE}
   [junit4]   2> 2791735 INFO  (closeThreadPool-71533-thread-3) [    ] o.e.j.s.AbstractConnector Started ServerConnector@7a62d274{HTTP/1.1,[http/1.1, h2c]}{127.0.0.1:41460}
   [junit4]   2> 2791735 INFO  (closeThreadPool-71533-thread-3) [    ] o.e.j.s.Server Started @2791784ms
   [junit4]   2> 2791735 INFO  (closeThreadPool-71533-thread-3) [    ] o.a.s.c.s.e.JettySolrRunner Jetty properties: {hostContext=/, solrconfig=solrconfig.xml, solr.data.dir=/x1/jenkins/jenkins-slave/workspace/Lucene-Solr-NightlyTests-master/checkout/solr/build/solr-core/test/J2/temp/solr.cloud.ChaosMonkeyNothingIsSafeTest_F7D80A63C16FF740-001/tempDir-001/jetty5, hostPort=41460, coreRootDirectory=/x1/jenkins/jenkins-slave/workspace/Lucene-Solr-NightlyTests-master/checkout/solr/build/solr-core/test/J2/../../../../../../../../../../../x1/jenkins/jenkins-slave/workspace/Lucene-Solr-NightlyTests-master/checkout/solr/build/solr-core/test/J2/temp/solr.cloud.ChaosMonkeyNothingIsSafeTest_F7D80A63C16FF740-001/shard-5-001/cores}
   [junit4]   2> 2791736 ERROR (closeThreadPool-71533-thread-3) [    ] o.a.s.u.StartupLoggingUtils Missing Java Option solr.log.dir. Logging may be missing or incomplete.
   [junit4]   2> 2791736 INFO  (closeThreadPool-71533-thread-3) [    ] o.a.s.s.SolrDispatchFilter Using logger factory org.apache.logging.slf4j.Log4jLoggerFactory
   [junit4]   2> 2791736 INFO  (closeThreadPool-71533-thread-3) [    ] o.a.s.s.SolrDispatchFilter  ___      _       Welcome to Apache Solr? version 9.0.0
   [junit4]   2> 2791736 INFO  (closeThreadPool-71533-thread-3) [    ] o.a.s.s.SolrDispatchFilter / __| ___| |_ _   Starting in cloud mode on port null
   [junit4]   2> 2791736 INFO  (closeThreadPool-71533-thread-3) [    ] o.a.s.s.SolrDispatchFilter \__ \/ _ \ | '_|  Install dir: null
   [junit4]   2> 2791736 INFO  (closeThreadPool-71533-thread-3) [    ] o.a.s.s.SolrDispatchFilter |___/\___/_|_|    Start time: 2019-05-03T13:20:50.709384Z
   [junit4]   2> 2791740 INFO  (closeThreadPool-71533-thread-2) [    ] o.a.s.m.r.SolrJmxReporter JMX monitoring for 'solr.node' (registry 'solr.node') enabled at server: com.sun.jmx.mbeanserver.JmxMBeanServer@50e707b6
   [junit4]   2> 2791742 INFO  (zkConnectionManagerCallback-71611-thread-1) [    ] o.a.s.c.c.ConnectionManager zkClient has connected
   [junit4]   2> 2791743 INFO  (closeThreadPool-71533-thread-3) [    ] o.a.s.s.SolrDispatchFilter Loading solr.xml from SolrHome (not found in ZooKeeper)
   [junit4]   2> 2791743 INFO  (closeThreadPool-71533-thread-3) [    ] o.a.s.c.SolrXmlConfig Loading container configuration from /x1/jenkins/jenkins-slave/workspace/Lucene-Solr-NightlyTests-master/checkout/solr/build/solr-core/test/J2/temp/solr.cloud.ChaosMonkeyNothingIsSafeTest_F7D80A63C16FF740-001/shard-5-001/solr.xml
   [junit4]   2> 2791747 INFO  (closeThreadPool-71533-thread-3) [    ] o.a.s.c.SolrXmlConfig Configuration parameter autoReplicaFailoverWorkLoopDelay is ignored
   [junit4]   2> 2791747 INFO  (closeThreadPool-71533-thread-3) [    ] o.a.s.c.SolrXmlConfig Configuration parameter autoReplicaFailoverBadNodeExpiration is ignored
   [junit4]   2> 2791749 INFO  (closeThreadPool-71533-thread-3) [    ] o.a.s.c.SolrXmlConfig MBean server found: com.sun.jmx.mbeanserver.JmxMBeanServer@50e707b6, but no JMX reporters were configured - adding default JMX reporter.
   [junit4]   2> 2791787 INFO  (closeThreadPool-71533-thread-2) [    ] o.a.s.m.r.SolrJmxReporter JMX monitoring for 'solr.jvm' (registry 'solr.jvm') enabled at server: com.sun.jmx.mbeanserver.JmxMBeanServer@50e707b6
   [junit4]   2> 2791788 INFO  (closeThreadPool-71533-thread-2) [    ] o.a.s.m.r.SolrJmxReporter JMX monitoring for 'solr.jetty' (registry 'solr.jetty') enabled at server: com.sun.jmx.mbeanserver.JmxMBeanServer@50e707b6
   [junit4]   2> 2791790 INFO  (closeThreadPool-71533-thread-2) [    ] o.a.s.c.CorePropertiesLocator Found 0 core definitions underneath /x1/jenkins/jenkins-slave/workspace/Lucene-Solr-NightlyTests-master/checkout/solr/build/solr-core/test/J2/temp/solr.cloud.ChaosMonkeyNothingIsSafeTest_F7D80A63C16FF740-001/shard-4-001/cores
   [junit4]   2> 2791867 INFO  (closeThreadPool-71533-thread-3) [    ] o.a.s.h.c.HttpShardHandlerFactory Host whitelist initialized: WhitelistHostChecker [whitelistHosts=null, whitelistHostCheckingEnabled=false]
   [junit4]   2> 2791880 WARN  (closeThreadPool-71533-thread-3) [    ] o.e.j.u.s.S.config No Client EndPointIdentificationAlgorithm configured for SslContextFactory@26fd0838[provider=null,keyStore=null,trustStore=null]
   [junit4]   2> 2791899 WARN  (closeThreadPool-71533-thread-3) [    ] o.e.j.u.s.S.config No Client EndPointIdentificationAlgorithm configured for SslContextFactory@15cc0dbf[provider=null,keyStore=null,trustStore=null]
   [junit4]   2> 2791900 INFO  (closeThreadPool-71533-thread-3) [    ] o.a.s.c.ZkContainer Zookeeper client=127.0.0.1:45775/solr
   [junit4]   2> 2791927 INFO  (zkConnectionManagerCallback-71618-thread-1) [    ] o.a.s.c.c.ConnectionManager zkClient has connected
   [junit4]   2> 2791938 INFO  (zkConnectionManagerCallback-71620-thread-1) [    ] o.a.s.c.c.ConnectionManager zkClient has connected
   [junit4]   2> 2791945 INFO  (TEST-ChaosMonkeyNothingIsSafeTest.test-seed#[F7D80A63C16FF740]) [    ] o.a.s.c.AbstractFullDistribZkTestBase create jetty 6 in directory /x1/jenkins/jenkins-slave/workspace/Lucene-Solr-NightlyTests-master/checkout/solr/build/solr-core/test/J2/temp/solr.cloud.ChaosMonkeyNothingIsSafeTest_F7D80A63C16FF740-001/shard-6-001 of type NRT
   [junit4]   2> 2791945 WARN  (closeThreadPool-71533-thread-2) [    ] o.e.j.s.AbstractConnector Ignoring deprecated socket close linger time
   [junit4]   2> 2791946 INFO  (closeThreadPool-71533-thread-2) [    ] o.a.s.c.s.e.JettySolrRunner Start Jetty (original configured port=0)
   [junit4]   2> 2791946 INFO  (closeThreadPool-71533-thread-2) [    ] o.a.s.c.s.e.JettySolrRunner Trying to start Jetty on port 0 try number 1 ...
   [junit4]   2> 2791946 INFO  (closeThreadPool-71533-thread-2) [    ] o.e.j.s.Server jetty-9.4.14.v20181114; built: 2018-11-14T21:20:31.478Z; git: c4550056e785fb5665914545889f21dc136ad9e6; jvm 11.0.1+13-LTS
   [junit4]   2> 2791948 INFO  (closeThreadPool-71533-thread-2) [    ] o.e.j.s.session DefaultSessionIdManager workerName=node0
   [junit4]   2> 2791948 INFO  (closeThreadPool-71533-thread-2) [    ] o.e.j.s.session No SessionScavenger set, using defaults
   [junit4]   2> 2791948 INFO  (closeThreadPool-71533-thread-2) [    ] o.e.j.s.session node0 Scavenging every 600000ms
   [junit4]   2> 2791948 INFO  (closeThreadPool-71533-thread-2) [    ] o.e.j.s.h.ContextHandler Started o.e.j.s.ServletContextHandler@4a48cb01{/,null,AVAILABLE}
   [junit4]   2> 2791949 INFO  (closeThreadPool-71533-thread-2) [    ] o.e.j.s.AbstractConnector Started ServerConnector@5d898615{HTTP/1.1,[http/1.1, h2c]}{127.0.0.1:36852}
   [junit4]   2> 2791949 INFO  (closeThreadPool-71533-thread-3) [n:127.0.0.1:41460_    ] o.a.s.c.c.ZkStateReader Updated live nodes from ZooKeeper... (0) -> (5)
   [junit4]   2> 2791949 INFO  (closeThreadPool-71533-thread-2) [    ] o.e.j.s.Server Started @2791997ms
   [junit4]   2> 2791949 INFO  (closeThreadPool-71533-thread-2) [    ] o.a.s.c.s.e.JettySolrRunner Jetty properties: {hostContext=/, solrconfig=solrconfig.xml, solr.data.dir=/x1/jenkins/jenkins-slave/workspace/Lucene-Solr-NightlyTests-master/checkout/solr/build/solr-core/test/J2/temp/solr.cloud.ChaosMonkeyNothingIsSafeTest_F7D80A63C16FF740-001/tempDir-001/jetty6, hostPort=36852, coreRootDirectory=/x1/jenkins/jenkins-slave/workspace/Lucene-Solr-NightlyTests-master/checkout/solr/build/solr-core/test/J2/temp/solr.cloud.ChaosMonkeyNothingIsSafeTest_F7D80A63C16FF740-001/shard-6-001/cores, replicaType=NRT}
   [junit4]   2> 2791953 ERROR (closeThreadPool-71533-thread-2) [    ] o.a.s.u.StartupLoggingUtils Missing Java Option solr.log.dir. Logging may be missing or incomplete.
   [junit4]   2> 2791953 INFO  (closeThreadPool-71533-thread-2) [    ] o.a.s.s.SolrDispatchFilter Using logger factory org.apache.logging.slf4j.Log4jLoggerFactory
   [junit4]   2> 2791953 INFO  (closeThreadPool-71533-thread-2) [    ] o.a.s.s.SolrDispatchFilter  ___      _       Welcome to Apache Solr? version 9.0.0
   [junit4]   2> 2791953 INFO  (closeThreadPool-71533-thread-2) [    ] o.a.s.s.SolrDispatchFilter / __| ___| |_ _   Starting in cloud mode on port null
   [junit4]   2> 2791953 INFO  (closeThreadPool-71533-thread-2) [    ] o.a.s.s.SolrDispatchFilter \__ \/ _ \ | '_|  Install dir: null
   [junit4]   2> 2791953 INFO  (closeThreadPool-71533-thread-2) [    ] o.a.s.s.SolrDispatchFilter |___/\___/_|_|    Start time: 2019-05-03T13:20:50.926453Z
   [junit4]   2> 2791966 INFO  (closeThreadPool-71533-thread-3) [n:127.0.0.1:41460_    ] o.a.s.c.ZkController Publish node=127.0.0.1:41460_ as DOWN
   [junit4]   2> 2791967 INFO  (closeThreadPool-71533-thread-3) [n:127.0.0.1:41460_    ] o.a.s.c.TransientSolrCoreCacheDefault Allocating transient cache for 4 transient cores
   [junit4]   2> 2791967 INFO  (closeThreadPool-71533-thread-3) [n:127.0.0.1:41460_    ] o.a.s.c.ZkController Register node as live in ZooKeeper:/live_nodes/127.0.0.1:41460_
   [junit4]   2> 2791971 INFO  (zkCallback-71519-thread-1) [    ] o.a.s.c.c.ZkStateReader Updated live nodes from ZooKeeper... (5) -> (6)
   [junit4]   2> 2791971 INFO  (zkCallback-71543-thread-1) [    ] o.a.s.c.c.ZkStateReader Updated live nodes from ZooKeeper... (5) -> (6)
   [junit4]   2> 2791971 INFO  (zkCallback-71531-thread-1) [    ] o.a.s.c.c.ZkStateReader Updated live nodes from ZooKeeper... (5) -> (6)
   [junit4]   2> 2791971 INFO  (zkCallback-71571-thread-1) [    ] o.a.s.c.c.ZkStateReader Updated live nodes from ZooKeeper... (5) -> (6)
   [junit4]   2> 2791971 INFO  (zkCallback-71562-thread-1) [    ] o.a.s.c.c.ZkStateReader Updated live nodes from ZooKeeper... (5) -> (6)
   [junit4]   2> 2791971 INFO  (zkCallback-71550-thread-1) [    ] o.a.s.c.c.ZkStateReader Updated live nodes from ZooKeeper... (5) -> (6)
   [junit4]   2> 2791971 INFO  (zkCallback-71591-thread-1) [    ] o.a.s.c.c.ZkStateReader Updated live nodes from ZooKeeper... (5) -> (6)
   [junit4]   2> 2791971 INFO  (zkCallback-71600-thread-1) [    ] o.a.s.c.c.ZkStateReader Updated live nodes from ZooKeeper... (5) -> (6)
   [junit4]   2> 2791972 INFO  (zkCallback-71583-thread-1) [    ] o.a.s.c.c.ZkStateReader Updated live nodes from ZooKeeper... (5) -> (6)
   [junit4]   2> 2791972 INFO  (zkCallback-71512-thread-2) [    ] o.a.s.c.c.ZkStateReader Updated live nodes from ZooKeeper... (5) -> (6)
   [junit4]   2> 2791982 INFO  (zkConnectionManagerCallback-71624-thread-1) [    ] o.a.s.c.c.ConnectionManager zkClient has connected
   [junit4]   2> 2791985 INFO  (closeThreadPool-71533-thread-2) [    ] o.a.s.s.SolrDispatchFilter Loading solr.xml from SolrHome (not found in ZooKeeper)
   [junit4]   2> 2791985 INFO  (closeThreadPool-71533-thread-2) [    ] o.a.s.c.SolrXmlConfig Loading container configuration from /x1/jenkins/jenkins-slave/workspace/Lucene-Solr-NightlyTests-master/checkout/solr/build/solr-core/test/J2/temp/solr.cloud.ChaosMonkeyNothingIsSafeTest_F7D80A63C16FF740-001/shard-6-001/solr.xml
   [junit4]   2> 2791997 INFO  (closeThreadPool-71533-thread-2) [    ] o.a.s.c.SolrXmlConfig Configuration parameter autoReplicaFailoverWorkLoopDelay is ignored
   [junit4]   2> 2791997 INFO  (closeThreadPool-71533-thread-2) [    ] o.a.s.c.SolrXmlConfig Configuration parameter autoReplicaFailoverBadNodeExpiration is ignored
   [junit4]   2> 2791997 INFO  (zkCallback-71607-thread-1) [    ] o.a.s.c.c.ZkStateReader Updated live nodes from ZooKeeper... (5) -> (6)
   [junit4]   2> 2791999 INFO  (closeThreadPool-71533-thread-2) [    ] o.a.s.c.SolrXmlConfig MBean server found: com.sun.jmx.mbeanserver.JmxMBeanServer@50e707b6, but no JMX reporters were configured - adding default JMX reporter.
   [junit4]   2> 2792007 INFO  (zkCallback-71619-thread-1) [    ] o.a.s.c.c.ZkStateReader Updated live nodes from ZooKeeper... (5) -> (6)
   [junit4]   2> 2792053 INFO  (zkConnectionManagerCallback-71630-thread-1) [    ] o.a.s.c.c.ConnectionManager zkClient has connected
   [junit4]   2> 2792055 INFO  (closeThreadPool-71533-thread-3) [n:127.0.0.1:41460_    ] o.a.s.c.c.ZkStateReader Updated live nodes from ZooKeeper... (0) -> (6)
   [junit4]   2> 2792057 INFO  (closeThreadPool-71533-thread-3) [n:127.0.0.1:41460_    ] o.a.s.c.s.i.ZkClientClusterStateProvider Cluster at 127.0.0.1:45775/solr ready
   [junit4]   2> 2792069 INFO  (closeThreadPool-71533-thread-3) [n:127.0.0.1:41460_    ] o.a.s.h.a.MetricsHistoryHandler No .system collection, keeping metrics history in memory.
   [junit4]   2> 2792143 INFO  (closeThreadPool-71533-thread-3) [n:127.0.0.1:41460_    ] o.a.s.m.r.SolrJmxReporter JMX monitoring for 'solr.node' (registry 'solr.node') enabled at server: com.sun.jmx.mbeanserver.JmxMBeanServer@50e707b6
   [junit4]   2> 2792180 INFO  (closeThreadPool-71533-thread-3) [n:127.0.0.1:41460_    ] o.a.s.m.r.SolrJmxReporter JMX monitoring for 'solr.jvm' (registry 'solr.jvm') enabled at server: com.sun.jmx.mbeanserver.JmxMBeanServer@50e707b6
   [junit4]   2> 2792180 INFO  (closeThreadPool-71533-thread-3) [n:127.0.0.1:41460_    ] o.a.s.m.r.SolrJmxReporter JMX monitoring for 'solr.jetty' (registry 'solr.jetty') enabled at server: com.sun.jmx.mbeanserver.JmxMBeanServer@50e707b6
   [junit4]   2> 2792183 INFO  (closeThreadPool-71533-thread-3) [n:127.0.0.1:41460_    ] o.a.s.c.CorePropertiesLocator Found 0 core definitions underneath /x1/jenkins/jenkins-slave/workspace/Lucene-Solr-NightlyTests-master/checkout/solr/build/solr-core/test/J2/../../../../../../../../../../../x1/jenkins/jenkins-slave/workspace/Lucene-Solr-NightlyTests-master/checkout/solr/build/solr-core/test/J2/temp/solr.cloud.ChaosMonkeyNothingIsSafeTest_F7D80A63C16FF740-001/shard-5-001/cores
   [junit4]   2> 2792184 INFO  (closeThreadPool-71533-thread-2) [    ] o.a.s.h.c.HttpShardHandlerFactory Host whitelist initialized: WhitelistHostChecker [whitelistHosts=null, whitelistHostCheckingEnabled=false]
   [junit4]   2> 2792186 WARN  (closeThreadPool-71533-thread-2) [    ] o.e.j.u.s.S.config No Client EndPointIdentificationAlgorithm configured for SslContextFactory@12f1fea4[provider=null,keyStore=null,trustStore=null]
   [junit4]   2> 2792191 WARN  (closeThreadPool-71533-thread-2) [    ] o.e.j.u.s.S.config No Client EndPointIdentificationAlgorithm configured for SslContextFactory@7200e04f[provider=null,keyStore=null,trustStore=null]
   [junit4]   2> 2792193 INFO  (closeThreadPool-71533-thread-2) [    ] o.a.s.c.ZkContainer Zookeeper client=127.0.0.1:45775/solr
   [junit4]   2> 2792213 INFO  (zkConnectionManagerCallback-71637-thread-1) [    ] o.a.s.c.c.ConnectionManager zkClient has connected
   [junit4]   2> 2792246 INFO  (zkConnectionManagerCallback-71639-thread-1) [    ] o.a.s.c.c.ConnectionManager zkClient has connected
   [junit4]   2> 2792262 INFO  (closeThreadPool-71533-thread-2) [    ] o.a.s.c.c.ZkStateReader Updated live nodes from ZooKeeper... (0) -> (6)
   [junit4]   2> 2792269 INFO  (closeThreadPool-71533-thread-2) [    ] o.a.s.c.ZkController Publish node=127.0.0.1:36852_ as DOWN
   [junit4]   2> 2792271 INFO  (closeThreadPool-71533-thread-2) [    ] o.a.s.c.TransientSolrCoreCacheDefault Allocating transient cache for 4 transient cores
   [junit4]   2> 2792271 INFO  (closeThreadPool-71533-thread-2) [    ] o.a.s.c.ZkController Register node as live in ZooKeeper:/live_nodes/127.0.0.1:36852_
   [junit4]   2> 2792273 INFO  (zkCallback-71519-thread-1) [    ] o.a.s.c.c.ZkStateReader Updated live nodes from ZooKeeper... (6) -> (7)
   [junit4]   2> 2792273 INFO  (zkCallback-71531-thread-1) [    ] o.a.s.c.c.ZkStateReader Updated live nodes from ZooKeeper... (6) -> (7)
   [junit4]   2> 2792273 INFO  (zkCallback-71571-thread-1) [    ] o.a.s.c.c.ZkStateReader Updated live nodes from ZooKeeper... (6) -> (7)
   [junit4]   2> 2792273 INFO  (zkCallback-71607-thread-1) [    ] o.a.s.c.c.ZkStateReader Updated live nodes from ZooKeeper... (6) -> (7)
   [junit4]   2> 2792273 INFO  (zkCallback-71543-thread-1) [    ] o.a.s.c.c.ZkStateReader Updated live nodes from ZooKeeper... (6) -> (7)
   [junit4]   2> 2792274 INFO  (zkCallback-71619-thread-1) [    ] o.a.s.c.c.ZkStateReader Updated live nodes from ZooKeeper... (6) -> (7)
   [junit4]   2> 2792274 INFO  (zkCallback-71583-thread-1) [    ] o.a.s.c.c.ZkStateReader Updated live nodes from ZooKeeper... (6) -> (7)
   [junit4]   2> 2792274 INFO  (zkCallback-71562-thread-1) [    ] o.a.s.c.c.ZkStateReader Updated live nodes from ZooKeeper... (6) -> (7)
   [junit4]   2> 2792275 INFO  (zkCallback-71600-thread-1) [    ] o.a.s.c.c.ZkStateReader Updated live nodes from ZooKeeper... (6) -> (7)
   [junit4]   2> 2792275 INFO  (zkCallback-71550-thread-1) [    ] o.a.s.c.c.ZkStateReader Updated live nodes from ZooKeeper... (6) -> (7)
   [junit4]   2> 2792275 INFO  (zkCallback-71591-thread-1) [    ] o.a.s.c.c.ZkStateReader Updated live nodes from ZooKeeper... (6) -> (7)
   [junit4]   2> 2792279 INFO  (zkCallback-71512-thread-2) [    ] o.a.s.c.c.ZkStateReader Updated live nodes from ZooKeeper... (6) -> (7)
   [junit4]   2> 2792288 INFO  (zkCallback-71629-thread-1) [    ] o.a.s.c.c.ZkStateReader Updated live nodes from ZooKeeper... (6) -> (7)
   [junit4]   2> 2792290 INFO  (zkCallback-71638-thread-1) [    ] o.a.s.c.c.ZkStateReader Updated live nodes from ZooKeeper... (6) -> (7)
   [junit4]   2> 2792343 INFO  (zkConnectionManagerCallback-71646-thread-1) [    ] o.a.s.c.c.ConnectionManager zkClient has connected
   [junit4]   2> 2792345 INFO  (closeThreadPool-71533-thread-2) [    ] o.a.s.c.c.ZkStateReader Updated live nodes from ZooKeeper... (0) -> (7)
   [junit4]   2> 2792347 INFO  (closeThreadPool-71533-thread-2) [    ] o.a.s.c.s.i.ZkClientClusterStateProvider Cluster at 127.0.0.1:45775/solr ready
   [junit4]   2> 2792363 INFO  (closeThreadPool-71533-thread-2) [    ] o.a.s.h.a.MetricsHistoryHandler No .system collection, keeping metrics history in memory.
   [junit4]   2> 2792452 INFO  (TEST-ChaosMonkeyNothingIsSafeTest.test-seed#[F7D80A63C16FF740]) [    ] o.a.s.c.AbstractFullDistribZkTestBase create jetty 7 in directory /x1/jenkins/jenkins-slave/workspace/Lucene-Solr-NightlyTests-master/checkout/solr/build/solr-core/test/J2/temp/solr.cloud.ChaosMonkeyNothingIsSafeTest_F7D80A63C16FF740-001/shard-7-001 of type NRT
   [junit4]   2> 2792455 WARN  (closeThreadPool-71533-thread-1) [    ] o.e.j.s.AbstractConnector Ignoring deprecated socket close linger time
   [junit4]   2> 2792456 INFO  (closeThreadPool-71533-thread-1) [    ] o.a.s.c.s.e.JettySolrRunner Start Jetty (original configured port=0)
   [junit4]   2> 2792456 INFO  (closeThreadPool-71533-thread-1) [    ] o.a.s.c.s.e.JettySolrRunner Trying to start Jetty on port 0 try number 1 ...
   [junit4]   2> 2792456 INFO  (closeThreadPool-71533-thread-1) [    ] o.e.j.s.Server jetty-9.4.14.v20181114; built: 2018-11-14T21:20:31.478Z; git: c4550056e785fb5665914545889f21dc136ad9e6; jvm 11.0.1+13-LTS
   [junit4]   2> 2792491 INFO  (closeThreadPool-71533-thread-1) [    ] o.e.j.s.session DefaultSessionIdManager workerName=node0
   [junit4]   2> 2792491 INFO  (closeThreadPool-71533-thread-1) [    ] o.e.j.s.session No SessionScavenger set, using defaults
   [junit4]   2> 2792491 INFO  (closeThreadPool-71533-thread-1) [    ] o.e.j.s.session node0 Scavenging every 660000ms
   [junit4]   2> 2792492 INFO  (closeThreadPool-71533-thread-1) [    ] o.e.j.s.h.ContextHandler Started o.e.j.s.ServletContextHandler@617aa2db{/,null,AVAILABLE}
   [junit4]   2> 2792493 INFO  (closeThreadPool-71533-thread-1) [    ] o.e.j.s.AbstractConnector Started ServerConnector@619c186f{HTTP/1.1,[http/1.1, h2c]}{127.0.0.1:36307}
   [junit4]   2> 2792493 INFO  (closeThreadPool-71533-thread-1) [    ] o.e.j.s.Server Started @2792541ms
   [junit4]   2> 2792493 INFO  (closeThreadPool-71533-thread-1) [    ] o.a.s.c.s.e.JettySolrRunner Jetty properties: {hostContext=/, solrconfig=solrconfig.xml, solr.data.dir=/x1/jenkins/jenkins-slave/workspace/Lucene-Solr-NightlyTests-master/checkout/solr/build/solr-core/test/J2/temp/solr.cloud.ChaosMonkeyNothingIsSafeTest_F7D80A63C16FF740-001/tempDir-001/jetty7, hostPort=36307, coreRootDirectory=/x1/jenkins/jenkins-slave/workspace/Lucene-Solr-NightlyTests-master/checkout/solr/build/solr-core/test/J2/temp/solr.cloud.ChaosMonkeyNothingIsSafeTest_F7D80A63C16FF740-001/shard-7-001/cores, replicaType=NRT}
   [junit4]   2> 2792494 ERROR (closeThreadPool-71533-thread-1) [    ] o.a.s.u.StartupLoggingUtils Missing Java Option solr.log.dir. Logging may be missing or incomplete.
   [junit4]   2> 2792494 INFO  (closeThreadPool-71533-thread-1) [    ] o.a.s.s.SolrDispatchFilter Using logger factory org.apache.logging.slf4j.Log4jLoggerFactory
   [junit4]   2> 2792494 INFO  (closeThreadPool-71533-thread-1) [    ] o.a.s.s.SolrDispatchFilter  ___      _       Welcome to Apache Solr? version 9.0.0
   [junit4]   2> 2792494 INFO  (closeThreadPool-71533-thread-1) [    ] o.a.s.s.SolrDispatchFilter / __| ___| |_ _   Starting in cloud mode on port null
   [junit4]   2> 2792494 INFO  (closeThreadPool-71533-thread-1) [    ] o.a.s.s.SolrDispatchFilter \__ \/ _ \ | '_|  Install dir: null
   [junit4]   2> 2792494 INFO  (closeThreadPool-71533-thread-1) [    ] o.a.s.s.SolrDispatchFilter |___/\___/_|_|    Start time: 2019-05-03T13:20:51.467423Z
   [junit4]   2> 2792502 INFO  (closeThreadPool-71533-thread-2) [    ] o.a.s.m.r.SolrJmxReporter JMX monitoring for 'solr.node' (registry 'solr.node') enabled at server: com.sun.jmx.mbeanserver.JmxMBeanServer@50e707b6
   [junit4]   2> 2792522 INFO  (zkConnectionManagerCallback-71649-thread-1) [    ] o.a.s.c.c.ConnectionManager zkClient has connected
   [junit4]   2> 2792525 INFO  (closeThreadPool-71533-thread-1) [    ] o.a.s.s.SolrDispatchFilter Loading solr.xml from SolrHome (not found in ZooKeeper)
   [junit4]   2> 2792525 INFO  (closeThreadPool-71533-thread-1) [    ] o.a.s.c.SolrXmlConfig Loading container configuration from /x1/jenkins/jenkins-slave/workspace/Lucene-Solr-NightlyTests-master/checkout/solr/build/solr-core/test/J2/temp/solr.cloud.ChaosMonkeyNothingIsSafeTest_F7D80A63C16FF740-001/shard-7-001/solr.xml
   [junit4]   2> 2792531 INFO  (closeThreadPool-71533-thread-1) [    ] o.a.s.c.SolrXmlConfig Configuration parameter autoReplicaFailoverWorkLoopDelay is ignored
   [junit4]   2> 2792531 INFO  (closeThreadPool-71533-thread-1) [    ] o.a.s.c.SolrXmlConfig Configuration parameter autoReplicaFailoverBadNodeExpiration is ignored
   [junit4]   2> 2792538 INFO  (closeThreadPool-71533-thread-1) [    ] o.a.s.c.SolrXmlConfig MBean server found: com.sun.jmx.mbeanserver.JmxMBeanServer@50e707b6, but no JMX reporters were configured - adding default JMX reporter.
   [junit4]   2> 2792665 INFO  (closeThreadPool-71533-thread-2) [    ] o.a.s.m.r.SolrJmxReporter JMX monitoring for 'solr.jvm' (registry 'solr.jvm') enabled at server: com.sun.jmx.mbeanserver.JmxMBeanServer@50e707b6
   [junit4]   2> 2792666 INFO  (closeThreadPool-71533-thread-2) [    ] o.a.s.m.r.SolrJmxReporter JMX monitoring for 'solr.jetty' (registry 'solr.jetty') enabled at server: com.sun.jmx

[...truncated too long message...]

:

ivy-configure:
[ivy:configure] :: loading settings :: file = /x1/jenkins/jenkins-slave/workspace/Lucene-Solr-NightlyTests-master/checkout/lucene/top-level-ivy-settings.xml

resolve:

ivy-availability-check:
[loadresource] Do not set property disallowed.ivy.jars.list as its length is 0.

-ivy-fail-disallowed-ivy-version:

ivy-fail:

ivy-configure:
[ivy:configure] :: loading settings :: file = /x1/jenkins/jenkins-slave/workspace/Lucene-Solr-NightlyTests-master/checkout/lucene/top-level-ivy-settings.xml

resolve:

ivy-availability-check:
[loadresource] Do not set property disallowed.ivy.jars.list as its length is 0.

-ivy-fail-disallowed-ivy-version:

ivy-fail:

ivy-fail:

ivy-configure:
[ivy:configure] :: loading settings :: file = /x1/jenkins/jenkins-slave/workspace/Lucene-Solr-NightlyTests-master/checkout/lucene/top-level-ivy-settings.xml

resolve:

ivy-availability-check:
[loadresource] Do not set property disallowed.ivy.jars.list as its length is 0.

-ivy-fail-disallowed-ivy-version:

ivy-fail:

ivy-configure:
[ivy:configure] :: loading settings :: file = /x1/jenkins/jenkins-slave/workspace/Lucene-Solr-NightlyTests-master/checkout/lucene/top-level-ivy-settings.xml

resolve:

ivy-availability-check:
[loadresource] Do not set property disallowed.ivy.jars.list as its length is 0.

-ivy-fail-disallowed-ivy-version:

ivy-fail:

ivy-fail:

ivy-configure:
[ivy:configure] :: loading settings :: file = /x1/jenkins/jenkins-slave/workspace/Lucene-Solr-NightlyTests-master/checkout/lucene/top-level-ivy-settings.xml

resolve:

ivy-availability-check:
[loadresource] Do not set property disallowed.ivy.jars.list as its length is 0.

-ivy-fail-disallowed-ivy-version:

ivy-fail:

ivy-fail:

ivy-configure:
[ivy:configure] :: loading settings :: file = /x1/jenkins/jenkins-slave/workspace/Lucene-Solr-NightlyTests-master/checkout/lucene/top-level-ivy-settings.xml

resolve:

ivy-availability-check:
[loadresource] Do not set property disallowed.ivy.jars.list as its length is 0.

-ivy-fail-disallowed-ivy-version:

ivy-fail:

ivy-fail:

ivy-configure:
[ivy:configure] :: loading settings :: file = /x1/jenkins/jenkins-slave/workspace/Lucene-Solr-NightlyTests-master/checkout/lucene/top-level-ivy-settings.xml

resolve:

ivy-availability-check:
[loadresource] Do not set property disallowed.ivy.jars.list as its length is 0.

-ivy-fail-disallowed-ivy-version:

ivy-fail:

ivy-fail:

ivy-configure:
[ivy:configure] :: loading settings :: file = /x1/jenkins/jenkins-slave/workspace/Lucene-Solr-NightlyTests-master/checkout/lucene/top-level-ivy-settings.xml

resolve:

ivy-availability-check:
[loadresource] Do not set property disallowed.ivy.jars.list as its length is 0.

-ivy-fail-disallowed-ivy-version:

ivy-fail:

ivy-fail:

ivy-configure:
[ivy:configure] :: loading settings :: file = /x1/jenkins/jenkins-slave/workspace/Lucene-Solr-NightlyTests-master/checkout/lucene/top-level-ivy-settings.xml

resolve:

ivy-availability-check:
[loadresource] Do not set property disallowed.ivy.jars.list as its length is 0.

-ivy-fail-disallowed-ivy-version:

ivy-fail:

ivy-fail:

ivy-configure:
[ivy:configure] :: loading settings :: file = /x1/jenkins/jenkins-slave/workspace/Lucene-Solr-NightlyTests-master/checkout/lucene/top-level-ivy-settings.xml

resolve:

ivy-availability-check:
[loadresource] Do not set property disallowed.ivy.jars.list as its length is 0.

-ivy-fail-disallowed-ivy-version:

ivy-fail:

ivy-fail:

ivy-configure:
[ivy:configure] :: loading settings :: file = /x1/jenkins/jenkins-slave/workspace/Lucene-Solr-NightlyTests-master/checkout/lucene/top-level-ivy-settings.xml

resolve:

ivy-availability-check:
[loadresource] Do not set property disallowed.ivy.jars.list as its length is 0.

-ivy-fail-disallowed-ivy-version:

ivy-fail:

ivy-fail:

ivy-configure:
[ivy:configure] :: loading settings :: file = /x1/jenkins/jenkins-slave/workspace/Lucene-Solr-NightlyTests-master/checkout/lucene/top-level-ivy-settings.xml

resolve:

ivy-availability-check:
[loadresource] Do not set property disallowed.ivy.jars.list as its length is 0.

-ivy-fail-disallowed-ivy-version:

ivy-fail:

ivy-fail:

ivy-configure:
[ivy:configure] :: loading settings :: file = /x1/jenkins/jenkins-slave/workspace/Lucene-Solr-NightlyTests-master/checkout/lucene/top-level-ivy-settings.xml

resolve:

ivy-availability-check:
[loadresource] Do not set property disallowed.ivy.jars.list as its length is 0.

-ivy-fail-disallowed-ivy-version:

ivy-fail:

ivy-fail:

ivy-configure:
[ivy:configure] :: loading settings :: file = /x1/jenkins/jenkins-slave/workspace/Lucene-Solr-NightlyTests-master/checkout/lucene/top-level-ivy-settings.xml

resolve:

jar-checksums:
    [mkdir] Created dir: /x1/jenkins/jenkins-slave/workspace/Lucene-Solr-NightlyTests-master/checkout/solr/null1221331740
     [copy] Copying 239 files to /x1/jenkins/jenkins-slave/workspace/Lucene-Solr-NightlyTests-master/checkout/solr/null1221331740
   [delete] Deleting directory /x1/jenkins/jenkins-slave/workspace/Lucene-Solr-NightlyTests-master/checkout/solr/null1221331740

check-working-copy:
[ivy:cachepath] :: resolving dependencies :: #;working@lucene1-us-west
[ivy:cachepath] 	confs: [default]
[ivy:cachepath] 	found org.eclipse.jgit#org.eclipse.jgit;5.3.0.201903130848-r in public
[ivy:cachepath] 	found com.jcraft#jsch;0.1.54 in public
[ivy:cachepath] 	found com.jcraft#jzlib;1.1.1 in public
[ivy:cachepath] 	found com.googlecode.javaewah#JavaEWAH;1.1.6 in public
[ivy:cachepath] 	found org.slf4j#slf4j-api;1.7.2 in public
[ivy:cachepath] 	found org.bouncycastle#bcpg-jdk15on;1.60 in public
[ivy:cachepath] 	found org.bouncycastle#bcprov-jdk15on;1.60 in public
[ivy:cachepath] 	found org.bouncycastle#bcpkix-jdk15on;1.60 in public
[ivy:cachepath] 	found org.slf4j#slf4j-nop;1.7.2 in public
[ivy:cachepath] :: resolution report :: resolve 68ms :: artifacts dl 6ms
	---------------------------------------------------------------------
	|                  |            modules            ||   artifacts   |
	|       conf       | number| search|dwnlded|evicted|| number|dwnlded|
	---------------------------------------------------------------------
	|      default     |   9   |   0   |   0   |   0   ||   9   |   0   |
	---------------------------------------------------------------------
[wc-checker] Initializing working copy...
[wc-checker] Checking working copy status...

-jenkins-base:

BUILD SUCCESSFUL
Total time: 494 minutes 26 seconds
Archiving artifacts
java.lang.InterruptedException: no matches found within 10000
	at hudson.FilePath$ValidateAntFileMask.hasMatch(FilePath.java:2847)
	at hudson.FilePath$ValidateAntFileMask.invoke(FilePath.java:2726)
	at hudson.FilePath$ValidateAntFileMask.invoke(FilePath.java:2707)
	at hudson.FilePath$FileCallableWrapper.call(FilePath.java:3086)
Also:   hudson.remoting.Channel$CallSiteStackTrace: Remote call to lucene
		at hudson.remoting.Channel.attachCallSiteStackTrace(Channel.java:1741)
		at hudson.remoting.UserRequest$ExceptionResponse.retrieve(UserRequest.java:357)
		at hudson.remoting.Channel.call(Channel.java:955)
		at hudson.FilePath.act(FilePath.java:1072)
		at hudson.FilePath.act(FilePath.java:1061)
		at hudson.FilePath.validateAntFileMask(FilePath.java:2705)
		at hudson.tasks.ArtifactArchiver.perform(ArtifactArchiver.java:243)
		at hudson.tasks.BuildStepCompatibilityLayer.perform(BuildStepCompatibilityLayer.java:81)
		at hudson.tasks.BuildStepMonitor$1.perform(BuildStepMonitor.java:20)
		at hudson.model.AbstractBuild$AbstractBuildExecution.perform(AbstractBuild.java:744)
		at hudson.model.AbstractBuild$AbstractBuildExecution.performAllBuildSteps(AbstractBuild.java:690)
		at hudson.model.Build$BuildExecution.post2(Build.java:186)
		at hudson.model.AbstractBuild$AbstractBuildExecution.post(AbstractBuild.java:635)
		at hudson.model.Run.execute(Run.java:1835)
		at hudson.model.FreeStyleBuild.run(FreeStyleBuild.java:43)
		at hudson.model.ResourceController.execute(ResourceController.java:97)
		at hudson.model.Executor.run(Executor.java:429)
Caused: hudson.FilePath$TunneledInterruptedException
	at hudson.FilePath$FileCallableWrapper.call(FilePath.java:3088)
	at hudson.remoting.UserRequest.perform(UserRequest.java:212)
	at hudson.remoting.UserRequest.perform(UserRequest.java:54)
	at hudson.remoting.Request$2.run(Request.java:369)
	at hudson.remoting.InterceptingExecutorService$1.call(InterceptingExecutorService.java:72)
	at java.util.concurrent.FutureTask.run(FutureTask.java:266)
	at java.util.concurrent.ThreadPoolExecutor.runWorker(ThreadPoolExecutor.java:1142)
	at java.util.concurrent.ThreadPoolExecutor$Worker.run(ThreadPoolExecutor.java:617)
	at java.lang.Thread.run(Thread.java:748)
Caused: java.lang.InterruptedException: java.lang.InterruptedException: no matches found within 10000
	at hudson.FilePath.act(FilePath.java:1074)
	at hudson.FilePath.act(FilePath.java:1061)
	at hudson.FilePath.validateAntFileMask(FilePath.java:2705)
	at hudson.tasks.ArtifactArchiver.perform(ArtifactArchiver.java:243)
	at hudson.tasks.BuildStepCompatibilityLayer.perform(BuildStepCompatibilityLayer.java:81)
	at hudson.tasks.BuildStepMonitor$1.perform(BuildStepMonitor.java:20)
	at hudson.model.AbstractBuild$AbstractBuildExecution.perform(AbstractBuild.java:744)
	at hudson.model.AbstractBuild$AbstractBuildExecution.performAllBuildSteps(AbstractBuild.java:690)
	at hudson.model.Build$BuildExecution.post2(Build.java:186)
	at hudson.model.AbstractBuild$AbstractBuildExecution.post(AbstractBuild.java:635)
	at hudson.model.Run.execute(Run.java:1835)
	at hudson.model.FreeStyleBuild.run(FreeStyleBuild.java:43)
	at hudson.model.ResourceController.execute(ResourceController.java:97)
	at hudson.model.Executor.run(Executor.java:429)
No artifacts found that match the file pattern "**/*.events,heapdumps/**,**/hs_err_pid*". Configuration error?
Recording test results
Build step 'Publish JUnit test result report' changed build result to UNSTABLE
Email was triggered for: Unstable (Test Failures)
Sending email for trigger: Unstable (Test Failures)

Mime
View raw message