lucene-dev mailing list archives

Site index · List index
Message view « Date » · « Thread »
Top « Date » · « Thread »
From Apache Jenkins Server <jenk...@builds.apache.org>
Subject [JENKINS] Lucene-Solr-BadApples-Tests-master - Build # 361 - Unstable
Date Wed, 15 May 2019 16:41:45 GMT
Build: https://builds.apache.org/job/Lucene-Solr-BadApples-Tests-master/361/

1 tests failed.
FAILED:  org.apache.solr.cloud.ChaosMonkeySafeLeaderWithPullReplicasTest.test

Error Message:
Timed out waiting for replica core_node12 (1557935077912) to replicate from leader core_node4 (0)

Stack Trace:
java.lang.AssertionError: Timed out waiting for replica core_node12 (1557935077912) to replicate from leader core_node4 (0)
	at __randomizedtesting.SeedInfo.seed([4059265D6B627B1A:C80D1987C59E16E2]:0)
	at org.junit.Assert.fail(Assert.java:88)
	at org.apache.solr.cloud.AbstractFullDistribZkTestBase.waitForReplicationFromReplicas(AbstractFullDistribZkTestBase.java:2271)
	at org.apache.solr.cloud.ChaosMonkeySafeLeaderWithPullReplicasTest.test(ChaosMonkeySafeLeaderWithPullReplicasTest.java:211)
	at java.base/jdk.internal.reflect.NativeMethodAccessorImpl.invoke0(Native Method)
	at java.base/jdk.internal.reflect.NativeMethodAccessorImpl.invoke(NativeMethodAccessorImpl.java:62)
	at java.base/jdk.internal.reflect.DelegatingMethodAccessorImpl.invoke(DelegatingMethodAccessorImpl.java:43)
	at java.base/java.lang.reflect.Method.invoke(Method.java:566)
	at com.carrotsearch.randomizedtesting.RandomizedRunner.invoke(RandomizedRunner.java:1750)
	at com.carrotsearch.randomizedtesting.RandomizedRunner$8.evaluate(RandomizedRunner.java:938)
	at com.carrotsearch.randomizedtesting.RandomizedRunner$9.evaluate(RandomizedRunner.java:974)
	at com.carrotsearch.randomizedtesting.RandomizedRunner$10.evaluate(RandomizedRunner.java:988)
	at org.apache.solr.BaseDistributedSearchTestCase$ShardsRepeatRule$ShardsFixedStatement.callStatement(BaseDistributedSearchTestCase.java:1082)
	at org.apache.solr.BaseDistributedSearchTestCase$ShardsRepeatRule$ShardsStatement.evaluate(BaseDistributedSearchTestCase.java:1054)
	at com.carrotsearch.randomizedtesting.rules.SystemPropertiesRestoreRule$1.evaluate(SystemPropertiesRestoreRule.java:57)
	at org.apache.lucene.util.TestRuleSetupTeardownChained$1.evaluate(TestRuleSetupTeardownChained.java:49)
	at org.apache.lucene.util.AbstractBeforeAfterRule$1.evaluate(AbstractBeforeAfterRule.java:45)
	at org.apache.lucene.util.TestRuleThreadAndTestName$1.evaluate(TestRuleThreadAndTestName.java:48)
	at org.apache.lucene.util.TestRuleIgnoreAfterMaxFailures$1.evaluate(TestRuleIgnoreAfterMaxFailures.java:64)
	at org.apache.lucene.util.TestRuleMarkFailure$1.evaluate(TestRuleMarkFailure.java:47)
	at com.carrotsearch.randomizedtesting.rules.StatementAdapter.evaluate(StatementAdapter.java:36)
	at com.carrotsearch.randomizedtesting.ThreadLeakControl$StatementRunner.run(ThreadLeakControl.java:368)
	at com.carrotsearch.randomizedtesting.ThreadLeakControl.forkTimeoutingTask(ThreadLeakControl.java:817)
	at com.carrotsearch.randomizedtesting.ThreadLeakControl$3.evaluate(ThreadLeakControl.java:468)
	at com.carrotsearch.randomizedtesting.RandomizedRunner.runSingleTest(RandomizedRunner.java:947)
	at com.carrotsearch.randomizedtesting.RandomizedRunner$5.evaluate(RandomizedRunner.java:832)
	at com.carrotsearch.randomizedtesting.RandomizedRunner$6.evaluate(RandomizedRunner.java:883)
	at com.carrotsearch.randomizedtesting.RandomizedRunner$7.evaluate(RandomizedRunner.java:894)
	at com.carrotsearch.randomizedtesting.rules.StatementAdapter.evaluate(StatementAdapter.java:36)
	at com.carrotsearch.randomizedtesting.rules.SystemPropertiesRestoreRule$1.evaluate(SystemPropertiesRestoreRule.java:57)
	at org.apache.lucene.util.AbstractBeforeAfterRule$1.evaluate(AbstractBeforeAfterRule.java:45)
	at com.carrotsearch.randomizedtesting.rules.StatementAdapter.evaluate(StatementAdapter.java:36)
	at org.apache.lucene.util.TestRuleStoreClassName$1.evaluate(TestRuleStoreClassName.java:41)
	at com.carrotsearch.randomizedtesting.rules.NoShadowingOrOverridesOnMethodsRule$1.evaluate(NoShadowingOrOverridesOnMethodsRule.java:40)
	at com.carrotsearch.randomizedtesting.rules.NoShadowingOrOverridesOnMethodsRule$1.evaluate(NoShadowingOrOverridesOnMethodsRule.java:40)
	at com.carrotsearch.randomizedtesting.rules.StatementAdapter.evaluate(StatementAdapter.java:36)
	at com.carrotsearch.randomizedtesting.rules.StatementAdapter.evaluate(StatementAdapter.java:36)
	at org.apache.lucene.util.TestRuleAssertionsRequired$1.evaluate(TestRuleAssertionsRequired.java:53)
	at org.apache.lucene.util.TestRuleMarkFailure$1.evaluate(TestRuleMarkFailure.java:47)
	at org.apache.lucene.util.TestRuleIgnoreAfterMaxFailures$1.evaluate(TestRuleIgnoreAfterMaxFailures.java:64)
	at org.apache.lucene.util.TestRuleIgnoreTestSuites$1.evaluate(TestRuleIgnoreTestSuites.java:54)
	at com.carrotsearch.randomizedtesting.rules.StatementAdapter.evaluate(StatementAdapter.java:36)
	at com.carrotsearch.randomizedtesting.ThreadLeakControl$StatementRunner.run(ThreadLeakControl.java:368)
	at java.base/java.lang.Thread.run(Thread.java:834)




Build Log:
[...truncated 13289 lines...]
   [junit4] Suite: org.apache.solr.cloud.ChaosMonkeySafeLeaderWithPullReplicasTest
   [junit4]   2> Creating dataDir: /x1/jenkins/jenkins-slave/workspace/Lucene-Solr-BadApples-Tests-master/solr/build/solr-core/test/J0/temp/solr.cloud.ChaosMonkeySafeLeaderWithPullReplicasTest_4059265D6B627B1A-001/init-core-data-001
   [junit4]   2> 975029 WARN  (SUITE-ChaosMonkeySafeLeaderWithPullReplicasTest-seed#[4059265D6B627B1A]-worker) [    ] o.a.s.SolrTestCaseJ4 startTrackingSearchers: numOpens=2 numCloses=2
   [junit4]   2> 975029 INFO  (SUITE-ChaosMonkeySafeLeaderWithPullReplicasTest-seed#[4059265D6B627B1A]-worker) [    ] o.a.s.SolrTestCaseJ4 Using PointFields (NUMERIC_POINTS_SYSPROP=true) w/NUMERIC_DOCVALUES_SYSPROP=false
   [junit4]   2> 975030 INFO  (SUITE-ChaosMonkeySafeLeaderWithPullReplicasTest-seed#[4059265D6B627B1A]-worker) [    ] o.a.s.SolrTestCaseJ4 Randomized ssl (false) and clientAuth (false) via: @org.apache.solr.util.RandomizeSSL(reason="", ssl=0.0/0.0, value=0.0/0.0, clientAuth=0.0/0.0)
   [junit4]   2> 975030 INFO  (SUITE-ChaosMonkeySafeLeaderWithPullReplicasTest-seed#[4059265D6B627B1A]-worker) [    ] o.a.s.SolrTestCaseJ4 SecureRandom sanity checks: test.solr.allowed.securerandom=null & java.security.egd=file:/dev/./urandom
   [junit4]   2> 975031 INFO  (SUITE-ChaosMonkeySafeLeaderWithPullReplicasTest-seed#[4059265D6B627B1A]-worker) [    ] o.a.s.BaseDistributedSearchTestCase Setting hostContext system property: /
   [junit4]   2> 975032 INFO  (TEST-ChaosMonkeySafeLeaderWithPullReplicasTest.test-seed#[4059265D6B627B1A]) [    ] o.a.s.c.ChaosMonkeySafeLeaderWithPullReplicasTest Starting ChaosMonkey test with 2 shards and 6 nodes
   [junit4]   2> 975038 INFO  (TEST-ChaosMonkeySafeLeaderWithPullReplicasTest.test-seed#[4059265D6B627B1A]) [    ] o.a.s.c.ZkTestServer STARTING ZK TEST SERVER
   [junit4]   2> 975039 INFO  (ZkTestServer Run Thread) [    ] o.a.s.c.ZkTestServer client port:0.0.0.0/0.0.0.0:0
   [junit4]   2> 975039 INFO  (ZkTestServer Run Thread) [    ] o.a.s.c.ZkTestServer Starting server
   [junit4]   2> 975139 INFO  (TEST-ChaosMonkeySafeLeaderWithPullReplicasTest.test-seed#[4059265D6B627B1A]) [    ] o.a.s.c.ZkTestServer start zk server on port:35183
   [junit4]   2> 975139 INFO  (TEST-ChaosMonkeySafeLeaderWithPullReplicasTest.test-seed#[4059265D6B627B1A]) [    ] o.a.s.c.ZkTestServer parse host and port list: 127.0.0.1:35183
   [junit4]   2> 975139 INFO  (TEST-ChaosMonkeySafeLeaderWithPullReplicasTest.test-seed#[4059265D6B627B1A]) [    ] o.a.s.c.ZkTestServer connecting to 127.0.0.1 35183
   [junit4]   2> 975144 INFO  (zkConnectionManagerCallback-6952-thread-1) [    ] o.a.s.c.c.ConnectionManager zkClient has connected
   [junit4]   2> 975150 INFO  (zkConnectionManagerCallback-6954-thread-1) [    ] o.a.s.c.c.ConnectionManager zkClient has connected
   [junit4]   2> 975151 INFO  (TEST-ChaosMonkeySafeLeaderWithPullReplicasTest.test-seed#[4059265D6B627B1A]) [    ] o.a.s.c.ZkTestServer put /x1/jenkins/jenkins-slave/workspace/Lucene-Solr-BadApples-Tests-master/solr/core/src/test-files/solr/collection1/conf/solrconfig-tlog.xml to /configs/conf1/solrconfig.xml
   [junit4]   2> 975153 INFO  (TEST-ChaosMonkeySafeLeaderWithPullReplicasTest.test-seed#[4059265D6B627B1A]) [    ] o.a.s.c.ZkTestServer put /x1/jenkins/jenkins-slave/workspace/Lucene-Solr-BadApples-Tests-master/solr/core/src/test-files/solr/collection1/conf/schema15.xml to /configs/conf1/schema.xml
   [junit4]   2> 975154 INFO  (TEST-ChaosMonkeySafeLeaderWithPullReplicasTest.test-seed#[4059265D6B627B1A]) [    ] o.a.s.c.ZkTestServer put /x1/jenkins/jenkins-slave/workspace/Lucene-Solr-BadApples-Tests-master/solr/core/src/test-files/solr/collection1/conf/solrconfig.snippet.randomindexconfig.xml to /configs/conf1/solrconfig.snippet.randomindexconfig.xml
   [junit4]   2> 975156 INFO  (TEST-ChaosMonkeySafeLeaderWithPullReplicasTest.test-seed#[4059265D6B627B1A]) [    ] o.a.s.c.ZkTestServer put /x1/jenkins/jenkins-slave/workspace/Lucene-Solr-BadApples-Tests-master/solr/core/src/test-files/solr/collection1/conf/stopwords.txt to /configs/conf1/stopwords.txt
   [junit4]   2> 975157 INFO  (TEST-ChaosMonkeySafeLeaderWithPullReplicasTest.test-seed#[4059265D6B627B1A]) [    ] o.a.s.c.ZkTestServer put /x1/jenkins/jenkins-slave/workspace/Lucene-Solr-BadApples-Tests-master/solr/core/src/test-files/solr/collection1/conf/protwords.txt to /configs/conf1/protwords.txt
   [junit4]   2> 975159 INFO  (TEST-ChaosMonkeySafeLeaderWithPullReplicasTest.test-seed#[4059265D6B627B1A]) [    ] o.a.s.c.ZkTestServer put /x1/jenkins/jenkins-slave/workspace/Lucene-Solr-BadApples-Tests-master/solr/core/src/test-files/solr/collection1/conf/currency.xml to /configs/conf1/currency.xml
   [junit4]   2> 975160 INFO  (TEST-ChaosMonkeySafeLeaderWithPullReplicasTest.test-seed#[4059265D6B627B1A]) [    ] o.a.s.c.ZkTestServer put /x1/jenkins/jenkins-slave/workspace/Lucene-Solr-BadApples-Tests-master/solr/core/src/test-files/solr/collection1/conf/enumsConfig.xml to /configs/conf1/enumsConfig.xml
   [junit4]   2> 975162 INFO  (TEST-ChaosMonkeySafeLeaderWithPullReplicasTest.test-seed#[4059265D6B627B1A]) [    ] o.a.s.c.ZkTestServer put /x1/jenkins/jenkins-slave/workspace/Lucene-Solr-BadApples-Tests-master/solr/core/src/test-files/solr/collection1/conf/open-exchange-rates.json to /configs/conf1/open-exchange-rates.json
   [junit4]   2> 975163 INFO  (TEST-ChaosMonkeySafeLeaderWithPullReplicasTest.test-seed#[4059265D6B627B1A]) [    ] o.a.s.c.ZkTestServer put /x1/jenkins/jenkins-slave/workspace/Lucene-Solr-BadApples-Tests-master/solr/core/src/test-files/solr/collection1/conf/mapping-ISOLatin1Accent.txt to /configs/conf1/mapping-ISOLatin1Accent.txt
   [junit4]   2> 975165 INFO  (TEST-ChaosMonkeySafeLeaderWithPullReplicasTest.test-seed#[4059265D6B627B1A]) [    ] o.a.s.c.ZkTestServer put /x1/jenkins/jenkins-slave/workspace/Lucene-Solr-BadApples-Tests-master/solr/core/src/test-files/solr/collection1/conf/old_synonyms.txt to /configs/conf1/old_synonyms.txt
   [junit4]   2> 975166 INFO  (TEST-ChaosMonkeySafeLeaderWithPullReplicasTest.test-seed#[4059265D6B627B1A]) [    ] o.a.s.c.ZkTestServer put /x1/jenkins/jenkins-slave/workspace/Lucene-Solr-BadApples-Tests-master/solr/core/src/test-files/solr/collection1/conf/synonyms.txt to /configs/conf1/synonyms.txt
   [junit4]   2> 975168 INFO  (TEST-ChaosMonkeySafeLeaderWithPullReplicasTest.test-seed#[4059265D6B627B1A]) [    ] o.a.s.c.AbstractFullDistribZkTestBase Will use NRT replicas unless explicitly asked otherwise
   [junit4]   2> 975356 WARN  (TEST-ChaosMonkeySafeLeaderWithPullReplicasTest.test-seed#[4059265D6B627B1A]) [    ] o.e.j.s.AbstractConnector Ignoring deprecated socket close linger time
   [junit4]   2> 975356 INFO  (TEST-ChaosMonkeySafeLeaderWithPullReplicasTest.test-seed#[4059265D6B627B1A]) [    ] o.a.s.c.s.e.JettySolrRunner Start Jetty (original configured port=0)
   [junit4]   2> 975356 INFO  (TEST-ChaosMonkeySafeLeaderWithPullReplicasTest.test-seed#[4059265D6B627B1A]) [    ] o.a.s.c.s.e.JettySolrRunner Trying to start Jetty on port 0 try number 1 ...
   [junit4]   2> 975356 INFO  (TEST-ChaosMonkeySafeLeaderWithPullReplicasTest.test-seed#[4059265D6B627B1A]) [    ] o.e.j.s.Server jetty-9.4.14.v20181114; built: 2018-11-14T21:20:31.478Z; git: c4550056e785fb5665914545889f21dc136ad9e6; jvm 11.0.1+13-LTS
   [junit4]   2> 975358 INFO  (TEST-ChaosMonkeySafeLeaderWithPullReplicasTest.test-seed#[4059265D6B627B1A]) [    ] o.e.j.s.session DefaultSessionIdManager workerName=node0
   [junit4]   2> 975358 INFO  (TEST-ChaosMonkeySafeLeaderWithPullReplicasTest.test-seed#[4059265D6B627B1A]) [    ] o.e.j.s.session No SessionScavenger set, using defaults
   [junit4]   2> 975358 INFO  (TEST-ChaosMonkeySafeLeaderWithPullReplicasTest.test-seed#[4059265D6B627B1A]) [    ] o.e.j.s.session node0 Scavenging every 600000ms
   [junit4]   2> 975358 INFO  (TEST-ChaosMonkeySafeLeaderWithPullReplicasTest.test-seed#[4059265D6B627B1A]) [    ] o.e.j.s.h.ContextHandler Started o.e.j.s.ServletContextHandler@325b5472{/,null,AVAILABLE}
   [junit4]   2> 975359 INFO  (TEST-ChaosMonkeySafeLeaderWithPullReplicasTest.test-seed#[4059265D6B627B1A]) [    ] o.e.j.s.AbstractConnector Started ServerConnector@c650fa1{HTTP/1.1,[http/1.1, h2c]}{127.0.0.1:44001}
   [junit4]   2> 975359 INFO  (TEST-ChaosMonkeySafeLeaderWithPullReplicasTest.test-seed#[4059265D6B627B1A]) [    ] o.e.j.s.Server Started @975436ms
   [junit4]   2> 975359 INFO  (TEST-ChaosMonkeySafeLeaderWithPullReplicasTest.test-seed#[4059265D6B627B1A]) [    ] o.a.s.c.s.e.JettySolrRunner Jetty properties: {hostContext=/, solr.data.dir=/x1/jenkins/jenkins-slave/workspace/Lucene-Solr-BadApples-Tests-master/solr/build/solr-core/test/J0/temp/solr.cloud.ChaosMonkeySafeLeaderWithPullReplicasTest_4059265D6B627B1A-001/tempDir-001/control/data, hostPort=44001, coreRootDirectory=/x1/jenkins/jenkins-slave/workspace/Lucene-Solr-BadApples-Tests-master/solr/build/solr-core/test/J0/../../../../../../../../../../x1/jenkins/jenkins-slave/workspace/Lucene-Solr-BadApples-Tests-master/solr/build/solr-core/test/J0/temp/solr.cloud.ChaosMonkeySafeLeaderWithPullReplicasTest_4059265D6B627B1A-001/control-001/cores, replicaType=NRT}
   [junit4]   2> 975360 ERROR (TEST-ChaosMonkeySafeLeaderWithPullReplicasTest.test-seed#[4059265D6B627B1A]) [    ] o.a.s.u.StartupLoggingUtils Missing Java Option solr.log.dir. Logging may be missing or incomplete.
   [junit4]   2> 975360 INFO  (TEST-ChaosMonkeySafeLeaderWithPullReplicasTest.test-seed#[4059265D6B627B1A]) [    ] o.a.s.s.SolrDispatchFilter Using logger factory org.apache.logging.slf4j.Log4jLoggerFactory
   [junit4]   2> 975361 INFO  (TEST-ChaosMonkeySafeLeaderWithPullReplicasTest.test-seed#[4059265D6B627B1A]) [    ] o.a.s.s.SolrDispatchFilter  ___      _       Welcome to Apache Solr? version 9.0.0
   [junit4]   2> 975361 INFO  (TEST-ChaosMonkeySafeLeaderWithPullReplicasTest.test-seed#[4059265D6B627B1A]) [    ] o.a.s.s.SolrDispatchFilter / __| ___| |_ _   Starting in cloud mode on port null
   [junit4]   2> 975361 INFO  (TEST-ChaosMonkeySafeLeaderWithPullReplicasTest.test-seed#[4059265D6B627B1A]) [    ] o.a.s.s.SolrDispatchFilter \__ \/ _ \ | '_|  Install dir: null
   [junit4]   2> 975361 INFO  (TEST-ChaosMonkeySafeLeaderWithPullReplicasTest.test-seed#[4059265D6B627B1A]) [    ] o.a.s.s.SolrDispatchFilter |___/\___/_|_|    Start time: 2019-05-15T15:43:50.132137Z
   [junit4]   2> 975363 INFO  (zkConnectionManagerCallback-6956-thread-1) [    ] o.a.s.c.c.ConnectionManager zkClient has connected
   [junit4]   2> 975364 INFO  (TEST-ChaosMonkeySafeLeaderWithPullReplicasTest.test-seed#[4059265D6B627B1A]) [    ] o.a.s.s.SolrDispatchFilter Loading solr.xml from SolrHome (not found in ZooKeeper)
   [junit4]   2> 975364 INFO  (TEST-ChaosMonkeySafeLeaderWithPullReplicasTest.test-seed#[4059265D6B627B1A]) [    ] o.a.s.c.SolrXmlConfig Loading container configuration from /x1/jenkins/jenkins-slave/workspace/Lucene-Solr-BadApples-Tests-master/solr/build/solr-core/test/J0/temp/solr.cloud.ChaosMonkeySafeLeaderWithPullReplicasTest_4059265D6B627B1A-001/control-001/solr.xml
   [junit4]   2> 975368 INFO  (TEST-ChaosMonkeySafeLeaderWithPullReplicasTest.test-seed#[4059265D6B627B1A]) [    ] o.a.s.c.SolrXmlConfig Configuration parameter autoReplicaFailoverWorkLoopDelay is ignored
   [junit4]   2> 975368 INFO  (TEST-ChaosMonkeySafeLeaderWithPullReplicasTest.test-seed#[4059265D6B627B1A]) [    ] o.a.s.c.SolrXmlConfig Configuration parameter autoReplicaFailoverBadNodeExpiration is ignored
   [junit4]   2> 975370 INFO  (TEST-ChaosMonkeySafeLeaderWithPullReplicasTest.test-seed#[4059265D6B627B1A]) [    ] o.a.s.c.SolrXmlConfig MBean server found: com.sun.jmx.mbeanserver.JmxMBeanServer@563ddaf0, but no JMX reporters were configured - adding default JMX reporter.
   [junit4]   2> 975517 INFO  (TEST-ChaosMonkeySafeLeaderWithPullReplicasTest.test-seed#[4059265D6B627B1A]) [    ] o.a.s.h.c.HttpShardHandlerFactory Host whitelist initialized: WhitelistHostChecker [whitelistHosts=null, whitelistHostCheckingEnabled=false]
   [junit4]   2> 975519 WARN  (TEST-ChaosMonkeySafeLeaderWithPullReplicasTest.test-seed#[4059265D6B627B1A]) [    ] o.e.j.u.s.S.config No Client EndPointIdentificationAlgorithm configured for SslContextFactory@5c012b8b[provider=null,keyStore=null,trustStore=null]
   [junit4]   2> 975522 WARN  (TEST-ChaosMonkeySafeLeaderWithPullReplicasTest.test-seed#[4059265D6B627B1A]) [    ] o.e.j.u.s.S.config No Client EndPointIdentificationAlgorithm configured for SslContextFactory@24fd5318[provider=null,keyStore=null,trustStore=null]
   [junit4]   2> 975523 INFO  (TEST-ChaosMonkeySafeLeaderWithPullReplicasTest.test-seed#[4059265D6B627B1A]) [    ] o.a.s.c.ZkContainer Zookeeper client=127.0.0.1:35183/solr
   [junit4]   2> 975525 INFO  (zkConnectionManagerCallback-6963-thread-1) [    ] o.a.s.c.c.ConnectionManager zkClient has connected
   [junit4]   2> 975529 INFO  (zkConnectionManagerCallback-6965-thread-1) [    ] o.a.s.c.c.ConnectionManager zkClient has connected
   [junit4]   2> 975633 INFO  (TEST-ChaosMonkeySafeLeaderWithPullReplicasTest.test-seed#[4059265D6B627B1A]) [n:127.0.0.1:44001_    ] o.a.s.c.OverseerElectionContext I am going to be the leader 127.0.0.1:44001_
   [junit4]   2> 975634 INFO  (TEST-ChaosMonkeySafeLeaderWithPullReplicasTest.test-seed#[4059265D6B627B1A]) [n:127.0.0.1:44001_    ] o.a.s.c.Overseer Overseer (id=73307351120347140-127.0.0.1:44001_-n_0000000000) starting
   [junit4]   2> 975642 INFO  (zkConnectionManagerCallback-6972-thread-1) [    ] o.a.s.c.c.ConnectionManager zkClient has connected
   [junit4]   2> 975646 INFO  (TEST-ChaosMonkeySafeLeaderWithPullReplicasTest.test-seed#[4059265D6B627B1A]) [n:127.0.0.1:44001_    ] o.a.s.c.s.i.ZkClientClusterStateProvider Cluster at 127.0.0.1:35183/solr ready
   [junit4]   2> 975647 INFO  (OverseerStateUpdate-73307351120347140-127.0.0.1:44001_-n_0000000000) [n:127.0.0.1:44001_    ] o.a.s.c.Overseer Starting to work on the main queue : 127.0.0.1:44001_
   [junit4]   2> 975647 INFO  (TEST-ChaosMonkeySafeLeaderWithPullReplicasTest.test-seed#[4059265D6B627B1A]) [n:127.0.0.1:44001_    ] o.a.s.c.ZkController Register node as live in ZooKeeper:/live_nodes/127.0.0.1:44001_
   [junit4]   2> 975649 INFO  (OverseerStateUpdate-73307351120347140-127.0.0.1:44001_-n_0000000000) [n:127.0.0.1:44001_    ] o.a.s.c.c.ZkStateReader Updated live nodes from ZooKeeper... (0) -> (1)
   [junit4]   2> 975649 INFO  (zkCallback-6971-thread-1) [    ] o.a.s.c.c.ZkStateReader Updated live nodes from ZooKeeper... (0) -> (1)
   [junit4]   2> 975670 INFO  (TEST-ChaosMonkeySafeLeaderWithPullReplicasTest.test-seed#[4059265D6B627B1A]) [n:127.0.0.1:44001_    ] o.a.s.h.a.MetricsHistoryHandler No .system collection, keeping metrics history in memory.
   [junit4]   2> 975699 INFO  (TEST-ChaosMonkeySafeLeaderWithPullReplicasTest.test-seed#[4059265D6B627B1A]) [n:127.0.0.1:44001_    ] o.a.s.m.r.SolrJmxReporter JMX monitoring for 'solr.node' (registry 'solr.node') enabled at server: com.sun.jmx.mbeanserver.JmxMBeanServer@563ddaf0
   [junit4]   2> 975721 INFO  (TEST-ChaosMonkeySafeLeaderWithPullReplicasTest.test-seed#[4059265D6B627B1A]) [n:127.0.0.1:44001_    ] o.a.s.m.r.SolrJmxReporter JMX monitoring for 'solr.jvm' (registry 'solr.jvm') enabled at server: com.sun.jmx.mbeanserver.JmxMBeanServer@563ddaf0
   [junit4]   2> 975721 INFO  (TEST-ChaosMonkeySafeLeaderWithPullReplicasTest.test-seed#[4059265D6B627B1A]) [n:127.0.0.1:44001_    ] o.a.s.m.r.SolrJmxReporter JMX monitoring for 'solr.jetty' (registry 'solr.jetty') enabled at server: com.sun.jmx.mbeanserver.JmxMBeanServer@563ddaf0
   [junit4]   2> 975724 INFO  (TEST-ChaosMonkeySafeLeaderWithPullReplicasTest.test-seed#[4059265D6B627B1A]) [n:127.0.0.1:44001_    ] o.a.s.c.CorePropertiesLocator Found 0 core definitions underneath /x1/jenkins/jenkins-slave/workspace/Lucene-Solr-BadApples-Tests-master/solr/build/solr-core/test/J0/../../../../../../../../../../x1/jenkins/jenkins-slave/workspace/Lucene-Solr-BadApples-Tests-master/solr/build/solr-core/test/J0/temp/solr.cloud.ChaosMonkeySafeLeaderWithPullReplicasTest_4059265D6B627B1A-001/control-001/cores
   [junit4]   2> 975756 INFO  (zkConnectionManagerCallback-6978-thread-1) [    ] o.a.s.c.c.ConnectionManager zkClient has connected
   [junit4]   2> 975758 INFO  (TEST-ChaosMonkeySafeLeaderWithPullReplicasTest.test-seed#[4059265D6B627B1A]) [    ] o.a.s.c.c.ZkStateReader Updated live nodes from ZooKeeper... (0) -> (1)
   [junit4]   2> 975759 INFO  (TEST-ChaosMonkeySafeLeaderWithPullReplicasTest.test-seed#[4059265D6B627B1A]) [    ] o.a.s.c.s.i.ZkClientClusterStateProvider Cluster at 127.0.0.1:35183/solr ready
   [junit4]   2> 975762 INFO  (qtp720243424-12522) [n:127.0.0.1:44001_    ] o.a.s.h.a.CollectionsHandler Invoked Collection Action :create with params collection.configName=conf1&name=control_collection&nrtReplicas=1&action=CREATE&numShards=1&createNodeSet=127.0.0.1:44001_&wt=javabin&version=2 and sendToOCPQueue=true
   [junit4]   2> 975766 INFO  (OverseerThreadFactory-4110-thread-1-processing-n:127.0.0.1:44001_) [n:127.0.0.1:44001_    ] o.a.s.c.a.c.CreateCollectionCmd Create collection control_collection
   [junit4]   2> 975876 INFO  (qtp720243424-12524) [n:127.0.0.1:44001_    x:control_collection_shard1_replica_n1] o.a.s.h.a.CoreAdminOperation core create command qt=/admin/cores&collection.configName=conf1&newCollection=true&name=control_collection_shard1_replica_n1&action=CREATE&numShards=1&collection=control_collection&shard=shard1&wt=javabin&version=2&replicaType=NRT
   [junit4]   2> 975876 INFO  (qtp720243424-12524) [n:127.0.0.1:44001_    x:control_collection_shard1_replica_n1] o.a.s.c.TransientSolrCoreCacheDefault Allocating transient cache for 4 transient cores
   [junit4]   2> 976891 INFO  (qtp720243424-12524) [n:127.0.0.1:44001_ c:control_collection s:shard1  x:control_collection_shard1_replica_n1] o.a.s.c.SolrConfig Using Lucene MatchVersion: 9.0.0
   [junit4]   2> 976912 INFO  (qtp720243424-12524) [n:127.0.0.1:44001_ c:control_collection s:shard1  x:control_collection_shard1_replica_n1] o.a.s.s.IndexSchema [control_collection_shard1_replica_n1] Schema name=test
   [junit4]   2> 977010 INFO  (qtp720243424-12524) [n:127.0.0.1:44001_ c:control_collection s:shard1  x:control_collection_shard1_replica_n1] o.a.s.s.IndexSchema Loaded schema test/1.6 with uniqueid field id
   [junit4]   2> 977031 INFO  (qtp720243424-12524) [n:127.0.0.1:44001_ c:control_collection s:shard1  x:control_collection_shard1_replica_n1] o.a.s.c.CoreContainer Creating SolrCore 'control_collection_shard1_replica_n1' using configuration from collection control_collection, trusted=true
   [junit4]   2> 977032 INFO  (qtp720243424-12524) [n:127.0.0.1:44001_ c:control_collection s:shard1  x:control_collection_shard1_replica_n1] o.a.s.m.r.SolrJmxReporter JMX monitoring for 'solr.core.control_collection.shard1.replica_n1' (registry 'solr.core.control_collection.shard1.replica_n1') enabled at server: com.sun.jmx.mbeanserver.JmxMBeanServer@563ddaf0
   [junit4]   2> 977035 INFO  (qtp720243424-12524) [n:127.0.0.1:44001_ c:control_collection s:shard1  x:control_collection_shard1_replica_n1] o.a.s.c.SolrCore [[control_collection_shard1_replica_n1] ] Opening new SolrCore at [/x1/jenkins/jenkins-slave/workspace/Lucene-Solr-BadApples-Tests-master/solr/build/solr-core/test/J0/temp/solr.cloud.ChaosMonkeySafeLeaderWithPullReplicasTest_4059265D6B627B1A-001/control-001/cores/control_collection_shard1_replica_n1], dataDir=[/x1/jenkins/jenkins-slave/workspace/Lucene-Solr-BadApples-Tests-master/solr/build/solr-core/test/J0/../../../../../../../../../../x1/jenkins/jenkins-slave/workspace/Lucene-Solr-BadApples-Tests-master/solr/build/solr-core/test/J0/temp/solr.cloud.ChaosMonkeySafeLeaderWithPullReplicasTest_4059265D6B627B1A-001/control-001/cores/control_collection_shard1_replica_n1/data/]
   [junit4]   2> 977040 INFO  (qtp720243424-12524) [n:127.0.0.1:44001_ c:control_collection s:shard1  x:control_collection_shard1_replica_n1] o.a.s.u.RandomMergePolicy RandomMergePolicy wrapping class org.apache.lucene.index.LogByteSizeMergePolicy: [LogByteSizeMergePolicy: minMergeSize=1677721, mergeFactor=38, maxMergeSize=2147483648, maxMergeSizeForForcedMerge=9223372036854775807, calibrateSizeByDeletes=false, maxMergeDocs=2147483647, maxCFSSegmentSizeMB=8.796093022207999E12, noCFSRatio=0.0]
   [junit4]   2> 977047 WARN  (qtp720243424-12524) [n:127.0.0.1:44001_ c:control_collection s:shard1  x:control_collection_shard1_replica_n1] o.a.s.c.RequestHandlers INVALID paramSet a in requestHandler {type = requestHandler,name = /dump,class = DumpRequestHandler,attributes = {initParams=a, name=/dump, class=DumpRequestHandler},args = {defaults={a=A,b=B}}}
   [junit4]   2> 977126 INFO  (qtp720243424-12524) [n:127.0.0.1:44001_ c:control_collection s:shard1  x:control_collection_shard1_replica_n1] o.a.s.u.UpdateHandler Using UpdateLog implementation: org.apache.solr.update.UpdateLog
   [junit4]   2> 977126 INFO  (qtp720243424-12524) [n:127.0.0.1:44001_ c:control_collection s:shard1  x:control_collection_shard1_replica_n1] o.a.s.u.UpdateLog Initializing UpdateLog: dataDir= defaultSyncLevel=FLUSH numRecordsToKeep=100 maxNumLogsToKeep=10 numVersionBuckets=65536
   [junit4]   2> 977129 INFO  (qtp720243424-12524) [n:127.0.0.1:44001_ c:control_collection s:shard1  x:control_collection_shard1_replica_n1] o.a.s.u.CommitTracker Hard AutoCommit: if uncommitted for 15000ms; 
   [junit4]   2> 977129 INFO  (qtp720243424-12524) [n:127.0.0.1:44001_ c:control_collection s:shard1  x:control_collection_shard1_replica_n1] o.a.s.u.CommitTracker Soft AutoCommit: disabled
   [junit4]   2> 977132 INFO  (qtp720243424-12524) [n:127.0.0.1:44001_ c:control_collection s:shard1  x:control_collection_shard1_replica_n1] o.a.s.u.RandomMergePolicy RandomMergePolicy wrapping class org.apache.lucene.index.LogByteSizeMergePolicy: [LogByteSizeMergePolicy: minMergeSize=1677721, mergeFactor=30, maxMergeSize=2147483648, maxMergeSizeForForcedMerge=9223372036854775807, calibrateSizeByDeletes=false, maxMergeDocs=2147483647, maxCFSSegmentSizeMB=8.796093022207999E12, noCFSRatio=0.14329101760807178]
   [junit4]   2> 977133 INFO  (qtp720243424-12524) [n:127.0.0.1:44001_ c:control_collection s:shard1  x:control_collection_shard1_replica_n1] o.a.s.s.SolrIndexSearcher Opening [Searcher@625cf7e[control_collection_shard1_replica_n1] main]
   [junit4]   2> 977134 INFO  (qtp720243424-12524) [n:127.0.0.1:44001_ c:control_collection s:shard1  x:control_collection_shard1_replica_n1] o.a.s.r.ManagedResourceStorage Configured ZooKeeperStorageIO with znodeBase: /configs/conf1
   [junit4]   2> 977135 INFO  (qtp720243424-12524) [n:127.0.0.1:44001_ c:control_collection s:shard1  x:control_collection_shard1_replica_n1] o.a.s.r.ManagedResourceStorage Loaded null at path _rest_managed.json using ZooKeeperStorageIO:path=/configs/conf1
   [junit4]   2> 977136 INFO  (qtp720243424-12524) [n:127.0.0.1:44001_ c:control_collection s:shard1  x:control_collection_shard1_replica_n1] o.a.s.h.ReplicationHandler Commits will be reserved for 10000ms.
   [junit4]   2> 977136 INFO  (qtp720243424-12524) [n:127.0.0.1:44001_ c:control_collection s:shard1  x:control_collection_shard1_replica_n1] o.a.s.u.UpdateLog Could not find max version in index or recent updates, using new clock 1633613284016914432
   [junit4]   2> 977140 INFO  (searcherExecutor-4115-thread-1-processing-n:127.0.0.1:44001_ x:control_collection_shard1_replica_n1 c:control_collection s:shard1) [n:127.0.0.1:44001_ c:control_collection s:shard1  x:control_collection_shard1_replica_n1] o.a.s.c.SolrCore [control_collection_shard1_replica_n1] Registered new searcher Searcher@625cf7e[control_collection_shard1_replica_n1] main{ExitableDirectoryReader(UninvertingDirectoryReader())}
   [junit4]   2> 977143 INFO  (qtp720243424-12524) [n:127.0.0.1:44001_ c:control_collection s:shard1  x:control_collection_shard1_replica_n1] o.a.s.c.ZkShardTerms Successful update of terms at /collections/control_collection/terms/shard1 to Terms{values={core_node2=0}, version=0}
   [junit4]   2> 977143 INFO  (qtp720243424-12524) [n:127.0.0.1:44001_ c:control_collection s:shard1  x:control_collection_shard1_replica_n1] o.a.s.c.ShardLeaderElectionContextBase make sure parent is created /collections/control_collection/leaders/shard1
   [junit4]   2> 977148 INFO  (qtp720243424-12524) [n:127.0.0.1:44001_ c:control_collection s:shard1  x:control_collection_shard1_replica_n1] o.a.s.c.ShardLeaderElectionContext Enough replicas found to continue.
   [junit4]   2> 977148 INFO  (qtp720243424-12524) [n:127.0.0.1:44001_ c:control_collection s:shard1  x:control_collection_shard1_replica_n1] o.a.s.c.ShardLeaderElectionContext I may be the new leader - try and sync
   [junit4]   2> 977148 INFO  (qtp720243424-12524) [n:127.0.0.1:44001_ c:control_collection s:shard1  x:control_collection_shard1_replica_n1] o.a.s.c.SyncStrategy Sync replicas to http://127.0.0.1:44001/control_collection_shard1_replica_n1/
   [junit4]   2> 977148 INFO  (qtp720243424-12524) [n:127.0.0.1:44001_ c:control_collection s:shard1  x:control_collection_shard1_replica_n1] o.a.s.c.SyncStrategy Sync Success - now sync replicas to me
   [junit4]   2> 977149 INFO  (qtp720243424-12524) [n:127.0.0.1:44001_ c:control_collection s:shard1  x:control_collection_shard1_replica_n1] o.a.s.c.SyncStrategy http://127.0.0.1:44001/control_collection_shard1_replica_n1/ has no replicas
   [junit4]   2> 977149 INFO  (qtp720243424-12524) [n:127.0.0.1:44001_ c:control_collection s:shard1  x:control_collection_shard1_replica_n1] o.a.s.c.ShardLeaderElectionContextBase Creating leader registration node /collections/control_collection/leaders/shard1/leader after winning as /collections/control_collection/leader_elect/shard1/election/73307351120347140-core_node2-n_0000000000
   [junit4]   2> 977151 INFO  (qtp720243424-12524) [n:127.0.0.1:44001_ c:control_collection s:shard1  x:control_collection_shard1_replica_n1] o.a.s.c.ShardLeaderElectionContext I am the new leader: http://127.0.0.1:44001/control_collection_shard1_replica_n1/ shard1
   [junit4]   2> 977254 INFO  (zkCallback-6964-thread-1) [    ] o.a.s.c.c.ZkStateReader A cluster state change: [WatchedEvent state:SyncConnected type:NodeDataChanged path:/collections/control_collection/state.json] for collection [control_collection] has occurred - updating... (live nodes size: [1])
   [junit4]   2> 977256 INFO  (qtp720243424-12524) [n:127.0.0.1:44001_ c:control_collection s:shard1  x:control_collection_shard1_replica_n1] o.a.s.c.ZkController I am the leader, no recovery necessary
   [junit4]   2> 977259 INFO  (qtp720243424-12524) [n:127.0.0.1:44001_ c:control_collection s:shard1  x:control_collection_shard1_replica_n1] o.a.s.s.HttpSolrCall [admin] webapp=null path=/admin/cores params={qt=/admin/cores&collection.configName=conf1&newCollection=true&name=control_collection_shard1_replica_n1&action=CREATE&numShards=1&collection=control_collection&shard=shard1&wt=javabin&version=2&replicaType=NRT} status=0 QTime=1383
   [junit4]   2> 977265 INFO  (qtp720243424-12522) [n:127.0.0.1:44001_    ] o.a.s.h.a.CollectionsHandler Wait for new collection to be active for at most 45 seconds. Check all shard replicas
   [junit4]   2> 977359 INFO  (zkCallback-6964-thread-2) [    ] o.a.s.c.c.ZkStateReader A cluster state change: [WatchedEvent state:SyncConnected type:NodeDataChanged path:/collections/control_collection/state.json] for collection [control_collection] has occurred - updating... (live nodes size: [1])
   [junit4]   2> 977359 INFO  (zkCallback-6964-thread-3) [    ] o.a.s.c.c.ZkStateReader A cluster state change: [WatchedEvent state:SyncConnected type:NodeDataChanged path:/collections/control_collection/state.json] for collection [control_collection] has occurred - updating... (live nodes size: [1])
   [junit4]   2> 977360 INFO  (qtp720243424-12522) [n:127.0.0.1:44001_    ] o.a.s.s.HttpSolrCall [admin] webapp=null path=/admin/collections params={collection.configName=conf1&name=control_collection&nrtReplicas=1&action=CREATE&numShards=1&createNodeSet=127.0.0.1:44001_&wt=javabin&version=2} status=0 QTime=1598
   [junit4]   2> 977366 INFO  (zkConnectionManagerCallback-6984-thread-1) [    ] o.a.s.c.c.ConnectionManager zkClient has connected
   [junit4]   2> 977368 INFO  (TEST-ChaosMonkeySafeLeaderWithPullReplicasTest.test-seed#[4059265D6B627B1A]) [    ] o.a.s.c.c.ZkStateReader Updated live nodes from ZooKeeper... (0) -> (1)
   [junit4]   2> 977370 INFO  (TEST-ChaosMonkeySafeLeaderWithPullReplicasTest.test-seed#[4059265D6B627B1A]) [    ] o.a.s.c.s.i.ZkClientClusterStateProvider Cluster at 127.0.0.1:35183/solr ready
   [junit4]   2> 977370 INFO  (TEST-ChaosMonkeySafeLeaderWithPullReplicasTest.test-seed#[4059265D6B627B1A]) [    ] o.a.s.c.ChaosMonkey monkey: init - expire sessions:false cause connection loss:false
   [junit4]   2> 977371 INFO  (qtp720243424-12524) [n:127.0.0.1:44001_    ] o.a.s.h.a.CollectionsHandler Invoked Collection Action :create with params collection.configName=conf1&name=collection1&nrtReplicas=1&action=CREATE&numShards=2&createNodeSet=&stateFormat=1&wt=javabin&version=2 and sendToOCPQueue=true
   [junit4]   2> 977375 INFO  (OverseerThreadFactory-4110-thread-2-processing-n:127.0.0.1:44001_) [n:127.0.0.1:44001_    ] o.a.s.c.a.c.CreateCollectionCmd Create collection collection1
   [junit4]   2> 977375 INFO  (OverseerCollectionConfigSetProcessor-73307351120347140-127.0.0.1:44001_-n_0000000000) [n:127.0.0.1:44001_    ] o.a.s.c.OverseerTaskQueue Response ZK path: /overseer/collection-queue-work/qnr-0000000000 doesn't exist.  Requestor may have disconnected from ZooKeeper
   [junit4]   2> 977580 WARN  (OverseerThreadFactory-4110-thread-2-processing-n:127.0.0.1:44001_) [n:127.0.0.1:44001_    ] o.a.s.c.a.c.CreateCollectionCmd It is unusual to create a collection (collection1) without cores.
   [junit4]   2> 977582 INFO  (qtp720243424-12524) [n:127.0.0.1:44001_    ] o.a.s.h.a.CollectionsHandler Wait for new collection to be active for at most 45 seconds. Check all shard replicas
   [junit4]   2> 977583 INFO  (qtp720243424-12524) [n:127.0.0.1:44001_    ] o.a.s.s.HttpSolrCall [admin] webapp=null path=/admin/collections params={collection.configName=conf1&name=collection1&nrtReplicas=1&action=CREATE&numShards=2&createNodeSet=&stateFormat=1&wt=javabin&version=2} status=0 QTime=211
   [junit4]   2> 977591 INFO  (TEST-ChaosMonkeySafeLeaderWithPullReplicasTest.test-seed#[4059265D6B627B1A]) [    ] o.a.s.c.AbstractFullDistribZkTestBase Creating jetty instances pullReplicaCount=1 numOtherReplicas=4
   [junit4]   2> 977778 INFO  (TEST-ChaosMonkeySafeLeaderWithPullReplicasTest.test-seed#[4059265D6B627B1A]) [    ] o.a.s.c.AbstractFullDistribZkTestBase create jetty 1 in directory /x1/jenkins/jenkins-slave/workspace/Lucene-Solr-BadApples-Tests-master/solr/build/solr-core/test/J0/temp/solr.cloud.ChaosMonkeySafeLeaderWithPullReplicasTest_4059265D6B627B1A-001/shard-1-001 of type NRT
   [junit4]   2> 977779 WARN  (closeThreadPool-6985-thread-1) [    ] o.e.j.s.AbstractConnector Ignoring deprecated socket close linger time
   [junit4]   2> 977779 INFO  (closeThreadPool-6985-thread-1) [    ] o.a.s.c.s.e.JettySolrRunner Start Jetty (original configured port=0)
   [junit4]   2> 977780 INFO  (closeThreadPool-6985-thread-1) [    ] o.a.s.c.s.e.JettySolrRunner Trying to start Jetty on port 0 try number 1 ...
   [junit4]   2> 977780 INFO  (closeThreadPool-6985-thread-1) [    ] o.e.j.s.Server jetty-9.4.14.v20181114; built: 2018-11-14T21:20:31.478Z; git: c4550056e785fb5665914545889f21dc136ad9e6; jvm 11.0.1+13-LTS
   [junit4]   2> 977783 INFO  (closeThreadPool-6985-thread-1) [    ] o.e.j.s.session DefaultSessionIdManager workerName=node0
   [junit4]   2> 977783 INFO  (closeThreadPool-6985-thread-1) [    ] o.e.j.s.session No SessionScavenger set, using defaults
   [junit4]   2> 977783 INFO  (closeThreadPool-6985-thread-1) [    ] o.e.j.s.session node0 Scavenging every 660000ms
   [junit4]   2> 977784 INFO  (closeThreadPool-6985-thread-1) [    ] o.e.j.s.h.ContextHandler Started o.e.j.s.ServletContextHandler@5ab29f4{/,null,AVAILABLE}
   [junit4]   2> 977785 INFO  (closeThreadPool-6985-thread-1) [    ] o.e.j.s.AbstractConnector Started ServerConnector@41bdcd85{HTTP/1.1,[http/1.1, h2c]}{127.0.0.1:44600}
   [junit4]   2> 977785 INFO  (closeThreadPool-6985-thread-1) [    ] o.e.j.s.Server Started @977862ms
   [junit4]   2> 977785 INFO  (closeThreadPool-6985-thread-1) [    ] o.a.s.c.s.e.JettySolrRunner Jetty properties: {hostContext=/, solrconfig=solrconfig.xml, solr.data.dir=/x1/jenkins/jenkins-slave/workspace/Lucene-Solr-BadApples-Tests-master/solr/build/solr-core/test/J0/temp/solr.cloud.ChaosMonkeySafeLeaderWithPullReplicasTest_4059265D6B627B1A-001/tempDir-001/jetty1, hostPort=44600, coreRootDirectory=/x1/jenkins/jenkins-slave/workspace/Lucene-Solr-BadApples-Tests-master/solr/build/solr-core/test/J0/../../../../../../../../../../x1/jenkins/jenkins-slave/workspace/Lucene-Solr-BadApples-Tests-master/solr/build/solr-core/test/J0/temp/solr.cloud.ChaosMonkeySafeLeaderWithPullReplicasTest_4059265D6B627B1A-001/shard-1-001/cores}
   [junit4]   2> 977785 ERROR (closeThreadPool-6985-thread-1) [    ] o.a.s.u.StartupLoggingUtils Missing Java Option solr.log.dir. Logging may be missing or incomplete.
   [junit4]   2> 977786 INFO  (closeThreadPool-6985-thread-1) [    ] o.a.s.s.SolrDispatchFilter Using logger factory org.apache.logging.slf4j.Log4jLoggerFactory
   [junit4]   2> 977786 INFO  (closeThreadPool-6985-thread-1) [    ] o.a.s.s.SolrDispatchFilter  ___      _       Welcome to Apache Solr? version 9.0.0
   [junit4]   2> 977786 INFO  (closeThreadPool-6985-thread-1) [    ] o.a.s.s.SolrDispatchFilter / __| ___| |_ _   Starting in cloud mode on port null
   [junit4]   2> 977786 INFO  (closeThreadPool-6985-thread-1) [    ] o.a.s.s.SolrDispatchFilter \__ \/ _ \ | '_|  Install dir: null
   [junit4]   2> 977786 INFO  (closeThreadPool-6985-thread-1) [    ] o.a.s.s.SolrDispatchFilter |___/\___/_|_|    Start time: 2019-05-15T15:43:52.557169Z
   [junit4]   2> 977789 INFO  (zkConnectionManagerCallback-6987-thread-1) [    ] o.a.s.c.c.ConnectionManager zkClient has connected
   [junit4]   2> 977791 INFO  (closeThreadPool-6985-thread-1) [    ] o.a.s.s.SolrDispatchFilter Loading solr.xml from SolrHome (not found in ZooKeeper)
   [junit4]   2> 977791 INFO  (closeThreadPool-6985-thread-1) [    ] o.a.s.c.SolrXmlConfig Loading container configuration from /x1/jenkins/jenkins-slave/workspace/Lucene-Solr-BadApples-Tests-master/solr/build/solr-core/test/J0/temp/solr.cloud.ChaosMonkeySafeLeaderWithPullReplicasTest_4059265D6B627B1A-001/shard-1-001/solr.xml
   [junit4]   2> 977794 INFO  (closeThreadPool-6985-thread-1) [    ] o.a.s.c.SolrXmlConfig Configuration parameter autoReplicaFailoverWorkLoopDelay is ignored
   [junit4]   2> 977794 INFO  (closeThreadPool-6985-thread-1) [    ] o.a.s.c.SolrXmlConfig Configuration parameter autoReplicaFailoverBadNodeExpiration is ignored
   [junit4]   2> 977796 INFO  (closeThreadPool-6985-thread-1) [    ] o.a.s.c.SolrXmlConfig MBean server found: com.sun.jmx.mbeanserver.JmxMBeanServer@563ddaf0, but no JMX reporters were configured - adding default JMX reporter.
   [junit4]   2> 977974 INFO  (TEST-ChaosMonkeySafeLeaderWithPullReplicasTest.test-seed#[4059265D6B627B1A]) [    ] o.a.s.c.AbstractFullDistribZkTestBase create jetty 2 in directory /x1/jenkins/jenkins-slave/workspace/Lucene-Solr-BadApples-Tests-master/solr/build/solr-core/test/J0/temp/solr.cloud.ChaosMonkeySafeLeaderWithPullReplicasTest_4059265D6B627B1A-001/shard-2-001 of type NRT
   [junit4]   2> 977975 WARN  (closeThreadPool-6985-thread-2) [    ] o.e.j.s.AbstractConnector Ignoring deprecated socket close linger time
   [junit4]   2> 977976 INFO  (closeThreadPool-6985-thread-2) [    ] o.a.s.c.s.e.JettySolrRunner Start Jetty (original configured port=0)
   [junit4]   2> 977976 INFO  (closeThreadPool-6985-thread-2) [    ] o.a.s.c.s.e.JettySolrRunner Trying to start Jetty on port 0 try number 1 ...
   [junit4]   2> 977976 INFO  (closeThreadPool-6985-thread-2) [    ] o.e.j.s.Server jetty-9.4.14.v20181114; built: 2018-11-14T21:20:31.478Z; git: c4550056e785fb5665914545889f21dc136ad9e6; jvm 11.0.1+13-LTS
   [junit4]   2> 977977 INFO  (closeThreadPool-6985-thread-2) [    ] o.e.j.s.session DefaultSessionIdManager workerName=node0
   [junit4]   2> 977977 INFO  (closeThreadPool-6985-thread-2) [    ] o.e.j.s.session No SessionScavenger set, using defaults
   [junit4]   2> 977977 INFO  (closeThreadPool-6985-thread-2) [    ] o.e.j.s.session node0 Scavenging every 660000ms
   [junit4]   2> 977977 INFO  (closeThreadPool-6985-thread-2) [    ] o.e.j.s.h.ContextHandler Started o.e.j.s.ServletContextHandler@4374cfe0{/,null,AVAILABLE}
   [junit4]   2> 977978 INFO  (closeThreadPool-6985-thread-2) [    ] o.e.j.s.AbstractConnector Started ServerConnector@3fd6004e{HTTP/1.1,[http/1.1, h2c]}{127.0.0.1:35781}
   [junit4]   2> 977978 INFO  (closeThreadPool-6985-thread-2) [    ] o.e.j.s.Server Started @978055ms
   [junit4]   2> 977978 INFO  (closeThreadPool-6985-thread-2) [    ] o.a.s.c.s.e.JettySolrRunner Jetty properties: {hostContext=/, solrconfig=solrconfig.xml, solr.data.dir=/x1/jenkins/jenkins-slave/workspace/Lucene-Solr-BadApples-Tests-master/solr/build/solr-core/test/J0/temp/solr.cloud.ChaosMonkeySafeLeaderWithPullReplicasTest_4059265D6B627B1A-001/tempDir-001/jetty2, hostPort=35781, coreRootDirectory=/x1/jenkins/jenkins-slave/workspace/Lucene-Solr-BadApples-Tests-master/solr/build/solr-core/test/J0/../../../../../../../../../../x1/jenkins/jenkins-slave/workspace/Lucene-Solr-BadApples-Tests-master/solr/build/solr-core/test/J0/temp/solr.cloud.ChaosMonkeySafeLeaderWithPullReplicasTest_4059265D6B627B1A-001/shard-2-001/cores}
   [junit4]   2> 977978 ERROR (closeThreadPool-6985-thread-2) [    ] o.a.s.u.StartupLoggingUtils Missing Java Option solr.log.dir. Logging may be missing or incomplete.
   [junit4]   2> 977978 INFO  (closeThreadPool-6985-thread-2) [    ] o.a.s.s.SolrDispatchFilter Using logger factory org.apache.logging.slf4j.Log4jLoggerFactory
   [junit4]   2> 977979 INFO  (closeThreadPool-6985-thread-2) [    ] o.a.s.s.SolrDispatchFilter  ___      _       Welcome to Apache Solr? version 9.0.0
   [junit4]   2> 977979 INFO  (closeThreadPool-6985-thread-2) [    ] o.a.s.s.SolrDispatchFilter / __| ___| |_ _   Starting in cloud mode on port null
   [junit4]   2> 977979 INFO  (closeThreadPool-6985-thread-2) [    ] o.a.s.s.SolrDispatchFilter \__ \/ _ \ | '_|  Install dir: null
   [junit4]   2> 977979 INFO  (closeThreadPool-6985-thread-2) [    ] o.a.s.s.SolrDispatchFilter |___/\___/_|_|    Start time: 2019-05-15T15:43:52.750110Z
   [junit4]   2> 977981 INFO  (closeThreadPool-6985-thread-1) [    ] o.a.s.h.c.HttpShardHandlerFactory Host whitelist initialized: WhitelistHostChecker [whitelistHosts=null, whitelistHostCheckingEnabled=false]
   [junit4]   2> 977981 INFO  (zkConnectionManagerCallback-6990-thread-1) [    ] o.a.s.c.c.ConnectionManager zkClient has connected
   [junit4]   2> 977982 INFO  (closeThreadPool-6985-thread-2) [    ] o.a.s.s.SolrDispatchFilter Loading solr.xml from SolrHome (not found in ZooKeeper)
   [junit4]   2> 977982 INFO  (closeThreadPool-6985-thread-2) [    ] o.a.s.c.SolrXmlConfig Loading container configuration from /x1/jenkins/jenkins-slave/workspace/Lucene-Solr-BadApples-Tests-master/solr/build/solr-core/test/J0/temp/solr.cloud.ChaosMonkeySafeLeaderWithPullReplicasTest_4059265D6B627B1A-001/shard-2-001/solr.xml
   [junit4]   2> 977982 WARN  (closeThreadPool-6985-thread-1) [    ] o.e.j.u.s.S.config No Client EndPointIdentificationAlgorithm configured for SslContextFactory@42c90f04[provider=null,keyStore=null,trustStore=null]
   [junit4]   2> 977986 INFO  (closeThreadPool-6985-thread-2) [    ] o.a.s.c.SolrXmlConfig Configuration parameter autoReplicaFailoverWorkLoopDelay is ignored
   [junit4]   2> 977986 INFO  (closeThreadPool-6985-thread-2) [    ] o.a.s.c.SolrXmlConfig Configuration parameter autoReplicaFailoverBadNodeExpiration is ignored
   [junit4]   2> 977988 INFO  (closeThreadPool-6985-thread-2) [    ] o.a.s.c.SolrXmlConfig MBean server found: com.sun.jmx.mbeanserver.JmxMBeanServer@563ddaf0, but no JMX reporters were configured - adding default JMX reporter.
   [junit4]   2> 978011 WARN  (closeThreadPool-6985-thread-1) [    ] o.e.j.u.s.S.config No Client EndPointIdentificationAlgorithm configured for SslContextFactory@b4ff6ab[provider=null,keyStore=null,trustStore=null]
   [junit4]   2> 978012 INFO  (closeThreadPool-6985-thread-1) [    ] o.a.s.c.ZkContainer Zookeeper client=127.0.0.1:35183/solr
   [junit4]   2> 978021 INFO  (zkConnectionManagerCallback-6997-thread-1) [    ] o.a.s.c.c.ConnectionManager zkClient has connected
   [junit4]   2> 978025 INFO  (zkConnectionManagerCallback-6999-thread-1) [    ] o.a.s.c.c.ConnectionManager zkClient has connected
   [junit4]   2> 978044 INFO  (closeThreadPool-6985-thread-1) [n:127.0.0.1:44600_    ] o.a.s.c.c.ZkStateReader Updated live nodes from ZooKeeper... (0) -> (1)
   [junit4]   2> 978070 INFO  (closeThreadPool-6985-thread-1) [n:127.0.0.1:44600_    ] o.a.s.c.ZkController Publish node=127.0.0.1:44600_ as DOWN
   [junit4]   2> 978076 INFO  (closeThreadPool-6985-thread-1) [n:127.0.0.1:44600_    ] o.a.s.c.TransientSolrCoreCacheDefault Allocating transient cache for 4 transient cores
   [junit4]   2> 978076 INFO  (closeThreadPool-6985-thread-1) [n:127.0.0.1:44600_    ] o.a.s.c.ZkController Register node as live in ZooKeeper:/live_nodes/127.0.0.1:44600_
   [junit4]   2> 978078 INFO  (zkCallback-6983-thread-1) [    ] o.a.s.c.c.ZkStateReader Updated live nodes from ZooKeeper... (1) -> (2)
   [junit4]   2> 978078 INFO  (zkCallback-6971-thread-1) [    ] o.a.s.c.c.ZkStateReader Updated live nodes from ZooKeeper... (1) -> (2)
   [junit4]   2> 978078 INFO  (zkCallback-6964-thread-3) [    ] o.a.s.c.c.ZkStateReader Updated live nodes from ZooKeeper... (1) -> (2)
   [junit4]   2> 978079 INFO  (zkCallback-6998-thread-1) [    ] o.a.s.c.c.ZkStateReader Updated live nodes from ZooKeeper... (1) -> (2)
   [junit4]   2> 978085 INFO  (zkConnectionManagerCallback-7006-thread-1) [    ] o.a.s.c.c.ConnectionManager zkClient has connected
   [junit4]   2> 978086 INFO  (closeThreadPool-6985-thread-1) [n:127.0.0.1:44600_    ] o.a.s.c.c.ZkStateReader Updated live nodes from ZooKeeper... (0) -> (2)
   [junit4]   2> 978088 INFO  (closeThreadPool-6985-thread-1) [n:127.0.0.1:44600_    ] o.a.s.c.s.i.ZkClientClusterStateProvider Cluster at 127.0.0.1:35183/solr ready
   [junit4]   2> 978118 INFO  (closeThreadPool-6985-thread-1) [n:127.0.0.1:44600_    ] o.a.s.h.a.MetricsHistoryHandler No .system collection, keeping metrics history in memory.
   [junit4]   2> 978150 INFO  (closeThreadPool-6985-thread-1) [n:127.0.0.1:44600_    ] o.a.s.m.r.SolrJmxReporter JMX monitoring for 'solr.node' (registry 'solr.node') enabled at server: com.sun.jmx.mbeanserver.JmxMBeanServer@563ddaf0
   [junit4]   2> 978180 INFO  (closeThreadPool-6985-thread-2) [    ] o.a.s.h.c.HttpShardHandlerFactory Host whitelist initialized: WhitelistHostChecker [whitelistHosts=null, whitelistHostCheckingEnabled=false]
   [junit4]   2> 978183 WARN  (closeThreadPool-6985-thread-2) [    ] o.e.j.u.s.S.config No Client EndPointIdentificationAlgorithm configured for SslContextFactory@5c834cd4[provider=null,keyStore=null,trustStore=null]
   [junit4]   2> 978184 INFO  (closeThreadPool-6985-thread-1) [n:127.0.0.1:44600_    ] o.a.s.m.r.SolrJmxReporter JMX monitoring for 'solr.jvm' (registry 'solr.jvm') enabled at server: com.sun.jmx.mbeanserver.JmxMBeanServer@563ddaf0
   [junit4]   2> 978185 INFO  (closeThreadPool-6985-thread-1) [n:127.0.0.1:44600_    ] o.a.s.m.r.SolrJmxReporter JMX monitoring for 'solr.jetty' (registry 'solr.jetty') enabled at server: com.sun.jmx.mbeanserver.JmxMBeanServer@563ddaf0
   [junit4]   2> 978187 INFO  (closeThreadPool-6985-thread-1) [n:127.0.0.1:44600_    ] o.a.s.c.CorePropertiesLocator Found 0 core definitions underneath /x1/jenkins/jenkins-slave/workspace/Lucene-Solr-BadApples-Tests-master/solr/build/solr-core/test/J0/../../../../../../../../../../x1/jenkins/jenkins-slave/workspace/Lucene-Solr-BadApples-Tests-master/solr/build/solr-core/test/J0/temp/solr.cloud.ChaosMonkeySafeLeaderWithPullReplicasTest_4059265D6B627B1A-001/shard-1-001/cores
   [junit4]   2> 978191 WARN  (closeThreadPool-6985-thread-2) [    ] o.e.j.u.s.S.config No Client EndPointIdentificationAlgorithm configured for SslContextFactory@6cacbe44[provider=null,keyStore=null,trustStore=null]
   [junit4]   2> 978192 INFO  (closeThreadPool-6985-thread-2) [    ] o.a.s.c.ZkContainer Zookeeper client=127.0.0.1:35183/solr
   [junit4]   2> 978202 INFO  (zkConnectionManagerCallback-7013-thread-1) [    ] o.a.s.c.c.ConnectionManager zkClient has connected
   [junit4]   2> 978203 INFO  (TEST-ChaosMonkeySafeLeaderWithPullReplicasTest.test-seed#[4059265D6B627B1A]) [    ] o.a.s.c.AbstractFullDistribZkTestBase create jetty 3 in directory /x1/jenkins/jenkins-slave/workspace/Lucene-Solr-BadApples-Tests-master/solr/build/solr-core/test/J0/temp/solr.cloud.ChaosMonkeySafeLeaderWithPullReplicasTest_4059265D6B627B1A-001/shard-3-001 of type NRT
   [junit4]   2> 978207 INFO  (zkConnectionManagerCallback-7015-thread-1) [    ] o.a.s.c.c.ConnectionManager zkClient has connected
   [junit4]   2> 978213 INFO  (closeThreadPool-6985-thread-2) [n:127.0.0.1:35781_    ] o.a.s.c.c.ZkStateReader Updated live nodes from ZooKeeper... (0) -> (2)
   [junit4]   2> 978214 WARN  (closeThreadPool-6985-thread-3) [    ] o.e.j.s.AbstractConnector Ignoring deprecated socket close linger time
   [junit4]   2> 978215 INFO  (closeThreadPool-6985-thread-3) [    ] o.a.s.c.s.e.JettySolrRunner Start Jetty (original configured port=0)
   [junit4]   2> 978216 INFO  (closeThreadPool-6985-thread-3) [    ] o.a.s.c.s.e.JettySolrRunner Trying to start Jetty on port 0 try number 1 ...
   [junit4]   2> 978217 INFO  (closeThreadPool-6985-thread-3) [    ] o.e.j.s.Server jetty-9.4.14.v20181114; built: 2018-11-14T21:20:31.478Z; git: c4550056e785fb5665914545889f21dc136ad9e6; jvm 11.0.1+13-LTS
   [junit4]   2> 978219 INFO  (closeThreadPool-6985-thread-2) [n:127.0.0.1:35781_    ] o.a.s.c.ZkController Publish node=127.0.0.1:35781_ as DOWN
   [junit4]   2> 978220 INFO  (closeThreadPool-6985-thread-2) [n:127.0.0.1:35781_    ] o.a.s.c.TransientSolrCoreCacheDefault Allocating transient cache for 4 transient cores
   [junit4]   2> 978220 INFO  (closeThreadPool-6985-thread-2) [n:127.0.0.1:35781_    ] o.a.s.c.ZkController Register node as live in ZooKeeper:/live_nodes/127.0.0.1:35781_
   [junit4]   2> 978222 INFO  (zkCallback-6971-thread-1) [    ] o.a.s.c.c.ZkStateReader Updated live nodes from ZooKeeper... (2) -> (3)
   [junit4]   2> 978222 INFO  (zkCallback-6983-thread-1) [    ] o.a.s.c.c.ZkStateReader Updated live nodes from ZooKeeper... (2) -> (3)
   [junit4]   2> 978222 INFO  (zkCallback-6998-thread-1) [    ] o.a.s.c.c.ZkStateReader Updated live nodes from ZooKeeper... (2) -> (3)
   [junit4]   2> 978222 INFO  (zkCallback-6964-thread-3) [    ] o.a.s.c.c.ZkStateReader Updated live nodes from ZooKeeper... (2) -> (3)
   [junit4]   2> 978223 INFO  (closeThreadPool-6985-thread-3) [    ] o.e.j.s.session DefaultSessionIdManager workerName=node0
   [junit4]   2> 978223 INFO  (closeThreadPool-6985-thread-3) [    ] o.e.j.s.session No SessionScavenger set, using defaults
   [junit4]   2> 978223 INFO  (closeThreadPool-6985-thread-3) [    ] o.e.j.s.session node0 Scavenging every 660000ms
   [junit4]   2> 978223 INFO  (closeThreadPool-6985-thread-3) [    ] o.e.j.s.h.ContextHandler Started o.e.j.s.ServletContextHandler@13d78874{/,null,AVAILABLE}
   [junit4]   2> 978224 INFO  (closeThreadPool-6985-thread-3) [    ] o.e.j.s.AbstractConnector Started ServerConnector@41b387c8{HTTP/1.1,[http/1.1, h2c]}{127.0.0.1:39918}
   [junit4]   2> 978224 INFO  (closeThreadPool-6985-thread-3) [    ] o.e.j.s.Server Started @978301ms
   [junit4]   2> 978224 INFO  (closeThreadPool-6985-thread-3) [    ] o.a.s.c.s.e.JettySolrRunner Jetty properties: {hostContext=/, solrconfig=solrconfig.xml, solr.data.dir=/x1/jenkins/jenkins-slave/workspace/Lucene-Solr-BadApples-Tests-master/solr/build/solr-core/test/J0/temp/solr.cloud.ChaosMonkeySafeLeaderWithPullReplicasTest_4059265D6B627B1A-001/tempDir-001/jetty3, hostPort=39918, coreRootDirectory=/x1/jenkins/jenkins-slave/workspace/Lucene-Solr-BadApples-Tests-master/solr/build/solr-core/test/J0/../../../../../../../../../../x1/jenkins/jenkins-slave/workspace/Lucene-Solr-BadApples-Tests-master/solr/build/solr-core/test/J0/temp/solr.cloud.ChaosMonkeySafeLeaderWithPullReplicasTest_4059265D6B627B1A-001/shard-3-001/cores}
   [junit4]   2> 978224 ERROR (closeThreadPool-6985-thread-3) [    ] o.a.s.u.StartupLoggingUtils Missing Java Option solr.log.dir. Logging may be missing or incomplete.
   [junit4]   2> 978224 INFO  (closeThreadPool-6985-thread-3) [    ] o.a.s.s.SolrDispatchFilter Using logger factory org.apache.logging.slf4j.Log4jLoggerFactory
   [junit4]   2> 978224 INFO  (closeThreadPool-6985-thread-3) [    ] o.a.s.s.SolrDispatchFilter  ___      _       Welcome to Apache Solr? version 9.0.0
   [junit4]   2> 978224 INFO  (closeThreadPool-6985-thread-3) [    ] o.a.s.s.SolrDispatchFilter / __| ___| |_ _   Starting in cloud mode on port null
   [junit4]   2> 978224 INFO  (closeThreadPool-6985-thread-3) [    ] o.a.s.s.SolrDispatchFilter \__ \/ _ \ | '_|  Install dir: null
   [junit4]   2> 978225 INFO  (closeThreadPool-6985-thread-3) [    ] o.a.s.s.SolrDispatchFilter |___/\___/_|_|    Start time: 2019-05-15T15:43:52.996004Z
   [junit4]   2> 978227 INFO  (zkCallback-7005-thread-1) [    ] o.a.s.c.c.ZkStateReader Updated live nodes from ZooKeeper... (2) -> (3)
   [junit4]   2> 978231 INFO  (zkConnectionManagerCallback-7024-thread-1) [    ] o.a.s.c.c.ConnectionManager zkClient has connected
   [junit4]   2> 978232 INFO  (zkCallback-7014-thread-1) [    ] o.a.s.c.c.ZkStateReader Updated live nodes from ZooKeeper... (2) -> (3)
   [junit4]   2> 978233 INFO  (closeThreadPool-6985-thread-3) [    ] o.a.s.s.SolrDispatchFilter Loading solr.xml from SolrHome (not found in ZooKeeper)
   [junit4]   2> 978233 INFO  (closeThreadPool-6985-thread-3) [    ] o.a.s.c.SolrXmlConfig Loading container configuration from /x1/jenkins/jenkins-slave/workspace/Lucene-Solr-BadApples-Tests-master/solr/build/solr-core/test/J0/temp/solr.cloud.ChaosMonkeySafeLeaderWithPullReplicasTest_4059265D6B627B1A-001/shard-3-001/solr.xml
   [junit4]   2> 978233 INFO  (zkConnectionManagerCallback-7022-thread-1) [    ] o.a.s.c.c.ConnectionManager zkClient has connected
   [junit4]   2> 978234 INFO  (closeThreadPool-6985-thread-2) [n:127.0.0.1:35781_    ] o.a.s.c.c.ZkStateReader Updated live nodes from ZooKeeper... (0) -> (3)
   [junit4]   2> 978236 INFO  (closeThreadPool-6985-thread-2) [n:127.0.0.1:35781_    ] o.a.s.c.s.i.ZkClientClusterStateProvider Cluster at 127.0.0.1:35183/solr ready
   [junit4]   2> 978236 INFO  (closeThreadPool-6985-thread-3) [    ] o.a.s.c.SolrXmlConfig Configuration parameter autoReplicaFailoverWorkLoopDelay is ignored
   [junit4]   2> 978236 INFO  (closeThreadPool-6985-thread-3) [    ] o.a.s.c.SolrXmlConfig Configuration parameter autoReplicaFailoverBadNodeExpiration is ignored
   [junit4]   2> 978238 INFO  (closeThreadPool-6985-thread-3) [    ] o.a.s.c.SolrXmlConfig MBean server found: com.sun.jmx.mbeanserver.JmxMBeanServer@563ddaf0, but no JMX reporters were configured - adding default JMX reporter.
   [junit4]   2> 978259 INFO  (closeThreadPool-6985-thread-2) [n:127.0.0.1:35781_    ] o.a.s.h.a.MetricsHistoryHandler No .system collection, keeping metrics history in memory.
   [junit4]   2> 978292 INFO  (closeThreadPool-6985-thread-2) [n:127.0.0.1:35781_    ] o.a.s.m.r.SolrJmxReporter JMX monitoring for 'solr.node' (registry 'solr.node') enabled at server: com.sun.jmx.mbeanserver.JmxMBeanServer@563ddaf0
   [junit4]   2> 978314 INFO  (closeThreadPool-6985-thread-2) [n:127.0.0.1:35781_    ] o.a.s.m.r.SolrJmxReporter JMX monitoring for 'solr.jvm' (registry 'solr.jvm') enabled at server: com.sun.jmx.mbeanserver.JmxMBeanServer@563ddaf0
   [junit4]   2> 978315 INFO  (closeThreadPool-6985-thread-2) [n:127.0.0.1:35781_    ] o.a.s.m.r.SolrJmxReporter JMX monitoring for 'solr.jetty' (registry 'solr.jetty') enabled at server: com.sun.jmx.mbeanserver.JmxMBeanServer@563ddaf0
   [junit4]   2> 978317 INFO  (closeThreadPool-6985-thread-2) [n:127.0.0.1:35781_    ] o.a.s.c.CorePropertiesLocator Found 0 core definitions underneath /x1/jenkins/jenkins-slave/workspace/Lucene-Solr-BadApples-Tests-master/solr/build/solr-core/test/J0/../../../../../../../../../../x1/jenkins/jenkins-slave/workspace/Lucene-Solr-BadApples-Tests-master/solr/build/solr-core/test/J0/temp/solr.cloud.ChaosMonkeySafeLeaderWithPullReplicasTest_4059265D6B627B1A-001/shard-2-001/cores
   [junit4]   2> 978381 INFO  (closeThreadPool-6985-thread-3) [    ] o.a.s.h.c.HttpShardHandlerFactory Host whitelist initialized: WhitelistHostChecker [whitelistHosts=null, whitelistHostCheckingEnabled=false]
   [junit4]   2> 978383 WARN  (closeThreadPool-6985-thread-3) [    ] o.e.j.u.s.S.config No Client EndPointIdentificationAlgorithm configured for SslContextFactory@193b8b18[provider=null,keyStore=null,trustStore=null]
   [junit4]   2> 978388 WARN  (closeThreadPool-6985-thread-3) [    ] o.e.j.u.s.S.config No Client EndPointIdentificationAlgorithm configured for SslContextFactory@2c8acba0[provider=null,keyStore=null,trustStore=null]
   [junit4]   2> 978391 INFO  (closeThreadPool-6985-thread-3) [    ] o.a.s.c.ZkContainer Zookeeper client=127.0.0.1:35183/solr
   [junit4]   2> 978400 INFO  (zkConnectionManagerCallback-7032-thread-1) [    ] o.a.s.c.c.ConnectionManager zkClient has connected
   [junit4]   2> 978403 INFO  (zkConnectionManagerCallback-7034-thread-1) [    ] o.a.s.c.c.ConnectionManager zkClient has connected
   [junit4]   2> 978409 INFO  (closeThreadPool-6985-thread-3) [n:127.0.0.1:39918_    ] o.a.s.c.c.ZkStateReader Updated live nodes from ZooKeeper... (0) -> (3)
   [junit4]   2> 978414 INFO  (closeThreadPool-6985-thread-3) [n:127.0.0.1:39918_    ] o.a.s.c.ZkController Publish node=127.0.0.1:39918_ as DOWN
   [junit4]   2> 978415 INFO  (closeThreadPool-6985-thread-3) [n:127.0.0.1:39918_    ] o.a.s.c.TransientSolrCoreCacheDefault Allocating transient cache for 4 transient cores
   [junit4]   2> 978415 INFO  (closeThreadPool-6985-thread-3) [n:127.0.0.1:39918_    ] o.a.s.c.ZkController Register node as live in ZooKeeper:/live_nodes/127.0.0.1:39918_
   [junit4]   2> 978418 INFO  (zkCallback-6971-thread-1) [    ] o.a.s.c.c.ZkStateReader Updated live nodes from ZooKeeper... (3) -> (4)
   [junit4]   2> 978418 INFO  (zkCallback-6998-thread-1) [    ] o.a.s.c.c.ZkStateReader Updated live nodes from ZooKeeper... (3) -> (4)
   [junit4]   2> 978418 INFO  (zkCallback-6983-thread-1) [    ] o.a.s.c.c.ZkStateReader Updated live nodes from ZooKeeper... (3) -> (4)
   [junit4]   2> 978418 INFO  (zkCallback-7005-thread-1) [    ] o.a.s.c.c.ZkStateReader Updated live nodes from ZooKeeper... (3) -> (4)
   [junit4]   2> 978418 INFO  (zkCallback-6964-thread-3) [    ] o.a.s.c.c.ZkStateReader Updated live nodes from ZooKeeper... (3) -> (4)
   [junit4]   2> 978418 INFO  (zkCallback-7014-thread-1) [    ] o.a.s.c.c.ZkStateReader Updated live nodes from ZooKeeper... (3) -> (4)
   [junit4]   2> 978419 INFO  (TEST-ChaosMonkeySafeLeaderWithPullReplicasTest.test-seed#[4059265D6B627B1A]) [    ] o.a.s.c.AbstractFullDistribZkTestBase create jetty 4 in directory /x1/jenkins/jenkins-slave/workspace/Lucene-Solr-BadApples-Tests-master/solr/build/solr-core/test/J0/temp/solr.cloud.ChaosMonkeySafeLeaderWithPullReplicasTest_4059265D6B627B1A-001/shard-4-001 of type NRT
   [junit4]   2> 978419 INFO  (zkCallback-7033-thread-1) [    ] o.a.s.c.c.ZkStateReader Updated live nodes from ZooKeeper... (3) -> (4)
   [junit4]   2> 978419 WARN  (closeThreadPool-6985-thread-2) [    ] o.e.j.s.AbstractConnector Ignoring deprecated socket close linger time
   [junit4]   2> 978419 INFO  (closeThreadPool-6985-thread-2) [    ] o.a.s.c.s.e.JettySolrRunner Start Jetty (original configured port=0)
   [junit4]   2> 978419 INFO  (closeThreadPool-6985-thread-2) [    ] o.a.s.c.s.e.JettySolrRunner Trying to start Jetty on port 0 try number 1 ...
   [junit4]   2> 978419 INFO  (zkCallback-7021-thread-1) [    ] o.a.s.c.c.ZkStateReader Updated live nodes from ZooKeeper... (3) -> (4)
   [junit4]   2> 978419 INFO  (closeThreadPool-6985-thread-2) [    ] o.e.j.s.Server jetty-9.4.14.v20181114; built: 2018-11-14T21:20:31.478Z; git: c4550056e785fb5665914545889f21dc136ad9e6; jvm 11.0.1+13-LTS
   [junit4]   2> 978421 INFO  (closeThreadPool-6985-thread-2) [    ] o.e.j.s.session DefaultSessionIdManager workerName=node0
   [junit4]   2> 978421 INFO  (closeThreadPool-6985-thread-2) [    ] o.e.j.s.session No SessionScavenger set, using defaults
   [junit4]   2> 978421 INFO  (closeThreadPool-6985-thread-2) [    ] o.e.j.s.session node0 Scavenging every 660000ms
   [junit4]   2> 978422 INFO  (closeThreadPool-6985-thread-2) [    ] o.e.j.s.h.ContextHandler Started o.e.j.s.ServletContextHandler@3c037609{/,null,AVAILABLE}
   [junit4]   2> 978422 INFO  (closeThreadPool-6985-thread-2) [    ] o.e.j.s.AbstractConnector Started ServerConnector@5d8585d8{HTTP/1.1,[http/1.1, h2c]}{127.0.0.1:38720}
   [junit4]   2> 978422 INFO  (closeThreadPool-6985-thread-2) [    ] o.e.j.s.Server Started @978499ms
   [junit4]   2> 978422 INFO  (closeThreadPool-6985-thread-2) [    ] o.a.s.c.s.e.JettySolrRunner Jetty properties: {hostContext=/, solrconfig=solrconfig.xml, solr.data.dir=/x1/jenkins/jenkins-slave/workspace/Lucene-Solr-BadApples-Tests-master/solr/build/solr-core/test/J0/temp/solr.cloud.ChaosMonkeySafeLeaderWithPullReplicasTest_4059265D6B627B1A-001/tempDir-001/jetty4, hostPort=38720, coreRootDirectory=/x1/jenkins/jenkins-slave/workspace/Lucene-Solr-BadApples-Tests-master/solr/build/solr-core/test/J0/temp/solr.cloud.ChaosMonkeySafeLeaderWithPullReplicasTest_4059265D6B627B1A-001/shard-4-001/cores}
   [junit4]   2> 978423 ERROR (closeThreadPool-6985-thread-2) [    ] o.a.s.u.StartupLoggingUtils Missing Java Option solr.log.dir. Logging may be missing or incomplete.
   [junit4]   2> 978423 INFO  (closeThreadPool-6985-thread-2) [    ] o.a.s.s.SolrDispatchFilter Using logger factory org.apache.logging.slf4j.Log4jLoggerFactory
   [junit4]   2> 978423 INFO  (closeThreadPool-6985-thread-2) [    ] o.a.s.s.SolrDispatchFilter  ___      _       Welcome to Apache Solr? version 9.0.0
   [junit4]   2> 978423 INFO  (closeThreadPool-6985-thread-2) [    ] o.a.s.s.SolrDispatchFilter / __| ___| |_ _   Starting in cloud mode on port null
   [junit4]   2> 978423 INFO  (closeThreadPool-6985-thread-2) [    ] o.a.s.s.SolrDispatchFilter \__ \/ _ \ | '_|  Install dir: null
   [junit4]   2> 978423 INFO  (closeThreadPool-6985-thread-2) [    ] o.a.s.s.SolrDispatchFilter |___/\___/_|_|    Start time: 2019-05-15T15:43:53.194299Z
   [junit4]   2> 978425 INFO  (zkConnectionManagerCallback-7043-thread-1) [    ] o.a.s.c.c.ConnectionManager zkClient has connected
   [junit4]   2> 978426 INFO  (closeThreadPool-6985-thread-2) [    ] o.a.s.s.SolrDispatchFilter Loading solr.xml from SolrHome (not found in ZooKeeper)
   [junit4]   2> 978426 INFO  (closeThreadPool-6985-thread-2) [    ] o.a.s.c.SolrXmlConfig Loading container configuration from /x1/jenkins/jenkins-slave/workspace/Lucene-Solr-BadApples-Tests-master/solr/build/solr-core/test/J0/temp/solr.cloud.ChaosMonkeySafeLeaderWithPullReplicasTest_4059265D6B627B1A-001/shard-4-001/solr.xml
   [junit4]   2> 978430 INFO  (closeThreadPool-6985-thread-2) [    ] o.a.s.c.SolrXmlConfig Configuration parameter autoReplicaFailoverWorkLoopDelay is ignored
   [junit4]   2> 978430 INFO  (closeThreadPool-6985-thread-2) [    ] o.a.s.c.SolrXmlConfig Configuration parameter autoReplicaFailoverBadNodeExpiration is ignored
   [junit4]   2> 978431 INFO  (zkConnectionManagerCallback-7041-thread-1) [    ] o.a.s.c.c.ConnectionManager zkClient has connected
   [junit4]   2> 978432 INFO  (closeThreadPool-6985-thread-3) [n:127.0.0.1:39918_    ] o.a.s.c.c.ZkStateReader Updated live nodes from ZooKeeper... (0) -> (4)
   [junit4]   2> 978432 INFO  (closeThreadPool-6985-thread-2) [    ] o.a.s.c.SolrXmlConfig MBean server found: com.sun.jmx.mbeanserver.JmxMBeanServer@563ddaf0, but no JMX reporters were configured - adding default JMX reporter.
   [junit4]   2> 978434 INFO  (closeThreadPool-6985-thread-3) [n:127.0.0.1:39918_    ] o.a.s.c.s.i.ZkClientClusterStateProvider Cluster at 127.0.0.1:35183/solr ready
   [junit4]   2> 978470 INFO  (closeThreadPool-6985-thread-3) [n:127.0.0.1:39918_    ] o.a.s.h.a.MetricsHistoryHandler No .system collection, keeping metrics history in memory.
   [junit4]   2> 978501 INFO  (closeThreadPool-6985-thread-3) [n:127.0.0.1:39918_    ] o.a.s.m.r.SolrJmxReporter JMX monitoring for 'solr.node' (registry 'solr.node') enabled at server: com.sun.jmx.mbeanserver.JmxMBeanServer@563ddaf0
   [junit4]   2> 978522 INFO  (closeThreadPool-6985-thread-3) [n:127.0.0.1:39918_    ] o.a.s.m.r.SolrJmxReporter JMX monitoring for 'solr.jvm' (registry 'solr.jvm') enabled at server: com.sun.jmx.mbeanserver.JmxMBeanServer@563ddaf0
   [junit4]   2> 978523 INFO  (closeThreadPool-6985-thread-3) [n:127.0.0.1:39918_    ] o.a.s.m.r.SolrJmxReporter JMX monitoring for 'solr.jetty' (registry 'solr.jetty') enabled at server: com.sun.jmx.mbeanserver.JmxMBeanServer@563ddaf0
   [junit4]   2> 978525 INFO  (closeThreadPool-6985-thread-3) [n:127.0.0.1:39918_    ] o.a.s.c.CorePropertiesLocator Found 0 core definitions underneath /x1/jenkins/jenkins-slave/workspace/Lucene-Solr-BadApples-Tests-master/solr/build/solr-core/test/J0/../../../../../../../../../../x1/jenkins/jenkins-slave/workspace/Lucene-Solr-BadApples-Tests-master/solr/build/solr-core/test/J0/temp/solr.cloud.ChaosMonkeySafeLeaderWithPullReplicasTest_4059265D6B627B1A-001/shard-3-001/cores
   [junit4]   2> 978551 INFO  (closeThreadPool-6985-thread-2) [    ] o.a.s.h.c.HttpShardHandlerFactory Host whitelist initialized: WhitelistHostChecker [whitelistHosts=null, whitelistHostCheckingEnabled=false]
   [junit4]   2> 978553 WARN  (closeThreadPool-6985-thread-2) [    ] o.e.j.u.s.S.config No Client EndPointIdentificationAlgorithm configured for SslContextFactory@1b8c4abc[provider=null,keyStore=null,trustStore=null]
   [junit4]   2> 978556 WARN  (closeThreadPool-6985-thread-2) [    ] o.e.j.u.s.S.config No Client EndPointIdentificationAlgorithm configured for SslContextFactory@24d07279[provider=null,keyStore=null,trustStore=null]
   [junit4]   2> 978557 INFO  (closeThreadPool-6985-thread-2) [    ] o.a.s.c.ZkContainer Zookeeper client=127.0.0.1:35183/solr
   [junit4]   2> 978572 INFO  (zkConnectionManagerCallback-7051-thread-1) [    ] o.a.s.c.c.ConnectionManager zkClient has connected
   [junit4]   2> 978575 INFO  (zkConnectionManagerCallback-7053-thread-1) [    ] o.a.s.c.c.ConnectionManager zkClient has connected
   [junit4]   2> 978581 INFO  (closeThreadPool-6985-thread-2) [    ] o.a.s.c.c.ZkStateReader Updated live nodes from ZooKeeper... (0) -> (4)
   [junit4]   2> 978586 INFO  (closeThreadPool-6985-thread-2) [    ] o.a.s.c.ZkController Publish node=127.0.0.1:38720_ as DOWN
   [junit4]   2> 978588 INFO  (closeThreadPool-6985-thread-2) [    ] o.a.s.c.TransientSolrCoreCacheDefault Allocating transient cache for 4 transient cores
   [junit4]   2> 978588 INFO  (closeThreadPool-6985-thread-2) [    ] o.a.s.c.ZkController Register node as live in ZooKeeper:/live_nodes/127.0.0.1:38720_
   [junit4]   2> 978590 INFO  (zkCallback-6998-thread-1) [    ] o.a.s.c.c.ZkStateReader Updated live nodes from ZooKeeper... (4) -> (5)
   [junit4]   2> 978590 INFO  (zkCallback-6971-thread-1) [    ] o.a.s.c.c.ZkStateReader Updated live nodes from ZooKeeper... (4) -> (5)
   [junit4]   2> 978590 INFO  (zkCallback-6983-thread-1) [    ] o.a.s.c.c.ZkStateReader Updated live nodes from ZooKeeper... (4) -> (5)
   [junit4]   2> 978591 INFO  (zkCallback-7005-thread-1) [    ] o.a.s.c.c.ZkStateReader Updated live nodes from ZooKeeper... (4) -> (5)
   [junit4]   2> 978591 INFO  (zkCallback-6964-thread-3) [    ] o.a.s.c.c.ZkStateReader Updated live nodes from ZooKeeper... (4) -> (5)
   [junit4]   2> 978591 INFO  (zkCallback-7033-thread-1) [    ] o.a.s.c.c.ZkStateReader Updated live nodes from ZooKeeper... (4) -> (5)
   [junit4]   2> 978591 INFO  (zkCallback-7021-thread-1) [    ] o.a.s.c.c.ZkStateReader Updated live nodes from ZooKeeper... (4) -> (5)
   [junit4]   2> 978591 INFO  (zkCallback-7040-thread-1) [    ] o.a.s.c.c.ZkStateReader Updated live nodes from ZooKeeper... (4) -> (5)
   [junit4]   2> 978591 INFO  (zkCallback-7014-thread-1) [    ] o.a.s.c.c.ZkStateReader Updated live nodes from ZooKeeper... (4) -> (5)
   [junit4]   2> 978593 INFO  (zkCallback-7052-thread-1) [    ] o.a.s.c.c.ZkStateReader Updated live nodes from ZooKeeper... (4) -> (5)
   [junit4]   2> 978594 INFO  (zkConnectionManagerCallback-7060-thread-1) [    ] o.a.s.c.c.ConnectionManager zkClient has connected
   [junit4]   2> 978595 INFO  (closeThreadPool-6985-thread-2) [    ] o.a.s.c.c.ZkStateReader Updated live nodes from ZooKeeper... (0) -> (5)
   [junit4]   2> 978597 INFO  (closeThreadPool-6985-thread-2) [    ] o.a.s.c.s.i.ZkClientClusterStateProvider Cluster at 127.0.0.1:35183/solr ready
   [junit4]   2> 978615 INFO  (closeThreadPool-6985-thread-2) [    ] o.a.s.h.a.MetricsHistoryHandler No .system collection, keeping metrics history in memory.
   [junit4]   2> 978633 INFO  (TEST-ChaosMonkeySafeLeaderWithPullReplicasTest.test-seed#[4059265D6B627B1A]) [    ] o.a.s.c.AbstractFullDistribZkTestBase create jetty 5 in directory /x1/jenkins/jenkins-slave/workspace/Lucene-Solr-BadApples-Tests-master/solr/build/solr-core/test/J0/temp/solr.cloud.ChaosMonkeySafeLeaderWithPullReplicasTest_4059265D6B627B1A-001/shard-5-001 of type PULL
   [junit4]   2> 978634 WARN  (closeThreadPool-6985-thread-3) [    ] o.e.j.s.AbstractConnector Ignoring deprecated socket close linger time
   [junit4]   2> 978635 INFO  (closeThreadPool-6985-thread-3) [    ] o.a.s.c.s.e.JettySolrRunner Start Jetty (original configured port=0)
   [junit4]   2> 978635 INFO  (closeThreadPool-6985-thread-3) [    ] o.a.s.c.s.e.JettySolrRunner Trying to start Jetty on port 0 try number 1 ...
   [junit4]   2> 978635 INFO  (closeThreadPool-6985-thread-3) [    ] o.e.j.s.Server jetty-9.4.14.v20181114; built: 2018-11-14T21:20:31.478Z; git: c4550056e785fb5665914545889f21dc136ad9e6; jvm 11.0.1+13-LTS
   [junit4]   2> 978636 INFO  (closeThreadPool-6985-thread-3) [    ] o.e.j.s.session DefaultSessionIdManager workerName=node0
   [junit4]   2> 978636 INFO  (closeThreadPool-6985-thread-3) [    ] o.e.j.s.session No SessionScavenger set, using defaults
   [junit4]   2> 978636 INFO  (closeThreadPool-6985-thread-3) [    ] o.e.j.s.session node0 Scavenging every 600000ms
   [junit4]   2> 978637 INFO  (closeThreadPool-6985-thread-3) [    ] o.e.j.s.h.ContextHandler Started o.e.j.s.ServletContextHandler@7c866724{/,null,AVAILABLE}
   [junit4]   2> 978637 INFO  (closeThreadPool-6985-thread-3) [    ] o.e.j.s.AbstractConnector Started ServerConnector@6df3bf29{HTTP/1.1,[http/1.1, h2c]}{127.0.0.1:44831}
   [junit4]   2> 978637 INFO  (closeThreadPool-6985-thread-3) [    ] o.e.j.s.Server Started @978714ms
   [junit4]   2> 978637 INFO  (closeThreadPool-6985-thread-3) [    ] o.a.s.c.s.e.JettySolrRunner Jetty properties: {hostContext=/, solrconfig=solrconfig.xml, solr.data.dir=/x1/jenkins/jenkins-slave/workspace/Lucene-Solr-BadApples-Tests-master/solr/build/solr-core/test/J0/temp/solr.cloud.ChaosMonkeySafeLeaderWithPullReplicasTest_4059265D6B627B1A-001/tempDir-001/jetty5, hostPort=44831, coreRootDirectory=/x1/jenkins/jenkins-slave/workspace/Lucene-Solr-BadApples-Tests-master/solr/build/solr-core/test/J0/temp/solr.cloud.ChaosMonkeySafeLeaderWithPullReplicasTest_4059265D6B627B1A-001/shard-5-001/cores, replicaType=PULL}
   [junit4]   2> 978638 ERROR (closeThreadPool-6985-thread-3) [    ] o.a.s.u.StartupLoggingUtils Missing Java Option solr.log.dir. Logging may be missing or incomplete.
   [junit4]   2> 978638 INFO  (closeThreadPool-6985-thread-3) [    ] o.a.s.s.SolrDispatchFilter Using logger factory org.apache.logging.slf4j.Log4jLoggerFactory
   [junit4]   2> 978638 INFO  (closeThreadPool-6985-thread-3) [    ] o.a.s.s.SolrDispatchFilter  ___      _       Welcome to Apache Solr? version 9.0.0
   [junit4]   2> 978638 INFO  (closeThreadPool-6985-thread-3) [    ] o.a.s.s.SolrDispatchFilter / __| ___| |_ _   Starting in cloud mode on port null
   [junit4]   2> 978638 INFO  (closeThreadPool-6985-thread-3) [    ] o.a.s.s.SolrDispatchFilter \__ \/ _ \ | '_|  Install dir: null
   [junit4]   2> 978638 INFO  (closeThreadPool-6985-thread-3) [    ] o.a.s.s.SolrDispatchFilter |___/\___/_|_|    Start time: 2019-05-15T15:43:53.409400Z
   [junit4]   2> 978640 INFO  (zkConnectionManagerCallback-7063-thread-1) [    ] o.a.s.c.c.ConnectionManager zkClient has connected
   [junit4]   2> 978642 INFO  (closeThreadPool-6985-thread-3) [    ] o.a.s.s.SolrDispatchFilter Loading solr.xml from SolrHome (not found in ZooKeeper)
   [junit4]   2> 978642 INFO  (closeThreadPool-6985-thread-3) [    ] o.a.s.c.SolrXmlConfig Loading container configuration from /x1/jenkins/jenkins-slave/workspace/Lucene-Solr-BadApples-Tests-master/solr/build/solr-core/test/J0/temp/solr.cloud.ChaosMonkeySafeLeaderWithPullReplicasTest_4059265D6B627B1A-001/shard-5-001/solr.xml
   [junit4]   2> 978645 INFO  (closeThreadPool-6985-thread-3) [    ] o.a.s.c.SolrXmlConfig Configuration parameter autoReplicaFailoverWorkLoopDelay is ignored
   [junit4]   2> 978645 INFO  (closeThreadPool-6985-thread-3) [    ] o.a.s.c.SolrXmlConfig Configuration parameter autoReplicaFailoverBadNodeExpiration is ignored
   [junit4]   2> 978647 INFO  (closeThreadPool-6985-thread-2) [    ] o.a.s.m.r.SolrJmxReporter JMX monitoring for 'solr.node' (registry 'solr.node') enabled at server: com.sun.jmx.mbeanserver.JmxMBeanServer@563ddaf0
   [junit4]   2> 978647 INFO  (closeThreadPool-6985-thread-3) [    ] o.a.s.c.SolrXmlConfig MBean server found: com.sun.jmx.mbeanserver.JmxMBeanServer@563ddaf0, but no JMX reporters were configured - adding default JMX reporter.
   [junit4]   2> 978670 INFO  (closeThreadPool-6985-thread-2) [    ] o.a.s.m.r.SolrJmxReporter JMX monitoring for 'solr.jvm' (registry 'solr.jvm') enabled at server: com.sun.jmx.mbeanserver.JmxMBeanServer@563ddaf0
   [junit4]   2> 978671 INFO  (closeThreadPool-6985-thread-2) [    ] o.a.s.m.r.SolrJmxReporter JMX monitoring for 'solr.jetty' (registry 'solr.jetty') enabled at server: com.sun.jmx.mbeanserver.JmxMBeanServer@563ddaf0
   [junit4]   2> 978673 INFO  (closeThreadPool-6985-thread-2) [    ] o.a.s.c.CorePropertiesLocator Found 0 core definitions underneath /x1/jenkins/jenkins-slave/workspace/Lucene-Solr-BadApples-Tests-master/solr/build/solr-core/test/J0/temp/solr.cloud.ChaosMonkeySafeLeaderWithPullReplicasTest_4059265D6B627B1A-001/shard-4-001/cores
   [junit4]   2> 978830 INFO  (closeThreadPool-6985-thread-3) [    ] o.a.s.h.c.HttpShardHandlerFactory Host whitelist initialized: WhitelistHostChecker [whitelistHosts=null, whitelistHostCheckingEnabled=false]
   [junit4]   2> 978832 WARN  (closeThreadPool-6985-thread-3) [    ] o.e.j.u.s.S.config No Client EndPointIdentificationAlgorithm configured for SslContextFactory@25002b07[provider=null,keyStore=null,trustStore=null]
   [junit4]   2> 978835 WARN  (closeThreadPool-6985-thread-3) [    ] o.e.j.u.s.S.config No Client EndPointIdentificationAlgorithm configured for SslContextFactory@d55555[provider=null,keyStore=null,trustStore=null]
   [junit4]   2> 978836 INFO  (closeThreadPool-6985-thread-3) [    ] o.a.s.c.ZkContainer Zookeeper client=127.0.0.1:35183/solr
   [junit4]   2> 978838 INFO  (TEST-ChaosMonkeySafeLeaderWithPullReplicasTest.test-seed#[4059265D6B627B1A]) [    ] o.a.s.c.AbstractFullDistribZkTestBase create jetty 6 in directory /x1/jenkins/jenkins-slave/workspace/Lucene-Solr-BadApples-Tests-master/solr/build/solr-core/test/J0/temp/solr.cloud.ChaosMonkeySafeLeaderWithPullReplicasTest_4059265D6B627B1A-001/shard-6-001 of type PULL
   [junit4]   2> 978839 WARN  (closeThreadPool-6985-thread-2) [    ] o.e.j.s.AbstractConnector Ignoring deprecated socket close linger time
   [junit4]   2> 978839 INFO  (zkConnectionManagerCallback-7070-thread-1) [    ] o.a.s.c.c.ConnectionManager zkClient has connected
   [junit4]   2> 978839 INFO  (closeThreadPool-6985-thread-2) [    ] o.a.s.c.s.e.JettySolrRunner Start Jetty (original configured port=0)
   [junit4]   2> 978839 INFO  (closeThreadPool-6985-thread-2) [    ] o.a.s.c.s.e.JettySolrRunner Trying to start Jetty on port 0 try number 1 ...
   [junit4]   2> 978839 INFO  (closeThreadPool-6985-thread-2) [    ] o.e.j.s.Server jetty-9.4.14.v20181114; built: 2018-11-14T21:20:31.478Z; git: c4550056e785fb5665914545889f21dc136ad9e6; jvm 11.0.1+13-LTS
   [junit4]   2> 978847 INFO  (closeThreadPool-6985-thread-2) [    ] o.e.j.s.session DefaultSessionIdManager workerName=node0
   [junit4]   2> 978847 INFO  (closeThreadPool-6985-thread-2) [    ] o.e.j.s.session No SessionScavenger set, using defaults
   [junit4]   2> 978847 INFO  (closeThreadPool-6985-thread-2) [    ] o.e.j.s.session node0 Scavenging every 660000ms
   [junit4]   2> 978847 INFO  (closeThreadPool-6985-thread-2) [    ] o.e.j.s.h.ContextHandler Started o.e.j.s.ServletContextHandler@78777776{/,null,AVAILABLE}
   [junit4]   2> 978848 INFO  (zkConnectionManagerCallback-7072-thread-1) [    ] o.a.s.c.c.ConnectionManager zkClient has connected
   [junit4]   2> 978849 INFO  (closeThreadPool-6985-thread-2) [    ] o.e.j.s.AbstractConnector Started ServerConnector@76aa6fe0{HTTP/1.1,[http/1.1, h2c]}{127.0.0.1:44289}
   [junit4]   2> 978849 INFO  (closeThreadPool-6985-thread-2) [    ] o.e.j.s.Server Started @978926ms
   [junit4]   2> 978849 INFO  (closeThreadPool-6985-thread-2) [    ] o.a.s.c.s.e.JettySolrRunner Jetty properties: {hostContext=/, solrconfig=solrconfig.xml, solr.data.dir=/x1/jenkins/jenkins-slave/workspace/Lucene-Solr-BadApples-Tests-master/solr/build/solr-core/test/J0/temp/solr.cloud.ChaosMonkeySafeLeaderWithPullReplicasTest_4059265D6B627B1A-001/tempDir-001/jetty6, hostPort=44289, coreRootDirectory=/x1/jenkins/jenkins-slave/workspace/Lucene-Solr-BadApples-Tests-master/solr/build/solr-core/test/J0/temp/solr.cloud.ChaosMonkeySafeLeaderWithPullReplicasTest_4059265D6B627B1A-001/shard-6-001/cores, replicaType=PULL}
   [junit4]   2> 978850 ERROR (closeThreadPool-6985-thread-2) [    ] o.a.s.u.StartupLoggingUtils Missing Java Option solr.log.dir. Logging may be missing or incomplete.
   [junit4]   2> 978850 INFO  (closeThreadPool-6985-thread-2) [    ] o.a.s.s.SolrDispatchFilter Using logger factory org.apache.logging.slf4j.Log4jLoggerFactory
   [junit4]   2> 978850 INFO  (closeThreadPool-6985-thread-2) [    ] o.a.s.s.SolrDispatchFilter  ___      _       Welcome to Apache Solr? version 9.0.0
   [junit4]   2> 978850 INFO  (closeThreadPool-6985-thread-2) [    ] o.a.s.s.SolrDispatchFilter / __| ___| |_ _   Starting in cloud mode on port null
   [junit4]   2> 978850 INFO  (closeThreadPool-6985-thread-2) [    ] o.a.s.s.SolrDispatchFilter \__ \/ _ \ | '_|  Install dir: null
   [junit4]   2> 978850 INFO  (closeThreadPool-6985-thread-2) [    ] o.a.s.s.SolrDispatchFilter |___/\___/_|_|    Start time: 2019-05-15T15:43:53.621478Z
   [junit4]   2> 978852 INFO  (zkConnectionManagerCallback-7076-thread-1) [    ] o.a.s.c.c.ConnectionManager zkClient has connected
   [junit4]   2> 978853 INFO  (closeThreadPool-6985-thread-2) [    ] o.a.s.s.SolrDispatchFilter Loading solr.xml from SolrHome (not found in ZooKeeper)
   [junit4]   2> 978853 INFO  (closeThreadPool-6985-thread-2) [    ] o.a.s.c.SolrXmlConfig Loading container configuration from /x1/jenkins/jenkins-slave/workspace/Lucene-Solr-BadApples-Tests-master/solr/build/solr-core/test/J0/temp/solr.cloud.ChaosMonkeySafeLeaderWithPullReplicasTest_4059265D6B627B1A-001/shard-6-001/solr.xml
   [junit4]   2> 978854 INFO  (closeThreadPool-6985-thread-3) [    ] o.a.s.c.c.ZkStateReader Updated live nodes from ZooKeeper... (0) -> (5)
   [junit4]   2> 978857 INFO  (closeThreadPool-6985-thread-2) [    ] o.a.s.c.SolrXmlConfig Configuration parameter autoReplicaFailoverWorkLoopDelay is ignored
   [junit4]   2> 978857 INFO  (closeThreadPool-6985-thread-2) [    ] o.a.s.c.SolrXmlConfig Configuration parameter autoReplicaFailoverBadNodeExpiration is ignored
   [junit4]   2> 978859 INFO  (closeThreadPool-6985-thread-2) [    ] o.a.s.c.SolrXmlConfig MBean server found: com.sun.jmx.mbeanserver.JmxMBeanServer@563ddaf0, but no JMX reporters were configured - adding default JMX reporter.
   [junit4]   2> 978859 INFO  (closeThreadPool-6985-thread-3) [    ] o.a.s.c.ZkController Publish node=127.0.0.1:44831_ as DOWN
   [junit4]   2> 978860 INFO  (closeThreadPool-6985-thread-3) [    ] o.a.s.c.TransientSolrCoreCacheDefault Allocating transient cache for 4 transient cores
   [junit4]   2> 978860 INFO  (closeThreadPool-6985-thread-3) [    ] o.a.s.c.ZkController Register node as live in ZooKeeper:/live_nodes/127.0.0.1:44831_
   [junit4]   2> 978863 INFO  (zkCallback-6983-thread-1) [    ] o.a.s.c.c.ZkStateReader Updated live nodes from ZooKeeper... (5) -> (6)
   [junit4]   2> 978863 INFO  (zkCallback-6998-thread-1) [    ] o.a.s.c.c.ZkStateReader Updated live nodes from ZooKeeper... (5) -> (6)
   [junit4]   2> 978863 INFO  (zkCallback-6971-thread-1) [    ] o.a.s.c.c.ZkStateReader Updated live nodes from ZooKeeper... (5) -> (6)
   [junit4]   2> 978863 INFO  (zkCallback-7005-thread-1) [    ] o.a.s.c.c.ZkStateReader Updated live nodes from ZooKeeper... (5) -> (6)
   [junit4]   2> 978863 INFO  (zkCallback-6964-thread-3) [    ] o.a.s.c.c.ZkStateReader Updated live nodes from ZooKeeper... (5) -> (6)
   [junit4]   2> 978863 INFO  (zkCallback-7014-thread-1) [    ] o.a.s.c.c.ZkStateReader Updated live nodes from ZooKeeper... (5) -> (6)
   [junit4]   2> 978864 INFO  (zkCallback-7052-thread-1) [    ] o.a.s.c.c.ZkStateReader Updated live nodes from ZooKeeper... (5) -> (6)
   [junit4]   2> 978864 INFO  (zkCallback-7040-thread-1) [    ] o.a.s.c.c.ZkStateReader Updated live nodes from ZooKeeper... (5) -> (6)
   [junit4]   2> 978864 INFO  (zkCallback-7021-thread-1) [    ] o.a.s.c.c.ZkStateReader Updated live nodes from ZooKeeper... (5) -> (6)
   [junit4]   2> 978864 INFO  (zkCallback-7033-thread-1) [    ] o.a.s.c.c.ZkStateReader Updated live nodes from ZooKeeper... (5) -> (6)
   [junit4]   2> 978867 INFO  (zkCallback-7071-thread-1) [    ] o.a.s.c.c.ZkStateReader Updated live nodes from ZooKeeper... (5) -> (6)
   [junit4]   2> 978875 INFO  (zkCallback-7059-thread-1) [    ] o.a.s.c.c.ZkStateReader Updated live nodes from ZooKeeper... (5) -> (6)
   [junit4]   2> 978876 INFO  (zkConnectionManagerCallback-7082-thread-1) [    ] o.a.s.c.c.ConnectionManager zkClient has connected
   [junit4]   2> 978877 INFO  (closeThreadPool-6985-thread-3) [    ] o.a.s.c.c.ZkStateReader Updated live nodes from ZooKeeper... (0) -> (6)
   [junit4]   2> 978879 INFO  (closeThreadPool-6985-thread-3) [    ] o.a.s.c.s.i.ZkClientClusterStateProvider Cluster at 127.0.0.1:35183/solr ready
   [junit4]   2> 978897 INFO  (closeThreadPool-6985-thread-3) [    ] o.a.s.h.a.MetricsHistoryHandler No .system collection, keeping metrics history in memory.
   [junit4]   2> 978929 INFO  (closeThreadPool-6985-thread-3) [    ] o.a.s.m.r.SolrJmxReporter JMX monitoring for 'solr.node' (registry 'solr.node') enabled at server: com.sun.jmx.mbeanserver.JmxMBeanServer@563ddaf0
   [junit4]   2> 978953 INFO  (closeThreadPool-6985-thread-3) [    ] o.a.s.m.r.SolrJmxReporter JMX monitoring for 'solr.jvm' (registry 'solr.jvm') enabled at server: com.sun.jmx.mbeanserver.JmxMBeanServer@563ddaf0
   [junit4]   2> 978954 INFO  (closeThreadPool-6985-thread-3) [    ] o.a.s.m.r.SolrJmxReporter JMX monitoring for 'solr.jetty' (registry 'solr.jetty') enabled at server: com.sun.jmx.mbeanserver.JmxMBeanServer@563ddaf0
   [junit4]   2> 978957 INFO  (closeThreadPool-6985-thread-3) [    ] o.a.s.c.CorePropertiesLocator Found 0 core definitions underneath /x1/jenkins/jenkins-slave/workspace/Lucene-Solr-BadApples-Tests-master/solr/build/solr-core/test/J0/temp/solr.cloud.ChaosMonkeySafeLeaderWithPullReplicasTest_4059265D6B627B1A-001/shard-5-001/cores
   [junit4]   2> 979155 INFO  (closeThreadPool-6985-thread-2) [    ] o.a.s.h.c.HttpShardHandlerFactory Host whitelist initialized: WhitelistHostChecker [whitelistHosts=null, whitelistHostCheckingEnabled=false]
   [junit4]   2> 979157 WARN  (closeThreadPool-6985-thread-2) [    ] o.e.j.u.s.S.config No Client EndPointIdentificationAlgorithm configured for SslContextFactory@5cc44348[provider=null,keyStore=null,trustStore=null]
   [junit4]   2> 979160 WARN  (closeThreadPool-6985-thread-2) [    ] o.e.j.u.s.S.config No Client EndPointIdentificationAlgorithm configured for SslContextFactory@7f667d58[provider=null,keyStore=null,trustStore=null]
   [junit4]   2> 979161 INFO  (closeThreadPool-6985-thread-2) [    ] o.a.s.c.ZkContainer Zookeeper client=127.0.0.1:35183/solr
   [junit4]   2> 979164 INFO  (zkConnectionManagerCallback-7089-thread-1) [    ] o.a.s.c.c.ConnectionManager zkClient has connected
   [junit4]   2> 979166 INFO  (zkConnectionManagerCallback-7091-thread-1) [    ] o.a.s.c.c.ConnectionManager zkClient has connected
   [junit4]   2> 979178 INFO  (closeThreadPool-6985-thread-2) [    ] o.a.s.c.c.ZkStateReader Updated live nodes from ZooKeeper... (0) -> (6)
   [junit4]   2> 979183 INFO  (closeThreadPool-6985-thread-2) [    ] o.a.s.c.ZkController Publish node=127.0.0.1:44289_ as DOWN
   [junit4]   2> 979184 INFO  (closeThreadPool-6985-thread-2) [    ] o.a.s.c.TransientSolrCoreCacheDefault Allocating transient cache for 4 transient cores
   [junit4]   2> 979184 INFO  (closeThreadPool-6985-thread-2) [    ] o.a.s.c.ZkController Register node as live in ZooKeeper:/live_nodes/127.0.0.1:44289_
   [junit4]   2> 979186 INFO  (zkCallback-7071-thread-1) [    ] o.a.s.c.c.ZkStateReader Updated live nodes from ZooKeeper... (6) -> (7)
   [junit4]   2> 979187 INFO  (zkCallback-6971-thread-1) [    ] o.a.s.c.c.ZkStateReader Updated live nodes from ZooKeeper... (6) -> (7)
   [junit4]   2> 979187 INFO  (zkCallback-7014-thread-1) [    ] o.a.s.c.c.ZkStateReader Updated live nodes from ZooKeeper... (6) -> (7)
   [junit4]   2> 979187 INFO  (zkCallback-6983-thread-1) [    ] o.a.s.c.c.ZkStateReader Updated live nodes from ZooKeeper... (6) -> (7)
   [junit4]   2> 979187 INFO  (zkCallback-6964-thread-3) [    ] o.a.s.c.c.ZkStateReader Updated live nodes from ZooKeeper... (6) -> (7)
   [junit4]   2> 979187 INFO  (zkCallback-7021-thread-1) [    ] o.a.s.c.c.ZkStateReader Updated live nodes from ZooKeeper... (6) -> (7)
   [junit4]   2> 979187 INFO  (zkCallback-7090-thread-1) [    ] o.a.s.c.c.ZkStateReader Updated live nodes from ZooKeeper... (6) -> (7)
   [junit4]   2> 979187 INFO  (zkCallback-7005-thread-1) [    ] o.a.s.c.c.ZkStateReader Updated live nodes from ZooKeeper... (6) -> (7)
   [junit4]   2> 979187 INFO  (zkCallback-7033-thread-1) [    ] o.a.s.c.c.ZkStateReader Updated live nodes from ZooKeeper... (6) -> (7)
   [junit4]   2> 979187 INFO  (zkCallback-6998-thread-1) [    ] o.a.s.c.c.ZkStateReader Updated live nodes from ZooKeeper... (6) -> (7)
   [junit4]   2> 979187 INFO  (zkCallback-7081-thread-1) [    ] o.a.s.c.c.ZkStateReader Updated live nodes from ZooKeeper... (6) -> (7)
   [junit4]   2> 979187 INFO  (zkCallback-7040-thread-1) [    ] o.a.s.c.c.ZkStateReader Updated live nodes from ZooKeeper... (6) -> (7)
   [junit4]   2> 979188 INFO  (zkCallback-7059-thread-1) [    ] o.a.s.c.c.ZkStateReader Updated live nodes from ZooKeeper... (6) -> (7)
   [junit4]   2> 979188 INFO  (zkCallback-7052-thread-1) [    ] o.a.s.c.c.ZkStateReader Updated live nodes from ZooKeeper... (6) -> (7)
   [junit4]   2> 979190 INFO  (zkConnectionManagerCallback-7098-thread-1) [    ] o.a.s.c.c.ConnectionManager zkClient has connected
   [junit4]   2> 979192 INFO  (closeThreadPool-6985-thread-2) [    ] o.a.s.c.c.ZkStateReader Updated live nodes from ZooKeeper... (0) -> (7)
   [junit4]   2> 979193 INFO  (closeThreadPool-6985-thread-2) [    ] o.a.s.c.s.i.ZkClientClusterStateProvider Cluster at 127.0.0.1:35183/solr ready
   [junit4]   2> 979210 INFO  (closeThreadPool-6985-thread-2) [    ] o.a.s.h.a.MetricsHistoryHandler No .system collection, keeping metrics history in memory.
   [junit4]   2> 979239 INFO  (closeThreadPool-6985-thread-2) [    ] o.a.s.m.r.SolrJmxReporter JMX monitoring for 'solr.node' (registry 'solr.node') enabled at server: com.sun.jmx.mbeanserver.JmxMBeanServer@563ddaf0
   [junit4]   2> 979259 INFO  (closeThreadPool-6985-thread-2) [    ] o.a.s.m.r.SolrJmxReporter JMX monitoring for 'solr.jvm' (registry 'solr.jvm') enabled at server: com.sun.jmx.mbeanserver.JmxMBeanServer@563ddaf0
   [junit4]   2> 979260 INFO  (closeThreadPool-6985-thread-2) [    ] o.a.s.m.r.SolrJmxReporter JMX monitoring for 'solr.jetty' (registry 'solr.jetty') enabled at server: com.sun.jmx.mbeanserver.JmxMBeanServer@563ddaf0
   [junit4]   2> 979262 INFO  (closeThreadPool-6985-thread-2) [    ] o.a.s.c.CorePropertiesLocator Found 0 core definitions underneath /x1/jenkins/jenkins-slave/workspace/Lucene-Solr-BadApples-Tests-master/solr/build/solr

[...truncated too long message...]

y disallowed.ivy.jars.list as its length is 0.

-ivy-fail-disallowed-ivy-version:

ivy-fail:

ivy-fail:

ivy-configure:
[ivy:configure] :: loading settings :: file = /x1/jenkins/jenkins-slave/workspace/Lucene-Solr-BadApples-Tests-master/lucene/top-level-ivy-settings.xml

resolve:

ivy-availability-check:
[loadresource] Do not set property disallowed.ivy.jars.list as its length is 0.

-ivy-fail-disallowed-ivy-version:

ivy-fail:

ivy-configure:
[ivy:configure] :: loading settings :: file = /x1/jenkins/jenkins-slave/workspace/Lucene-Solr-BadApples-Tests-master/lucene/top-level-ivy-settings.xml

resolve:

ivy-availability-check:
[loadresource] Do not set property disallowed.ivy.jars.list as its length is 0.

-ivy-fail-disallowed-ivy-version:

ivy-fail:

ivy-fail:

ivy-configure:
[ivy:configure] :: loading settings :: file = /x1/jenkins/jenkins-slave/workspace/Lucene-Solr-BadApples-Tests-master/lucene/top-level-ivy-settings.xml

resolve:

ivy-availability-check:
[loadresource] Do not set property disallowed.ivy.jars.list as its length is 0.

-ivy-fail-disallowed-ivy-version:

ivy-fail:

ivy-configure:
[ivy:configure] :: loading settings :: file = /x1/jenkins/jenkins-slave/workspace/Lucene-Solr-BadApples-Tests-master/lucene/top-level-ivy-settings.xml

resolve:

ivy-availability-check:
[loadresource] Do not set property disallowed.ivy.jars.list as its length is 0.

-ivy-fail-disallowed-ivy-version:

ivy-fail:

ivy-fail:

ivy-configure:
[ivy:configure] :: loading settings :: file = /x1/jenkins/jenkins-slave/workspace/Lucene-Solr-BadApples-Tests-master/lucene/top-level-ivy-settings.xml

resolve:

ivy-availability-check:
[loadresource] Do not set property disallowed.ivy.jars.list as its length is 0.

-ivy-fail-disallowed-ivy-version:

ivy-fail:

ivy-fail:

ivy-configure:
[ivy:configure] :: loading settings :: file = /x1/jenkins/jenkins-slave/workspace/Lucene-Solr-BadApples-Tests-master/lucene/top-level-ivy-settings.xml

resolve:

ivy-availability-check:
[loadresource] Do not set property disallowed.ivy.jars.list as its length is 0.

-ivy-fail-disallowed-ivy-version:

ivy-fail:

ivy-fail:

ivy-configure:
[ivy:configure] :: loading settings :: file = /x1/jenkins/jenkins-slave/workspace/Lucene-Solr-BadApples-Tests-master/lucene/top-level-ivy-settings.xml

resolve:

ivy-availability-check:
[loadresource] Do not set property disallowed.ivy.jars.list as its length is 0.

-ivy-fail-disallowed-ivy-version:

ivy-fail:

ivy-fail:

ivy-configure:
[ivy:configure] :: loading settings :: file = /x1/jenkins/jenkins-slave/workspace/Lucene-Solr-BadApples-Tests-master/lucene/top-level-ivy-settings.xml

resolve:

ivy-availability-check:
[loadresource] Do not set property disallowed.ivy.jars.list as its length is 0.

-ivy-fail-disallowed-ivy-version:

ivy-fail:

ivy-fail:

ivy-configure:
[ivy:configure] :: loading settings :: file = /x1/jenkins/jenkins-slave/workspace/Lucene-Solr-BadApples-Tests-master/lucene/top-level-ivy-settings.xml

resolve:

ivy-availability-check:
[loadresource] Do not set property disallowed.ivy.jars.list as its length is 0.

-ivy-fail-disallowed-ivy-version:

ivy-fail:

ivy-fail:

ivy-configure:
[ivy:configure] :: loading settings :: file = /x1/jenkins/jenkins-slave/workspace/Lucene-Solr-BadApples-Tests-master/lucene/top-level-ivy-settings.xml

resolve:

ivy-availability-check:
[loadresource] Do not set property disallowed.ivy.jars.list as its length is 0.

-ivy-fail-disallowed-ivy-version:

ivy-fail:

ivy-fail:

ivy-configure:
[ivy:configure] :: loading settings :: file = /x1/jenkins/jenkins-slave/workspace/Lucene-Solr-BadApples-Tests-master/lucene/top-level-ivy-settings.xml

resolve:

ivy-availability-check:
[loadresource] Do not set property disallowed.ivy.jars.list as its length is 0.

-ivy-fail-disallowed-ivy-version:

ivy-fail:

ivy-fail:

ivy-configure:
[ivy:configure] :: loading settings :: file = /x1/jenkins/jenkins-slave/workspace/Lucene-Solr-BadApples-Tests-master/lucene/top-level-ivy-settings.xml

resolve:

ivy-availability-check:
[loadresource] Do not set property disallowed.ivy.jars.list as its length is 0.

-ivy-fail-disallowed-ivy-version:

ivy-fail:

ivy-fail:

ivy-configure:
[ivy:configure] :: loading settings :: file = /x1/jenkins/jenkins-slave/workspace/Lucene-Solr-BadApples-Tests-master/lucene/top-level-ivy-settings.xml

resolve:

ivy-availability-check:
[loadresource] Do not set property disallowed.ivy.jars.list as its length is 0.

-ivy-fail-disallowed-ivy-version:

ivy-fail:

ivy-fail:

ivy-configure:
[ivy:configure] :: loading settings :: file = /x1/jenkins/jenkins-slave/workspace/Lucene-Solr-BadApples-Tests-master/lucene/top-level-ivy-settings.xml

resolve:

jar-checksums:
    [mkdir] Created dir: /x1/jenkins/jenkins-slave/workspace/Lucene-Solr-BadApples-Tests-master/solr/null1476218113
     [copy] Copying 240 files to /x1/jenkins/jenkins-slave/workspace/Lucene-Solr-BadApples-Tests-master/solr/null1476218113
   [delete] Deleting directory /x1/jenkins/jenkins-slave/workspace/Lucene-Solr-BadApples-Tests-master/solr/null1476218113

check-working-copy:
[ivy:cachepath] :: resolving dependencies :: #;working@lucene1-us-west
[ivy:cachepath] 	confs: [default]
[ivy:cachepath] 	found org.eclipse.jgit#org.eclipse.jgit;5.3.0.201903130848-r in public
[ivy:cachepath] 	found com.jcraft#jsch;0.1.54 in public
[ivy:cachepath] 	found com.jcraft#jzlib;1.1.1 in public
[ivy:cachepath] 	found com.googlecode.javaewah#JavaEWAH;1.1.6 in public
[ivy:cachepath] 	found org.slf4j#slf4j-api;1.7.2 in public
[ivy:cachepath] 	found org.bouncycastle#bcpg-jdk15on;1.60 in public
[ivy:cachepath] 	found org.bouncycastle#bcprov-jdk15on;1.60 in public
[ivy:cachepath] 	found org.bouncycastle#bcpkix-jdk15on;1.60 in public
[ivy:cachepath] 	found org.slf4j#slf4j-nop;1.7.2 in public
[ivy:cachepath] :: resolution report :: resolve 68ms :: artifacts dl 7ms
	---------------------------------------------------------------------
	|                  |            modules            ||   artifacts   |
	|       conf       | number| search|dwnlded|evicted|| number|dwnlded|
	---------------------------------------------------------------------
	|      default     |   9   |   0   |   0   |   0   ||   9   |   0   |
	---------------------------------------------------------------------
[wc-checker] Initializing working copy...
[wc-checker] Checking working copy status...

-jenkins-base:

BUILD SUCCESSFUL
Total time: 123 minutes 17 seconds
Archiving artifacts
java.lang.InterruptedException: no matches found within 10000
	at hudson.FilePath$ValidateAntFileMask.hasMatch(FilePath.java:2847)
	at hudson.FilePath$ValidateAntFileMask.invoke(FilePath.java:2726)
	at hudson.FilePath$ValidateAntFileMask.invoke(FilePath.java:2707)
	at hudson.FilePath$FileCallableWrapper.call(FilePath.java:3086)
Also:   hudson.remoting.Channel$CallSiteStackTrace: Remote call to lucene
		at hudson.remoting.Channel.attachCallSiteStackTrace(Channel.java:1741)
		at hudson.remoting.UserRequest$ExceptionResponse.retrieve(UserRequest.java:357)
		at hudson.remoting.Channel.call(Channel.java:955)
		at hudson.FilePath.act(FilePath.java:1072)
		at hudson.FilePath.act(FilePath.java:1061)
		at hudson.FilePath.validateAntFileMask(FilePath.java:2705)
		at hudson.tasks.ArtifactArchiver.perform(ArtifactArchiver.java:243)
		at hudson.tasks.BuildStepCompatibilityLayer.perform(BuildStepCompatibilityLayer.java:81)
		at hudson.tasks.BuildStepMonitor$1.perform(BuildStepMonitor.java:20)
		at hudson.model.AbstractBuild$AbstractBuildExecution.perform(AbstractBuild.java:744)
		at hudson.model.AbstractBuild$AbstractBuildExecution.performAllBuildSteps(AbstractBuild.java:690)
		at hudson.model.Build$BuildExecution.post2(Build.java:186)
		at hudson.model.AbstractBuild$AbstractBuildExecution.post(AbstractBuild.java:635)
		at hudson.model.Run.execute(Run.java:1835)
		at hudson.model.FreeStyleBuild.run(FreeStyleBuild.java:43)
		at hudson.model.ResourceController.execute(ResourceController.java:97)
		at hudson.model.Executor.run(Executor.java:429)
Caused: hudson.FilePath$TunneledInterruptedException
	at hudson.FilePath$FileCallableWrapper.call(FilePath.java:3088)
	at hudson.remoting.UserRequest.perform(UserRequest.java:212)
	at hudson.remoting.UserRequest.perform(UserRequest.java:54)
	at hudson.remoting.Request$2.run(Request.java:369)
	at hudson.remoting.InterceptingExecutorService$1.call(InterceptingExecutorService.java:72)
	at java.util.concurrent.FutureTask.run(FutureTask.java:266)
	at java.util.concurrent.ThreadPoolExecutor.runWorker(ThreadPoolExecutor.java:1142)
	at java.util.concurrent.ThreadPoolExecutor$Worker.run(ThreadPoolExecutor.java:617)
	at java.lang.Thread.run(Thread.java:748)
Caused: java.lang.InterruptedException: java.lang.InterruptedException: no matches found within 10000
	at hudson.FilePath.act(FilePath.java:1074)
	at hudson.FilePath.act(FilePath.java:1061)
	at hudson.FilePath.validateAntFileMask(FilePath.java:2705)
	at hudson.tasks.ArtifactArchiver.perform(ArtifactArchiver.java:243)
	at hudson.tasks.BuildStepCompatibilityLayer.perform(BuildStepCompatibilityLayer.java:81)
	at hudson.tasks.BuildStepMonitor$1.perform(BuildStepMonitor.java:20)
	at hudson.model.AbstractBuild$AbstractBuildExecution.perform(AbstractBuild.java:744)
	at hudson.model.AbstractBuild$AbstractBuildExecution.performAllBuildSteps(AbstractBuild.java:690)
	at hudson.model.Build$BuildExecution.post2(Build.java:186)
	at hudson.model.AbstractBuild$AbstractBuildExecution.post(AbstractBuild.java:635)
	at hudson.model.Run.execute(Run.java:1835)
	at hudson.model.FreeStyleBuild.run(FreeStyleBuild.java:43)
	at hudson.model.ResourceController.execute(ResourceController.java:97)
	at hudson.model.Executor.run(Executor.java:429)
No artifacts found that match the file pattern "**/*.events,heapdumps/**,**/hs_err_pid*". Configuration error?
Recording test results
Build step 'Publish JUnit test result report' changed build result to UNSTABLE
Email was triggered for: Unstable (Test Failures)
Sending email for trigger: Unstable (Test Failures)

Mime
View raw message